##TITLE=1H_EC-3189
 CDCl3, 8 sc, 
 8.4.2019
##JCAMPDX= 6.0         $$ Bruker NMR JCAMP-DX V2.0
##DATA TYPE= NMR FID
##DATA CLASS= NTUPLES
##ORIGIN= UXNMR, Bruker Analytische Messtechnik GmbH
##OWNER= root
$$ XWIN-NMR		Version 3.5
$$ Mon Apr  8 14:13:02 2019 Russian Standard Time (UT+4h)  she@DPX200
##.OBSERVE FREQUENCY= 200.1315
##.OBSERVE NUCLEUS= ^1H
##.DELAY= (6, 6)
##.ACQUISITION MODE= SIMULTANEOUS
##.ACQUISITION SCHEME= undefined
##.AVERAGES= 8
##.DIGITISER RES= 18
##SPECTROMETER/DATA SYSTEM= spect
##.PULSE SEQUENCE= zg30
##.SOLVENT NAME= CDCl3
##.SHIFT REFERENCE= (INTERNAL, CDCl3, 0, 15.7039)
##AUDIT TRAIL= $$ (NUMBER, WHEN, WHO, WHERE, WHAT)
$$ ##TITLE= Audit trail, XWIN-NMR		Version 3.5
$$ ##JCAMPDX= 5.01
$$ ##ORIGIN= Bruker BioSpin GmbH
$$ ##OWNER= she
$$ F:/spectra/data/she/nmr/H-F/1/audita.txt
$$ ##AUDIT TRAIL=  $$ (NUMBER, WHEN, WHO, WHERE, WHAT)
(   1,<2019-04-08 14:11:49.40 +0400>,<she>,<DPX200>,
      <created by zg, POWCHK disabled, PULCHK disabled
       configuration hash MD5:
       00 E9 B6 7A A2 85 ED C7 34 08 36 98 17 FE 4E 26
       data hash MD5: 16K
       8F 91 96 FD 77 0B D3 98 A4 C6 93 24 CC 40 AF 51>)
$$ ##END=
$$ 
$$ hash MD5
$$ D5 E3 03 84 E8 0D 92 57 C5 66 14 64 63 1C D4 FB
##$RELAX= 
##$RELAX= 
##$RELAX= 
##$RELAX= 
##$RELAX= 
##$RELAX= 
$$ Bruker specific parameters
$$ --------------------------
##$DU= <F:/spectra>
##$EXPNO= 1
##$NAME= <H-F>
##$PROCNO= 1
##$TYPE= <nmr>
##$USER= <she>
##$AMP= (0..31)
100 100 100 100 100 100 100 100 100 100 100 100 100 100 100 100 100 100 
100 100 100 100 100 100 100 100 100 100 100 100 100 100 
##$AQSEQ= 0
##$AQ_mod= 1
##$AUNM= <au_zg>
##$AUTOPOS= <>
##$BF1= 200.13
##$BF2= 200.13
##$BF3= 200.13
##$BF4= 200.13
##$BF5= 200.13
##$BF6= 200.13
##$BF7= 200.13
##$BF8= 200.13
##$BYTORDA= 1
##$CFDGTYP= 0
##$CFRGTYP= 5
##$CHEMSTR= <none>
##$CNST= (0..31)
1 1 145 1 1 1 1 1 1 1 1 1 1 1 1 1 1 1 1 1 1 1 1 1 1 1 1 1 1 1 1 1 
##$CPDPRG= <>
##$CPDPRG1= <>
##$CPDPRG2= <>
##$CPDPRG3= <>
##$CPDPRG4= <mlev>
##$CPDPRG5= <mlev>
##$CPDPRG6= <mlev>
##$CPDPRG7= <mlev>
##$CPDPRG8= <mlev>
##$CPDPRGB= <>
##$CPDPRGT= <>
##$D= (0..31)
0 1.2 0 0 0 0 0 0 0 0 0 0.03 0 0 0 0 0 0 0 0 0 0 0 0 0 0 0 0 0 0 0 0 
##$DATE= 1554718308
##$DBL= (0..7)
120 120 120 120 120 120 120 120 
##$DBP= (0..7)
150 150 150 150 150 150 150 150 
##$DBP07= 0
##$DBPNAM0= <>
##$DBPNAM1= <>
##$DBPNAM2= <>
##$DBPNAM3= <>
##$DBPNAM4= <>
##$DBPNAM5= <>
##$DBPNAM6= <>
##$DBPNAM7= <>
##$DBPOAL= (0..7)
0.5 0.5 0.5 0.5 0.5 0.5 0.5 0.5 
##$DBPOFFS= (0..7)
0 0 0 0 0 0 0 0 
##$DE= 6
##$DECBNUC= <off>
##$DECIM= 24
##$DECNUC= <off>
##$DECSTAT= 4
##$DIGMOD= 1
##$DIGTYP= 9
##$DL= (0..7)
0 120 120 120 120 120 120 120 
##$DP= (0..7)
150 150 150 150 150 150 150 150 
##$DP07= 0
##$DPNAME0= <>
##$DPNAME1= <>
##$DPNAME2= <>
##$DPNAME3= <>
##$DPNAME4= <>
##$DPNAME5= <>
##$DPNAME6= <>
##$DPNAME7= <>
##$DPOAL= (0..7)
0.5 0.5 0.5 0.5 0.5 0.5 0.5 0.5 
##$DPOFFS= (0..7)
0 0 0 0 0 0 0 0 
##$DQDMODE= 0
##$DR= 18
##$DS= 0
##$DSLIST= <SSSSSSSSSSSSSSS>
##$DSPFIRM= 0
$$ [...]
##$SUBNAM2= <"">
##$SUBNAM3= <"">
##$SUBNAM4= <"">
##$SUBNAM5= <"">
##$SUBNAM6= <"">
##$SUBNAM7= <"">
##$SUBNAM8= <"">
##$SUBNAM9= <"">
##$SW= 24.9337058887773
##$SWIBOX= (0..15)
0 0 2 0 0 0 0 0 0 0 0 0 0 0 0 0 
##$SW_h= 4990.01996007984
##$TD= 16384
##$TD0= 1
##$TE= 0
##$TE2= 300
##$TE3= 300
##$TEG= 300
##$TL= (0..7)
0 120 120 120 120 120 120 120 
##$TP= (0..7)
150 150 150 150 150 150 150 150 
##$TP07= 0
##$TPNAME0= <>
##$TPNAME1= <>
##$TPNAME2= <>
##$TPNAME3= <>
##$TPNAME4= <>
##$TPNAME5= <>
##$TPNAME6= <>
##$TPNAME7= <>
##$TPOAL= (0..7)
0.5 0.5 0.5 0.5 0.5 0.5 0.5 0.5 
##$TPOFFS= (0..7)
0 0 0 0 0 0 0 0 
##$TUNHIN= 0
##$TUNHOUT= 0
##$TUNXOUT= 0
##$USERA1= <user>
##$USERA2= <user>
##$USERA3= <user>
##$USERA4= <user>
##$USERA5= <user>
##$V9= 5
##$VALIST= <valist>
##$VCLIST= <CCCCCCCCCCCCCCC>
##$VD= 0
##$VDLIST= <DDDDDDDDDDDDDDD>
##$VPLIST= <PPPPPPPPPPPPPPP>
##$VTLIST= <TTTTTTTTTTTTTTT>
##$WBST= 1024
##$WBSW= 4
##$XGAIN= (0..3)
0 0 0 0 
##$XL= 0
##$YL= 0
##$YMAX_a= 256287
##$YMIN_a= -283774
##$ZGOPTNS= <>
##$ZL1= 120
##$ZL2= 120
##$ZL3= 120
##$ZL4= 120
##$ABSF1= 10
##$ABSF2= 0
##$ABSG= 5
##$ABSL= 3
##$ALPHA= 0
##$AQORDER= 0
##$ASSFAC= 0
##$ASSFACI= 0
##$ASSFACX= 0
##$ASSWID= 0
##$AUNMP= <proc_1d>
##$AZFE= 0.1
##$AZFW= 0.1
##$BCFW= 1
##$BC_mod= 2
##$BYTORDP= 1
##$COROFFS= 0
##$CY= 11.3945322036743
##$DATMOD= 1
##$DC= 2
##$DFILT= <>
##$DTYPP= 0
##$F1P= 18.9103706918063
##$F2P= -1.10871071338519
##$FCOR= 0.5
##$FTSIZE= 0
##$FT_mod= 4
##$GAMMA= 1
##$GB= 0.15
##$INTBC= 1
##$INTSCL= 1
##$ISEN= 128
##$LB= 0.24
##$LEV0= 0
##$LPBIN= 0
##$MAXI= 10000
##$MC2= 0
##$MEAN= 0
##$ME_mod= 0
##$MI= 1.114404
##$NCOEF= 0
##$NC_proc= 0
##$NLEV= 6
##$NOISF1= 3.799351
##$NOISF2= 2.8
##$NSP= 1
##$NTH_PI= 0
##$NZP= 0
##$OFFSET= 15.70392
##$PC= 1
##$PHC0= -8852.081
##$PHC1= 13.60026
##$PH_mod= 1
##$PKNL= yes
##$PPARMOD= 0
##$PSCAL= 0
##$PSIGN= 0
##$REVERSE= no
##$SF= 200.130013532006
##$SI= 16384
##$SIGF1= 3
##$SIGF2= 2
##$SINO= 400
##$SIOLD= 16384
##$SREGLST= <1H.CDCl3>
##$SSB= 0
##$STSI= 0
##$STSR= 0
##$SW_p= 3612.71676300578
##$SYMM= 0
##$S_DEV= 0
##$TDeff= 0
##$TDoff= 0
##$TI= <>
##$TILT= no
##$TM1= 0
##$TM2= 0
##$TOPLEV= 0
##$USERP1= <user>
##$USERP2= <user>
##$USERP3= <user>
##$USERP4= <user>
##$USERP5= <user>
##$WDW= 1
##$XDIM= 8192
##$YMAX_p= 0
##$YMIN_p= 0
$$ End of Bruker specific parameters
$$ ---------------------------------
##NTUPLES= NMR FID
##VAR_NAME=  TIME,          FID/REAL,        FID/IMAG
##SYMBOL=    X,             R,               I
##VAR_TYPE=  INDEPENDENT,   DEPENDENT,       DEPENDENT
##VAR_FORM=  AFFN,          ASDF,            ASDF
##VAR_DIM=   8192,          8192,            8192
##UNITS=     SECONDS,       ARBITRARY UNITS, ARBITRARY UNITS
##FACTOR=    0.0002004,     1,               1
##FIRST=     0,             0,               0
##LAST=      1.6414764,     0,               0
##MIN=       0,             -283774,         0
##MAX=       1.6414764,     256287,          0
$$ Real data points
##PAGE= N=1
##DATA TABLE= (X++(R..R)), XYDATA
$$ [...]
$$ plain form
1966 231 413 344 -9 -91 179 224 735 183 186 79 348 38 209 -19 -221 56 -186 173 125 -95 24 386
1988 386 277 -14 -107 -36 107 213 211 128 78 138 -43 221 419 -44 362 19 165 54 122 400 15 55 48 188
2012 188 165 284 -152 -2 179 169 -38 -222 -156 13 -55 26 -84 -171 -55 316 117 -160 -462 -450 117 228
2034 228 -31 134 -545 -66 -104 8 -251 -907 -483 84 371 27 -148 -556 121 129 65 -367 -579 -507 259 156
2056 156 -79 -300 -474 -99 201 245 -343 -475 -88 343 193 39 -580 -371 -149 583 -30 -182 -473 -141
2076 -141 204 381 -57 -851 -504 402 374 -78 -667 -387 193 496 200 -278 -714 110 439 263 98 -578
2096 -578 -84 361 589 165 -221 -91 94 402 784 -237 -518 -332 510 361 197 -121 -496 68 787 417
2116 417 -218 -282 -124 217 403 -39 -234 -507 61 475 447 -209 -274 413 287 168 97 -889 -280 368 395 330
$$ packed form
1966B31J82o9l53q2K70M5N11n52Lj07K69l10J71k28k02K77k42L59m8k20J19L62
1988C86j09k91r3P1J43J06kq3n0O0j81K64J98m63M06l43J46j11O8K78l85M0pJ40
2012A88k3J19m36J50J81j0k07j84O6J69o8Q1j10q7J16L71j99k77l02J2N67J11
2034B28k59J65o79M79l8J12k59o56M24N67K87l44j75m08O77Qo4m32k12P2P66j03
2056A56k35k21j74L75L00M4n88j32L87M31j50j54o19K09K22P32o13j52k91L32
2076a41L45J77m38p94L47R06k8m52n89K80N80L03k96m78m36Q24L29j76j65o76
2096e78M94M45K28m24l86J30J85L08L82j021k81J86Q42j49j64l18l75N64P19l70
2116D17o35o4J58L41J86m42j95k73N68M14k8o56o5O87j26j19p1r86O09O48K7o5
$$ plain form
2138 330 -236 -310 203 726 139 -88 -133 244 78 280 91 -596 43 -113 486 -12 -309 -197 -155 454 60
2159 60 -358 -491 18 289 258 77 -622 -366 51 -44 -202 -277 -349 -141 204 236 -129 -479 -415 47 229 257 -19
2182 -19 -265 -164 130 140 -516 -378 -139 229 207 237 -267 -419 5 180 260 -277 -364 -69 183 58 -6 -149
2204 -149 -425 -68 -87 96 -156 -253 -249 14 283 -39 8 -48 -128 331 -149 -160 -212 -141 226 -96 -325 59 37 169
2228 169 73 -100 -41 -33 45 209 385 229 -71 -246 71 -57 61 194 -60 93 220 -146 332 12 -90 153
2250 153 -134 401 -108 -276 409 115 -5 -34 139 0 140 51 -125 94 30 -68 46 134 -61 -150 110 261
2272 261 -57 98 152 11 216 -244 -45 -7 -52 15 -103 -51 255 240 102 -14 -205 189 198 -336 -560 12 297
2295 297 -72 -160 -276 -178 255 24 -175 -59 -155 -126 -89 169 -132 -421 -442 -69 84 -30 -453 -313 -19 -21 -230
$$ packed form
2138C30n66p4N13N23n87k27m5L77j66K02j89o87O39j56N99m98k97J12M2O09l94
2159F0m18j33N09K71l1j81o99K56M17r5j58p5p2K08L45L2l65l50O4M62J82K8k76
2182a9k46J01K94J0o56J38K39L68k2L0n04j52M24J75Q0n37q7K95K52j25o4j43
2204a49k76L57j9J83k52r7MK63K69l22M7n6q0M59m80j1n2P1L67l22k29L84k2J32
2228A69r6j73N9QP8J64J76j56l00j75L17j28J18J33k54J53J27l66M78l20j02K43
2250A53k87N35n09j68O85k94j20k9J73j39J40q9j76K19o4r8J14Q8j95q9K60J51
2272B61l18J55N4j41K05m60J99L8m5O7j18N2L06j5j38j16j91L94Rn34k24N72K85
2295B97l69q8j16R8M33k31j99J16r6K9L7K58l01k89k1L73J53j14m23J40K94kk09
$$ plain form
2318 -230 -207 -391 -67 -16 14 -328 -425 -167 -106 178 -35 -323 -671 181 23 -115 -114 -151 226 229 230 280 -325 -334 -148
2343 -148 -136 105 -22 36 -165 109 161 -230 -138 -26 165 170 135 -245 -207 -41 321 303 -16 -432 -237 118 658
2366 658 -15 -54 -148 288 273 369 14 -21 51 286 240 -88 -316 17 166 363 33 -528 -23 113 418 -23
2388 -23 -165 -69 23 -61 400 -131 48 85 125 57 200 144 5 -275 -6 365 128 -243 -269 43 151 140 -349
2411 -349 -205 68 -12 332 -170 -81 191 95 335 100 -192 -203 -151 92 381 -41 -138 3 170 221 -20 -70 -620
2434 -620 157 25 41 62 -503 -312 132 -50 -77 -109 -50 -67 262 -19 -30 71 317 54 304 -272 -307 -74 34
2457 34 82 -319 -28 39 -99 -35 284 -133 -275 -151 168 178 -255 -65 -34 134 -122 -300 -250 -74 50 198
2479 198 248 231 -117 -30 279 -118 -138 -185 -223 279 -4 307 292 131 -33 170 -130 30 -138 43 94 46 62
$$ packed form
2318b30K3j84L24N1L0l42r7K58O1K84k13k88l48Q52j58j38Jl7L77LJN0o05rJ86
2343a48J2K41j27N8k01K74N2l91R2J12J91Nl5l80L8J66L62j8l19m16J95L55N40
2366F58o73l9r4M36j5R6l55l5P2K35m6l28k28L33J49J97l30n61N05J36L05m41
2388b3j42R6R2q4M61n31J79L7M0o8J43n6j39k80K69L71k37l71k6L12J08j1m89
2411c49J44K73q0L44n02Q9K72r6K40k35k92j1N2K43K89m22r7J41J67N1k41n0n50
2434f20P77j32J6K1n65J91M44j82k7l2N9j7L29k81j1J01K46k63K50n76l5K33J08
2457C4M8m01K91O7j38O4L19m17j42J24L19J0m33J90L1J68k56j78N0J76J24J48
2479A98N0j7l48Q7L09l97k0m7l8N02k83L11j5j61j64K03l00J60j68J81N1m8J6
$$ plain form
2502 62 161 -168 123 -26 92 215 289 -75 86 78 209 4 -39 -6 98 118 216 146 291 -147 20 15 81 218
2526 218 -161 348 203 -136 -222 70 128 86 -92 88 -180 -225 -192 167 157 97 194 -70 54 51 12 -53 75 -145
2550 -145 122 4 -89 32 -225 -263 -337 225 -247 -173 -13 -50 110 111 -35 -298 50 281 -211 -320 -418 -355 102
2573 102 -75 -40 -22 -133 -307 263 66 -211 -380 94 206 -40 -308 -270 24 -6 -183 -85 -303 -223 373 -165
2595 -165 72 -9 -234 49 75 162 115 -119 -95 91 -51 45 -50 167 -48 349 -356 123 111 -113 61 294 61
2618 61 -167 -237 31 117 202 91 -350 170 425 47 -136 183 -169 461 -119 -115 -85 -397 174 4 99 284 -147
2641 -147 64 237 227 55 -196 -240 298 76 388 -173 -11 -30 100 213 -19 -245 10 -42 118 110 -99 -536
2663 -536 -467 179 234 -153 -62 67 40 267 -34 -254 174 -21 53 410 -121 49 -99 -49 130 -183 -288 -187
$$ packed form
2502F2R9l29K91j49J18J23P4l64J61qJ31k05m3L3J04K0R8p0J45m38J67nO6J37
2526B18l79N09j45l39q6K92N8m2j78J80k68m5L3L59j0o0R7k64J24ll9o5J28k20
2550a45K67j18r3J21k57l8p4N62m72P4J60l7J60Jj46k63L48K31m92j09r8O3M57
2573A02j77L5J8j11j74N70j97k77j69M74J12k46k68L8K94l0j77R8k18Q0N96n38
2595a65K37q1k25K83K6Q7m7k34K4J86j42R6r5K17k15L97p05M79j2k24J74K33k33
2618F1k28p0K68Q6Q5j11m41N20K55l78j83L19l52O30n80ML0l12N71j70R5J85m31
2641a47K11J73j0j72k51m4N38k22L12n61J62j9J30J13k32k26K55n2J60qk09m37
2663e36O9O46N5l87R1J29k7K27l01k20M28j95P4L57n31J70j48N0J79l13j05J01
$$ plain form
2685 -187 48 143 -202 -143 -43 0 -22 -14 233 -75 -352 18 240 -76 -335 -132 119 84 -31 -21 -269 -260 -137
2708 -137 29 113 -110 -277 -55 -172 89 -83 -169 29 169 246 73 -56 -215 144 298 -208 -2 -73 62
2729 62 75 -90 91 72 99 175 19 -332 -19 -152 254 -3 -53 12 214 -263 -5 13 -114 81 66 159 -176
2752 -176 192 -31 182 -174 177 461 95 -65 103 -175 161 230 17 36 232 -56 92 248 29 -201 84
2773 84 272 197 -105 -26 -131 180 368 -2 -214 -275 -9 -55 143 -145 235 -27 -22 77 0 179 -154 -192 -130 -17
2797 -17 -135 -79 -132 53 34 -157 29 -8 -276 -45 233 149 -305 -26 -88 19 -123 84 -110 -180 126 150 -29
2820 -29 148 8 -106 57 -86 -272 -256 -268 7 81 110 -17 40 -108 240 92 225 -201 138 385 133 42
2842 42 -253 67 -158 211 236 -220 -202 142 351 162 -429 -227 -246 5 235 -168 89 -64 -90 68 118 73
$$ packed form
2685a87K35R5l45N9J00M3k2QK47l08k77L70K22l16k59K03K51l5j15J0k48RJ23
2708a37J66Q4k23j67K22j17K61j72q6J98J40P7j73j29j59L59J54n06K06p1J35
2729F2J3j65J81j9K7P6j56l51L13j33M06k57n0O5K02m77K58J8j27J95j5R3l35
2752a76L68k23K13l56L51K84l66j60J68k78L36O9k13J9J96k88J48J56k19k30K85
2773H4J88p5l02P9j05L11J88l70k12o1K66m6J98k88L80k62NR9p7J79l33l8O2J13
2797a7j18N6n3J85j9j91J86l7k68K31K78q4m54K79o2J07j42K07j94p0L06K4j79
2820b9J77j40j14J63j43j86J6j2K75P4K9j27N7j48L48j48J33m26L39K47k52r1
2842D2k95L20k25L69K5m56J8L44K09j89n91K02j9K51K30m03K57j53k6J58N0m5
$$ plain form
2864 73 -125 -101 -27 158 232 -256 133 228 -20 -76 -91 -269 -108 -34 50 -119 -230 -158 69 250 122 -161 -109 259
2888 259 57 254 44 -118 -338 310 246 44 -40 -94 245 222 -260 -247 -181 -42 300 -205 -137 -227 137 19 -131
2911 -131 159 -66 -33 -228 194 -188 -95 -184 101 360 -52 -166 -111 -33 -269 54 192 -62 24 97 40 107 226
2934 226 -47 46 74 100 -76 22 14 0 -162 204 -94 -22 173 133 58 -131 -316 -46 267 14 -157 -150 -85 -48 138
2959 138 57 193 -494 -68 -64 91 -62 1 -40 9 -92 26 -50 -58 8 -23 134 -185 -83 126 -103 129 89 -240
2983 -240 127 91 -9 -17 -202 15 -49 176 107 303 111 -196 91 5 111 -333 56 53 127 -235 329 -95 -140
3006 -140 -252 -199 -152 236 17 -237 201 116 286 33 -32 91 -23 -65 245 -116 -318 -98 290 81 -26 547
3028 547 29 40 -152 -170 -138 44 82 28 37 183 -229 64 -86 -83 -44 139 -156 -248 96 37 207 -219 138 149
$$ packed form
2864G3j98K4P4J85P4m88L89R5k48n6j5j78J61P4Q4j69j11P2K27J81j28k83N2L68
2888B59k02J97k10j62k20O48o4k02q4n4L39k3m82J3O6J39L42n05O8r0L64j18j50
2911a31K90k25L3j95M22l82R3q9K85K59m12j14N5P8k36L23J38k54Q6P3n7O7J19
2934B26k73R3K8K6j76R8qj4j62L66k98P2J95m0p5j89j85K70L13k53j71PO5L7J86
2959A38q1J36o87M26MJ55j53O3m1M9j01J18p6qO6l1J57l19J02K09k29K32m0l29
2983b40L67l6j00qj85K17o4K25o9J96j92l07K87q6J06m44L89lP4l62N64m24m5
3006a40j12N3M7L88k19k54M38q5J70k53o5J23j14m2L10l61k02K20L88k09j07N73
3028E47n18J1j92j8L2J82L8n4RJ46m12K93j50LL9J83k95r2L44n9J70m26L57J1
$$ plain form
3052 149 185 -267 28 13 -143 101 386 -229 82 47 154 90 -77 43 -42 -127 97 165 -70 -64 -71 89 -144 105
3076 105 -223 -148 -68 13 -32 -124 -119 -251 -75 16 -127 -30 -252 19 409 -125 -349 -77 -89 81 -214 -94 194
3099 194 -9 -6 42 269 -157 -219 -194 -220 100 -252 -229 163 -91 -23 -21 138 -155 -104 161 -13 -90 -257 44 -84
3123 -84 -59 -261 266 -48 294 107 241 -113 -20 85 -191 194 79 -174 22 -13 210 29 -20 -380 117 292
3145 292 -90 105 -55 125 190 172 256 -98 -240 3 -100 31 -185 -96 303 333 -137 80 -350 -147 -45 238
3167 238 154 -244 -31 103 189 80 84 -208 -47 239 246 9 -206 53 -144 -139 -141 -40 -263 22 12 23 -22 -282
3191 -282 -198 -189 -292 -137 -360 -121 -404 123 185 -95 -242 -295 269 318 -254 5 123 55 215 -165 53 -43 -130
3214 -130 75 56 -24 -87 9 -185 23 -14 -49 81 49 98 87 -250 -137 178 -80 -60 -97 -82 271 -83 218 134
$$ packed form
3052A49L6m52K95j5j56K44K85o15L11l5J07o4j67J20q5q5K24O8k35OpJ60k33K49
3076A05l28P5Q0Q1m5r2Nj32J76R1j43R7k22K71L90n34k24K72j2J70k95J20K88
3099A94k03LM8K27m26o2K5k6L20l52K3L92k54O8KJ59k93N1K65j74p7j67L01j28
3123h4K5k02N27l14L42j87J34l54R3J05k76L85j15k53J96l5K23j81m9l60M97J75
3145B92l82J95j60J80O5j8Q4l54j42K43j03J31k16Q9L99L0m70K17m30K03J02K83
3167B38q4l98K13J34Q6j09Mk92J61K86Pk37k15K59j97NkJ01k23K85j0J1m5k60
3191b82Q4Rj03J55k23K39k83N27O2k80j47n3N64M9n72K59J18o8J60l80K18r6q7
3214a30K05j9q0o3R6j94K08l7l5J30l2M9j1l37J13L15k58K0l7J5L53l54L01q4
$$ plain form
3238 134 9 -184 227 304 99 157 204 3 -134 142 -197 77 -8 7 131 -52 -11 31 -76 -129 65 274 -174
3261 -174 244 182 -193 -90 -173 -113 39 -201 52 -95 -150 70 1 536 180 89 458 16 97 273 -90 70
3283 70 56 359 417 213 -108 36 137 74 -30 145 -56 26 -2 32 -149 -25 170 -138 -28 -64 170 -174 247
3306 247 2 4 39 148 45 88 -338 -66 -136 -345 -500 -207 -16 61 -307 -227 -199 -139 -71 256 211 -82 -67 -367
3330 -367 -32 96 -372 -173 -8 -133 80 -484 35 -272 34 -240 208 -68 -113 249 -84 -259 -35 -122 -109
3351 -109 -168 269 308 -255 60 -286 145 -62 -17 130 175 270 246 -3 16 105 -221 133 150 -219 -334 80 148
3374 148 -153 302 18 142 -212 71 55 -136 50 50 62 8 -324 -87 331 -1 -67 159 160 15 22 366 132
3397 132 -111 328 -38 52 204 41 -252 -9 13 168 -243 123 163 -221 -154 156 32 27 -113 77 305 87
$$ packed form
3238A34j25j93M11P7k05N8M7k01j37K76l39K74q5J5J24j83M1M2j07n3J94K09m48
3261a74M18o2l75J03q3O0J52k40K53j47n5K20o9N35l56r1L69m42Q1J76l63J60
3283G0j4L03N8k04l21J44J01o3j04J75k01Q2k8L4j81J24J95l08J10l6K34l44M21
3306B47k45KL5J09j03M3m26K72p0k09j55K93J91P7l68Q0K8O0O8L27m5k93J5l00
3330c67L35J28m68J99J65j25K13n64N19l07L06k74M48k76m5L62l33j75K24q7J3
3351a09n9M37L9n63L15l46M31k07M5J47M5R5k4k49J9Q9l26L54J7l69j15M14O8
3374A48l01M55k84J24l54K83j6j91J86%J2n4l32K37M18l32o6K26Jj45PL44k34
3397A32k43M39l66R0J52j63k93K43K2J55m11L66M0l84O7L10j24nj40J90K28k18
$$ plain form
3419 87 125 105 -193 28 150 87 -44 169 -143 -141 91 -146 -213 199 -128 -8 47 265 -136 -62 -96 -74 23 -68
3443 -68 75 -146 192 -57 28 -76 -47 239 -87 82 4 66 344 -104 160 -139 84 -78 -105 -137 300 60
3465 60 295 -99 -124 192 -17 11 91 -224 -158 4 154 -5 -303 -69 -49 87 147 -14 126 -124 -22 318
3487 318 23 -174 -162 -91 144 -27 -95 -148 -146 -22 -17 -386 -96 -130 -95 39 86 -165 -38 63 116 117 57 -114 -436
3512 -436 -146 170 172 63 -263 313 27 55 -69 -215 41 -422 -91 87 103 -387 -164 6 -289 276 156
3533 156 199 -120 -17 -37 -54 -168 164 -130 -121 157 -15 -2 -140 83 167 -63 -8 -41 15 177 174 -90 80 71 150
3558 150 -31 -14 9 -49 -178 -3 176 98 -36 -146 366 -131 -48 5 -3 212 -74 159 45 51 91 225 -209 -1
3582 -1 104 55 -169 242 -366 169 -12 -235 -49 -133 359 18 -14 37 -408 -66 -216 260 -253 295 -176 -121
$$ packed form
3419H7L8k0k98K21J22o3j31K13l12KK32k37o7M12l27J20N5K18m01P4l4K2R7r1
3443f8J43k21L38k49Q5j04K9K86l26J69p8O2K78m48K64k99K23j62k7l2M37k40
3465F0K35l94k5L16k09K8Q0l15O6J62J50j59k98K34K0J36O0j61J40k50J02L40
3487C18k95j97J2P1K35j71o8n3KJ24Nl69K90l4L5J34M7k51J27J01N3Jo0j71l22
3512d36K90L16Kj09l26N76k86K8j24j46K56m63L31J78J6m90K23J70k95N65j20
3533A56M3l19J03k0j7j14L32k94RK78j72J3j38K23Q4k30N5l3N6J62lk64J70rP9
3558A50j81J7K3n8j29J75J79p8j34j10N12m97Q3N3qK15k86K33j14OM0J34m34K08
3582aJ05m9k24M11o08N35j81k23J86q4M92l41l2N1m45L42j50M76n13N48m71N5
$$ plain form
3604 -121 -49 -89 -157 265 -84 -72 204 -193 -26 198 -97 -182 263 342 288 -149 26 -17 158 23 71 -82 508
3627 508 -130 42 -500 174 -155 -55 492 -137 95 136 -116 -120 -235 99 -33 60 64 -118 136 51 153 -56
3649 -56 -171 -189 -26 27 16 194 155 135 -238 109 39 -224 -171 321 58 -37 -334 24 43 94 -130 42 73 159
3673 159 -179 -94 92 -224 -32 252 93 -106 -264 45 81 -66 365 -142 -112 98 216 -16 41 -168 29
3694 29 -56 30 -125 -105 -171 -159 -109 -197 -130 108 -71 239 247 -112 -330 -22 -80 -70 140 -121 -59 -160 108 60 12
3719 12 133 193 264 -113 -210 38 -59 46 395 -112 -462 -227 -92 245 -41 -76 -185 161 203 170 85 165 -160
3742 -160 -173 0 -47 -38 -115 315 -261 -58 67 -307 -89 -92 -234 -74 -78 -207 -223 -85 58 -33 -52 -80 -76 -175 -286
3767 -286 -33 -86 -137 -16 402 79 207 178 215 48 -271 -19 38 -156 -172 3 -101 -46 28 -354 -36 17 69
$$ packed form
3604a21P2m0o8M22l49J2K76l97J67K24k95q5M45P9n4m37J75m3J75j35M8j53N90
3627E08o38J72n42O74l29J00N47o29K32M1k52mj15L34j32R3Mj82K54q5J02k09
3649e6j15j8J63N3j1J78l9k0l73L47p0k63N3M92k63r5k97L58J9N1k24J72L1Q6
3673A59l38Q5J86l16J92K84j59j99j58L09L6j47M31n07L0K10J18k32N7k09J97
3694B9q5Q6j55K0o6J2N0q8O7K38j79L10Ql59k18L08n8J0K10k61O2j01K68m8m8
3719A2J21O0P1l77r7K48r7J05L49n07l50K35J35L37k86l5j09L46M2l3q5Q0l25
3742a60j3J73m7Rp7M30n76K03J25l74K18lj42J60mj29j6J38J43r1j9k8Mr9j11
3767b86K53n3n1J21M18l23J28k9L7j67l19K52N7j94j6J75j04N5P4l82L18N3N2
$$ plain form
3790 69 210 -95 -7 0 91 -242 4 -81 135 207 -82 -154 -183 -129 82 111 67 -204 -1 -39 -106 51 -375 -302 -165
3815 -165 175 -76 -36 76 291 -281 -41 -260 -280 -13 -43 -34 33 134 -57 -47 -124 -13 -1 52 1 -276 111 131
3839 131 42 212 -166 -186 78 148 -98 -108 -26 -105 -159 -72 -5 73 1 341 -103 -170 -36 -61 -68 28 -10 -17 -145 -56 -45
3866 -45 146 138 -142 243 265 31 -80 348 -210 -164 -24 -295 -198 199 -322 -291 36 -98 -11 152 111 200 -91
3889 -91 215 -30 -196 87 -57 -178 -73 61 -115 -41 -11 -67 -239 396 -28 -108 -30 -138 24 80 -58 81
3911 81 121 -48 -294 -235 123 219 10 -180 117 -369 277 103 -25 41 -123 73 -146 -49 32 -135 68 -252
3933 -252 -293 -275 -218 -7 -100 81 107 -246 672 -62 -133 -107 87 -50 -37 -39 -242 36 183 83 70 207 221 52
3957 52 -192 -262 -132 -9 -192 71 1 220 173 -78 -90 312 81 -94 -145 122 -241 -256 -209 -106 -104 -197 -59 -138
$$ packed form
3790F9J41l05Q8PR1l33K46q5K16P2k89p2k9N4K11K9m4k71K03l8o7J57m26P3J37
3815a65L40k51M0J12K15n72K40k19k0K67l0RO7J01j91J0p7J11J2N3n1k77L87K0
3839A31q9J70l78k0K64P0k46j0Q2p9n4Q7O7P8p2L40m44o7J34k5pR6l8pj28Q9J1
3866d5J91qk80L85K2k34j11M28n58M6J40k71R7L97n21L1L27j34Q7J63m1Q9k91
3889i1L06k45j66K83j44j21J05J34j76P4L0n6j72O35m24q0P8j08J62N6j38J39
3911H1M0j69k46N9L58R6k09j90K97m86O46j74j28O6j64J96k19R7Q1j67K03l20
3933b52m1J8N7K11r3J81K6l53R18p34p1K6J94j37J3kk03K78J47j00j3J37J4j69
3957E2k44p0J30J23j83K63p0K19m7k51j2M02k31j75n1K67l63j5M7J03Kr3J38p9
$$ plain form
3981 -138 -271 71 55 -141 -63 58 -118 268 -145 120 -220 191 -54 290 95 -129 -87 130 312 -159 5
4002 5 -212 -20 64 -80 -37 -201 337 193 220 204 -142 -240 -250 122 -98 51 -249 17 100 -111 33 -115 268
4025 268 -18 -371 287 42 13 246 15 -134 -316 118 347 -141 -61 115 39 123 -284 -12 -112 -275 175
4046 175 -131 56 56 41 -4 -141 -240 -253 5 348 -50 -106 133 -68 -4 -167 -195 153 180 -330 -5 56 3 -26
4070 -26 -147 173 172 -437 -60 -72 7 56 -314 120 -176 -130 -115 -97 -10 -1 -131 -204 7 175 -399 165 -283 -71
4094 -71 94 -196 54 -54 -110 36 -79 -132 77 155 162 -173 -101 -37 151 94 80 232 -112 -31 -86 -151 202 -97
4118 -97 45 306 48 -31 -166 -64 128 -23 15 -103 -147 194 70 239 43 -15 -224 -54 8 166 77 103 280
4141 280 57 -21 75 77 66 122 39 195 162 47 142 53 -46 126 401 -68 123 -211 73 -98 -316 55 375 31
$$ packed form
3981a38j33L42j6j96P8J21j76L86m13K65l40M11k45L44j95k24M2K17J82m71J64
4002Ek17J92Q4j44M3j64N38j44K7j6l46r8j0L72k20J49l00K66Q3k11J44j48L83
4025B68k86l53O58k45k9K33k31j49j82M34K29m88Q0J76p6Q4m07K72j00j63M50
4046A75l06J87%j5m5j37r9j3K58L43l98n6K39k01O4j63k8L48K7n10L25O1n3k9
4070b6j21L20jo09L77j2P9M9l70M34k96M6J5J8Q7Rj30p3K11J68n74N64m48K12
4094g1J65k90K50j08n6J46j15n3K09P8Pl35P2O4J88n7j4J52l44Q1n5o5L53k99
4118i7J42K61k58p9j35J02J92j51L8j18m4L41j24J69j96n8k09J70O2J58q9K6J77
4141B80k23p8R6Kj1N6q3J56l3j15R5q9r9J72K75m69J91l34K84j71k18L71L20l44
$$ plain form
4165 31 -131 49 58 66 -47 43 47 -159 -142 -271 -231 -174 -186 -77 -189 170 -277 -40 -66 101 115 26 -25 125 -115
4190 -115 -264 140 -79 99 151 131 278 -189 204 380 -7 -78 -74 -183 75 103 56 -166 -168 -324 -172 121 193
4213 193 160 -157 55 62 86 192 -103 -143 7 225 214 126 -282 -31 -433 -230 80 158 34 -107 80 200 5
4236 5 -19 -182 -7 86 160 -166 -208 359 -60 87 251 -269 -207 13 -315 274 138 -221 53 -26 -186 -2 -355
4259 -355 13 160 374 167 39 183 -139 232 -115 94 -144 -254 177 -137 -120 126 -22 126 -104 -279
4279 -279 -29 44 -76 279 118 23 295 75 -94 -20 -110 -129 93 -232 74 152 -80 95 -255 -124 110 -62
4301 -62 29 43 88 -375 79 -237 65 47 13 66 74 -208 24 -35 23 -73 -379 -278 -572 -273 141 -1 -149 -355
4325 -355 -162 127 -89 123 -18 -277 -13 42 -77 157 8 127 -116 107 -142 -36 -164 -43 129 -86
$$ packed form
4165C1j62J80RQj13R0Mk06J7j29M0N7j2J09j12L59m47K37k6J67J4q9n1J50k40
4190a15j49M04k19J78N2k0J47m67L93J76l87p1Mj09K58K8m7k22kj56J52K93P2
4213A93l3l17K12PK4J06k95m0J50K18j1q8m08K51m02K03L10P8j24j41J87J20j95
4236Ek4j63J75R3P4l26m2N67m19J47J64n20O2K20l28N89j36l59K74p9j60J84l53
4259c55L68J47K14k07j28J44l22L71l47K09k38j10M31l14J7K46j48J48k30j75
4279b79K50P3j20L55j61r5K72k20j69P4r0j9K22l25L06P8k32J75l50J31K34j72
4301f2R1J4M5m63M54l16L02j8l4N3Qk82K32n9N8r6l06J01k94K99M14j42j48k06
4325c55J93K89k16K12j41k59K64N5j19K34j49J19k43K23k49J06j28J21J72k15
$$ plain form
4345 -86 -44 8 14 100 55 -56 80 -98 89 15 185 -290 -1 -25 81 -45 -139 -118 -83 75 102 -163 -31 305
4369 305 86 -101 -323 126 12 -55 -4 54 107 185 -23 -6 -36 -156 209 416 -287 -351 22 -23 382 -180 3
4392 3 -83 -175 98 31 90 -59 -366 136 167 29 -80 -115 -207 13 127 -77 -51 -39 266 42 -8 -114 -32 26 -225
4417 -225 -300 323 87 -41 -1 58 76 -119 -230 -72 172 -79 -104 -2 -151 -64 -133 84 -115 -105 -49 101 -116
4440 -116 84 129 -18 135 -133 -189 -19 84 75 154 159 116 -273 -59 -47 -75 2 174 59 121 11 -214 0 118
4464 118 -162 272 -325 -12 42 -14 -15 -161 -102 115 207 120 -158 73 154 -217 -264 -42 -107 85 62 -81 -74 -297
4488 -297 -206 208 -305 374 210 210 -83 172 -153 -357 -146 -234 -269 158 -214 -220 51 -3 13 -295 -50 223 -286
4511 -286 -97 -159 72 -93 -37 -9 213 -3 -99 -246 -129 -75 189 -150 -108 64 -67 -115 -117 -90 204 15 180
$$ packed form
4345h6M2N2OQ6m5j11J36j78J87p4J70m75K89k4J06j26r4K1L5J58K7k65J32L36
4369C05k19j87k22M49j14o7N1N8N3P8k08J7l0j20L65K07p03o4L73m5M05n62J83
4392Cq6r2K73o7N9j49l07N02L1j38j09l5r2K20J14k04K6J2L05k24n0j06Q2N8k51
4417b25p5O23k36j28M0N9J8j95j11J58K44k51k5J02j49Q7o9K17j99J0N6J50k17
4440a16K00M5j47J53k68n6J70J03rP9Nm3l89K14J2k8P7J72j15O2j10k25K14J18
4464A18k80M34n97L13N4n6jj46N9K17R2q7k78K31Q1l71m7K22o5J92k3j43Pk23
4488b97R1M14n13O79j64%k93K55l25k04K11q8l5M27l72oK71n4J6l08K45K73n09
4511b86J89o2K31j65N6K8K22k16r6j47J17N4K64l39M2J72j31m8kK7K94j89J65
$$ plain form
4534 180 -59 -106 -97 -300 -26 -42 315 -22 -130 -12 19 -3 237 168 -92 -154 -341 228 -122 105 118 133 -38
4557 -38 162 275 304 -179 -104 -30 61 436 49 192 42 -40 88 238 -132 276 73 -433 125 -171 13 33
4579 33 -260 -65 -172 -116 309 211 -105 -70 49 -62 -114 82 65 178 81 72 57 -252 41 -115 155 -103 89
4602 89 92 188 -33 39 56 13 78 -4 129 -9 44 -59 -302 259 151 -297 41 200 -174 -116 -82 -67 319 44
4626 44 -115 299 14 150 187 -155 -182 14 106 -246 -202 478 -85 -98 -213 -86 -29 184 27 80 5 102 346
4649 346 -34 91 211 -41 -30 373 339 314 0 144 170 -31 -265 -95 16 351 -38 -29 341 78 77 -188 113
4672 113 23 -42 -172 -138 -83 -34 54 123 103 107 221 94 217 22 -62 281 220 -55 -82 150 -106 -124 32 -50 -92
4697 -92 239 134 -159 14 133 241 305 100 -244 -9 -106 -21 -226 -86 154 135 66 212 -45 210 149 -168
$$ packed form
4534A80k39m7Rk03K74j6L57l37j08J18L1k2K40o9k60o2j87N69l50K27J3J5j71
4557c8K00J13K9m83P5P4R1L75l87J43j50q2J28J50l70M08k03n06N58k96J84K0
4579C3k93J95j07N6M25r8l16L5J19j11n2J96j7J13r7rj5l09K93j56K70k58J92
4602H9LR6k21P2J7m3O5q2J33j38N3j03k43N61j08m48L38J59l74N8L4J5L86k75
4626D4j59M14k85J36L7l42k7J96R2l52M4O80n63j3j15J27N7K13j57N3p5R7K44
4649C46l80J25J20k52J1M03l4k5l14J44K6k01k34J70J11L35l89RL70k63jk65L01
4672A13r0o5j30L4N5M9Q8O9k0MJ14j27J23j95q4L43o1k75k7K32k56j8J56q2m2
4697i2L31j05k93J73J19J08O4k05l44K35r7Q5k05J40K40j9o9J46k57K55o1l17
$$ plain form
4719 -168 89 -32 -311 361 -47 -196 3 166 -49 84 3 -268 145 174 -66 -28 134 0 183 -255 -5
4740 -5 208 -182 -210 238 -34 245 92 124 17 -3 74 98 331 208 -125 125 93 -216 -277 318 127 247 98
4763 98 -92 28 186 -98 105 216 -175 -62 -314 134 -62 -165 -71 -38 -122 -72 75 -163 374 186 -130 -196
4785 -196 -56 -180 19 -44 -359 175 -52 228 36 133 -115 -422 -9 -276 94 -11 -68 109 109 -58 -19 -59
4807 -59 -173 155 77 36 131 -53 -57 217 -263 13 185 -50 -279 -119 -129 104 -27 -80 222 217 4 52 -9 174
4831 174 48 -65 111 97 29 64 95 43 -161 -166 292 290 -214 -105 52 146 -53 -466 -46 -164 -28 -136 -12
4854 -12 -433 12 -11 -398 -278 -92 74 -48 45 39 136 -6 230 340 -102 99 -141 -170 436 -293 12 -114
4876 -114 207 238 -8 -177 103 -54 -319 55 -52 24 37 100 -20 52 -196 -4 -108 234 79 -206 68 -148
$$ packed form
4719a68K57j21k79O72m08j49J99J63k15J33q1k71M13K9k40L8J62j34J83m38K50
4740eK13l90k8M48k72K79j53L2j07k0P7K4K33j23l33K50l2l09o1N95j91J20j49
4763I8j90J20J58k84K03J11l91J13k52M48j96j03R4L3q4N0J47k38N37j88l16o6
4785a96J40j24J99o3l15N34k27K80j92R7k48l07M13k67L70j05n7J77%j67L9m0
4807e9j14L28p8m1R5j84mK74m80K76J72k35k29J60j0K33j31n3L02nk13M8o1J83
4831A74j26j13J76j4o8L5L1n2k04nM58kn04J09J57R4j99m13M20j18J36j08J24
4854a2m21M45k3l87J20J86J66j22R3oR7j42K36J10m42K01k40k9O06p29L05j26
4876a14L21L1k46j69K80j57k65L74j07P6J3O3j20P2k48J92j04L42j55k85K74k16
$$ plain form
4898 -148 259 113 -143 -3 29 141 -325 105 -176 -281 2 -342 -123 30 -469 228 362 216 116 74 -341
4919 -341 86 -110 72 147 -178 -62 -166 196 -239 65 115 -48 -39 151 -54 169 187 18 -3 95 -6 -291
4941 -291 255 19 -89 111 -88 217 150 -27 -171 154 20 75 -264 -70 28 -250 -32 -261 -96 -239 -134
4962 -134 48 195 -108 -76 -76 47 -165 -210 -68 -141 216 -146 -420 -181 -93 -153 17 215 10 159 -103 -88 130
4985 130 129 -52 -134 87 -219 0 32 -98 -78 138 75 71 -30 -111 99 -85 104 -150 -105 178 -79 -100 148 -17
5009 -17 280 59 155 4 318 19 117 49 -340 -145 -19 164 226 -187 144 117 -15 -105 63 -153 -78 30 163
5032 163 -50 -64 -170 -40 267 54 47 -259 214 247 -30 26 -292 255 -64 -10 290 36 147 130 -193 -237 -200
5055 -200 128 -225 -4 324 36 -22 -179 -101 -48 -10 -26 -51 -115 38 -78 -141 -124 -99 313 128 112 99 -70 253
$$ packed form
4898a48M07j46k56J40L2J12m66M30k81j05K83l44K19J53m99O97J34j46j00m2m15
4919c41M27j96J82P5l25J16j04L62m35L04N0j63RJ90k05K23J8j69k1R8j01k85
4941b91N46k36j08K00j99L05o7j77j44L25j34N5l39J94R8k78K18k29J65j43J05
4962a34J82J47l03L2%J23k12m5J42p3L57l62k74K39Q8o0J70J98k05J49k62J5K18
4985A30jj81q2K21l06K19L2j30K0K16o3mj01q1K10j84J89k54M5K83k57k1K48j65
5009a7K97k21R6j51L14k99R8o8l89J95J26J83O2m13L31k7j32r0J68k16P5J08J33
5032A63k13j4j06J30L07k13pl06M73L3k77N6l18N47l19N4L00k54J11j7l23m4L7
5055b00L28l53K21L28k88n8j57P8N3L8j6k5o4J53j16o3J7K5M12j85j6j3j69L23
$$ plain form
5079 253 -426 -97 86 -80 95 -133 -170 105 6 -257 -54 -47 112 161 129 51 236 69 -71 -141 -19 -72 186
5102 186 128 -243 -83 19 8 -187 -180 -34 -146 -103 39 -218 -69 91 135 231 -128 -185 57 272 -250 -432 256
5125 256 -106 -87 -123 -388 -89 197 75 19 -227 -64 -10 -4 136 -11 50 -273 -4 169 80 167 -117 33 -276
5148 -276 12 116 -113 295 159 121 264 -84 -213 24 -187 -52 -345 94 9 232 148 50 -6 93 -71 27
5170 27 399 -283 -20 1 -184 88 112 75 81 -134 116 33 160 -14 24 195 -107 67 -207 48 -22 246 -535
5193 -535 -98 -153 -90 291 -376 74 -111 212 61 -352 206 37 89 140 -222 -64 -441 -13 -13 7 -208 -210 148
5216 148 -42 167 -62 -50 -17 23 130 16 -203 76 -374 -32 -155 -24 112 -323 -102 -84 -89 -176 -96 5 -54
5239 -54 158 152 198 146 -127 113 -28 302 -85 -2 -13 188 82 -63 -68 276 11 -49 135 -191 -2 -42 -78 198
$$ packed form
5079B53o79L29J83j66J75k28l7K75r9k63K03PJ59M9l2p8J85j67j40p0J22n3K58
5102A86n8l71J60J02j1j95PJ46j12M3J42k57J49J60M4R6l59n7K42K15n22j82O88
5125B56l62J9l6k65K99K86j22n6k46J63N4OJ40j47O1l23K69J73q9Q7k84J50l09
5148b76K88J04k29M08j36l8J43l48j29K37k11J35k93M39q5K23q4r8n6R9j64R8
5170B7L72o82K63K1j85K72K4l7Ok15K50q3J27j74L8J71l02J74k74K55p0K68p81
5193e35M37n5O3L81o67M50j85L23j51m13N58j69N2N1l62J58l77M28%K0k15kL58
5216A48j90K09k29J2L3M0J07j14k19K79m50L42j23J31J36m35K21J8nq7Q0J01n9
5239e4K12oM6n2k73K40j41L30l87Q3j1K01j06j45nL44k65o0J84l26J89m0l6K76
$$ plain form
5263 198 99 15 -230 -6 -106 34 -198 75 76 -352 -363 -290 102 -45 -204 364 -148 -46 -46 64 60 66 214 -232
5287 -232 -74 -162 29 255 1 56 69 -289 -215 -46 108 -41 23 -141 126 -9 -168 -239 -5 71 -111 80
5309 80 82 84 -294 -24 141 -239 156 -174 -180 -91 22 153 22 -71 -121 -36 -79 249 -59 35 63 -280 -2 110 161
5334 161 51 -174 173 -108 110 332 -6 75 42 105 178 58 396 8 128 -87 256 -75 -74 -371 -12 76
5356 76 62 -117 -66 -152 25 -67 -96 -384 -120 327 5 -42 -330 -174 239 -147 -47 -155 -39 71 85 26 -145
5379 -145 -342 218 -29 114 393 -59 153 -278 -159 -186 114 -140 89 -125 129 319 376 -95 246 -25 21
5400 21 -86 280 44 68 167 16 170 108 -60 -25 -138 138 233 223 261 81 -171 -239 -19 -64 -33 -51 43 133 59
5425 59 272 58 -14 330 58 1 59 -497 89 -106 -81 161 -42 69 83 -109 -275 -152 15 30 -307 3
$$ packed form
5263A98r9q4k45K24j00J40k32K73Jm28j1P3L92j47j59N68n12J02%J10mOJ48m46
5287b32J58q8J91K26k54N5J3l58P4J69J54j49O4j64K67j35j59p1K34P6j82J91
5309H0KKl78K70J65l80L95l30oQ9J13J31j31r3n0Q5m3L28l08R4K8l43K78J12N1
5334A61j10k25L47k81K18K22l38Q1l3O3P3j20L38l88J20k15L43l31Jk97L59Q8
5356G6j4j79N1q6J77r2k9k88K64M47l22m7k88J56M13l86J00j08J16J10J4n9j71
5379a45j97N60k47J43K79m52K12m31J19k7L00k54K29k14K54J90N7m71L41k71M6
5400B1j07L66k36K4R9j51J54o2j68L5j13K76R5j0L8j80k52o8K20m5L1j8R4R0p4
5425E9K13k14p2L44k72n7N8n56N86j95K5K42k03J11J4j92j66J23J67J5l37L10
$$ plain form
5447 3 -32 138 -48 -183 -2 160 124 -13 189 -205 38 -140 -231 114 -70 96 66 77 204 102 174 39 -146
5470 -146 -41 -248 11 111 -12 -78 -53 -278 -173 30 74 -117 -41 -194 -37 -125 -237 -144 -64 -102 -97 3 -86 -220
5494 -220 -28 46 -154 209 10 332 -50 -93 126 -104 -232 0 51 457 -136 -36 174 -144 150 214 185 139
5516 139 240 137 -165 16 68 125 3 28 -33 15 77 -264 339 -18 130 -32 -395 362 -204 125 71 -133
5538 -133 49 -164 18 -54 142 51 98 9 -140 176 116 -91 0 175 358 -114 -176 76 -186 100 17 183 -57
5561 -57 -9 -54 -219 -96 165 -51 -112 -3 -46 -105 295 71 -33 185 89 84 130 -259 406 -47 29 5 168 -156
5585 -156 47 190 72 -26 97 159 41 -29 86 51 142 -24 344 85 0 146 -52 165 -29 391 -37 137
5607 137 41 -201 -90 -93 246 105 -245 -4 -14 55 -76 87 -24 -267 369 148 16 -231 12 -316 190 -77
$$ packed form
5447Cl5J70j86j35J81J62l6j37K02l94K43j78r1L45j84J66l0J1J27j02P2j35j85
5470a46J05k07K59J00j23o6K5k25J05K03M4j91P6j53J57q8j12R3Q0l8NJ00q9j34
5494b20J92P4k00L63j99L22l82m3K19k30j28K32N1M06n93J00K10l18K94O4k9m6
5516A39J01j03l02J81N2N7j22K5o1M8O2l41O03l57J48j62l63P57n66L29n4k04
5538a33J82k13J82p2J96r1M7q9j49L16o0k07R1J75J83m72o2K52k62K86q3J66k40
5561e7M8m5j65J23K61k16o1J09m3n9M00k24j04K18r6nM6l89O65m53P6k4J63l24
5585a56K03J43j18r8J23O2j18p0J15l5R1j66L68k59q5J46j98K17j94M20m28J74
5607A37r6k42J11lL39j41l50K41j0O9j31J63j11k43O36k21j32k47K43l28N06k67
$$ plain form
5629 -77 169 -177 83 177 -123 42 383 88 -155 -390 -217 -87 -274 -221 -247 37 9 36 110 28 111 -201 -244
5652 -244 -373 -174 18 -295 182 -258 93 379 132 -324 -584 273 83 168 -23 65 -75 -88 105 258 9
5673 9 -66 -171 -31 75 -20 -196 -200 72 10 -61 15 29 -7 -127 -135 148 -326 -109 -151 251 29 251 -198 65 35
5698 35 -33 257 37 110 82 -207 117 108 216 -82 -176 81 70 -69 -148 36 -4 187 65 100 142 -80 -136 40
5722 40 -90 -32 -144 285 14 114 76 17 -79 -72 3 -149 -210 -224 -132 -5 -205 -177 -38 -16 122 -161 -14 53 -92
5747 -92 -20 -12 -121 14 73 24 327 235 -51 60 -334 -356 -168 -401 0 92 15 -85 259 -24 21 -6 223 261
5771 261 -19 -41 -325 61 130 299 179 232 -79 248 -1 80 -178 -193 -107 -185 -11 205 -146 -55 395 29 55
5794 55 179 205 -293 142 -34 -63 126 -124 58 78 -252 -12 -194 -179 -116 -31 225 44 11 362 201 35 -14
$$ packed form
5629g7K46l46K60R4l00J65L41k95k43k35J73J30j87N3k6K84k8K7P4q2Q3l12m3
5652b44j29J99J92l13M77m40L51K86k47m56k60Q57j90Q5j91Q8j40j3J93J53k49
5673Ip5j05J40J06r5j76mK72o2p1P6J4l6j20qK83m74K17m2M02k22K22m49K63l0
5698C5o8K90k20P3k8k89L24rJ08k98r4K57j1j39p9J84m0J91j22L5M2k22n6J76
5722D0j30N8j12M29k71J00l8n9r6PP5j52o1j4R2J27k00K8J39K2J38k83J47O7j45
5747i2P2Qj09J35N9m9L03r2k86J11l94k2J88k33M01R2p7j00L44k83M5k7K29L8
5771B61k80k2k84L86O9J69j20N3l11L27k49Q1k58j5Q6p8J74K16l51R1M50l66K6
5794E5J24K6m98M35j76k9J89k50J82K0l30K40j82J5O3Q5K56j81l3L51j61j66m9
$$ plain form
5817 -14 186 65 72 -159 133 163 176 -183 -113 -9 -58 -88 5 87 211 191 268 245 -53 171 -307 97 33 27 -221
5842 -221 14 167 -47 -117 269 -29 -83 43 284 -97 84 96 64 205 -96 -134 -134 147 -149 -34 65 121 225
5865 225 30 22 -91 -17 -1 -191 3 -147 -98 9 -95 132 -47 -74 -35 -43 149 267 -86 -93 -93 -98 -205 -56 75
5890 75 71 -229 -255 50 -365 186 149 20 -214 -22 -98 -30 -25 59 54 201 255 11 -11 -280 60 -16 44 -270 -70
5915 -70 -140 -44 2 -391 -79 -168 53 8 -22 -3 -195 -4 106 125 88 216 -326 -107 131 -183 -35 -149 -462
5938 -462 163 -76 -169 -29 -248 157 -186 60 98 -89 107 377 -20 -95 148 -8 49 5 143 302 178 -129
5960 -129 -73 81 -49 -219 241 -159 -278 70 -150 71 -46 37 194 -111 -92 -226 -26 -195 257 21 -92
5981 -92 -2 27 -17 -11 67 94 -110 119 -146 -128 -128 223 14 30 -210 141 59 135 233 -53 -101 -4 -24 -8 65 -235 173
$$ packed form
5817a4K00j21Pk31K92L0J3l59P0J04m9l0R3Q2J24k0P7k3k98K24m78M04o4ok48
5842b21K35J53k14p0L86k98n4J26K41l81J81J2l2J41l01l8%K81k96J15R9N6J04
5865B25j95qj13P4J6j90J94j50M9J07j04K27j79k7L9qJ92J18l53p%nj07J49J31
5890G5ml00k6L05m15N51l7j29k34J92p6O8NQ4nJ47N4k44k2k69L40p6O0l14K00
5915g0p0R6M6l93L12q9K21m5l0J9j92J91J10J9l7J28n42K19K38l14J48j14l13
5938d62O25k39r3J40k19M05l43K46L8j87J96K70l97p5K43j56N7m4J38J59j24l07
5960a29N6J54j30j70M60m00j19L48k20K21j17Q3J57l05J9j34K00j69M52k36j13
5981i2R0K9m4OP8K7k04K29k65J8%L51k09J6k40L51q2P6R8k86m8R7k0J6P3l00M08
$$ plain form
6008 173 66 -88 116 131 -26 -423 -144 -96 -241 -218 25 60 -103 264 -86 159 56 31 -1 40 -221 112
6030 112 -128 -16 -81 -97 -292 229 -136 199 -106 24 -176 -68 -56 106 -177 96 -86 287 -142 163 130
6051 130 76 -194 -154 137 65 132 -261 29 56 -58 202 430 -87 208 4 -142 -332 -77 -206 344 268 59
6073 59 125 42 -140 100 95 144 -124 185 106 59 142 -68 -15 -208 42 -182 85 -102 -128 -43 13 99 127 47 -121
6098 -121 120 20 55 -284 -301 146 -36 -86 73 142 114 -109 -145 -36 274 -111 72 -8 20 -271 -223 -76 -93
6121 -93 -143 25 -5 399 -4 64 133 181 69 -238 -11 -321 -165 3 166 93 -91 -25 192 -6 -189 219 -6
6144 -6 -39 360 182 -138 42 12 -20 -227 191 -4 93 102 178 40 -238 -18 -5 -27 193 -118 -153 53 -13 -274
6168 -274 -201 -57 -5 -172 91 183 110 144 140 23 -107 -175 20 263 116 32 -122 9 -254 -50 0 13 -159 -29
$$ packed form
6008A73j07j54K04J5j57l97K79M8j45K3K43L5j63L67l50K45j03k5l2M1k61L33
6030A12k40J12o5j6j95N21l65L35l05J30k00J08J2J62k83K73j82L73m29L05l3
6051A30n4k70M0K91p2O7l93K90K7j14K60K28n17K95k04j46j90K55j29N50p6k09
6073E9O6q3j82K40nM9k68L09p9m7Q3k10N3j93K50k24K67j87k6Q5N6Q6K8q0j68
6098a21K41j00L5l39j7M47j82n0J59O9k8k23l6J09L10l85J83q0K8k91M8J47j7
6121i3n0J68l0M04m03O8O9M8j12l07K27l10J56J68J63p3j84O6K17j98j83M08k25
6144fl3L99j78l20J80l0l2k07M18j95R7RP6j38k78K20J3k2K20l11l5K06o6k61
6168b74P3J44N2j67K63R2p3L4mj17j30o8J95K43j47q4j54J31k63K04N0J3j72J30
$$ plain form
6192 -29 -135 35 -204 -14 -292 -106 -88 17 -96 -148 208 47 147 -270 63 -242 -88 -103 -108 195 -71 231
6214 231 54 4 -38 -33 -223 -66 -306 -351 27 238 -298 288 -309 -125 -42 112 392 -125 -56 311 -197 58
6236 58 -274 -212 -49 -46 0 -183 20 -164 -65 -254 126 269 195 359 70 -43 5 97 -54 -131 -9 15 31 217
6260 217 -5 -38 96 -31 52 -349 -102 51 -269 -38 1 -22 60 241 -120 111 81 -304 33 115 27 146 -11
6283 -11 -289 79 299 83 -180 384 -86 -11 101 150 122 -193 -353 -26 -168 -43 -53 74 224 -197 134 -85
6305 -85 -15 -167 36 72 -25 -94 188 -14 196 173 -170 -183 130 -201 -30 65 -37 71 -25 266 -202 -90 -1
6328 -1 258 98 63 121 -113 35 -308 -263 4 244 385 252 259 -110 223 -180 53 284 -281 215 -63 -86 -48
6351 -48 -10 -26 58 -404 200 -68 -83 -44 159 149 -251 -249 96 114 3 242 -55 -237 109 -361 -77 132 -146
$$ packed form
6192b9j06J70k39J90k78J86J8J05j13n2L56j61J00m17L33l05J54j5nL03k66L02
6214B31j77n0m2Nj90J57k40m5L78K11n36N86n97J84Q3J54K80n17O9L67n08K55
6236E8l32O2J63LM6j83K03j84R9j89L80J43p4J64k89j13M8R2j51p7J22K4J6J86
6260B17k22l3J34j27Q3m01K47J53l20K31L9k3Q2J81l61K31l0l85L37Q2q8J19j57
6283a1k78L68K20k16k63N64m70P5J12M9k8l15j60L27j42J25j0J27J50m21L31k19
6305h5P0j52K03L6r7o9K82k02K10k3l43j3L13l31J71R5j02J08r6K91m68J12Q9
6328aK59j60l5N8k34J48l43M5K67K40J41j33Pl69L33m03K33K31n65M96k78k3L8
6351d8L8j6Q4m62O04k68j5L9K03j0m00KL45J8j11K39k97j82L46m70K84K09k78
$$ plain form
6374 -146 -105 -277 -84 -16 -125 -30 -112 -206 24 -130 25 -176 70 -158 -146 -295 -362 -46 512 410 -110 224
6396 224 135 25 -38 -66 335 -104 -53 -276 69 -94 -56 161 -271 -108 -66 -84 -29 19 211 143 -222 60 -190
6419 -190 104 67 -30 73 95 -50 -12 -2 161 317 1 78 -327 -155 203 -162 -256 67 -259 -112 -82 158 -204
6442 -204 43 75 77 97 -55 273 78 -176 -100 -25 -7 -37 -84 -86 -150 -96 214 -44 -121 263 321 102 -165 -389 25
6467 25 68 -289 -132 -26 -22 -169 65 23 26 -142 121 1 -209 -238 33 -1 85 57 -289 -297 -27 -278 16 51 -189
6492 -189 -227 -78 51 -308 -116 207 80 -35 -64 49 217 -134 -87 131 288 0 348 87 -198 163 -132
6513 -132 -106 51 -139 190 -41 -60 37 43 187 75 -297 340 255 -16 -119 74 -65 306 -197 178 6 -240
6535 -240 -23 -11 -28 90 77 74 -20 -24 -111 -88 322 66 -106 -283 -209 247 99 -25 118 -180 203 190 118 176 -216
$$ packed form
6374a46M1j72J93O8j09R5q2r4K30j54J55k01K46k28J2j49o7L16N58j02n20L34
6396B24q9j10o3k8M01m39N1k23L45j63L8K17m32J63M2j8N5M8J92o8l65K82k50
6419a90K94l7r7J03K2j45L8J0J63J56l16P7m05J72L58l65r4L23l26J47L0K40l62
6442b04K47L2KK0j52L28j95k54P6P5J8l0m7ko4N4L10k58p7L84N8k19k67k24M14
6467B5M3l57J57J06Mj47K34m2Lj68K63j20k10k9K71l4Q6k8l46qK70k51K94L5k40
6492a89l8J49J29l59J92L23j27j15k9J13J68l51M7K18J57k88L48k61k85L61k95
6513a32K6J57j90L29k31j9R7OJ44j12l72O37q5k71j03J93j39L71n03L75j72k46
6535b40K17J2j7J18j3lr4mq7K3M10k56j72j77P4M56j48j24J43k98L83j3p2N8l92
$$ plain form
6560 -216 40 -55 -75 -74 424 330 59 22 47 -34 103 -55 74 20 -323 266 83 -23 177 -233 50 27 -127
6583 -127 120 -58 -59 14 189 -201 244 -148 53 173 85 33 -72 146 88 121 -91 -214 -176 -232 150 171 175 9
6607 9 -111 -55 383 108 56 -187 -98 30 -164 124 92 320 -74 -107 -160 51 -29 -147 -46 121 143 -98 226
6630 226 236 307 295 57 -45 -107 -55 -121 -275 -152 107 -26 12 219 350 -48 204 186 -133 124 95 177 79 157
6654 157 -221 -40 258 242 133 85 50 -283 47 82 199 -25 -213 -366 -275 109 79 43 203 -4 198 -203
6676 -203 -30 33 -118 -274 -134 -8 -82 339 -145 -159 113 -38 -111 -7 -85 -37 257 -124 143 -2 121 61
6698 61 -24 163 83 27 230 -194 -77 54 -282 74 -192 85 -155 -127 32 296 -60 -19 -108 30 -17 328 -103
6721 -103 -1 82 198 67 -96 -230 -41 -93 -159 -349 -105 -133 -133 -102 -208 -154 10 -274 -5 -214 -188 -31 2
$$ packed form
6560b16K56r5k0JM98r4k71l7K5q1J37j58J29n4l43N89j83j06K00m10K83k3j54
6583a27K47j78jP3J75l90M45l92K01J20q8n2j05K18n8L3k12j23L8n6L82K1Mj66
6607Ij20N6M38k75n2k43Q9J28j94K88l2K28l94l3n3K11q0j18J01J67K2k41L24
6630B26J0P1j2k38j02o2N2o6j54J23K59j33L8K07J31l98K52j8l19K57k9Q2r8P8
6654A57l78J81K98j6j09m8l5l33L30L5J17k24j88j53R1L84l0l6J60k07K02m01
6676b03J73O3j51j56J40J26p4M21m84j4K72j51p3J04p8M8K94l81K67j45J23o0
6698F1q5J87q0n6K03m24J17J31l36L56k66K77k40K8J59K64l56M1q9J38m7L45m31
6721a03J02Q3J16j31j63j34J89n2o6j90K44k8%L1j06N4J64k84K69k09K6J57L3
$$ plain form
6744 2 -22 -16 48 69 71 21 149 194 103 -49 -7 -236 -126 52 -252 43 -67 -178 21 -237 5 -214 -78 48
6768 48 9 -116 -161 73 -14 155 86 -68 30 186 -37 -202 52 110 120 -93 -79 -69 115 160 -8 2 187 71
6792 71 414 -316 -127 104 -148 303 109 -4 77 100 107 -134 148 43 62 20 -43 -119 -7 -22 -4 25 145 -15
6816 -15 246 -91 -81 118 -85 67 -116 -26 75 234 -413 104 296 -110 32 167 49 77 -220 186 134 60
6838 60 4 55 -261 -86 76 -94 -163 12 -65 27 -55 -134 -86 78 -90 -309 -123 -26 30 148 76 429 -115 -180
6862 -180 308 157 96 60 94 53 224 -228 161 -187 -85 297 51 292 34 -187 241 -20 -91 -8 15 75 121
6885 121 -30 12 263 8 57 113 217 66 -80 215 86 290 195 -30 146 -99 -125 -30 -195 32 -99 -235
6907 -235 221 -95 -58 -58 -52 8 -200 417 166 116 -48 260 -37 -18 -140 31 51 158 134 -186 174 -304 13
$$ packed form
6744Bk4OO4K1Kn0J28M5r1j52M2k29J10J78l04K95j10j11J99k58K42k19J36J26
6768D8l9j25m5K34q7J69o9j54R8J56k23j65K54N8J0k13J4J0J84M5j68J0J85j16
6792G1L43p30J89K31k52M51j94j13Q1K3Pk41K82j05J9m2o3p6J12j5J8K9J20j60
6816a5K61l37J0J99k03J52j83R0J01J59o47N17J92m06J42J35j18K8k97M06n2p4
6838F0n6N1l16J75J62j70o9J75p7R2q2p9M8J64j68k19J86R7N6J18p2L53n44o5
6862a80M88j51o1l6L4m1J71m52L89l48J02L82k46K41k58k21M28k61p1Q3K3O0M6
6885A21j51M2K51k55M9N6J04j51j46K95j29K04r5k25J76k45k6R5j65K27j31j36
6907b35M56l16L7%OO0k08O17k51n0j64L08k97J9j22J71K0J07k4l20L60m78L17
$$ plain form
6930 13 -51 4 -81 241 334 -33 70 -49 60 -192 284 -95 -154 -44 -5 -73 157 147 -135 -2 282 145 -69
6953 -69 -349 -149 112 -136 162 -144 -101 230 -2 335 107 198 134 129 -193 -91 53 242 -107 -104 -48 -79 142
6976 142 -242 8 -242 216 30 66 -396 -42 -85 217 -168 -180 -41 -83 271 -25 -183 -220 -90 211 -242 126
6998 126 -95 173 -199 -94 32 -132 -25 -141 -358 333 234 -339 -34 310 188 183 151 92 -115 -138 -85 -59 -42
7021 -42 -84 22 -167 102 209 91 160 -196 -154 -63 25 -17 48 -194 -179 -216 157 31 -110 -49 -61 -38 -13 264 56
7046 56 101 50 403 210 -158 436 155 39 104 -93 -224 86 155 141 319 57 -15 -57 202 88 126 16 -111
7069 -111 -51 113 -255 421 113 59 33 24 199 39 -98 110 44 -26 -64 74 -10 164 -237 -250 -75 -127 19 27
7093 27 -298 15 -59 224 42 56 252 174 287 46 -310 -169 258 -75 -203 -151 44 -239 -297 44 -136 -78
$$ packed form
6930A3o4N5q5L22R3l67J03j19J09k52M76l79n9J10L9o8K30j0k82J33K84j37k14
6953f9k80K00K61k48K98l06M3L31k32L37k28R1o4nl22J02J44J89l49LN6l1K21
6976A42l84K50k50M58j86L6m62L54m3L02l85j2J39m2L54k96j58l7J30L01m53L68
6998A26k21K68l72J05J26j64J07j16k17O91r9n73L05L44j22nl2n9k07k3N3K6J7
7021d2m2J06j89K69J07j18O9l56M2R1Q8m2O5k42J5l7L73j26j41O1j2K3K5K77k08
7046E6M5n1L53j93l68N94k81j16O5j97j31L10O9j4J78k62p2m2K59j14L8j10j27
7069a11O0J64l68O76l08n4k6rJ75j60j37K08o6p0l8J38q4J74m01j3J75n2J46Q
7093B7l25L13p4K83j82J4J96p8J13k41l56J41M27l33j28N2J95k83n8L41j80N8
$$ plain form
7115 -78 -57 -225 -73 85 71 26 65 362 35 -76 108 413 129 88 -44 137 83 -77 82 179 -106 232 -160
7138 -160 -16 -158 77 -92 -50 -225 137 -51 -34 -121 -120 80 8 141 -161 72 -52 137 268 -166 5 -47
7160 -47 -81 -163 -326 -224 -31 -17 -1 210 -82 -86 95 -69 -29 -103 265 -111 -301 -131 61 -49 158 -304 -146
7183 -146 -19 -77 -89 -89 -209 -27 62 -150 32 156 -143 110 -47 120 133 135 -119 -128 -237 111 270 -13 189
7206 189 -403 -50 -244 -14 27 -58 292 -189 68 101 17 -122 39 -17 15 -30 -268 93 -19 -1 -236 106 79
7229 79 141 -134 -133 -91 -352 -144 -76 11 37 -179 -100 -169 187 136 -142 75 58 -132 -124 45 -252 -133 -37 -80 -122 -56
7255 -56 -44 -139 -169 -113 32 43 18 -91 -140 265 -336 3 46 -192 132 -147 -83 143 -139 -208 -225 -213 122 17
7279 17 51 113 208 109 -158 -271 -127 162 186 97 207 131 -316 90 69 -260 -164 54 11 -143 89 9 -194 -111
$$ packed form
7115g8K1j68J52J58j4m5L9K97l27j11J84L05k84m1j32J81n4j60J59R7k85L38l92
7138a60J44j42K35j69M2j75L62j88J7q7JK00p2J33l02K33j24J89J31m34J71n2
7160d7l4q2j63J02J93J4J6K11k92mJ81j64M0p4L68l76j90J70J92j10K07m62J58
7183a46J27n8j2%j20J82Q9k12J82J24k99K53j57J67J3Kk54rj09L48J59k83K02
7206A89n92L53j94K30M1q5L50m81K57L3q4j39J61n6L2m5k38L61j12J8k35L42k7
7229G9O2k75JM2k61K08O8Q7K6k16P9o9L56n1k78K17j7j90QJ69k97J19R6m3m2O6
7255e6J2r5l0N6J45J1k5j09m9M05o01L39M3k38L24k79O4K26k82o9j7J2L35j05
7279A7L4O2R5r9k67j13J44K89K4q9J10p6m47M06k1l29R6K18m3j54K32q0k03Q3
$$ plain form
7303 -111 121 2 -5 -129 -126 -58 -192 14 227 -111 32 -107 143 116 -86 29 39 -210 250 65 -178 -142 44
7326 44 81 84 -202 121 26 343 70 16 18 -278 103 165 -214 -59 -216 -151 -5 -90 -78 -31 -93 61 28 -155 17
7351 17 74 133 230 170 -82 -94 164 -310 -345 -108 0 -217 -158 -162 -64 -207 -81 297 -23 20 217 122 268 -76
7375 -76 -271 98 58 241 151 104 -153 -159 30 -236 -193 180 169 34 -125 -97 -332 -229 24 -14 109 -59 -216
7398 -216 -102 -141 127 -41 103 163 91 105 59 -271 44 39 -194 -72 -80 -136 -150 277 -86 -37 130 139 140 -74 -381
7423 -381 -161 -221 -115 47 -203 -239 -28 34 -186 244 -39 -80 -293 61 123 21 16 -59 -27 130 -70 94 -177
7446 -177 33 -235 -216 -158 -70 484 -165 171 26 -34 -156 -24 -198 -70 -232 -314 17 133 175 273 -31 69
7468 69 257 26 -31 -230 -46 -81 -36 -7 -31 59 -172 179 -155 -69 124 168 -66 -349 -147 81 -135 -6 279
$$ packed form
7303a11K32j19pj24LO8j34K06K13l38J43j39K50k7k02J15J0k49M60j85k43L6J86
7326D4L7Lk86L23r5L17k73n4Kk96L81O2l79J55j57O5J46q5J2M7o2J54l3j83J72
7351A7N7N9R7o0k52j2K58m74l5K37J08k17N9mR8j43J26L78l20M3J97r5J46l44
7375g6j95L69m0J83r0m7k57oJ89k66M3L73j1j35j59K8k35J03K53l8J23j68j57
7398b16J14l9K68j68J44O0p2J4m6l30L15nk33J22qn6j4M27l63M9J67RJk14l07
7423c81K20o0J06J62k50l6K11O2k20M30k83m1k13L54O2j02np5L2J57k00J64k71
7446a77K10k68J9N8Q8N54o49L36j45o0j22J32j74J28j62q2L31J16M2R8l04J00
7468F9J88k31n7j99J84l5M5K9k4R0k31L51l34Q6J93M4k34k83K02K28k16J29K85
$$ plain form
7491 279 -36 -67 15 115 -13 132 -334 -155 39 77 -208 -123 57 -73 -82 -141 169 63 62 -174 108 -232 377
7514 377 41 -32 28 -80 108 311 133 10 -143 -57 249 270 262 -69 108 140 -53 -53 -157 -118 94 -223 -96
7537 -96 -227 98 183 -122 -141 80 -24 94 -86 -68 -201 223 -141 50 81 72 -99 -222 -61 -261 48 222
7559 222 -270 151 61 129 -34 -147 -417 220 76 345 127 1 -151 186 105 -244 462 -137 220 251 -67
7580 -67 132 -111 76 -108 9 -4 -275 105 170 47 166 -198 105 240 -120 37 108 218 -116 -188 -85 -139
7602 -139 -206 91 79 16 -116 -84 -47 -292 54 22 189 21 11 86 57 23 27 64 173 2 87 37 -66 -46 -187
7627 -187 192 64 -164 224 24 139 132 -175 285 66 13 181 -409 -175 42 71 -298 241 -23 60 82 -91
7649 -91 47 78 96 42 279 -65 115 100 -349 -119 48 -241 -70 -70 -380 171 234 183 -159 -447 230 106 -340
$$ packed form
7491B79l15l1Q2J00j28J45m66J79J94L8k85Q5J80j30rn9L10j06jk36K82l40O09
7514C77l36p3O0j08J88K03j78j23j53Q6L06K1ql31J77L2j93%j04L9K12l17J27
7537i6j31L25Q5l05j9K21j04J18j80J8j33M24l64J91L1rj71j23J61k00L09J74
7559B22m92M21r0O8j63j13k70O37j44K69k18j26j52L37q1l49P06n99L57L1l18
7580f7J99k43J87j84J17j3k71L80O5j23J19l64L03J35l60J57P1J10l34p2J03n4
7602a39o7K97j2o3j32L2L7k45L46l2J67j68j0P5k9l4ML7J09j71Q5n0j03K0j41
7627a87L79j28k28L88k00J15pl07M60k19n3J68n90K34K17K9l69N39k64Q3K2j73
7649i1J38L1J8n4K37l44J80j5m49K30J67k89J71%l10N51O3n1l42k88O77j24m46
$$ plain form
7672 -340 -122 205 -85 66 140 182 277 -82 -96 150 -9 -109 -91 22 198 110 -335 232 317 -168 223 -363
7694 -363 -107 -33 133 -7 -208 325 310 -223 -462 -277 -88 171 383 -189 -273 -133 -7 -152 -256 38 70
7715 70 -87 11 -19 223 64 97 92 -45 179 126 44 131 123 38 -79 295 355 -50 214 -146 244 -214 13 37 -109
7740 -109 49 36 -181 259 72 95 46 -125 -278 -137 -269 -63 -155 -273 -201 -60 -6 -26 -192 120 99 190 73
7763 73 12 122 -625 91 -92 -356 -131 -77 -188 405 136 197 -214 -99 -47 -376 222 24 -267 -120 75 -50
7785 -50 -246 132 171 -85 163 -307 66 229 119 66 105 -78 5 -13 -25 109 329 88 142 132 17 -95 -11
7808 -11 -259 -91 175 196 1 233 103 -62 167 112 189 126 167 205 112 -159 142 137 -37 59 -247 15 47 0
7832 0 10 138 -217 -92 247 81 165 -215 -109 -118 -341 -140 -9 -16 -30 -239 -371 352 -73 -47 -273 -229 50 153
$$ packed form
7672c40K18L27k90J51P4M2R5l59j4K46j59j00J8J13J76q8m45N67Q5m85L91n86
7694c63K56P4J66j40k01N33j5n33k39J85J89K59K12n72q4J40J26j45j04K94L2
7715G0j57R8l0K42j59L3nj37K24n3q2Q7qq5j17L74O0m05K64l60L90m58K27K4j46
7740a09J58j3k17M40j87K3m9j71j53J41j32K06r2j18P2J41N4k0j66L12k1R1j17
7763G3o1J10p47P16j83k64K25N4j11N93k69O1m11J15N2l29N98j98k91J47J95j25
7785e0j96L78L9k56K48m70L73J63j10n3L9j83Q3j8j2J34K20k41N4j0j15j12Q4
7808a1k48J68K66K1j95K32j30j65K29n5P7o3M1L8r3k71L01nj74R6l06K62L2m7
7832@J0J28l55J25L39j66Q4l80J06rk23K01J31pj4k09j32P23m25K6k26M4K79J03
$$ plain form
7856 153 -23 -23 -101 -221 -171 176 87 223 -76 -265 -285 138 -43 241 19 161 -39 60 176 74 -78 253
7878 253 234 -50 37 25 -174 57 81 -8 93 48 77 34 170 -77 152 -135 -70 -6 45 -52 -107 -88 0 -241 20
7903 20 13 117 313 141 -323 -232 -33 -296 86 -11 -33 -210 175 142 -31 219 210 40 -214 -120 215 -49 -196
7926 -196 54 -120 -77 -64 -86 99 233 373 27 257 6 25 30 -38 -133 149 -230 -19 212 12 -73 243 79
7949 79 -121 96 -40 48 -126 343 73 -45 41 -110 -235 -191 -77 140 157 -217 144 -235 -2 -60 186 164
7971 164 -71 1 -138 52 44 -23 -173 -107 76 47 56 -79 -30 215 -27 110 -120 178 55 84 -74 -55 181 -335
7995 -335 22 -126 46 239 -126 360 37 19 133 -134 334 131 8 -214 71 66 -277 -136 22 148 17
8016 17 -87 311 -173 -43 211 132 111 -5 164 -17 -115 -71 -232 84 102 -250 -197 -229 82 128 57 -19 -573 -318
$$ packed form
7856A53j76%p8j20N0L47q9J36k99j89k0M23j81K84k22J42k00R9J16j02j52L31
7878B53j9k84Q7j2j99K31K4q9J01m5K9m3J36k47K29k87O5O4N1r7n5J9Q8k41K61
7903B0pJ04J96j72m64R1J99k63L82r7k2j77L85l3j73K50rj70k54R4L35k64j47
7926a96K50j74M3J3k2J85J34J40l46K30k51J9No8r5K82l79K11K31k00q5L16j64
7949G9k00K17j36Q8j74M69k70j18Q6j51j25M4J14K17J7l74L61l79K33n8K46k2
7971A64k35P2j39J90qo7j50O6J83k9Rj35M9K45k42J37k30K98j23K9j58J9K36n16
7995c35L57j48J72J93l65M86l23j8J14k67M68k03j23k22K85nl43J41J58J26j31
8016A7j04L98m84J30K54p9k1j16J69j81r8M4j61L16J8l52N3l2L11M6p1p6n54K55
$$ plain form
8040 -318 -271 111 -22 -22 -215 36 304 -176 -197 -71 -271 294 -169 238 -114 -89 -110 -203 -156 264 -16 -85 97
8063 97 -79 -15 -64 16 79 -269 -47 5 -19 279 138 -178 -242 -90 25 158 -70 264 -300 -122 223 -155 80
8086 80 -13 206 -261 -143 134 36 -34 -162 -244 -39 275 -110 201 13 -157 -25 -74 -142 -96 -200 102 104 26 36
8110 36 204 -187 161 -51 -134 -73 223 119 102 -214 -34 36 -394 -207 -225 212 103 290 -50 7 -148 -108 53
8133 53 166 -54 -172 -97 3 183 29 169 193 68 -429 98 -107 -56 207 33 44 -189 -5 -87 117 51
8155 51 183 28 -316 112 99 -78 -50 -192 113 315 -17 205 -245 -224 -153 19 15 10 303 41 -164 -392 171
8178 171 118 184 -113 310 -257 -24 -97 -110 242 8 -53 192 -141
$$ packed form
8040c18M7L82j33%j93K51K68m80k1J26k00N65m63M07l52K5k1r3M7M20k80o9J82
8063I7j76O4m9Q0O3l48K22N2k4K98j41l16o4J52J15J33k28L34n64J78L45l78K35
8086H0r3K19m67J18K77r8p0j28q2K05L14l85L11j88j70J32m9o8M6j04L02Kp8J0
8110C6J68l91L48k12q3O1K96j04j7l16J80P0m30J87j8M37j09J87l40N7j55M0J61
8133E3J13k20j18P5J00J80j54J40K4j25m97N27k05N1K63j74J1k33J84q2K04o6
8155E1J32j55l44M28j3j77K8j42L05K02l32K22m50K1P1J72mnK93k62k05k28N63
8178A71n3O6k97M23n67K33p3j3L52k34o1K45l33
8191a41
$$ Imaginary data points
##PAGE= N=2
##DATA TABLE= (X++(I..I)), XYDATA
$$ plain form
0 0 0 0 0 0 0 0 0 0 0 8 -8 8 -8 16 -16 16 -24 24 -32 39 -40 48 -56 64 -76 87 -99 111 -127 142 -161 179
32 179 -203 226 -251 281 -311 345 -385 425 -471 521 -575 637 -707 786 -874 975 -1092 1224
50 1224 -1387 1582 -1824 2130 -2541 3109 -3964 5386 -8192 15875 -80064 -283774 -172132 10574
64 10574 89708 -7441 -124087 -136688 -18990 73979 29309 -104375 -149834 -51500 85505
75 85505 91952 -51478 -191534 -164799 -14806 79334 20741 -105178 -157620 -82606 18821
86 18821 10272 -106718 -177842 -113057 5793 36449 -57634 -177456 -185994 -70603 33549 10123
98 10123 -93468 -150788 -103271 -11204 17008 -52719 -125570 -95006 6604 54902 -1886 -96299
110 -96299 -120019 -39383 59142 61019 -26030 -86508 -57898 11969 42880 2907 -61464 -66611
$$ packed form
0@%%%%%%%%%Qj6J6j6K4l2L2m0M8n6P1p9Q8j04J20j40J63j86K10k38K69l03L40
32A79l82M29m77N32n92O56p30Q10q96R92j096J212j344J493j660J849k067K316
50A224k611K969l406L954m671N650p073R350j3578K4067r5939k03710J11642J82706
64A0574P9134r7149j16646j2601J17698R2969m4670j33684m5459R8334J37005
75H5505O447j43430j40056K6735J49993R4140n8593j25919n2442P5014J01427
86A8821q549j16990p1124O4785J18850L0656r4083j19822q538J15391J04152k3426
98A0123j03591n7320M7517R2067K8212o9727p2851L0564J01610M8298n6788r4413
110i6299k3720Q0636R8525J877q7049o0478K8610O9867L0911l9973o4371n147
$$ plain form
122 -66611 2900 56565 20292 -61299 -91370 -40134 33374 46941 -12598 -71597 -62062 -4557
134 -4557 30091 7627 -41530 -55066 -7371 44104 29862 -27232 -50193 -14343 36709 54600
146 54600 24069 -21347 -24734 19052 52788 38579 3681 -10150 11212 43498 42229 2791
158 2791 -23554 -4774 26597 32966 10042 -21439 -34869 -16167 6170 -1444 -28426 -40195 -32865
171 -32865 -22327 -23383 -40496 -57844 -52286 -32648 -27842 -40371 -52785 -57337 -52445 -39846 -35909
184 -35909 -43680 -46247 -39586 -36082 -38029 -38372 -37506 -34505 -27756 -26101 -30082 -27158 -20256 -24003 -31375
199 -31375 -28324 -20086 -14775 -13518 -20280 -31214 -29252 -13617 -7105 -17137 -28346 -28068 -15288 -1164
213 -1164 -5750 -27407 -34694 -15303 6008 6995 -9046 -26641 -23934 3287 23241 9341 -17261
$$ packed form
122f6611O9511N3665l6273q1591l0071N1236P3508J3567n9539n8999R535N7505
134d557L4648k2464m9157j3536M7695N1475j4242n7094k2961L5850N1052J7891
146E4600l0531m5416l387M3786L3736j4209l4898j3831K1362L2286j269l9438
158B791k6345J8780L1371O369k2924l1481j3430J8702K2337p614k6982j1769P330
171c2865J0538j056j7113j7348N558J9638M806j2529j2414m552M892J2599L937
184c5909p771k567O661L504j947l43Q66L001O749J655l981K924O902l747p372
199c1375L051Q238N311J257o762j0934J962J5635O512j0032j1209K78J2780J4124
213a164m586k1657p287J9391K1311R87j6041j7595K707K7221J9954j3900k6602
$$ plain form
226 -17261 -19143 5934 29600 26747 -2324 -22009 -3202 33183 41686 14929 -14566 -16458 13619
239 13619 41863 29780 -11811 -27404 688 33230 29690 -6555 -38416 -28780 14416 35438
251 35438 5252 -39935 -48776 -15123 20700 16115 -28824 -59146 -33986 13371 21337 -17828 -57065
264 -57065 -51438 -4418 31900 11067 -42231 -60087 -22020 24841 28418 -14345 -52202 -34958
276 -34958 19052 41843 5042 -42983 -44511 1662 45244 34888 -20101 -52778 -20899 33644
288 33644 45239 3525 -40478 -35423 15693 50473 22162 -33190 -44799 -1870 45071 43417
300 43417 -6562 -48078 -28666 29546 53374 15887 -33848 -36317 9225 49846 35466 -19246
312 -19246 -45427 -9469 42007 48600 4069 -40743 -35314 17885 52233 24301 -30702 -44248
$$ packed form
226a7261j882K5077K3666k853k9071j9685J8807L6385Q503k6757k9495j892L0077
239A3619K8244j2083m1591j5593K8092L2542l540l6245l1861R636M3196K1022
251C5438l0186m5187q841L3653L5823m585m4939l0322K5160M7357P966l9165l9237
264e7065N627M7020L6318k0833n3298j7856L8067M6861L577m2763l7857J7244
276c4958N4010K2791l6801m8025j528M6173M3582j0356n4989l2677L1879N4543
288C3644J1595m1714m4003N055N1116L4780k8311n5352j1609M2929M6941j654
300D3417m9979m1516J9412N8212K3828l7487m9735k469M5542M0621j4380n4712
312a9246k6181L5958N1476O593m4531m4812N429N3199L4348k7932n5003j3546
$$ plain form
324 -44248 -4666 38375 34482 -14880 -51413 -29650 23758 40913 2162 -46024 -49065 -4659
336 -4659 36015 21679 -31466 -56243 -24388 21760 27782 -11467 -50778 -42458 6168 34633 7679
349 7679 -39417 -49927 -13278 28216 27486 -16341 -48907 -28534 17357 31837 2024 -34305 -35523
362 -35523 1060 33669 20663 -20908 -38690 -12012 25326 31233 277 -31728 -25541 12096
374 12096 33076 13094 -19236 -25765 -1276 26687 24854 -6162 -28252 -12530 19181 28485 7274
387 7274 -18842 -21339 3762 25838 17187 -9762 -20134 -4192 16496 19766 825 -19066 -13961
400 -13961 10247 21832 7710 -12191 -15827 -1766 14999 14842 -2989 -14434 -5403 9460 13315
413 13315 3816 -8748 -8902 4676 16176 9501 -4304 -7337 947 10049 12266 4680 -3714 -1311
$$ packed form
324d4248L9582M3041l893m9362l6533K1763N3408J7155l8751m8186l041M4406
336d659M0674j4336n3145k4777L1855M6148O022l9249l9311Q320M8626K8465k6954
349G679m7096j0510L6649M1494p30m3827l2566K0373M5891J4480k9813l6329j218
362c5523L6583L2609j3006m1571j7782K6678L7338N907l0956l2005O187L7637
374A2096K0980j9982l2330o529K4489K7963j833l1016k2090J5722L1711R304k1211
387G274k6116k497K5101K2076q651k6949j0372J5942K0688L270j8941j9891N105
400a3961K4208J1585j4122j9901l636J4061J6765j57j7831j1445R031J4863L855
413A3315r499j2564j54J3578J1500o675j3805l033Q284R102K217p586q394K403
$$ plain form
427 -1311 8118 10868 5618 755 182 4466 9698 8566 1634 -457 3591 5531 5060 4264 2816 1382
443 1382 2627 3597 1457 1758 4009 2959 19 433 1486 2165 3080 1043 -3006 -1472 4607 4959 -1145
460 -1145 -5028 -3179 945 5513 3081 -5952 -9247 -2381 4350 3326 -3987 -11038 -9184 1671 6247
475 6247 -3513 -14711 -13156 -2424 4711 1476 -11079 -18456 -9929 4959 5682 -6738 -17192 -13160
489 -13160 1636 10584 1900 -14708 -15939 102 13914 10911 -4075 -14951 -6112 13472 20661
502 20661 5379 -10427 -7171 10769 23213 16564 -2978 -11026 4968 25223 24755 4710 -9330
515 -9330 -3199 17518 29280 14734 -7347 -9628 10523 27294 21584 -427 -13517 -982 23066
528 23066 28328 7310 -12640 -8895 12752 28419 18311 -7045 -16142 3339 26566 24162 1466
$$ packed form
427a311R429K750n250m863n73M284N232j132o932k091M048J940m71p96j448j434
443A382J245R70k140L01K251j050k940M14J053O79R15k037m049J534O079L52o104
460a145l883J849M124M568k432r033l295O866O731j024p313p051J854J0855M576
475F247r760j1198J555J0732P135l235j2555p377Q527J4888P23j2420j0454M032
489a3160J4796Q948q684j6608j231J6041J3812l003j4986j0876Q839J9584P189
502B0661j5282j5806L256J7940J2444o649j9542q048J5994K0255m68k0045j4040
515i330O131K0717J1762j4546k2081k281K0151J6771n710k2011j3090J2535K4048
528B3066N262k1018j9950L745K1647J5667j0108k5356r097J9481K3227k404k2696
$$ plain form
541 1466 -16379 -7479 17645 29303 11814 -13691 -15468 7062 26063 19726 -5908 -21131 -6319
554 -6319 20296 24457 757 -20818 -16377 7064 23484 11589 -16047 -25225 -4738 18823 16672
567 16672 -7369 -25286 -16234 10460 21505 3274 -21757 -22307 1096 20427 14522 -10282 -23901
580 -23901 -8731 17264 21233 -54 -19138 -14411 8631 24035 12238 -12615 -19446 460 20846
593 20846 19201 -1986 -18737 -10392 12649 21505 4461 -16400 -16661 2812 18187 11508 -10478
606 -10478 -22444 -8093 12900 15216 -2963 -19415 -16073 2809 15116 4858 -15884 -19577 -3064
619 -3064 13186 10549 -7241 -19651 -11370 8475 15332 1891 -14511 -13865 1089 13573 9032
632 9032 -8179 -15649 -3774 12351 12231 -1920 -13396 -10396 4623 14210 5487 -9893 -12560 -1345
$$ packed form
541A466j7845Q900K5124J1658j7489k5505j777K2530J9001o337k5634j5223J4812
554f319K6615M161k3700k1575M441K3441J6420j1895k7636r178K0487K3561k151
567A6672k4041j7917R052K6694J1045j8231k5031n50K3403J9331n905k4804j3619
580b3901J5170K5995L969k1287j9084M727K3042J5404j1797k4853o831J9906K0386
593B0846j645k1187j6751Q345K3041Q856j7044k0861k61J9473J5375o679k1986
606a0478j1966J4351K0993K316j8179j6452L342J8882J2307j0258k0742l693J6513
619c064J6250k637j7790j2410Q281J9845O857j3441j6402O46J4954J2484m541
632I032j7211p470J1875J6125j20j4151j1476L000J5019R587q723j5380k667J1215
$$ plain form
646 -1345 9696 8118 -3928 -12396 -6046 7441 10702 608 -9457 -8899 1305 10609 8144 -3191
660 -3191 -8245 -427 8849 9846 2046 -3988 -2270 6838 12068 6676 -2160 -2656 3950 9658 9363 3235
676 3235 -2118 675 7040 8110 3509 -704 -816 2578 6090 3917 -1471 -3631 -546 2240 2254 -112
692 -112 -2975 -3816 -1080 767 -1188 -3075 -2610 -1778 -1581 -1066 -1706 -2585 -2296 -1412 -1567 -1100 43 -743
710 -743 -2364 -1729 -846 53 1129 243 -2855 -3243 405 1896 89 -2646 -3563 -1649 1268 1719 -2823
727 -2823 -6145 -3842 392 1974 -273 -5828 -7694 -2807 2525 1087 -4978 -7222 -4311 951 3130
742 3130 -1560 -8452 -6696 867 5413 1779 -5300 -8116 -3405 4924 5521 -2227 -7599 -5051 2680
757 2680 6407 1362 -7208 -8533 444 7574 4633 -5325 -10039 -5947 3884 6955 -1287 -10488 -8901
$$ packed form
646a345J1041j578j2046q468O350J3487L261j0094j0065N58J0204R304k465j1335
660c191n054P818R276R97p800o034J718R108N230n392q836m96O606N708k95o128
676C235n353K793O365J070m601m213j12L394L512k173n388k160L085K786J4k366
692a12k863q41K736J847j955j887M65Q32J97N15o40q79K89Q84j55M67J143p86
710g43j621O35Q83Q99J076q86l098l88L648J491j807k735r17J914K917M51m542
727b823l322K303M234J582k247n555j866M887N332j438o065k244K911N262K179
742C130m690o892J756P563M546l634p079k816M711Q329N97p748n372K548P731
757B680L727n045q570j325Q977P130k941r958m714M092R831L071q242r201J587
$$ plain form
772 -8901 1307 6507 1281 -8352 -11784 -3739 6702 6393 -4951 -12224 -7744 3318 8470 1513
786 1513 -8932 -9879 1190 9773 5572 -5173 -10008 -3310 8398 11706 1266 -9295 -6604 5063
800 5063 12051 6502 -4764 -8186 826 11690 10115 -1974 -9686 -3815 7756 12728 4390 -8453
814 -8453 -9517 2500 11169 7211 -4295 -10024 -3194 8594 10308 -714 -10749 -7038 4900 10836
828 10836 4781 -7426 -10901 -1283 10000 8261 -3544 -10393 -5199 5873 9969 1016 -10228 -9636
842 -9636 2053 9767 5035 -6379 -11796 -4887 6663 7959 -2971 -11522 -8325 2045 7442 1159
856 1159 -9696 -11852 -2511 7162 4555 -6257 -12378 -7478 3149 6975 -502 -10347 -9480 747
870 747 6603 3172 -5992 -10040 -3383 6375 7057 -2032 -8603 -5491 3021 7556 3295 -5354 -7251 410
$$ packed form
772h901J0208N200n226r633l432Q045J0441l09j1344p273M480J1062N152o957
786A513j0445r47J1069Q583m201j0745m835O698J1708L308j0440j0561K691J1667
800E063O988n549j1266l422R012J0864j575j2089p712N871J1571M972q338j2843
814h453j064J2017Q669l958j1506n729O830J1788J714j1022j0035L711J1938N936
828A0836o055j2207l475R618J1283j739j1805o849N194J1072M096q953j1244N92
842i636J1689P714m732j1414n417O909J1550J296j0930q551L197J0370N397o283
856A159j0855k156R341R673k607j0812o121M900J0627L826p477r845Q67J0227
870G47N856l431r164m048O657R758O82r089o571L112Q512M535m261q649j897P661
$$ plain form
886 410 7255 5367 -2405 -6564 -3052 5154 7498 1103 -6253 -4988 2366 6928 4035 -2744 -5725
901 -5725 -1131 5339 5301 -983 -5052 -2643 3480 6166 2527 -4032 -4563 1086 5742 4111 -881 -3721
917 -3721 -991 4013 5108 1252 -3109 -1813 2416 4717 2712 -1344 -2984 213 4299 3590 -154
932 -154 -2083 -998 1888 3301 1709 -1388 -1598 1259 2424 1858 -353 -1530 -496 1667 2263 526
948 526 -557 -374 534 1334 1527 519 -180 770 1202 686 373 166 322 256 1005 762 403 361 434 -453 -105
969 -105 1065 1056 -23 -225 -915 -529 833 938 -748 -1743 -352 928 1076 -420 -1953 -2116 443 1805
987 1805 84 -2066 -2755 -1122 1182 1856 -1103 -3834 -2272 1241 2087 -200 -3181 -3311 -153 2868
1003 2868 2266 -2552 -4288 -1389 2089 2999 153 -3484 -3008 1504 4519 1347 -2579 -3609 47 4128
$$ packed form
886D10O845j888p772m159L512Q206K344o395p356J265P354M562k893o779k981
901e725M594O470l8o284m069K409O123K686l639o559n31N649M656j631m992k840
917c721K730N004J095l856m361J296M229K301k005m056j640L197M086p09l744
932a54j929J085K886J413j592l097k10K857J165n66k211j177J034K163N96j737
948E26j083J83R08Q00J93j008o99R50M32n16l13k07J56o6P49k43l59m2P3q87L48
969a05J170rj079k02o90L86J362J05j686r95J391J280J48j496j533j63K559J362
987A805j721k150o89J633K304O74k959k731J562L513Q46k287k981j30L158L021
1003B868o02m818j736K899L478R10k846l637M76M512L015l172l926j030L656M081
$$ plain form
1019 4128 4035 -475 -4144 -1859 3389 4825 1390 -2642 -3330 1380 5711 3698 -1771 -3472 -100 4668
1035 4668 5704 1227 -3968 -2743 3409 6580 3357 -2253 -3626 745 5906 5577 -527 -4675 -1116
1050 -1116 4624 6588 2102 -3425 -3855 2133 7185 4378 -2023 -4669 -479 5447 6025 720 -4792
1065 -4792 -3066 3459 7005 2228 -3361 -4444 832 6012 5208 -1257 -5198 -1673 4577 5382 1132
1080 1132 -4355 -4374 1874 6390 3486 -3137 -5308 -1001 4913 5284 -246 -5507 -3376 3307 5796 1818
1096 1818 -3710 -4814 165 5460 4300 -2051 -5231 -1838 3663 5237 811 -4674 -4054 1450 5306
1111 5306 2269 -3134 -4771 -1017 4168 4230 -869 -5574 -3089 2213 4417 879 -4236 -4700 -327 3825
1127 3825 2889 -2682 -5401 -2140 2117 3507 -185 -4629 -3985 969 3830 1325 -3171 -4190 -1369
$$ packed form
1019D128r3m510l669K285N248J436l435m032o88M710M331k013n469j701L372M768
1035D668J036m477n195J225O152L171l223n610j373M371N161l29o104m148L559
1050a116N740J964m486n527m30N988N052k807o401k646M190N926N78n305n512
1065d792J726O525L546m777n589j083N276N180q04o465l941L525O250Q05m250
1080A132n487j9O248M516k904o623k171M307N914L71n530n261K131O683K489l978
1096A818n528j104M979N295j160o351l180L393N501J574m426n485O20N504L856
1111E306l037n403j637L754N185O2n099m705K485N302K204l538n115m64M373M152
1127C825r36n571k719L261M257J390l692m444O44M954K861k505m496j019K821
$$ plain form
1142 -1369 2888 2527 -1202 -4780 -2463 1874 3002 545 -3233 -3875 -105 3767 2163 -1820 -3245
1157 -3245 -1173 2169 3110 319 -2598 -2021 1522 3394 1211 -1558 -2282 41 2635 2816 -330 -2074
1173 -2074 -898 1961 2769 994 -758 -1067 1181 2864 1805 -372 -964 460 1994 2617 1016 -990
1189 -990 -366 1753 2302 1350 82 -252 698 2207 1825 449 -342 604 1081 1215 618 -407 -200 666
1207 666 1181 898 261 -33 -173 228 361 -73 -703 107 66 -18 -63 -440 -465 -717 -527 -347 -347 -417 -241 -807
1229 -807 -1365 -135 42 -237 -789 -935 -1055 143 270 -601 -1626 -1178 -176 57 -399 -1373 -1790 -855 416
1248 416 433 -1109 -2023 -1588 -71 656 -286 -1744 -2309 -350 529 233 -1297 -2840 -1537 302 1286 -679
1266 -679 -2647 -2007 -311 1441 378 -1539 -2710 -904 1441 1414 -1394 -2260 -1529 882 2287 439
$$ packed form
1142a369M257l61l729l578K317M337J128k457l778o42L770L872j604l983j425
1157c245K072L342R41k791k917N77L543J872k183k769p24K323K594J81l146j744
1173b074J176K859Q08j775j752l09K248J683j059k177n92J424J534O23j601k006
1189i90O24K119N49r52j268l34R50J509l82j376p91R46M77J34n97j025K07Q66
1207F66N15k83o37k94j40M01J33m34o30Q10m1q4m5l77k5k52J90J80%p0J76n66
1229h07n58J230J77k79n52j46j20J198J27q71j025M48J002K33m56r74m17R35J271
1248D16J7j542r14M35J517P27r42j458n65J959Q79k96j530j543J303J839R84j965
1266f79j968O40J696J752j063j917j171J806K345k7k808q66P31K411J405j848
$$ plain form
1282 439 -2116 -2198 366 1971 1664 -824 -2587 -1122 2008 2360 -207 -2523 -1622 1054 2789 1523
1298 1523 -1719 -2884 -163 2620 2417 -378 -2639 -1292 1719 2986 654 -2613 -1903 731 3169
1313 3169 2411 -1059 -2507 -670 2806 3195 562 -2281 -1665 1576 3705 2006 -1703 -2304 634 3209
1329 3209 2810 -184 -2339 -1293 2190 3306 686 -2290 -1985 1009 3034 1720 -1605 -3026 -861
1344 -861 2575 2779 -309 -2894 -2517 780 2840 1011 -2203 -3104 -221 2061 1665 -1383 -3313 -1796
1360 -1796 1412 2574 201 -2759 -2551 -14 2126 1658 -1521 -3474 -1052 2021 1862 -482 -2941 -2106
1376 -2106 501 2273 474 -2640 -2662 -437 1553 1111 -1128 -3131 -2025 1280 2051 -404 -2272 -2147
1392 -2147 284 1739 890 -1471 -2567 -361 1480 1480 -529 -1876 -1565 881 2056 624 -1612 -1505
$$ packed form
1282D39k555q2K564J605l07k488j763J465L130L52k567k316R01K676J735j266
1298A523l242j165K721K783k03k795k261J347L011J267k332l267P10K634K438
1313C169p58l470j448J837L476L89k633k843O16L241K129j699l709o01K938K575
1329C209l99k994k155J046L483J116k620k976L05K994K025j314l325j421K165
1344h61L436K04l088k585L77L297K060j829l214r01K883K282l96l048j930J517
1360a796L208J162k373k960K08K537K140m68l179j953K422L073j59k344k459Q35
1376b106K607J772j799l114k2K225J990m42k239k003J106L305P71k455j868J25
1392b147K431J455q49k361j096K206J841%k009j347L11K446J175j432k236J07
$$ plain form
1408 -1505 377 1842 1588 -411 -1702 -762 1637 1879 -8 -1155 -1022 564 1945 1141 -838 -1623
1424 -1623 458 1353 1323 -195 -851 -603 774 1839 595 -1044 -632 588 1350 1084 -155 -1162 -289
1441 -289 1052 1093 770 -456 -237 391 1358 1168 144 -426 372 535 937 416 -87 -260 763 912 588
1460 588 -185 -390 222 550 610 161 -433 123 303 290 216 79 -218 -78 176 26 -258 -107 71 14 -263
1481 -263 74 -217 -494 -337 -304 102 388 -169 -589 -193 -332 207 -155 171 -667 -770 -192 381 36 -585
1501 -585 -599 -421 -191 261 -391 -1224 -886 230 231 -149 -836 -994 -252 530 455 -770 -1109 -684 -107 418 -58
1522 -58 -1029 -1011 415 1010 572 -857 -857 -292 701 839 -311 -1267 -574 818 1301 616 -874 -1088 381
1541 381 1554 1207 -279 -1033 -301 923 1615 709 -1093 -815 796 1522 965 -530 -948 63 1719
$$ packed form
1408a505J882J465k54j999j291R40K399K42j887j147J33J586J381q04j979p85
1424a623K081Q95l0j518o56K48J377J065j244j639M12J220P62k66j239j007Q73
1441b89J341M1l23j226K19O28R67j90j024n70P98J63M02n21n03j73J023J49l24
1460E88p73k05O12L28O0m49n94N56J80j3p4j37k97J40K54j50k84J51J78n7k77
1481b63L37k91k77J57L3M06K86n57m20L96j39N39l62L26q38j03N78N73l45o21
1501e85j4J78K30M52o52q33L38J116Jl80o87j58P42P82p5j225l39M25N77N25m76
1522e8r71J8J426N95m38j429%N65R93J38j150r56O93J392M83o85j490k14J469
1541C81J173l47j486p54P32J224O92r06j802K78J611P26n57j495m18J011J656
$$ plain form
1558 1719 1508 -82 -1360 -352 911 1848 893 -840 -1034 333 2253 1452 -405 -1163 -84 1327
1574 1327 1871 890 -1443 -784 967 2085 1098 -501 -1328 -285 1739 1720 -33 -1309 -665 1296 2008
1591 2008 858 -1101 -1629 130 1897 1216 -792 -1624 -617 1508 1682 18 -1158 -1425 652 1470
1607 1470 724 -1023 -1413 -290 1303 1110 -616 -1693 -949 854 1229 257 -1221 -1277 370 1374 803
1624 803 -563 -1543 -699 920 1278 -319 -1504 -1327 535 1262 360 -971 -1655 -614 1045 816 -753
1641 -753 -1640 -1021 523 977 408 -1209 -1476 -49 1302 650 -716 -1574 -818 1049 1060 -463 -1536 -749
1659 -749 329 1022 865 -462 -1160 -332 1237 800 -221 -1265 -558 384 971 656 -818 -646 306 1100
1677 1100 412 63 -876 -339 899 1007 188 -677 -367 851 1113 938 -169 -727 222 1018 916 170 -273
$$ packed form
1558A719k11j590j278J008J263R37r55j733j94J367J920q01j857p58J079J411
1574A327N44r81k333O59J751J118r87j599q27J043K024j9j753j276O44J961P12
1591B008j150j959n28J759J767o81k008q32J007K125J74j664j176k67K077Q18
1607A470p46j747l90J123J593j93j726j077P44J803L75r72j478n6J647J004n71
1624H03j366r80Q44J619L58j597j185J77J862P27r02j331o84J041J659k29j569
1641g53q87O19J544M54n69j617k67J427J351o52j366q58P56J867J1j523j073P87
1659g49J078O93j57j327o98Q28J569m37j021j044P07R42N87l15j474J72R52P94
1677A100o88l49r39N37J238J08q19q65L10J218K62j75j107n58R49P96j02p46m43
$$ plain form
1696 -273 -132 572 958 392 -126 -344 471 487 649 85 70 -173 648 701 304 100 111 128 227 307 80 -305
1718 -305 266 384 213 571 -414 -341 111 307 211 -128 177 188 48 414 82 -129 -54 124 225 -15 97
1739 97 -136 -164 -323 120 86 -39 -1 -369 -224 182 14 -251 -466 -659 -52 119 -260 -647 -667 -280 -76 -183
1761 -183 -93 -725 -568 -48 359 81 -557 -446 -197 350 303 -409 -531 -684 -126 419 -247 -921 -468 -333 333
1782 333 170 -567 -982 -311 519 336 -185 -755 -694 274 349 352 -610 -822 168 793 471 -119 -869 -30 592
1803 592 764 -93 -561 -293 14 1044 814 -454 -671 -197 650 354 -274 -627 -743 419 796 432 -389
1822 -389 -774 283 873 604 35 -650 -175 543 938 63 -248 -679 625 993 291 -296 -703 4 996
1841 996 814 -177 -398 -265 513 1107 132 -595 -500 139 879 549 -180 -924 -180 472 1127 190 -528 -615 -137
$$ packed form
1696b73J41P04L86n66n18k18Q15J6J62n64j5k43Q21N3l97k04J1J7R9Q0k27l85
1718c05N71J18j71L58r85P3M52J96r6l39L05J1j40L66l32k11P5J78J01k40J12
1739I7k33k8j59M43l4j25L8l68J45M06j68k65k15j93O07J71l79l87k0L87K04j07
1761a83R0o32J57N20M07k78o38J11K49N47m7p12j22j53N58N45o66o74M53J35O66
1782C33j63p37m15O71Q30j83n21n70O1R68P5Lr62k12R90O25l22n90p50Q39O22
1803E92J72q57m68K68L07J030k30j268k17M74Q47k96o28l53j16J162L77l64q21
1822c89l85J057N90k69n69o85M75P18L95q75l11m31J304L68p02n87m07P07R92
1841I96j82r91k21J33P78N94r75p27R5O39P40l30p29p44P44O52O55r37p18q7M78
$$ plain form
1862 -137 760 41 -713 -882 -195 560 541 -130 -956 -704 149 533 17 -674 -844 -238 675 324 -411 -1261
1882 -1261 -514 337 792 -362 -707 -632 -151 906 249 -623 -1059 -461 278 402 -110 -991 -556 234 681
1901 681 106 -876 -682 -198 467 304 40 -520 -528 362 498 -242 -941 -704 -288 565 178 -739 -453 -509 287
1922 287 648 129 -468 -219 432 615 -10 -312 -328 -241 360 381 -47 -600 -26 603 519 -48 -229 -263 123 600
1944 600 305 10 -251 396 480 689 210 -352 -276 459 558 155 173 -384 47 457 -64 -64 -14 -202 137 325
1966 325 157 -189 142 170 290 353 -364 -84 -165 373 287 -114 -327 80 -33 74 427 115 -328 83 -17
1987 -17 11 287 12 117 126 202 -64 177 -241 -130 -467 -80 137 -136 -60 -534 -205 -307 -180 -20 -280 -285 -242
2010 -242 -83 -229 -169 -456 -128 353 -57 -364 -282 -414 65 199 -140 -151 -431 -328 112 17 -514 -299 30
$$ packed form
1862a37Q97p19p54j69O87P55j9o71q26K52Q53L84n16o91j70O06R13l51p35q50
1882a261P47Q51M55j154l45P5M81J057o57q72m36N98P39J24n12q81M35P90M47
1901F81n75r82J94M84O65j63k64n60qQ90J36p40o99K37M16Q53l87r17K86n6P96
1922B87L61n19n97K49O51J83o25l02j6Q7O01K1m28n53N74O29q4n67j81l4L86M77
1944F00k95k95k61O47Q4K09m79n62P6P35R9m03J8n57M31M10n21%N0j88L39J88
1966C25j68l46L31K8J20O3p17K80q1N38q6m01k13M07j13J07L53l12m43M11j00
1987a7K8K76k75J05RP6k66K41m18J11l37L87K17k73P6m74L29j02J27J60k60nM3
2010b42J59j46O0k87L28M81m10l07Q2j32M79J34l39j1k80J03M40r5n31K15L29
$$ plain form
2031 30 -137 151 40 -141 -397 -77 -25 203 -333 -404 34 -90 427 -285 -558 -292 -52 144 -94 -382 -310
2052 -310 57 455 389 -58 -298 -391 149 587 207 -531 -276 91 579 191 -35 -252 92 436 888 291 -362
2073 -362 -128 331 486 368 -289 -474 123 395 330 -37 -547 -14 228 568 292 -16 -252 4 662 244
2093 244 -162 -603 -4 594 864 162 -279 -88 154 420 426 -202 -462 -28 401 163 -499 -364 -51 312 380
2114 380 258 -479 -510 -29 710 420 92 -413 -14 421 321 -272 -592 -82 151 495 -57 -329 -460 217
2134 217 367 479 -279 -477 -187 49 368 -15 -628 -894 -105 384 160 -272 -550 -468 68 405 -72 -171 -413
2155 -413 -346 46 49 -214 -799 -21 625 39 -45 -14 -389 -98 339 16 -242 129 227 247 229 -190 -440 -297 255
2178 255 319 11 -391 -246 162 173 465 -190 -516 -13 410 184 82 -507 -159 176 412 11 27 -204 98
$$ packed form
2031C0j67K88j11j81k56L20N2K28n36p1M38j24N17p12k73K66K40J96k38k88P2
2052c10L67L98o6m47k40r3N40M38l80p38K55L67M88l88k26k17L44L44M52n97o53
2073c62K34M59J55j18o57j85N97K72o5l67n10N33K42L40k76l08k36K56O58m18
2093B44m06m41N99N98K70p02m41J91K42K66Oo28k60M34M29k38o62J35L13L63O8
2114C80j22p37l1M81P39k90l28n05L99M35j00n93l20N10K33L44n52k72j31O77
2134B17J50J12p58j98K90K36L19l83o13k66P89M89k24m32k78Q2N36L37m77r9k42
2155d13O7L92Lk63n85P78O46n86q4L1l75K91M37l23k58L71R8K0j8m19k50J43N52
2178B55O4l08m02J45M08J1K92o55l26N03M23k26j02n89L48L35K36m01J6k31L02
$$ plain form
2199 98 511 277 -84 -204 42 239 449 97 -292 240 204 180 236 -171 -22 -17 57 77 -171 61 140 115 326
2222 326 19 -213 419 -1 11 481 -215 359 -63 -61 424 173 -63 185 35 282 -59 -124 -254 -62 162
2243 162 -18 271 119 -23 143 -374 -222 -287 230 -224 -159 11 79 -153 -29 -80 -32 74 170 -240 -82 -19
2265 -19 450 -63 -270 -140 -152 -3 -85 35 -200 -543 -290 -32 -6 85 42 -173 -255 -63 190 -48 24 -165 164
2288 164 19 -252 -167 -20 4 9 170 -123 -164 -181 242 266 -84 -431 -286 25 112 207 -209 -151 28 129 126 -160
2312 -160 -218 -343 199 -217 113 -274 -250 49 342 140 90 -324 -112 394 66 293 -613 -157 293 136 211
2333 211 -272 -2 124 368 323 -106 -126 200 250 21 155 245 46 124 304 472 155 -415 189 316 152 113
2355 113 -135 69 130 228 -72 50 -337 333 530 521 -38 -73 -100 -44 329 221 -159 -160 227 391 -5 -118 -227
$$ packed form
2199I8M13k34l61j20K46J97K10l52l89N32l6k4N6m07J49NP4K0k48K32P9k5K11
2222C26l07k32O32m20J2M70o96N74m22KM85k51k36K48j50K47l41o5j30J92K24
2243A62j80K89j52j42J66n17J52o5N17m54O5J70O8k32J24n1M8J06R6m10J58O3
2265a9M69n13k07J30j2J49q2J20k35l43K53K58K6R1m3k15q2J92K53k38P2j89L29
2288A64j45k71Q5J47K4NJ61k93m1j7M23K4l50l47J45L11Q7R5m16N8J79J01lk86
2312a60n8j25N42m16L30l87K4K99K93k02n0m14K12N06l28K27r06M56M50j57P5
2333B11m83K70J26K44m5m29k0L26N0k29J34R0j99P8J80J68l17n70O04J27j64l9
2355A13k48K04O1R8l00J22l87O70J97rn59l5k7N6L73j08l80jL87J64l96j13j09
$$ plain form
2378 -227 93 348 214 -46 14 -366 -13 377 354 -449 -374 -404 365 110 39 -296 -159 147 131 -99 -87 8 144
2401 144 171 -99 -244 -371 -63 292 66 12 -455 -273 69 81 141 -32 -280 -84 89 327 -204 -691 65
2422 65 128 350 -251 -210 -682 -132 373 186 -91 -109 37 -71 -37 -265 32 -44 383 221 112 -92 -372 283
2444 283 323 183 0 -218 37 101 25 -98 109 -195 134 243 258 272 -222 60 -34 -207 264 -174 180 273
2466 273 89 -82 2 -131 -130 270 158 123 48 -116 108 8 85 -249 -28 152 -53 -45 -152 -122 -1 267 316
2489 316 88 -20 24 -57 11 244 -181 -25 -35 248 348 -84 24 14 182 -92 -181 -124 117 67 316 273 -211
2512 -211 -44 -258 -50 -88 -328 -133 -245 115 -87 -59 -70 -395 70 -306 -228 -62 -135 -18 -2 -66 92 39 195
2535 195 -83 -137 -153 268 277 -158 120 -178 -90 -254 55 74 -121 -166 -64 -30 -32 -366 -130 -116 155 81 -59 -162
$$ packed form
2378b27L20K55j34k60O0l80L53L90k3q03P5l0P69k55p1l35J37L06j6k30J2R5J36
2401A44K7k70j45j27L08L55k26n4m67J82L42J2O0j73k48J96J73K38n31m87P56
2422F5O3K22o01M1m72N50N05j87k77j8J46j08L4k28K97p6M27j62j09k04k80O55
2444B83M0j40j83k18K55O4p6j23K07l04L29J09J5J4m94K82r4j73M71m38L54R3
2466B73j84j71Q4j33JM00j12l5p5j64K24j00P7l34K21J80k05Qj07L0J21K68M9
2489C16k28j08M4q1O8K33m25J56j0K83J00m32J08j0J68k74q9N7K41n0K49m3m84
2512b11J67k14K08l8k40J95j12L60k02K8j1l25M65l76P8J66p3J17J6o4J58n3J56
2535A95k78n4j6M21Rm35K78k98Q8j64L09J9j95m5J02L4kl34K36J4K71p4j40j03
$$ plain form
2559 -162 51 -27 -21 -402 -292 -216 -42 246 -46 42 -91 31 83 271 -243 -116 -43 47 211 -40 -88 126 110
2582 110 281 147 -56 -128 84 307 394 -243 -226 181 274 -83 -166 100 -525 -155 500 205 -424 32 93 234
2604 234 116 75 -70 -89 -1 189 77 97 -100 -138 336 165 -169 -363 -22 195 263 33 -6 -239 328 390 -13
2627 -13 -127 -3 68 106 176 128 -9 -374 -31 278 300 -294 -428 -130 206 186 -135 -245 -123 -27 -14 -37 1 -160
2651 -160 53 169 -26 -165 14 81 -116 116 45 -49 -370 -78 160 -252 -209 29 177 186 -220 159 -345 -207
2673 -207 -55 123 238 -168 -322 -143 228 -257 -92 12 204 412 142 176 -396 85 -43 435 278 153
2693 153 -238 140 89 246 -60 -123 121 -73 -228 386 -38 -5 -18 272 338 91 45 -99 -152 73 -162 -31
2715 -31 -259 216 251 404 -18 -135 317 658 -9 91 -143 53 9 35 74 135 -108 0 161 16 354 -195
$$ packed form
2559a62K13p8Ol81J10P6J74K88k92Q8j33J22N2J88n14J27P3R0J64k51m8K14j6
2582A10J71j34k03p2K12K23Q7o37J7M07R3l57q3K66o25L70O55k95o29M56O1J41
2604B34j18m1j45j9Q8J90j12K0j97l8M74j71l34j94L41K17O8k30l9k33N67O2m03
2627a3j14J24P1L8P0m8j37l65L43L09K2n94j34K98L36k0l21j10J22R6J3k3L8j61
2651a60K13J16j95j39J79O7j97K32p1r4l21K92K38m12M3K38J48Rm06L79n04J38
2673b07J52J78J15m06j54J79L71m85J65J04J92K08k70L4n72M81j28M78j57j25
2693A53l91L78n1J57l06o3K44j94j55O14m24L3j3K90O6k47m6j44n3K25k35J31
2715c1k28M75L5J53m22j17M52L41o67J00k34J96m4K6L9O1k43J08J61j45L38n49
$$ plain form
2737 -195 336 68 178 206 238 64 -45 -12 -150 -162 -64 218 -51 60 -13 70 -24 85 -97 -165 -95 -190 -316 -43
2761 -43 -27 340 -133 -153 -299 35 -148 -363 70 61 121 31 0 78 227 -44 25 151 -4 -83 200 29 -117 24
2785 24 347 -265 232 -36 9 90 -171 72 201 -66 -33 103 71 -235 -36 164 -147 -40 -18 73 2 187 -236
2808 -236 -197 -32 171 -52 211 -148 63 231 148 -12 -166 -102 -215 -14 262 101 -191 -76 284 -175 -170 -58
2830 -58 5 94 117 -6 30 287 -179 363 153 163 298 -127 -56 -91 226 154 -238 -300 193 -100 -59 -274 -173 64
2854 64 251 374 -23 -134 190 300 152 439 -38 276 -91 182 233 -123 -16 283 180 248 -46 -398 -107
2875 -107 99 299 -205 -288 -211 77 -80 123 158 -214 96 186 -40 123 24 -64 -87 132 -56 -110 -197 -10 68
2898 68 40 -327 7 82 -201 172 121 60 339 -141 68 -116 56 -149 -17 221 -209 161 -130 44 161 63
$$ packed form
2737a95N31k68J10K8L2j74j09L3j38j2R8K82k69J11p3Q3r4J09j82o8P0r5j26K73
2761d3J6L67m73k0j46L34j83k15M33rO0r0l1P8J49k71O9J26j55p9K83j71j46J41
2785B4L23o12M97k68M5Q1k61K43J29k67L3J36l2l06J99K00l11J07K2R1p1J85m23
2808b36L9J65K03k23K63l59K11J68q3j60j54O4j13K01K76j61k92J15L60m59NJ12
2830e8O3Q9K3j23L6K57m66N42k10J0J35m25P1l5L17p2l92o2M93k93M1k15J01K37
2854F4J87J23l97j11L24J10j48K87m77L14l67K73N1l56J07K99j03O8k94l52K91
2875a07K06K00n04q3P7K88j57K03L5l72L10R0k26J63r9q8k3K19j88n4q7J87P8
2898F8k8l67L34P5k83L73n1o1K79m80K09j84J72k05J32K38m30L70k91J74J17r8
$$ plain form
2920 63 -12 213 -275 231 240 50 -36 54 136 -50 43 35 17 111 149 -339 411 73 45 -40 202 -280 113 -11 -377
2945 -377 35 -10 -14 -37 8 12 -16 374 194 91 223 150 17 -115 -185 -27 76 -178 126 -2 -155 -150 260 61
2969 61 -293 26 43 171 165 170 77 -273 87 211 145 62 182 -45 276 101 95 -117 -73 -43 16 -113 160 -66 107
2994 107 66 -212 -137 -121 -109 19 -112 -172 -17 -44 -13 50 -95 340 107 -154 -85 -19 47 -84 24 56 -447 -40
3018 -40 170 22 52 -303 204 168 -74 -135 311 -80 2 85 -91 55 210 -175 -421 -51 -65 -207 -105 -54 166
3041 166 -2 55 -210 -98 93 189 -117 -145 -26 3 107 -269 39 31 30 -13 -35 -133 77 -52 32 84 107 -168 -128
3066 -128 187 -327 82 20 -111 -218 -85 33 -74 61 287 127 67 -118 3 -36 -171 -168 -130 17 -85 -90 222
3089 222 150 -26 -394 -25 2 -48 202 192 -375 -131 349 277 -52 -39 1 321 19 155 -120 155 -106 343
$$ packed form
2920F3p5K25m88N06Rj90q6R0Q2j86R3qj8R4L8m88P50l38k8q5K42m82L93j24l66
2945c77M12m5mk3M5Mk8L90j80j03J32p3j33j32p0J58J03k54L04j28j53NM10j99
2969F1l54L19J7J28oNr3l50L60J24o6q3J20k27L21j75ok12M4L0N9j29K73k26J73
2994A07m1k78P5J6J2J28j31o0J55k7L1O3j45M35k33k61O9O6O6j31J08L2n03M07
3018d0K10j48L0l55N07l6k42o1M46l91Q2Q3j76J46J55l85k46L70j4j42J02N1K20
3041A66j68N7k65J12J91R6l06k8J19K9J04l76L08qjm3k2r8K10j29Q4N2K3k75M0
3066a28L15n14M09o2j31j07J33J18j07J35K26j60o0j85J21l9j35LL8J47j02nL12
3089B22p2j76l68L69K7n0K50j0n67K44M80p2l29J3M0L20l02J36k75K75k61M49
$$ plain form
3111 343 217 76 -149 -93 21 -63 315 -63 -239 497 97 84 73 -67 -17 103 -19 2 106 -269 260 255 17
3134 17 -135 -140 -37 368 246 53 65 -9 -31 -115 -89 -110 -271 -220 356 29 -58 6 -146 24 17 171 26 -83 50
3159 50 311 222 -201 -472 -1 -101 59 69 -133 122 -322 25 -221 -35 -79 -210 338 128 107 -226 62 238
3181 238 165 -33 -244 114 115 -13 -28 -109 -58 116 -95 6 -139 108 127 -149 143 -37 -77 -276 -252 105 -558
3204 -558 -247 -126 -163 -111 -92 -157 -195 -140 205 135 -25 246 -231 -196 -22 88 143 -389 -250 77 180 230 36
3227 36 -93 -4 -14 296 220 19 -166 275 258 120 -63 -159 -165 3 215 66 119 -46 197 194 -65 -30 37 341
3251 341 217 -28 195 182 -49 210 -253 8 -75 -63 188 -218 266 91 -38 405 45 -76 -95 -20 -64 50
3273 50 88 188 9 -179 14 87 -102 48 313 18 -102 -53 -31 -417 -123 11 -112 -125 118 349 -228 -23
$$ packed form
3111C43j26j41k25N6J14q4L78l78j76P36m00j3j1j40N0J20j22K1J04l75N29nk38
3134A7j52nJ03M05j22j93J2p4k2q4K6k1j61N1N76l27q7O4j52J70pJ54j45j09J33
3159E0K61q9m23k71M71j00J60J0k02K55m44L47k46J86m4j31N48k10k1l33K88J76
3181B38p3j98k11L58Jj28j5q1N1J74k11J01j45K47J9k76K92j80m0j99K4L57o63
3204e58L11J21l7N2J9o5l8N5L45p0j60K71m77L5J74J10N5n32J39L27J03N0j94
3227C6j29Q9j0L10p6k01j85M41j7j38j83r6oJ68K12j49N3j65K43lk59L5O7L04
3251C41j24k45K23j3k31K59m63K61q3J2K51m06M84j75j29M43l60j21j9P5m4J14
3273E0L8J00j79j88J93P3j89J50K65k95j20M9K2l86K94J34j23j3K43K31n77K05
$$ plain form
3295 -23 -54 342 -72 -45 -102 -127 -126 162 -122 86 215 -41 -82 -78 -116 -53 151 93 -69 363 -77 35 0 4 144
3320 144 -142 77 368 150 224 -373 98 -25 204 80 143 -373 142 -276 384 173 195 -142 -143 47 80 14
3342 14 -177 121 -208 205 -157 137 -373 -249 22 157 65 -439 17 -227 186 97 23 118 -4 -63 -31 267
3364 267 280 59 45 303 -32 -45 -65 54 132 -114 69 112 24 -83 -152 -110 67 -295 -88 343 9 -204 -24
3387 -24 -143 99 247 -186 254 -135 -244 -114 234 72 -364 -10 40 -98 91 70 60 116 89 56 -88 -46 -19
3410 -19 179 221 42 260 95 234 53 102 -172 -208 -218 180 -40 -161 34 -205 29 -209 197 216 153 54 83
3433 83 -61 105 -339 112 111 287 -39 151 111 -263 141 15 -15 -194 -68 -102 224 -9 -359 95 -28 -75
3455 -75 -156 237 97 -59 82 1 -355 19 -129 116 87 26 101 89 17 -16 93 -59 54 -127 57 -306 56
$$ packed form
3295b3l1L96m14K7n7k5JK88k84K08J29k56m1Ml8O3K04n8j62M32m40J12l5MJ40
3320A44k86K19K91k18P4n97M71j23K29j24O3n16N15m18O60k11K2l37jJ90L3o6
3342A4j91K98l29M13l62K94n10J24K71J35r2n04M56k44M13q9p4R5j22n9L2K98
3364B67J3k21j4K58l35j3k0J19P8k46J83M3q8j07o9M2J77l62K07M31l34k13J80
3387b4j19K42J48m33M40l89j09J30L48j62m36L54N0j38J89k1j0N6k7l3j44M2K7
3410a9J98M2j79K18j65J39j81M9k74l6j0L98k20j21J95k39K34k38M06J9o3r9K9
3433H3j44J66m44M51jJ76l26J90m0l74M04j26l0j79J26l4L26k33l50M54j23m7
3455g5q1L93j40j56J41q1l56L74j48K45k9o1P5j2p2l3J09j52J13j81J84l63L62
$$ plain form
3478 56 -68 -65 -15 -111 312 -119 45 77 -137 43 87 -184 75 74 -66 -127 -109 11 474 27 111 -304 -184 136
3502 136 -160 -43 36 -16 30 165 203 183 -315 43 -148 -155 240 67 362 -10 178 29 -248 23 120 -75 4
3525 4 -101 246 -184 -209 -287 252 1 -13 86 83 -140 89 -34 43 0 135 5 71 71 -397 -171 -248 107 -85 -297
3550 -297 -159 118 -69 102 -163 -71 -5 24 -349 -104 60 -212 -338 47 94 51 85 -53 -333 201 274 81
3572 81 123 84 -108 -444 192 -232 88 75 -63 257 30 -50 31 428 144 -199 90 33 162 81 -149 127 -8
3595 -8 339 32 -94 -107 -66 -184 403 159 -21 -36 171 -250 -127 69 120 -230 224 263 -208 -172 171 -25 -237
3618 -237 140 185 -238 -162 -102 88 -72 43 96 2 -240 219 81 68 161 139 -105 -259 244 -92 89 0 -75
3641 -75 114 26 58 275 160 -140 -183 17 61 90 154 -49 -52 -141 14 -56 107 143 55 70 2 -160 -360 -51 44
$$ packed form
3478E6j24LN0r6M23m31J64L2k14J80M4k71K59jj40o1J8J20M63m47Q4m15J20L20
3502A36k96J17P9n2M6J35L8k0m98L58j91pL95j73K95l72J88j49k77K71R7j95P9
3525Dj05L47m30k5p8N39k51j4R9lk23K29j23P7m3J35j30O6%m68K26p7L55j92k12
3550b97J38K77j87J71k65R2O6K9l73K45J64k72j26L85M7m3L4j38k80N34P3j93
3572H1M2l9j92l36O36m24L20j3j38L20k27q0Q1L97k84l43K89n7J29q1k30K76j35
3595hL47l07j26j3M1j18N87k44j80j5K07m21J23J96N1l50M54L9m71L6L43j96k12
3618b37L77M5m23P6O0J90j60J15N3r4k42M59j38j3R3k2k44j54N03l36J81q9p5
3641g5J89q8L2K17j15l00m3K00M4K9O4k03lq9J55p0J63L6q8J5o8j62k00L09R5
$$ plain form
3666 44 110 -193 -89 -142 -33 249 35 -83 -164 92 113 -216 -81 -351 122 -130 4 32 -251 -122 -196 44
3688 44 -14 105 -38 32 -243 129 113 245 185 90 -59 64 99 -192 51 191 70 265 -35 -99 -132 -131 19 -18
3712 -18 -105 118 -124 273 -70 -36 -56 -96 235 75 -261 149 119 -311 31 -1 180 80 71 6 43 13 65 -32 99
3737 99 191 2 -124 -51 -172 -56 -422 105 -46 -21 71 -166 -207 32 111 51 -57 95 -61 -178 -257 -141 -104
3760 -104 -69 -34 -174 87 144 -65 -130 9 237 6 -205 -304 158 -105 52 -44 -106 -184 -86 225 -240 -14 -97
3783 -97 50 91 -77 114 40 55 -417 144 -85 -29 110 -108 -62 51 32 -66 -159 35 160 23 286 -77 -257
3806 -257 150 179 173 103 65 -200 6 -172 -96 42 76 -362 -45 -148 -177 -487 83 75 -83 -227 336 119 -90
3829 -90 93 120 49 -38 -33 -254 19 -11 -190 121 -295 -74 -3 188 -46 -42 -56 -174 282 35 171 38 -226 -80
$$ packed form
3666D4O6l03J04n3J09K82k14j18q1K56K1l29J35k70M73k52J34K8k83J29p4K40
3688D4n8J19j43P0k75L72j6J32o0r5j49J23L5k91K43J40j21J95l00o4l3JJ50l7
3712a8q7K23k42L97l43L4k0m0L31j60l36M10l0m30L42l2J81j00ro5L7l0N2r7J31
3737I9R2j89j26P3j21J16l66N27j51K5R2k37m1K39P9o0j08J52j56j17p9J16L7
3760a04L5L5j40K61N7k09o5J39K28k31k11r9M62k63J57r6o2p8R8L11m65K26q3
3783i7J47M1j68J91p4J5m72N61k29N6J39k18M6J13j9r8r3J94J25j37K63l63j80
3806b57M07K9op0l8k65K06j78P6J38L4m38L17j03k9l10N70qj58j44N63k17k09
3829i0J83K7p1q7Nk21K73l0j79L11m16K21P1J91k34Mj4j18M56k47J36j33k64J46
$$ plain form
3853 -80 -1 31 160 -70 -266 20 -7 -420 70 -73 -166 -248 -159 59 84 -119 169 -259 78 192 78 -36 142
3876 142 61 -160 214 -233 -17 -362 287 249 166 -72 50 238 -233 188 82 -121 93 69 -39 -7 -97 147
3898 147 -274 -32 198 -16 8 12 -184 31 177 168 -184 -2 -25 121 -11 123 -96 -205 -29 -30 196 -205 -165
3921 -165 42 210 121 98 -141 86 -58 88 61 26 147 46 143 -304 -203 212 125 -91 35 -86 -19 67 264
3944 264 40 -186 -14 -350 -37 274 157 -37 -249 -103 -137 43 26 56 65 154 -20 -36 117 199 120 -148 -219
3967 -219 -305 4 71 -16 -103 -103 180 335 110 -260 -144 -165 -425 -197 -3 1 332 53 -282 -365 -169 238 -233
3990 -233 -22 -77 -2 87 138 75 -73 140 317 32 31 174 -67 -226 43 24 237 124 -63 64 -20 -16 -143 96
4014 96 49 255 80 -37 151 -47 -83 -104 -220 30 130 -116 -469 -107 -2 135 151 -74 -25 -90 -249 -156 149
$$ packed form
3853h0P9L2J29k30j96K86k7m13M90j43r3q2Q9K18K5k03K88m28L37J14j14j14J78
3876A42q1k21L74m47K16l45O49l8q3k38J22J88m71M21j06k03K14k4j08L2r0K44
3898A47m21K42K30k14K4Mj96K15J46rl52J82k3J46j32J34k19j09J76jK26m01M0
3921a65K07J68q9k3k39K27j44J46k7l5J21j01R7m47J01M15q7k16J26j21O7Q6J97
3944B64k24k26J72l36L13L11j17j94k12J46l4J80j7L0RQ9j74j6J53Q2p9k68p1
3967b19q6L09O7q7q7%K83J55k25l70J16k1k60K28J94ML31k79l35q3J96M07m71
3990b33K11n5P5Q9N1o3j48K13J77k85jJ43k41j59K69j9K13j13j87J27q4Mj27K39
4014I6m7K06j75j17J88j98l6k1j16K50J00k46l53L62J05J37J6k25M9o5j59R3L05
$$ plain form
4037 149 267 138 235 -1 -73 -315 -73 350 -283 -338 99 147 170 19 155 184 180 -86 159 -74 -22 194 155
4060 155 155 25 -124 31 -135 -166 44 220 303 -13 154 -126 204 401 -194 -106 131 265 90 131 -5 32
4082 32 -92 127 17 -56 -179 22 -300 104 -37 209 424 148 -52 -288 -333 118 157 110 -19 -218 64 23
4104 23 -87 -204 -108 140 186 261 -109 240 35 -9 73 -105 -138 75 -82 170 -221 -256 60 63 101 -95 -22 -144
4128 -144 -47 -149 104 414 42 12 439 301 154 260 -194 -107 -6 -265 -169 -7 -396 15 -144 7 246
4149 246 -80 -63 130 -24 -27 -24 102 -167 -81 112 -105 -113 218 255 -191 85 -141 -2 201 361 -182 -277 107
4172 107 161 119 -206 -25 -78 -121 0 -5 -82 -416 -33 136 189 -176 197 -94 310 139 -229 -36 -218 -66 1
4195 1 -92 -117 228 -294 152 80 312 -44 99 -168 135 -49 -6 -64 158 -278 -187 251 270 75 -227 265 -25
$$ packed form
4037A49J18j29R7k36p2k42K42M23o33n5M37M8K3j51J36K9mk66K45k33N2K16l9
4060A55%j30j49J55j66l1K10J76Q3l16J67k80L30J97n95Q8K37J34j75M1j36L7
4082C2j24K19j10p3j23K01l22M04j41K46K15k76k00k36m5M51L9m7j29j99K82m1
4104B3j10j17R6K48M6P5l70L49k05m4Q2j78l3K13j57K52l91l5L16LL8j96P3j22
4128a44R7j02K53L10l72l0M27j38j47J06m54Q7J01k59R6J62l89M11j59J51K39
4149B46l26J7J93j54lLJ26k69Q6J93k17qL31L7m46K76k26J39K03J60n43r5L84
4172A07N4m2l25J81n3m3J21np7l34L83J69N3l65L73k91M04j71l68J93j82J52O7
4195Ar3k5L45n22M46p2K32l56J43k67L03j84M3n8K22m36R1M38J9j95l02M92k90
$$ plain form
4218 -25 -5 -280 82 -61 -167 -70 -110 -214 76 270 136 168 140 31 -166 106 -5 69 -146 -85 -108 63 110
4241 110 -88 24 232 -114 -287 138 -92 69 101 63 -90 36 78 147 -12 -47 -85 11 -232 206 73 -80
4263 -80 295 11 17 34 -136 155 -97 82 78 31 187 -125 -23 -174 -47 27 200 10 131 44 140 358 -86
4286 -86 61 34 -98 22 -165 146 351 78 9 -123 -137 7 82 113 -130 48 -3 66 198 143 286 13 -192
4309 -192 33 92 -58 -60 5 -259 276 -86 139 79 48 31 -112 164 -344 395 221 8 -184 -203 87 -90 -107
4332 -107 36 144 -143 134 -154 -62 -25 -44 -79 -240 237 67 32 -1 208 -34 186 99 -99 22 20 -24 351
4355 351 50 -25 258 -87 91 -365 -144 -94 -14 0 -196 394 318 198 -93 -124 -173 -34 28 20 -5 60 140 145 236
4380 236 -41 242 23 274 -168 -58 71 167 73 182 -29 -253 245 32 82 -118 -160 -70 125 -130 -17 60
$$ packed form
4218b5K0k75L62j43j06R7m0j04K90J94j34L2k8j09j97K72j11P4k15O1k3J71M7
4241A10j98J12K08l46j73M25k30J61L2l8j53J26M2O9j59l5l8R6k43M38j33j53
4263h0L75k84OJ7j70K91k52J79mm7J56l12J02j51J27P4J73j90J21q7R6K18m44
4286h6J47k7j32J20j87L11K05k73o9j32j4J44P5L1k43J78n1O9J32n5J43k73k05
4309a92K25N9j50kO5k64N35l62K25o0l1j7j43K76n08P39j74k13j92j9K90j77j7
4332a07J43J08k87K77k88R2L7j9l5j61M77j70l5l3K09k42K20q7j98J21km4L75
4355C51l01p5K83l45J78m56K21N0Q0J4j96N90p6j20k91l1m9J39O2qk5O5Q0NR1
4380B36k77K83k19K51m42J10J29R6r4J09k11k24M98k13N0k00m2R0J95k55J13P7
$$ plain form
4402 60 -27 62 -168 -220 30 128 37 314 190 -116 -94 -63 -4 54 22 181 -173 266 -108 -46 -312 109 144 -235
4426 -235 -455 34 -454 132 -164 -19 -111 -120 148 -52 -284 -40 229 47 390 -163 -375 -370 180 -5 214 -76
4448 -76 -140 286 12 -229 -276 183 -256 -1 -183 -9 -65 -145 -117 -294 125 -85 102 97 278 287 -61 -123 -69 253
4472 253 -291 206 40 271 -203 -262 -162 -82 23 78 133 -197 32 -248 55 -34 295 -120 24 -136 39 -372
4494 -372 -10 -101 -215 -44 -47 -197 -58 55 -164 -141 -136 -1 226 250 62 -67 183 92 127 282 -287 -244 9
4517 9 -202 -191 -130 238 -88 -56 219 -87 408 -7 -148 -186 283 56 -67 234 116 -195 -12 11 -177 313
4539 313 -51 3 110 176 -237 -48 -10 281 -259 -261 47 26 106 -56 23 20 428 -122 -116 -185 18 120 -103 -65 137
4564 137 -90 162 179 249 -65 -13 26 -259 -59 146 -133 106 115 127 -22 -137 -40 264 69 -41 -56 48 114
$$ packed form
4402F0q7Q9k30n2K50R8r1K77j24l06K2L1N9N8l2J59l54M39l74O2k66M21L5l79
4426b35k20M89m88N86k96J45r2rK68k00k32K44K69j82L43n53k12NN50j85K19k90
4448g6o4M26k74k41m7M59m39K55j82J74n6q0K8j77M19k10J87nJ81Rl48o2N4L22
4472B53n44M97j66K31m74n9J00Q0J05N5N5l30K29k80L03q9L29m15J44j60J75m11
4494c72L62r1j14J71lj50J39J13k19K3NJ35K27K4j88j29K50r1L5J55n69M3K53
4517Ik11J1O1L68l26L2K75l06M95m15j41l8M69k27j23L01j18l11J83K3j88M90
4539C13l64N4J07O6m13J89L8K91n40kL08k1Q0j62P9lM08n50Oo9K03J02k23L8K02
4564A37k27K52J7P0l14N2L9k85K00K05k79K39RJ2j49j15R7L04j95j10j5J04O6
$$ plain form
4587 114 162 -64 -97 38 -78 -45 -84 129 3 100 26 -79 -57 -62 38 -85 143 -39 -12 191 -21 64 -215 39
4611 39 64 -84 -172 -208 90 117 21 -110 154 256 93 242 -102 -85 15 317 -300 -45 -60 47 141 18 -269
4634 -269 -151 -12 5 41 -201 -66 47 120 111 -2 -45 30 85 175 -160 -1 -5 47 -203 -353 -235 -138 148 -77
4658 -77 -249 -16 -24 -108 331 345 18 150 29 101 -141 40 -65 309 205 52 -96 -351 231 100 -108 -320
4680 -320 -24 38 68 -1 219 39 -47 142 149 -58 14 -30 72 -284 -93 -165 216 49 65 -76 162 -56 -353
4703 -353 -290 1 168 24 263 113 71 -40 -138 136 -10 53 -32 -200 64 10 20 -31 -200 179 -16 -25 146
4726 146 155 -17 -340 28 180 -266 -109 192 201 206 123 -123 1 -243 -245 79 -82 197 -138 -214 276 151 219 -40
4750 -40 -32 -63 -11 108 -201 223 -15 190 -52 200 -247 119 251 98 -157 -253 20 152 -107 28 86 117 32
$$ packed form
4587A14M8k26l3J35j16L3l9K13j26R7p4j05K2nJ00j23K28j82K7K03k12Q5k79K54
4611C9K5j48q8l6K98K7r6j31K64J02j63J49l44J7J00L02o17K55j5J07R4j23k87
4634b69J18J39J7L6k42J35J13P3rj13m3P5N5R0l35J59mN2k50j50J18R7K86k25
4658g7j72K33qq4M39J4l27J32j21P2k42J81j05L74j04j53j48k55N82j31k08k12
4680c20K96O2L0o9K20j80q6J89Pk07P2m4J02l56J91p2L81j67J6j41K38k18k97
4703c53O3K91J67j44K39j50m2j11r8K74j46O3q5j68K64n4J0n1j69L79j95rJ71
4726A46Rj72l23L68J52m46J57L01RNq3k46J24k44kL24j61K79l35p6M90j25O8k59
4750d0Ql1N2J19l09M24k38K05k42K52m47L66J32j53k55r6K73J32k59J35N8L1q5
$$ plain form
4773 32 147 140 177 -12 -213 -187 -191 190 -57 195 164 71 -97 189 169 26 -80 84 197 129 -130 -138 196 213 -73
4798 -73 -163 -227 -110 -222 -62 175 -68 -274 69 50 -201 -73 69 367 310 38 -57 -32 151 -310 -76 151
4820 151 128 -82 -192 124 -89 79 278 -4 -139 67 -41 -42 -156 100 -51 -121 37 -146 -223 196 -152 -77
4842 -77 -204 -164 52 9 72 97 5 11 103 -56 187 51 -17 41 -103 371 5 -5 12 -131 -139 -116 -237 -329 -61 -35
4868 -35 -94 -30 -100 105 113 182 -146 -6 235 -21 65 239 -344 -41 76 244 16 161 -236 -83 -115 86 274
4891 274 120 -23 -127 -66 -79 -22 -133 93 -44 -20 66 -43 -323 -12 -22 203 47 -177 102 -22 -23 -38 68
4914 68 -58 -214 15 -192 126 -234 41 -260 -73 -147 -142 -133 -32 265 -194 70 80 63 -34 7 248 81 64 171
4938 171 65 -189 205 -91 1 284 -76 10 95 165 168 32 -33 143 78 63 -35 -214 220 182 -129 67 -142 -95
$$ packed form
4773C2J15pL7j89k01K6mL81k47K52l1r3j68K86k0j43j06J64J13o8k59qL34J7k86
4798g3r0o4J17j12J60K37k43k06L43j9k51J28J42K98n7k72r5K5J83m61K34K27
4820A51k3k10j10L16k13J68J99k82j35K06j08jj14K56j51p0J58j83p7M19l48P5
4842g7j27M0K16m3O3K5r2OR2j59K43j36o8N8j44M74l66j0J7j43qK3j21r2K68K6
4868c5n9O4p0K05QO9l28J40K41k56Q6J74n83L03J17J68k28J45l97J53l2K01J88
4891B74j54j43j04O1j3N7j11K26j37K4Q6j09k80L11j0K25j56k24K79j24jj5J06
4914F8j26j56K29k07L18l60K75l01J87p4NRJ01K97m59K64J0j7r7M1K41j67j7J07
4938A71j06k54L94k96R2K83l60Q6Q5P0Lj36o5J76o5j5r8j79M34l8l11J96k09M7
$$ plain form
4962 -95 -209 -43 -43 -225 -259 -35 343 82 -116 -3 -107 -57 -81 -4 8 -13 268 105 39 57 -245 90 18 -187
4986 -187 -12 260 27 -96 214 -16 254 -246 -74 -197 569 -38 80 337 167 4 -42 219 120 -146 -55
5007 -55 262 -100 220 -72 76 101 66 -271 -51 22 20 229 -208 103 -247 18 -199 -53 181 -156 247 -58
5029 -58 100 6 -12 6 -160 -92 -151 68 217 -92 -36 11 -183 -229 -152 147 286 204 -267 -232 86 189 23 191
5053 191 36 53 -229 219 -347 124 115 -197 -230 -181 126 -174 74 139 95 70 -291 194 43 -88 -376 -224 -118
5076 -118 -50 44 -183 -275 -249 335 -106 39 -137 -86 -110 -146 189 51 226 -154 -10 48 -122 21 93 137 171 138
5100 138 18 -118 32 -68 -29 279 251 77 1 138 117 -20 -106 -104 10 -233 80 -459 -103 -203 57 -284
5122 -284 305 161 207 150 39 322 189 -66 -42 -182 -141 -126 -182 -322 -319 228 102 -111 -25 -17 -115 75 89 -202
$$ packed form
4962i5j14J66%j82l4K24L78k61j98J13j04N0k4P7J2k1K81j63o6J8l02L35p2k05
4986a87J75K72k33j23L10k30K70n00J72j23P66o07J18K57j70j63m6K61r9k66R1
5007e5L17l62L20k92J48K5l5l37K20P3kK09m37L11l50K65k17J46K34l37M03l05
5029e8J58r4j8J8j66O8n9K19J49l09N6M7j94m6P7K99J39q2m71L5L18J03j66J68
5053A91j55J7k82M48n66M71rl12l3M9L07l00K48O5m4k5l61M85j51j31k88J52J06
5076a18O8R4k27r2K6N84m41J45j76N1k4l6L35j38J75l80J44N8j70J43P2M4L4l3
5100A38j20j36J50j00L9L08k8j74p6J37k1j37q6KJ14k43L13n39L56j00K60l41
5122b84N89j44M6n7j11K83j33k55K4j40M1J5n6j40LN47j26k13Q6Qr8J90J4k91
$$ plain form
5146 -202 51 -198 243 -142 10 137 219 -183 -136 68 -87 101 128 -88 94 -227 85 -121 78 -133 156
5167 156 200 -85 257 -148 -34 40 -303 159 -43 113 138 -174 -56 35 368 -45 152 13 236 -219 -84
5188 -84 -21 368 346 -165 144 -82 -74 -23 173 -192 -138 15 77 36 47 46 6 32 -48 -50 -54 102 -18 -106 -287 -208 29
5215 29 -5 -50 -51 117 -188 -43 -136 257 -215 304 26 123 154 78 57 -46 -143 -310 165 171 173 381 24 482 33
5240 33 257 -16 110 143 244 242 -197 137 91 97 206 63 -131 -36 -293 -10 -294 -23 -51 -271 -93 17 -176
5263 -176 70 80 33 32 214 -44 -109 -14 23 279 140 174 158 129 -187 -64 320 -203 -81 -15 -168 -152 22 -63
5287 -63 345 -25 264 -18 81 269 81 89 110 128 78 232 134 -90 -17 23 -135 -135 -41 150 -305 -317 72 92 100 -19
5313 -19 -38 -168 -183 194 344 137 -2 -121 43 95 61 338 -10 -94 312 87 -41 163 -217 77 -190 83
$$ packed form
5146b02K53k49M41l85J52J27Q2m02M7K04j55J88K7k16J82l21L12k06J99k11K89
5167A56M4k85L42m05J14P4l43M62k02J56K5l12J18R1L33m13J97j39K23m55J35
5188h4O3L89k2n11L09k26QN1J96l65N4J53O2m1J1jm0K6q0kmJ56j20q8j81P9K37
5215B9l4m5jJ68l05J45r3L93m72N19k78R7L1p6k1j03r7j67M75OKK08l57M58m49
5240C3K24k73J26L3J01km39L34m6OJ09j43j94R5k57K83k84K71k8k20J78J10j93
5263a76K46J0m7jJ82k58o5R5L7K56j39L4j6k9l16J23L84n23J22O6j53J6J74q5
5287f3M08l70K89k82R9J88j88QK1J8n0J54r8k24P3M0j58%R4J91m55j2L89K0Qj19
5313a9j9j30j5L77J50k07j39j19J64N2l4K77l48q4M06k25j28K04l80K94k67K73
$$ plain form
5335 83 -80 99 -90 30 44 106 83 226 -113 -120 -103 2 124 67 277 -18 21 -80 -99 15 -12 -71 163 34
5359 34 -351 -160 361 -4 -86 -91 60 -111 -34 -51 -207 55 76 -115 170 -336 102 -115 -77 102 67 78 103 57
5383 57 -119 -236 -90 39 86 139 -164 -97 126 242 146 109 202 32 -75 5 183 -273 -187 17 -251 23 366
5406 366 -137 50 -211 -64 -278 102 -151 -179 -5 141 -104 195 248 -63 -83 -320 83 20 -13 -122 120 258
5428 258 124 -76 -123 6 122 -292 80 203 -37 141 -210 102 -173 215 -5 126 163 -26 90 67 -3
5449 -3 -163 139 -8 -192 47 231 38 -191 -149 -68 45 199 -24 84 48 105 -30 26 31 20 -31 -118 290 143
5473 143 128 152 45 -115 127 -39 39 153 -11 -25 219 -157 -117 -41 -164 89 184 145 71 48 -160 117 307
5496 307 -49 54 68 -40 16 -251 -53 -50 477 128 182 -106 -184 58 63 -145 -89 83 -80 54 -206 -14 -287
$$ packed form
5335H3j63J79j89J20J4O2k3J43l39pJ7J05J22n7K10k95L9j01j9J14k7n9K34j29
5359C4l85J91N21l65q2nJ51j71P7j7j56K62K1j91K85n06M38k17L8J79l5J1K5m6
5383E7j76j17J46J29M7N3l03O7K23J16r6l7R3j70j07Q0J78m56Q6K04k68K74L43
5406C66n03J87k61J47k14L80k53k8J74J46k45K99N3l11k0k37M03o3l3j09K42J38
5428B58j34k00m7J29J16m14L72J23k40J78l51L12k75L88k20J31L7j89J16k3p0
5449cj60L02j47j84K39J84j93k29M2Q1J13J54k23J08l6N7j35N6Nj1n1q7M08j47
5473A43j5K4j07j60K42j66P8J14j64j4K44l76M0P6j23K53R5l9p4k3k08K77J90
5496C07l56J03J4j08N6k67J98LN27l49N4k88p8K42Nk08N6J72j63J34k60J92k73
$$ plain form
5519 -287 62 25 203 189 58 353 -145 218 -57 -40 -74 2 -249 39 10 82 -13 119 4 129 9 90 180
5542 180 -114 58 48 -30 -152 -61 -95 -138 -90 26 -128 -94 183 218 -67 64 -47 4 -445 68 197 -23 69
5565 69 60 29 58 419 183 96 140 68 50 -100 155 -95 -323 313 242 -181 120 -74 -85 197 -114 -176 -158 -119 -35
5590 -35 217 -66 2 163 55 -34 -153 -8 -12 -229 -197 -220 34 -150 82 179 -24 -1 79 170 -174 -50 63 -69
5614 -69 16 -13 -262 -180 255 125 25 161 -88 89 -272 56 -90 25 -255 12 248 -5 -104 -265 81 24
5636 24 -239 -50 -3 159 152 -232 388 -115 17 -26 -67 -123 4 401 83 -197 76 158 -15 217 244 124 83
5659 83 268 -232 -24 -73 -71 -41 -129 39 95 -214 -166 180 264 191 210 -275 -3 -61 125 -114 98 232 -102 1
5683 1 -72 171 61 -26 41 -147 -115 -7 -163 -37 225 47 248 54 -70 -199 217 51 258 -188 38 -86
$$ packed form
5519b87L49l7J78j4j31K95m98L63k75J7l4P6k51K88k9P2r5J32j15J25j20Q1R0
5542A80k94J72j0p8j22R1l4m3M8J16j54L4K77L5k85J31j11N1m49N13J29k20R2
5565F9rl1K9L61k36q7M4p2j8j50K55k50k28O36p1m23L01j94j1K82l11o2J8L9Q4
5590c5K52k83O8J61j08q9j19J45mk17L2k3K54j84K32R7k03K3Q0R1l44J24J13j32
5614f9Q5k9k49Q2M35j30j00J36k49J77l61L28j46J15k80K67K36k53r9j61L46n7
5636B4k63J89M7J62pl84O20n03J32m3m1n6J27L97l18k80K73Q2j73K32K7j20m1
5659H3J85n00K08m9KL0q8J68N6l09M8L46Q4p3J9m85K72n8J86k39K12J34l34J03
5683Ap3K43j10q7O7j88L2J08j56J26K62j78K01j94j24j29M16j66K07m46K26j24
$$ plain form
5705 -86 80 -192 52 26 274 6 63 173 68 -136 -98 112 -121 -114 -54 63 -216 48 136 -131 -94 -34 125
5728 125 61 54 -34 -49 297 152 98 47 -344 250 -192 188 -29 -235 -27 154 -40 207 27 15 218 -62 72
5751 72 -348 -14 211 25 -2 189 91 249 6 36 -281 10 -100 163 293 -76 -70 -72 64 -52 197 267 -82
$$ packed form
5705h6J66k72K44k6K48k68N7J10j05k04L8K10k33PO0J17k79K64Q8k67L7O0J59
5728A25o4pq8j5L46j45n4n1l91N94m42L80k17k06K08J81j94K47j80j2K03k80J34
5751G2m20L34K25j86k7J91r8J58k43L0l17K91j10K63J30l69OkJ36j16K49P0l49
$$ [...]
8191a62
##END NTUPLES=NMR FID
##END=
