##TITLE=1H_EC-3189(53)
 CDCl3, 8 sc, 
 22.10.2019
##JCAMPDX= 6.0         $$ Bruker NMR JCAMP-DX V2.0
##DATA TYPE= NMR FID
##DATA CLASS= NTUPLES
##ORIGIN= UXNMR, Bruker Analytische Messtechnik GmbH
##OWNER= root
$$ XWIN-NMR		Version 3.5
$$ Tue Oct 22 15:37:47 2019 Russian Standard Time (UT+4h)  she@DPX200
##.OBSERVE FREQUENCY= 200.1315
##.OBSERVE NUCLEUS= ^1H
##.DELAY= (6, 6)
##.ACQUISITION MODE= SIMULTANEOUS
##.ACQUISITION SCHEME= undefined
##.AVERAGES= 8
##.DIGITISER RES= 18
##SPECTROMETER/DATA SYSTEM= spect
##.PULSE SEQUENCE= zg30
##.SOLVENT NAME= D2O
##.SHIFT REFERENCE= (INTERNAL, D2O, 0, 15.7039)
##AUDIT TRAIL= $$ (NUMBER, WHEN, WHO, WHERE, WHAT)
$$ ##TITLE= Audit trail, XWIN-NMR		Version 3.5
$$ ##JCAMPDX= 5.01
$$ ##ORIGIN= Bruker BioSpin GmbH
$$ ##OWNER= she
$$ F:/spectra/data/she/nmr/H-F/1/audita.txt
$$ ##AUDIT TRAIL=  $$ (NUMBER, WHEN, WHO, WHERE, WHAT)
(   1,<2019-10-22 15:36:09.78 +0400>,<she>,<DPX200>,
      <created by zg, POWCHK disabled, PULCHK disabled
       configuration hash MD5:
       00 E9 B6 7A A2 85 ED C7 34 08 36 98 17 FE 4E 26
       data hash MD5: 16K
       EC C8 42 6D F5 CA 5C 89 63 10 E2 AC 9D 6F 8A 3C>)
$$ ##END=
$$ 
$$ hash MD5
$$ FA 1F 92 63 2C B9 1B 4A D6 EC 22 DD 96 68 63 BA
##$RELAX= 
##$RELAX= 
##$RELAX= 
##$RELAX= 
##$RELAX= 
##$RELAX= 
$$ Bruker specific parameters
$$ --------------------------
##$DU= <F:/spectra>
##$EXPNO= 1
##$NAME= <H-F>
##$PROCNO= 1
##$TYPE= <nmr>
##$USER= <she>
##$AMP= (0..31)
100 100 100 100 100 100 100 100 100 100 100 100 100 100 100 100 100 100 
100 100 100 100 100 100 100 100 100 100 100 100 100 100 
##$AQSEQ= 0
##$AQ_mod= 1
##$AUNM= <au_zg>
##$AUTOPOS= <>
##$BF1= 200.13
##$BF2= 200.13
##$BF3= 200.13
##$BF4= 200.13
##$BF5= 200.13
##$BF6= 200.13
##$BF7= 200.13
##$BF8= 200.13
##$BYTORDA= 1
##$CFDGTYP= 0
##$CFRGTYP= 5
##$CHEMSTR= <none>
##$CNST= (0..31)
1 1 145 1 1 1 1 1 1 1 1 1 1 1 1 1 1 1 1 1 1 1 1 1 1 1 1 1 1 1 1 1 
##$CPDPRG= <>
##$CPDPRG1= <>
##$CPDPRG2= <>
##$CPDPRG3= <>
##$CPDPRG4= <mlev>
##$CPDPRG5= <mlev>
##$CPDPRG6= <mlev>
##$CPDPRG7= <mlev>
##$CPDPRG8= <mlev>
##$CPDPRGB= <>
##$CPDPRGT= <>
##$D= (0..31)
0 1.2 0 0 0 0 0 0 0 0.06 0 0.03 0 0 0 0 0.0002 0 0 0 0 0 0 0 0 0 0 0 0 
0 0 0 
##$DATE= 1571744169
##$DBL= (0..7)
120 120 120 120 120 120 120 120 
##$DBP= (0..7)
150 150 150 150 150 150 150 150 
##$DBP07= 0
##$DBPNAM0= <>
##$DBPNAM1= <>
##$DBPNAM2= <>
##$DBPNAM3= <>
##$DBPNAM4= <>
##$DBPNAM5= <>
##$DBPNAM6= <>
##$DBPNAM7= <>
##$DBPOAL= (0..7)
0.5 0.5 0.5 0.5 0.5 0.5 0.5 0.5 
##$DBPOFFS= (0..7)
0 0 0 0 0 0 0 0 
##$DE= 6
##$DECBNUC= <off>
##$DECIM= 24
##$DECNUC= <off>
##$DECSTAT= 4
##$DIGMOD= 1
##$DIGTYP= 9
##$DL= (0..7)
0 120 120 120 120 120 120 120 
##$DP= (0..7)
150 150 150 150 150 150 150 150 
##$DP07= 0
##$DPNAME0= <>
##$DPNAME1= <>
##$DPNAME2= <>
##$DPNAME3= <>
##$DPNAME4= <>
##$DPNAME5= <>
##$DPNAME6= <>
##$DPNAME7= <>
##$DPOAL= (0..7)
0.5 0.5 0.5 0.5 0.5 0.5 0.5 0.5 
##$DPOFFS= (0..7)
0 0 0 0 0 0 0 0 
##$DQDMODE= 0
##$DR= 18
##$DS= 0
##$DSLIST= <SSSSSSSSSSSSSSS>
$$ [...]
##$SUBNAM2= <"">
##$SUBNAM3= <"">
##$SUBNAM4= <"">
##$SUBNAM5= <"">
##$SUBNAM6= <"">
##$SUBNAM7= <"">
##$SUBNAM8= <"">
##$SUBNAM9= <"">
##$SW= 24.0689530833862
##$SWIBOX= (0..15)
0 0 2 0 0 0 0 0 0 0 0 0 0 0 0 0 
##$SW_h= 4816.95568400771
##$TD= 16384
##$TD0= 1
##$TE= 0
##$TE2= 300
##$TE3= 300
##$TEG= 300
##$TL= (0..7)
0 120 120 120 120 120 120 120 
##$TP= (0..7)
150 150 150 150 150 150 150 150 
##$TP07= 0
##$TPNAME0= <>
##$TPNAME1= <>
##$TPNAME2= <>
##$TPNAME3= <>
##$TPNAME4= <>
##$TPNAME5= <>
##$TPNAME6= <>
##$TPNAME7= <>
##$TPOAL= (0..7)
0.5 0.5 0.5 0.5 0.5 0.5 0.5 0.5 
##$TPOFFS= (0..7)
0 0 0 0 0 0 0 0 
##$TUNHIN= 0
##$TUNHOUT= 0
##$TUNXOUT= 0
##$USERA1= <user>
##$USERA2= <user>
##$USERA3= <user>
##$USERA4= <user>
##$USERA5= <user>
##$V9= 5
##$VALIST= <valist>
##$VCLIST= <CCCCCCCCCCCCCCC>
##$VD= 0
##$VDLIST= <DDDDDDDDDDDDDDD>
##$VPLIST= <PPPPPPPPPPPPPPP>
##$VTLIST= <TTTTTTTTTTTTTTT>
##$WBST= 1024
##$WBSW= 4
##$XGAIN= (0..3)
0 0 0 0 
##$XL= 0
##$YL= 0
##$YMAX_a= 167464
##$YMIN_a= -107825
##$ZGOPTNS= <>
##$ZL1= 120
##$ZL2= 120
##$ZL3= 120
##$ZL4= 120
##$ABSF1= 10
##$ABSF2= 0
##$ABSG= 5
##$ABSL= 3
##$ALPHA= 0
##$AQORDER= 0
##$ASSFAC= 0
##$ASSFACI= 0
##$ASSFACX= 0
##$ASSWID= 0
##$AUNMP= <proc_1d>
##$AZFE= 0.1
##$AZFW= 0.1
##$BCFW= 1
##$BC_mod= 2
##$BYTORDP= 1
##$COROFFS= 0
##$CY= 11.3945322036743
##$DATMOD= 1
##$DC= 2
##$DFILT= <>
##$DTYPP= 0
##$F1P= 20.1720416913024
##$F2P= 0.152960286110954
##$FCOR= 0.5
##$FTSIZE= 0
##$FT_mod= 4
##$GAMMA= 1
##$GB= 0.15
##$INTBC= 1
##$INTSCL= 1
##$ISEN= 128
##$LB= 0.24
##$LEV0= 0
##$LPBIN= 0
##$MAXI= 10000
##$MC2= 0
##$MEAN= 0
##$ME_mod= 0
##$MI= 1.114404
##$NCOEF= 0
##$NC_proc= 0
##$NLEV= 6
##$NOISF1= 3.799351
##$NOISF2= 2.8
##$NSP= 1
##$NTH_PI= 0
##$NZP= 0
##$OFFSET= 15.70392
##$PC= 1
##$PHC0= -9587.231
##$PHC1= 57.80083
##$PH_mod= 1
##$PKNL= yes
##$PPARMOD= 0
##$PSCAL= 0
##$PSIGN= 0
##$REVERSE= no
##$SF= 200.130013532006
##$SI= 16384
##$SIGF1= 3
##$SIGF2= 2
##$SINO= 400
##$SIOLD= 16384
##$SREGLST= <1H.CDCl3>
##$SSB= 0
##$STSI= 0
##$STSR= 0
##$SW_p= 3612.71676300578
##$SYMM= 0
##$S_DEV= 0
##$TDeff= 0
##$TDoff= 0
##$TI= <>
##$TILT= no
##$TM1= 0
##$TM2= 0
##$TOPLEV= 0
##$USERP1= <user>
##$USERP2= <user>
##$USERP3= <user>
##$USERP4= <user>
##$USERP5= <user>
##$WDW= 1
##$XDIM= 8192
##$YMAX_p= 0
##$YMIN_p= 0
$$ End of Bruker specific parameters
$$ ---------------------------------
##NTUPLES= NMR FID
##VAR_NAME=  TIME,          FID/REAL,        FID/IMAG
##SYMBOL=    X,             R,               I
##VAR_TYPE=  INDEPENDENT,   DEPENDENT,       DEPENDENT
##VAR_FORM=  AFFN,          ASDF,            ASDF
##VAR_DIM=   8192,          8192,            8192
##UNITS=     SECONDS,       ARBITRARY UNITS, ARBITRARY UNITS
##FACTOR=    0.0002076,     1,               1
##FIRST=     0,             0,               0
##LAST=      1.7004516,     0,               0
##MIN=       0,             -107825,         0
##MAX=       1.7004516,     167464,          0
$$ Real data points
##PAGE= N=1
##DATA TABLE= (X++(R..R)), XYDATA
0@%%%%%%%qJ6j6J6j6K4l2M0m8N6p2Q8j04J20j36J54j79K09k41K74l12L52l95M50
31B40n08N68o37P14p94Q82r81J089j209J341j486J644j820K018k236K481k761
48a455L081l452L886m401N026n803O806q154J0068j3032J8297l0530J12964P4163
62A67464j00543R481o891J5068M621l523l4585r28j320j1824j4646N593l224J1908
76C6651J5169r457l1871o248O103P364Q300M237j3344m245M077k468k753R976
90B1491M142l671n93m349j0011Q55O280l0M04J754o518n551J136j222k521M047
106E643K074m739k918j893l269K275N635j446k955K11j332k040K657J576j380
121a901J386J444j512j271J206p48J140L315l4k241K05k22p57J776K063j634m68
$$ plain form
0 0 0 0 0 0 0 0 0 -8 8 -8 8 -8 16 -16 24 -24 32 -40 48 -56 64 -72 82 -97 112 -129 145 -167 185 -210 240
31 240 -268 300 -337 377 -417 465 -516 573 -636 705 -781 863 -957 1061 -1175 1306 -1455
48 -1455 1626 -1826 2060 -2341 2685 -3118 3688 -4466 5602 -7430 10867 -19663 93301 167464
62 167464 66921 76402 69511 84579 89200 85677 51092 50164 48844 37020 22374 27967 24743 36651
76 36651 51820 42363 10492 4244 10347 17711 26011 30248 16904 12659 16736 14268 11515 21491
90 21491 25633 21962 21369 17020 7009 7864 14144 14114 14518 16272 9754 4203 5339 4117 1596 5643
106 5643 7717 2978 60 -1833 -5102 -2827 2808 1362 -1593 -1382 -2714 -4754 -2097 -521 -1901
121 -1901 -515 929 -583 -1854 -648 -1396 -256 3059 3025 784 989 767 10 1786 3849 2215 1747
138A747N01j198l78J765p40q64Q85L82j264n5M30r96M51J257p33r94M85n80l6
157F5R13M84j056n8L25j79j91K94k50j42Q91j5n06M6J18k09K23M89n84K42j7N5
179I38n04P31P4q89O41l02m01k08N91j97k32K17p4k51K74p4o24J45M97k35K70
200C87J56r14K97J63K26m63O29J0m38L85J13j78j69J16o8J5M72k63m58K07J42
221C67k79L10j38n60K15J15Q3l93K62j24ko7M13l22k49J38J83j19J07k49J41K7
243a41L7p6r9J58m0Q8l80K87J16N5k4j10Q1j42J82K93l93K50k56M34k40k32O7
266h5K63o8P7k42k01L18l77K33K36k17j16Q1j14K67j53K85n4j78J03l39J1K12
288e8J55j66R9p1K04k90j11J49j94J83J37o0Mo8jj31O6j86K53k28J20Q1k22K51
$$ plain form
138 1747 2248 1050 672 2437 1697 833 1718 2100 836 781 1211 215 666 1923 1190 196 681 101 65
157 65 978 1462 406 348 673 494 303 597 347 205 1096 1081 575 621 739 530 753 1242 658 900 883 938
179 938 434 1165 1239 350 991 689 288 80 671 474 242 459 385 134 408 334 -290 -145 352 117 387
200 387 543 -371 -74 89 315 -148 481 491 53 438 551 373 204 320 252 267 739 476 18 225 367
221 367 88 398 260 -300 -85 30 113 -280 -18 -142 -144 -211 202 -120 -369 -231 -48 -167 -60 -309 -168 -141
243 -141 -104 -180 -279 -121 -161 -73 -453 -166 -50 5 -19 -129 -48 -190 -8 285 -108 142 -114 320 80 -152 -85
266 -85 178 110 187 -55 -256 62 -315 -82 154 -63 -179 -98 -212 55 -98 187 133 -45 58 -281 -270 -58
288 -58 97 -69 30 -41 163 -127 -238 -89 -283 -100 37 -23 -19 -87 -88 -219 -153 -339 -86 -314 -194 -113 -335 -84
312h4l5K04k53j77J34J68p2J7j30L19k00O6K66k95J82j05K96m67l02M37m0M77
334D06m24K48k07j66K20l1J69k96J6K10k38J4P1M5j51L8K03j07k29M22l25k04
356c16J57n5K48N3j95k5K2lL13l69K60L9j63j10k3K70k4k08O0O1K62k01O6j33
380a4rj63M66n88R2L35m7k31k1K36p5J91k62k20K11M26l55n1L18l85K99N9O3n42
404b67J68K59j11K7l37K42j69q1K28j6J39O2n4j98J41q6j03M75l55K41p4l75K21
427b3K21l27J7J54L66n64R4J24O0j27rJ69J92o13K27J86j79lJ12k71K42o2J09
450I5L69l46L3j25K51m18L08q3j39K20j53J13j54r0K76j78m2j31J54K96k83j09
472a36M14n6n25J92QJ47K57m24K6K3j62K42k66K62q2J06J72j73l09K28j08J95
$$ plain form
312 -84 -119 85 -168 -345 -211 -43 -115 -98 -228 91 -109 -43 223 -72 110 5 301 -166 -468 -31 -71 406
334 406 -18 230 23 -143 77 46 215 -81 -65 145 -93 -79 -8 37 -114 -76 127 20 -209 213 -112 -316
356 -316 -159 -214 34 87 -108 -133 -111 -114 199 -170 90 129 -34 -144 -167 103 79 -129 -69 -8 254 53 119 -14
380 -14 -23 -186 280 -308 -216 119 72 -159 -180 56 -19 172 -90 -310 -99 327 -28 -79 239 -146 153 212 275 -267
404 -267 -99 160 49 76 -261 -19 -188 -269 -41 -57 82 144 90 -108 33 -53 -156 319 -36 205 131 -244 -23
427 -23 198 -129 -112 42 408 -156 -62 62 122 -5 -14 155 347 -266 -39 147 -32 -35 77 -194 48 -14 95
450 95 464 118 151 26 277 -141 167 84 -55 165 12 125 -29 -119 157 -21 -63 -194 -40 256 -27 -136
472 -136 278 222 -303 -111 -103 44 301 -123 -97 -74 -236 6 -260 2 -80 26 198 25 -284 -56 -164 31
494C1j25J37K88j77m00J54N44n62n8J81j51j33K79j3N5k15L92j42m15K14m6K93
516A31j26m5Q9k17L55j36m7k50J58l1J93j03l1J44j49K48j46k71N22l15Q9q1M07
539C88n63K00R1r9J9k25J83j4o2m5N32o66J13l32L92j14J49R2L3k84K08j83j7
562b04K51nJ17jl63J13K58J6j91j76K07m2j67L12j31k50r8K08P6l4rJ8L80j73
586A12j34o6L38k58r8j41Q2L32n31M09o8J68J9m6j19j36M17n49R7K45j69J45K50
609B99l12N6j84m4R2K86k3p9j01J13j17Oj4JR5o6K10k82j58K72K0L5r7k41K82
634D9J69k74p1J88j54n3m9K52k1j53J21l20N6J13K5K62j87k14M74j37l41M47l12
657a30J68j19K26l75L48l25N9J35j0j72K94J1k1j71q9K92K1j38r1j33P2K00k6
$$ plain form
494 31 -94 43 331 154 -246 -92 452 -110 -168 13 -138 -271 8 -5 50 -165 227 85 -330 -116 -162 131
516 131 5 -40 49 -168 187 51 4 -246 -88 -119 74 -29 -60 84 -65 183 37 -234 288 -27 62 -19 388
539 388 -175 25 116 17 36 -189 -6 -20 -82 -127 405 -261 -148 -480 -88 -202 -53 39 72 -212 -4 -187 -204
562 -204 47 42 159 158 -205 -92 166 182 -9 -185 22 -20 -187 125 -6 -256 -354 -146 -70 -104 -113 -95 285 112
586 112 -22 -88 250 -8 -106 -247 -165 167 -364 45 -23 145 164 118 -1 -137 280 -269 -172 73 -96 49 299
609 299 -13 43 -141 -185 -93 193 170 91 -10 103 -14 -8 -22 -21 74 8 218 -64 -222 50 70 105 8 -233 49
634 49 218 -56 -127 61 -93 -146 -195 57 36 -117 4 -316 -260 -147 -122 140 -47 -261 213 76 -265 182 -130
657 -130 38 -81 145 -230 118 -207 -148 -13 -23 -195 99 110 89 -82 -171 121 142 4 -87 -220 -148 52 26
680B6K6J09k60j18n9J78K48j41P7j04j01J45j67K21k1k06j79J34K98n4L2qk39
703a63J51J10p6O0o7n5L5K05kl54Q7J07j11l4N8j97N85k81qk46M71m38K92j87
727e8J25p5M3j04R7k02J94K3J76j71l51M61k78J02l7K66l30L4N3K20k50N6J69
750A63l67J08K38m26M7j3L38N5j90N9j13k5J56j04K00J3q3K15k83J86q4J03m4
773A49P9l64P9J04l83M24k1R0L2O4j86p0L73l97J22K59P2k00k43L0n4J27k72L38
797A52k73M05j53P9m22oK24r8oK67l00N09n41J95Mj00M3r5L22n24M72l26M30n20
821b62K44J26l08RL08L4kk00N3K76j82J90k93J50k98L22o2o1L0K9k04k9n2J63
845a9n1q4K19j96M4n9K73l39N1R9J58l2r2j39J19K45o87O15O3N5j50m9j41M5M
$$ plain form
680 26 52 161 -99 -217 -276 -98 150 9 86 -18 -119 26 -141 80 59 -147 -326 -192 106 52 84 76 -163
703 -163 -12 98 22 82 15 -40 -5 200 198 -156 -69 38 -73 -107 -49 -246 339 58 50 -196 275 -163 129 -58
727 -58 67 -8 35 -69 28 -174 20 43 219 48 -303 158 -120 -18 -55 211 -119 -85 -32 188 -62 -6 163
750 163 -204 -96 142 -284 -237 -250 88 143 -47 12 -101 -126 30 -74 126 139 56 271 -12 174 90 193 149
773 149 228 -136 -57 47 -336 88 67 157 189 253 67 -3 370 -27 95 354 426 226 -17 13 -41 86 -186 152
797 152 -121 284 131 210 -212 -218 6 -92 -98 169 -131 378 -163 32 36 -64 -21 -116 206 -318 154 -172 258 -262
821 -262 -18 108 -200 -191 117 151 149 -51 2 278 96 286 -7 143 -155 167 105 44 74 103 -101 -130 -182 -19
845 -19 -70 -154 65 -131 -87 -146 127 -212 -161 -62 96 64 -28 -167 -48 197 -490 125 188 243 93 44 -97 -52 -48
870d8mK98r8k81M3J08p4J40J38l92J83j56J21l31L74O5Q8m14J79P5j41R2L7k93
894b91N06k34m4M42l47m6j20M01k56P9J3q7q2l35M34K57k93Oq1k11L96l0J6l29
918b36L47j04k64J63J5M17j79l75J80J51k07J40j91NL39r7l15L28l12J66Nj04
940a28mJ0O1R8R4J1K02n27K88j98Q5j35L38k17j49L46j33Q4j84m0K30l35J42J69
964A08j62j81J29K73rj66j8R6j5j37L41J2k02J50k6j75R9j74j24N5J52J81k07
987@M7j75p8K68N5k32J26o4j34Q2J87l8j82J48p2j0J49j5k09Q5K0K90l65J10J75
1012A68l43L61l90K7J26J0N0J74k01j6J92j15k65N8K40j42J10n3J9k37M72k28
1034A7j48K19J76m02q6M7K68k71l8J78J49l28R8O1K93k33L0Ln2J18K10l83l47
$$ plain form
870 -48 -52 246 148 -133 -90 18 -56 84 222 -170 13 -143 -22 -353 21 86 174 -240 -61 14 -127 -35 2 -291
894 -291 215 -19 -63 379 32 -14 -134 267 11 90 103 16 -66 -401 33 290 -3 3 -78 -289 107 77 93 -236
918 -236 111 7 -257 -94 -79 338 159 -216 -36 115 -92 48 -143 -138 201 104 -211 117 -195 -29 -24 -128
940 -128 -132 -122 -61 37 131 142 344 -183 105 -93 -8 -143 195 -22 -171 175 42 126 -58 -98 132 -203 -61 108
964 108 -54 -235 -106 167 158 -8 -26 70 55 -82 259 271 69 219 193 18 117 -57 -181 -126 26 207 0
987 0 47 -128 -206 62 117 -115 11 -53 -187 -105 82 44 -138 10 -62 -72 77 62 -147 -62 -42 248 -117 -7 168
1012 168 -175 186 -204 -177 -51 -41 9 183 -18 -34 158 43 -222 -164 76 -66 44 -9 10 -227 245 17
1034 17 -131 88 264 -138 -224 -177 91 -180 -218 -40 109 -219 -121 -60 233 0 30 33 -19 99 309 -74 -421
1057d21M00k5K29n6k9J1J02l88J22j3J01l4J0J53j92j32L65l55J97k41L90k12
1079a8m3q8J50M2k16J69j58K57j7n8k7K6K28n68K52J24k40M0L52r8p2j6J16j00
1103C7j08K82m17J43P6o7K0K37k85j41J71k16J84J25M3j29j09K77n2j96K18M2
1125A35j35K0j87L83m44J65K59j71O5J03J07m32R3r1L53j41J2j69K17j26K03k80
1147f1J79j58J02j63p9K04k73J16M9J37Q0Q9J6j67k42J2J65q1l2k27M92k83J90
1170F5k04K85j02j75L12l38J35oQR6j35K7J18J01l30r8P8K4L03j04o0r9J18k13
1194a94J14j00M09l70J53R5Kq9K18k11J28L2M5J14j66l4l91J73J28j00Q4M8r1
1217cJ88k24o3J71j48j57K63q4r5L91j46J25n7k5r7K1k1J91k68M91k25p7j96j66
$$ plain form
1057 -421 -21 -46 183 127 98 109 211 -177 -55 -68 33 -1 9 162 -30 -162 203 -152 45 -196 194 -18
1079 -18 -61 -149 1 43 -173 -4 -162 95 78 20 -7 19 247 -321 -69 55 -185 -145 207 109 37 21 137 37
1103 37 -71 211 -206 -63 13 -54 -34 203 -82 -223 -52 -268 -84 41 84 -45 -154 123 71 -125 93 135
1125 135 0 20 -167 216 -228 -63 196 25 90 193 300 -132 -39 -130 223 82 94 -75 142 16 219 -61
1147 -61 118 -40 62 -101 -180 24 -249 -133 -84 53 133 222 238 71 -171 -159 6 -75 -107 -334 158 -125 65
1170 65 -139 146 44 -131 181 -157 -22 -28 -20 76 -59 -32 86 187 -143 -241 -163 -139 164 60 0 -99 19 -194
1194 -194 -80 -180 229 -141 12 107 109 20 238 27 155 187 232 346 180 146 -245 -72 56 -44 40 88 -3
1217 -3 185 -39 -102 69 -79 -236 27 -57 -152 239 93 218 161 136 39 60 39 230 -38 453 228 151 -45 -211
1241b11j49O60k57q2n0L5L00J0j76j48K84j21l6j16J86l3o5j42K49j32k30J47
1263g7k1O2k1K2J21L8j70M2N0j80n3K06K5qp7J32j17O0q4j74J56j25R3K77l09
1288a32L55j50PJ9m5K91k72j96J89l7k96Q5L91n01L3L10k68J17L07m02J04J85
1310I4l98L94j15J23j58R7j1j31J08j34L2n0L17j72P6j67L02j54l23J67Q3L48
1332C28l42M22k31k46j53lJ60J88j85K29j17O4o3m2Q5J17o11L32j87L57J02l24
1354a20nl1L69j72j82L64kj95rnj64jL71k69J67j1N8k72J41j19j53P3r4K55k34
1379b40J70J29M4J08l06j43J20J56k22j45K45r3L99k70J31k98K36m66K99j14M23
1400A63j19R5%j91m1J05K03Q0k31n8j4l0O4j13M53n60L49k44r7K4J54p3P4j87
$$ plain form
1241 -211 -360 300 43 -39 -89 -54 246 256 80 -68 216 95 59 -57 129 96 31 -111 138 6 -224 -77
1263 -77 -98 -36 -57 -35 86 124 -46 -4 46 -134 -187 19 44 36 -41 91 -26 34 -50 -224 -68 -193 -100 177 -132
1288 -132 223 73 80 99 54 345 73 -123 66 29 -267 -182 209 -292 -259 51 -217 -100 207 -195 -91 94
1310 94 -304 90 -25 98 -60 37 26 -105 3 -131 -99 -149 168 -4 72 -95 207 53 -270 -103 -20 328
1332 328 -14 408 177 -69 -222 -225 -65 123 -62 167 50 114 51 9 94 211 -400 -68 -255 102 204 -120
1354 -120 -125 -156 213 41 -141 223 221 26 17 12 -152 -153 218 -51 116 105 163 -109 32 -87 -240 -167 -261 -6 -240
1379 -240 -70 59 103 211 -95 -238 -118 38 -184 -329 -84 -177 222 -48 83 -215 21 -445 -146 -260 163
1400 163 44 139 139 -52 -93 12 215 295 64 6 -8 -38 26 -87 366 -194 155 -89 -186 -162 -8 -81 -7 -194
1424a94K8L54j01o8j6j23P4J71j12k22J14r5K63lJ73Ql22m5L4j5j8J63k95J77
1448g0P8j43K25m07J79j2J72j93M23j17k71P5J7K0M5k65J64J77J30l56J66p9R5
1471E3J50K9p4k6m71N66m03j0K86J55o90L27K59O3J95k58k15k4K4K49J61l36J4
1494B4J5L18l70R8k3r4J51l12K07K5Mj40j01J28jJ61k84K18p8J35Jk79Q5J7m8
1519a43O3Q0j93K94l6L4j29k05R4J97O7J5k44M5j1L1j15K46n3j24L8N1l9j07n6
1544b00L24r0J02j60k5j51K67LK08o9k54L1j07o4J38M36m03J94j23j16j21K50
1566G0j3j33q0J82o5j10P5K2Q0j17M4j0L62l51J12j12o4l5J62K50j41j8r0J77
1590A97k25k4N6K16o9j40J2j45J34N6q8l3P8j63P7K84k68Q1J06j95O4O6k61N5
$$ plain form
1424 -194 -166 188 87 19 3 -120 -46 125 13 -209 -95 -190 73 70 243 251 -71 -116 -82 -97 -115 48 -247 -70
1448 -70 8 -135 90 -317 -138 -150 22 -171 252 135 -136 -61 -44 -24 21 -244 -80 97 227 -129 37 -42 53
1471 53 203 232 158 132 -339 227 -176 -186 100 255 -435 -108 151 214 409 151 -64 -88 -64 185 346 10 24
1494 24 39 357 -13 85 62 -32 119 -193 14 39 43 -97 -198 -70 -71 90 -194 24 -54 81 82 -197 -112 -95 -143
1519 -143 -80 0 -193 101 65 99 -30 -235 -141 56 123 138 -106 -61 -72 -41 -156 90 37 -87 -49 2 -37 -144 -200
1544 -200 124 34 136 -24 -49 -200 67 70 278 209 -45 -14 -121 -185 -47 389 -14 180 57 -59 -180 70
1566 70 57 -76 -156 26 -39 -149 -74 -52 28 -89 -45 -55 307 -44 68 -44 -108 -143 19 269 128 110 20 197
1590 197 -28 -52 4 220 151 11 23 -122 12 68 -20 -53 25 -138 -61 223 -45 36 142 -53 11 77 -184 -129
1614a29K40k64K21j46K91n51Q7R4J98k54J05J68j80J1O3J02L20m40J45K73k90
1635F4J29l68O4k7J13p1Q9J32J18j17n25K06L44k76K64p9j26LQ8Q3q8L4j19K98
1659B33l21J38j99j57K97J10r1p8J07L7j46J89k78J24J40l67J86K2j02J54j05
1680a07m3K73K9k54J29j43n2L62J5m52J27Q2j44J86J9l7O9r0jN7j38J78k2q6K59
1705B16l28K01M3j99q0M45k60j18l8N4L48n41K40j86L97l13L6J05k33K26j01q4
1727a70KJ12J10j57j5R8M8k3kL01j82k30J35Lo1L02l86K94p1k49N0j2J90k1l47
1752b81M31l26M7M31k72K77n15J51K71m83L64L64n84J80K6n0J52k47K17j65k2
1773c4rq1O7K12j02k17L03k38j7J38M7l4M0J2P0j6l2m23L88n1Kj98J67Q4N6j66
$$ plain form
1614 -129 111 -153 68 -78 213 -338 -251 -157 41 -213 -108 60 -120 -109 -46 56 376 -64 81 354 64
1635 64 193 -175 -111 -138 -25 -96 -7 125 243 126 -399 -193 151 -125 139 60 -66 -63 25 108 20 54 -65 233
1659 233 -88 50 -149 -306 -9 101 10 -68 39 76 -70 119 -159 -35 105 -262 -76 -54 -156 -2 -107
1680 -107 -150 123 152 -102 27 -116 -168 194 209 -243 -116 -34 -178 8 27 -10 59 -31 -32 25 -113 65 43 -43 216
1705 216 -112 89 132 -67 -147 298 38 -80 -118 -64 284 -257 -17 -203 194 -119 -83 22 -211 15 -86 -170
1727 -170 -168 -56 54 -103 -118 -20 28 5 3 304 122 -108 27 30 -31 271 -115 179 108 -141 -91 -103 87 66 -281
1752 -281 150 -176 -129 302 30 307 -208 -57 214 -269 95 459 -125 55 81 31 183 -64 153 -12 -34
1773 -34 -43 -124 -57 155 53 -164 139 -99 -116 22 69 35 75 87 157 141 109 -314 74 23 25 -173 -6 78 134 -32
1799c2J00M4j52o0J86k68j04L35rJj74J43Rl8p3j76L55l7M3J43k12J52j30J57
1823B03l82j13L56l8k01K8K23j62n1K18p6J06j52QM00j44K25l18L3k3K4l26J18
1846d4o2r2J01K28K2m19M46q0q0R3L3jj31O9Ol73L76j65n2K07l24o5J99r1J14
1871h5J47k37K06J04O6k42O1j24J14K67k22J14j22K40j62q0j53o0j40K5L22k12
1893a73J44j5M9j22K33j62L86n02K04j56K17k89O1M95k44j35J23j36M5k10Q7K96
1915A96j74Q2J14k33K51j15k16O6j18q3K79p5j82L26l13L72k99J2L5K74k70L53
1937B82l02J06j55K44o2j45k9R7j62jo8L05P9m15L37k4L7q4J10n6N9n1r2R5p0
1962C5K5R9m58L53l08L11l8j29O6J85k30M5M2J72m3l48J64R7lo3j13M3n5jR3N3
$$ plain form
1799 -32 68 112 -40 -100 86 -182 -286 49 40 41 -133 10 19 -19 -92 -268 87 50 93 236 24 176 46 203
1823 203 -179 -292 64 26 -175 -147 76 -86 -137 81 5 111 -41 -33 367 223 448 130 163 140 164 -162 -44
1846 -44 -106 -198 -97 131 153 -266 180 100 20 113 146 145 14 83 89 -284 92 -73 -125 82 -242 -307 -108 -199 -85
1871 -85 62 -175 31 135 201 -41 20 -104 10 277 55 169 47 287 125 45 -108 -168 -308 -283 39 -173
1893 -173 -29 -44 5 -117 116 -46 340 -162 42 -114 103 -186 -125 370 126 -9 114 -22 23 -187 -100 196
1915 196 22 104 218 -15 236 121 -95 -29 -147 -230 49 -26 -208 118 -195 177 -122 -110 -75 199 -71 282
1937 282 -20 86 -69 175 113 -32 -61 36 -126 -127 -195 110 189 -226 111 87 124 40 150 94 153 102 10 105 35
1962 35 60 159 -299 54 -254 57 19 -110 -44 141 -89 -44 -2 170 127 -221 -57 40 37 -26 -139 -96 -151 -152 -59 -6
1988fj31j03L9J14m5K25N9k66j32K59j0m0q3L66q1k55J78J34j98n8j35L81j96
2011A6Nj12K3n6K31l06L7n4K45J34j18n0j9J74j59O0o9K1R3k12J26k4K09j04m5
2036D6J39l31J70k56J79K74l07L21j82o0j0J03k71L29k14j97M15k6j4n0R0%N1
2059A99Q9j66j18O7j94J40L4M5N6j22m46M79n7R5o9l6K15j5l28J70N7J72l10O7
2083B4k6J76k48J79J09j20k69J70J31J3m8Ok23N5O6K9j16K03j53J58J89m00J80
2106H5O6o1j31J29K0j25j53J89J01M6m9j47J16k14L5Ro2q5N53n9m05J04L56j54
2130A64p1m21L71j32K81J88l66j55L47q1j30k7J40j81O3m4j80J61J90r3N4j66
2152h8J63m37L79K05m13M46k96o3O5L47o87P8J13K51M5k80K02K05j14l47J50K1
$$ plain form
1988 -6 -137 -240 -201 -87 -132 93 152 -114 -246 13 3 -37 -120 246 165 -90 88 222 24 -34 -169 212 16
2011 16 21 -91 -68 -124 107 -199 -162 -216 29 163 45 -5 -24 150 -9 51 -18 3 96 -116 10 -14 195 91 46
2036 46 185 -146 24 -232 -53 221 -86 235 53 -7 -17 86 -185 144 -70 -267 148 122 108 58 148 148 199
2059 199 288 122 4 71 -123 17 51 96 152 30 -416 63 6 101 32 -4 211 196 -132 38 95 267 -43 24
2083 24 -2 174 -74 105 214 94 -175 -5 126 139 91 97 -126 -71 -5 24 -92 111 -42 116 305 -95 85
2106 85 151 90 -41 88 108 -17 -170 19 120 166 117 -30 86 -128 -93 -84 -146 -231 322 263 -142 -38 318 164
2130 164 93 -328 43 -89 192 380 14 -141 206 125 -5 -32 108 -73 -10 -54 -234 -73 117 24 78 -88
2152 -88 75 -362 17 222 -191 255 -41 -104 -39 308 -379 -301 -188 63 108 -172 30 235 121 -226 -76 -55
2174e5O4n1L14l13o1K7J36Q8j04j32J94l9J96k38j54L11l80K40j68K30j93J35
2196D7L82p71N86l94K08l42M64o9n89M76k6K09j99k44J73K63k32p1L70k11J51
2217A81k4q3P4k60K24J00J6j32J12m93K11J34n8j36r5M27j14n2Q5j59J14m8j24
2240a00N16n15L06l8J91j64j68p4J51j66j05q3K40o6M5K92m26J00J19J25j98L6
2262A8l42N38k49J21K3j19j46Q5K80j91j82K20P4k04J51K9J5lj33J93J22k82J60
2285A78O0k07J67m2j94O2j70P6M23m48R1K15l94J77J36l16K38J25k47J55mk21
2307a40L18Jl47K91l83R6K43M9k26R1K22l86l4L18p0k4q5K4K0J27j32k72L3K94
2331B8K53l27K31l60J42J37%K17k73j07J88k45K40n3N8o9J23j35o3j48p7j22L49
$$ plain form
2174 -55 9 -42 272 -41 -102 -75 61 149 45 -87 107 68 264 26 -128 183 -197 43 -125 105 -88 47
2196 47 429 -342 244 -150 58 -284 180 111 -478 -2 -28 181 -18 -262 -89 174 -58 -129 241 30 181
2217 181 157 74 148 -112 112 212 228 96 208 -285 -74 60 2 -134 -229 198 84 32 117 -42 72 24 -100
2240 -100 416 -99 207 169 360 196 28 -46 105 -61 -166 -249 -9 -75 -30 262 -164 -64 55 180 -18 18
2262 18 -324 214 -35 86 109 -10 -156 -71 209 18 -164 56 130 -74 77 106 121 118 -15 178 300 18 178
2285 178 238 31 198 156 -38 24 -146 -70 353 -95 -4 211 -183 -6 130 -186 52 177 -70 85 81 -140
2307 -140 178 179 -168 123 -260 -164 79 128 -98 -7 215 -171 -205 113 43 19 -66 -42 -22 105 -27 -299 -266 28
2331 28 281 -46 185 -175 -33 104 104 321 48 -59 129 -116 124 71 129 60 183 48 -15 -163 -240 -362 -13
2354a3QK03k63J16nJ01j36J57j11J27p8j68Q3P4qL0k09J45j26O9l1R4q2j30J55
2379Bm1J1j79L96m54J42L24j69j52Q8JJ26qMk52K48l74K17K6J92j35j36K53J5
2403A45j61K0O9k04j71L98l57J22K76k03N7j02nM28k61j42K85n1k44J81J48k09
2425A9q7K79p7m87M68M7n1j98J01j02J43J08m59K24J71J0N2m24L19j06Q8j88K52
2448A02l71K91q8L3k34K16k5J39k76R2L53l79L6J18k3j4J39l60L20J12k58j58
2470b35KM28j35j71L23k05K7L07l06j03J1K75k08N1n9l9j26P9O9q6J24m3P3J08
2494A61l0k84N5r4K63k76K53N6j20J34J3n0p4j38J9K0K3m2J78p2j81L14j58p3
2518a03L18l02n0K0J54j54K45N9J98k11m54K80P3p1L9J52j20j8j70J68k53J72
$$ plain form
2354 -13 -5 198 -65 51 46 147 11 168 57 184 106 -62 21 95 87 117 -92 53 -73 -4 -35 59 -23 -153 2
2379 2 -39 -28 -207 189 -265 -123 201 32 -120 -32 -31 95 87 91 -161 87 -287 -70 -44 148 13 -123 130 145
2403 145 -16 4 73 -131 -302 96 -261 -139 137 -66 -9 -111 -116 312 51 -91 194 143 -101 80 228 19
2425 19 -68 211 134 -353 115 162 111 -87 14 -88 55 163 -296 -72 99 109 161 -263 56 -50 38 -150 102
2448 102 -269 22 -66 -33 -267 -51 -76 63 -213 -121 232 -147 -111 7 -16 -30 109 -251 69 181 -77 -235
2470 -235 -233 195 60 -111 212 7 34 341 35 -68 -57 218 10 61 2 -37 -163 -84 -15 -101 23 -20 53 161
2494 161 131 -153 -98 -192 71 -205 48 104 -16 118 131 81 7 -131 -112 -92 -69 -111 67 -5 -186 128 -30 -103
2518 -103 215 -87 -137 -117 37 -117 128 187 385 174 -280 0 73 2 41 193 73 55 -115 53 -200 -28
2540b8K28k62J50J71k38j61J58K84k90K08k24J80l78M9q3K28K24j81k30N11m08
2561i2K50j06J4l20K77L0m3o3Nl1K02j99k44L04q6lM50j51j36k8RO3q3J7j17Q3
2587Bn1Q9j3L1j75K28M5j7ok27M14n17J98J78k83j27oL29l7K01m45P5J8L0J2Q
2613d6m4K06j36K17l36L31l21J82l0mK28k04N4j00N9j70n5M5M81l75j2N3O0K03
2637B86j80Nj56J55p0k51K14l76M73r1j30J42QR6k84J86R3l82M91P5m01L0J08
2660D1j93K38j91j04K23JL6j41J11K02j67j91K11P9m05K50J31l31L00Q9j17j34
2682f2j67J69o4O7R0N3l44L19n7n0K72j83k9N9N0J64k64k41N43n22J44L82l55
2705b6j92L38Rl24M03l98O6J51m7K53l17q9M3Q6J30k61K02r3K8j12O7M2j62K04
$$ plain form
2540 -28 200 -62 88 259 21 -140 18 302 12 220 -4 176 -202 -153 -236 -8 216 35 -195 316 -92
2561 -92 158 52 66 -254 23 53 10 -53 -48 -79 123 -76 -320 -16 -102 -105 345 194 58 30 39 102 19 36 -81 2
2587 2 -49 40 27 58 -117 111 156 139 133 -94 320 -197 1 179 -104 -231 -237 92 55 256 -189 -114 -96 -66 -54 -46
2613 -46 -90 116 -20 197 -139 192 -129 53 23 19 247 43 97 -3 56 -114 -169 -124 357 -18 -30 23 83 286
2637 286 106 111 -45 110 40 -211 3 -373 100 9 -121 21 29 125 -159 27 120 -262 229 304 -97 -67 41
2660 41 -152 86 -105 -209 14 15 51 -90 21 223 56 -135 76 155 -250 0 131 -200 100 189 72 -62
2682 -62 -229 -60 -124 -57 33 86 -258 61 4 -46 226 43 14 73 123 287 23 -218 325 -197 -53 329 -26
2705 -26 -218 120 129 -195 208 -190 -124 27 -20 233 -84 -173 -130 -44 86 -175 27 -66 -38 -150 -83 -41 -203 1
2729Aj06M9J27k31J20j99J46q1J02j56J73J27k3K49m50K22j20r0L08J86k74n8
2751B2Jn3p3j54K35K83l08n1J70j01p5O8K95j68k4k45j46L09k20K60j79P8K22
2774A46k90K8j09K63k60J33q6L79k33L14m05J96j67J68q2J0L7j82N3Q2K26l34
2796a13K97k0n0j73on9K95J01l57K32k42r7K68K35ok75lq4K12l56L6J93J13lj66
2821b8J70l60J63J24k21J78j2j05OM6k66N86o06M42k53N9j86L41J2j24Q4R9r9
2844E0j40J54jN9l35L43m77K56l5q6L03r8p7K73r9L8k93K28M6k90M30o4k54L02
2868B33j66mp0k47L57R4k62J11j48L00l46J1J04m36L92L5Q2L40o30J26K62k40
2890a02K83l05J75j2k23J23R2n7j59N1m2m4K82l7J22j79P7k74L65l19n9P8J65
$$ plain form
2729 1 -105 -56 71 -160 -40 -239 -93 -174 -72 -228 -55 72 49 298 -152 70 -50 -140 168 354 80 22
2751 22 23 -30 -103 -257 -22 261 -47 -98 72 -29 -104 -36 259 91 67 -178 -324 -15 -235 25 -154 -76 146
2774 146 -144 -116 -225 38 -222 -89 -175 204 -29 285 -120 76 -91 77 -5 5 42 -140 -87 -5 221 -113
2796 -113 184 164 114 -59 -65 -124 171 272 -85 147 -95 -192 76 311 305 30 27 -57 155 -201 -165 28 141 138 -28
2821 -28 142 -218 -55 69 -152 26 14 -91 -85 -39 -305 281 -325 117 -136 -77 -263 78 90 -34 50 149 50
2844 50 -90 64 63 122 -213 130 -347 -91 -126 -212 91 -7 -84 189 90 128 -165 63 109 -181 249 185 -69 233
2868 233 67 63 -7 -254 103 197 -65 46 -102 198 -148 -137 -33 -469 -77 -42 40 380 -250 -124 138 -102
2890 -102 181 -124 51 39 -184 -61 31 -26 -185 -134 -176 -220 62 25 147 -32 45 -229 136 -183 -242 -164 1
2913AP6j74J23K2j41J5q6M7L6J72Q4k42J4M55k89K12m05L17l94J16L4o2J64k06
2937a11K0J87j37M3R1J50j32q8j61J93j63N7O9K07j12j3K9p7L6m51J55L31n5K8
2961I6J1j72K56m71L18n6j06J37m1k18M88l36j8J4p6PK58J05o06L02pO0J90j41
2985fR6l38M13J02n16K28L8J9j16O6J89k48J98k71K40J47l01J87K03l12O9j80
3007i3J58j76j28L55K13m60N9k36K25K19l19P3K01K2j5J8j16K1lk5N2j25K14j59
3031b5j1J0j18J8L2K69j47n7j42J72j25J66k78L95m08M36j39o5jN3m7k31L32k09
3055a20O4Q2o4J08j74J24P7j9k64k1L73r8q2R8J46p4l71J21J53n9k09K53j10J80
3079A14j38K7J01l1j85K79p3m50N86j45l08L21l49LJ45k7K50j98k0n6K38j81J54
$$ plain form
2913 1 77 -97 26 48 -93 -78 -164 -117 -81 91 175 -67 -53 402 113 325 -80 237 -157 -41 -7 -69 95 -111
2937 -111 -91 96 -41 2 93 243 111 23 -138 55 -108 -51 18 225 113 100 129 52 88 -363 -208 123 68 96
2961 96 107 -65 191 -280 38 -18 -124 13 -28 -246 242 -94 -112 -98 -174 -167 91 196 -410 -108 -115 -55 135 -6
2985 -6 90 -248 165 267 -249 -21 17 36 -80 -14 175 -73 125 -146 94 241 -60 127 330 18 87 -93
3007 -93 65 -111 -239 116 329 -131 -72 -308 -83 136 -183 -110 91 113 98 116 0 21 18 -7 45 -80 134 -25
3031 -25 -36 -26 -144 -126 -94 175 28 -29 -171 1 -124 42 -236 159 -249 187 48 -17 -18 35 -12 -243 89 -120
3055 -120 -56 26 -38 70 -104 20 97 78 -186 -207 166 68 -14 84 230 156 -215 -94 59 0 -209 44 -66 114
3079 114 -24 3 104 73 -112 167 94 -356 230 85 -223 98 -251 -248 -103 -130 120 -78 -98 -154 84 -97 57
3102E7j03R6l46N09j94l8R1j54j4J99L7kl91J75RR5L9J36m32M50m6J6L8k66K5
3127a4M4j12K19k7l1j31l23O28j29k11J72k26n3L97j40L1k56L57k85L45m27q0
3149b52r2O38m35n2K85l0j31P8K46m16K90l63L54K1k17O1k52N5L09l58K93l1j8
3172a7j3L8j6k60L19Q8j86R3k32K01Kon9J58j75K39q1j39J83%r2l40K82j18K8
3197a03m4J95K37m14J58j39Q6j04L44m70M21k60Q3n8P8p7K94Mk06j84K55n5K04
3220B45j70nk01J5M19m23K10J7m0o2k67L15Q0q2Mj23K48m42L55r9j20O4q8K37
3244H7j6J01k12j74K25J10l62m9N16j58m4R9j17P8k34P2J42j29K83j87k74L35
3266I2p3nM8J63l59K10j44j82L29l80o5M98j26J3k0k57K81m8K36r5J9j11N4k57
$$ plain form
3102 57 -46 50 -296 213 19 -19 72 -82 -96 103 140 138 -253 -78 -69 26 65 201 -231 219 173 189 227 -39 -14
3127 -14 30 -82 137 110 79 -52 -375 253 124 -87 85 -141 -194 203 63 94 -162 195 -90 255 -172 -252
3149 -252 -344 294 -141 -193 92 62 -69 9 255 -161 129 -234 120 141 -76 -15 -267 -212 97 -261 32 1 -17
3172 -17 -30 8 -8 -268 51 139 -47 46 -186 15 17 11 -48 110 -65 174 93 -46 137 137 45 -295 -13 -131 -103
3197 -103 -147 48 285 -129 29 -110 -24 -128 216 -254 167 -93 -10 -68 10 -67 227 231 25 -159 96 41 245
3220 245 75 70 -131 -116 303 -120 90 107 67 5 -262 53 133 51 55 -68 180 -262 93 -6 -126 -62 -150 87
3244 87 71 172 -40 -214 11 121 -241 -290 226 68 24 123 6 84 -150 -78 64 -65 218 31 -243 92
3266 92 19 14 62 225 -134 76 -68 -250 79 -301 -366 132 6 19 -1 -258 23 -25 211 116 135 24 78 -179
3290a79j7K60l5K89l49P0On2J31k43k8J90J5j33K29m80M18l27L18k14N6j34J88
3313b1ORj1j6K69l81M4K82m5m6M6k85nM51m39N3L5J07r4N7O5J74j56r9m0N4J46
3340A60m7K18l46J08J27l88N28m70K74l0q8l4J58l67j9K55o8o0jK14n6l5RKj33
3365h9K98k11j84K23k39R2l8O0L78l08L05l35J68l38R5L39k9l0k07l5Q8O7j68
3388i8K6j20J69Jk17M67j80O6k30N1k7J04p3K57q2q2K26k30j35K78j5j72j4l01
3412c31O83n02R8J86j61K34j10l23L10J18Mm37K20o1K64l28J56L3n37M31j02K
3434a53P6p4M76k56k25o5N55k91J84k72J24Q9J7j81L26l84P6k59K55k33P1M36
3456B92p7l29P0j49j31M42k88K09J6k95nK79l20K86K30k51R3Q0m2j09j01pJ66
$$ plain form
3290 -179 -196 64 29 318 -31 39 45 -7 124 -119 -147 43 58 -75 154 -326 92 -235 83 -131 -75 -209 -21
3313 -21 -15 -6 -17 -33 236 -145 -101 181 136 90 136 -149 -154 297 -142 -89 -54 53 -41 16 81 255 99 0 -40 14 160
3340 160 113 331 -15 93 220 -168 360 -110 164 134 46 12 170 -197 -216 39 -29 -89 -90 124 68 33 42 44 -89
3365 -89 209 -2 -186 37 -202 -110 -148 -88 290 -18 287 -48 120 -218 -123 216 187 157 -50 -85 3 70 -98
3388 -98 -72 -192 -23 -22 -239 228 48 114 -116 -65 -92 12 -61 196 114 32 258 28 -107 171 156 -16 -30 -331
3412 -331 352 -150 -52 134 -27 207 97 -226 84 202 206 -231 -11 -72 192 -136 20 53 -484 -53 -155 -153
3434 -153 -77 -151 325 69 -156 -221 334 43 227 -45 79 168 185 4 330 -54 22 -237 18 -215 -144 292
3456 292 215 -114 -44 -193 -324 118 -170 39 55 -240 -245 34 -286 0 230 -21 72 152 110 1 -100 -107 59
3479E9k95R7J04j06J61j6M8q1k1j64L19m47J81J33j17j37M01k7j8l1j52n4L80
3502B17l24k55K12J46K46J1j19J77m66M06m86L04j32R3j09K58n0k12j12L55l26
3523a66K15j48J93N0k3l5M4k44L61p5m38K96M1Qj69K17k9L6j50J09k95K43k25
3546a84P8J88J52l5l24k1L02k37K90k17J75k89K03j04J32j02K81m24J68Q9k43
3567a22j5K39K06m57L87j52p2L9p4K09l07N05m75K99p7j43K5L84m79j15j6J44
3589f7L54j58o6l62M59j04O8j53n1J98j56K44k94J90j42j10Q9m5L76j81l80J08
3611a83K70k15J69J6l26L00m1km6j26J79j14L57j58O1k16p3J16p1K33k3K09j50
3634A66J12l29m4J78l95K56J77M7l87L37q8R5k95K34r5m6k11L05K69l61J4j75
$$ plain form
3479 59 -236 -139 -35 -141 20 4 52 -29 -50 -214 105 -342 -161 -28 -145 -282 119 92 74 43 -109 -163 217
3502 217 -107 -362 -150 -4 242 253 134 311 -155 251 -235 69 -63 30 -79 179 129 -83 -195 160 -166
3523 -166 49 -99 94 144 121 86 130 -114 247 172 -266 30 71 79 -90 127 98 134 -16 93 -202 41 -184
3546 -184 -106 82 234 199 -125 -146 156 -81 209 -8 167 -122 81 -23 109 7 288 -136 32 121 -122
3567 -122 -137 102 308 -149 238 86 14 53 -21 188 -119 386 -89 210 133 -10 15 399 -80 -195 -211 -67
3589 -67 287 129 63 -299 160 56 124 -29 -80 118 -38 206 -88 102 -40 -150 -61 -106 270 89 -291 -183
3611 -183 87 -128 41 57 -269 31 -10 -12 -58 -184 -5 -119 238 80 141 -75 -148 -32 -103 130 107 316 166
3634 166 278 -51 -95 83 -312 -56 121 168 -219 118 30 125 -170 64 -31 -77 -288 17 286 -75 -61 -236
3656b36L35j14R9kJ7j04l2Q8k10N7j96L02j31J90L4j5k42J75P2j18J35J18m91
3679b69K81K77p89N27M5k17O5j21K13j20k2M7L80k43r7j52J64j1l46M32j28P6
3701hj07J89m5m5J33q1r3O7k66J55N5O7J77R6j65j73j23L28k81J08l5J01k28N
3725a69L72j77j96Q0r8M69k36k07J47OK4Pj46K76j75L5L66m98j7L04j4j43P2k18
3749a36J36N9k60J65rM86l43Qm48K53N0K29k28J78j31j66J17K1O5j74J09k40M45
3772A86L7j87k36O7J51L19l23k42r3M05k89K67k88J90K78l49l0L3K52k62J76j9
3794D3r9N6R5l0j71K11o6L1k11L42n33J03L04m23K20r0L94k00L23l7n26O9k2K20
3818CJ21j93K96m22M09k99L5p3J29l6j35J93M1o8j1q9J48M60o07K0q4R1R2K95
$$ plain form
3656 -236 99 -15 84 82 99 -5 -37 51 -159 -102 -298 4 -127 63 97 82 -160 15 87 -31 104 222 -269
3679 -269 12 289 -500 27 72 -145 -80 -201 12 -108 -130 -83 297 54 -43 -195 -31 -42 -388 44 -84 -8
3701 -8 -115 74 29 -16 117 36 -57 10 -256 -101 -46 21 198 294 129 -44 -167 161 -120 -12 -47 54 -174 -169
3725 -169 203 26 -170 -90 -188 281 45 -162 -15 -9 15 22 -124 152 -23 12 378 -120 -137 167 153 10 82 -136
3749 -136 0 59 -201 -36 -45 441 98 106 -342 -89 -39 190 -38 140 9 -157 -40 -19 46 -128 -19 -259 186
3772 186 223 36 -200 -133 18 337 14 -228 -321 84 -205 62 -226 -36 242 -107 -137 -104 148 -114 62 43
3794 43 -56 0 95 65 -106 105 39 70 -141 201 -332 -229 75 -348 -128 -218 176 -24 299 262 -264 -195 -217 3
3818 3 124 -69 227 -195 214 -85 -50 -123 6 -30 -165 28 69 1 -10 -99 49 509 -98 -78 -162 -71 21 316
3842C16l91J43k3J25k70K06j13m0p4K16l0j01L2K1j11J46j50K62j92J28m10n9
3864c69N12k24rJ26K60j68k56M5O1k2R6j66j89P3J36L23j44k37Q3Q8J93Q5k79
3887A8K35k02q9K03k87J28j05q7M95l60qJ02L9J00r1Pj52K09p4p9M0j54n1K32
3911F9k05M06j76lM7n17P40k52q7R5J66J82m53L23l52j59L79k70m1n7mL03r7P5
3935A12j48J16OJ27k16j44J69J7o0k9Q6pn4L54m44J27k50J09m3K80J18l50J89
3958F5k2Q6n58O39j68P3o3k07R4K52k94K6L2l1J23k02K0J44L5j2k43K37kq5J14
3983E3Q5M6m36N66m87j78L31O4k27L8J88k71J03P8r4j51M79j37pJ37j35P6j02
4006A9K94m98O5J7K8L43l82q9L15lj59j80L03m12L12O3O6M9k10K48r7j21q9J51
$$ plain form
3842 316 -75 68 45 170 -100 106 -7 -47 -121 95 65 -36 -4 17 -94 52 -98 164 -28 100 -310 -369
3864 -369 143 -81 -90 36 296 128 -128 -83 -22 -44 52 -114 -303 -230 -94 229 85 -152 -69 19 212 297 18
3887 18 253 51 -38 165 -122 6 -99 -186 309 -51 -59 43 82 182 91 98 -54 155 81 2 42 -112 -163 69
3911 69 -136 270 94 91 138 -379 361 109 22 117 283 465 12 335 -17 -176 203 -67 -108 -165 -169 134 37 112
3935 112 -36 80 86 213 -3 -147 22 39 -21 -50 36 29 -25 329 -115 12 -238 -129 -172 108 226 -124 65
3958 65 43 129 -429 210 42 115 52 -155 -61 191 -103 -77 -45 -76 47 -155 -135 9 44 32 -211 26 24 -61 53
3983 53 138 184 -252 314 -173 -351 -20 44 -183 -145 43 -228 -125 -47 -141 -292 187 50 43 180 45 121 19
4006 19 313 -185 -120 -103 -75 268 -114 -203 112 109 -50 -230 73 -339 -27 36 102 151 -59 189 92 -29 -118 33
4030C3J31l32M8Q6L52l71m3K14o8k45K85k10J52j44K62l24K36K6p2J67k01J45
4052A27J23k42p3r4J93K9k20L3K03J88l80J42j36j2j24L42q7J03k77K98k30l7
4074a31K88p3l38K74j66r5R7K19R4k26K22Kk00jK38k28Q3k49M11k11q5Q6k96K41
4098d4P1lK44j98J06k97j63J86K18q9lj56J20K07j9k43J27k85L77j91p1L7J95
4121A26l24K07O9j61P0K9O2m01L72k0J10j19p0k35K55K33m03Pp7L91j3n9qk99
4145b58L94%P5K6l58K4J32l1k61M92m43K64J79R8l44J15j65kJ19J4Pk12K08k81
4169b08r5J92m8J71o1j40l5L13j82O0J24q4o2j72M47l52J12l0k16K1J11j9m0M15
4193B22l82K76P9j85j23K67j11oJl35J31J2J56r8J91J94k52l5L7J46k00j8J03
$$ plain form
4030 33 164 -168 -120 -34 318 -53 -96 118 50 -195 90 -120 32 -112 150 -174 62 88 16 183 -18 127
4052 127 250 8 -65 -159 34 63 -157 -124 79 267 -113 29 -107 -119 -243 99 12 115 -162 136 -94 -131
4074 -131 157 84 -254 20 -146 -241 -144 75 169 -57 165 167 -33 -34 204 -24 59 -190 221 10 -75 11 -285 -44
4098 -44 27 24 268 70 176 -121 -284 -98 120 31 28 -128 -8 199 180 -63 64 -221 156 -35 -106 -69 126
4121 126 -198 9 78 -83 -13 16 78 -323 49 29 139 20 -50 -285 -30 203 -200 -193 -270 121 108 49 41 -258
4145 -258 136 136 211 237 -121 -97 35 4 -257 235 -208 56 235 333 -11 104 -61 -63 56 70 77 -135 73 -208
4169 -208 -303 -111 -159 12 -49 -189 -224 89 -93 -33 91 7 -55 -227 220 -132 -20 -50 -266 -245 -134 -153 -193 222
4193 222 -160 116 195 10 -113 154 43 37 38 -297 -166 -154 2 -96 95 289 37 2 39 185 -15 -33 70
4216G0l62M69K3j55J02k66J05K47k10J11j83j86N1J81j95L8J32J67J05l46J40
4237C8J05k22j42J28J16PJ04j04k18K95K9r7j17J4j63M66k81J52j37j67J21K76
4259B03j44k93R0K21K54l59j02L5K06l4rj39j24K55J26k15L5M38p71N98l00k96
4281c25K03J25K91j79j77o6K80l5M0n8k37J8J3J54k22O9j1L11k11m4m9J46O4k05
4305a05L22o5k22K23p1Q2l1j20k03K65J27r8Q7k60J39j01J27N4k8J33k04l7j77
4328a63L95m42J35p8K24j8r2J29o9J97l32J02l04M18j65K23r6q8j63L51j68j31
4350a35J79pK43k29k07K4p5j6K17M5%J43k40j5K14k24J37j71L68mm3m51L06q6
4374b7N0j04J69l41J07l9L79j06k56l1lqJ13Q2m7q6Q5J11K56k61j43J95j14L53
$$ plain form
4216 70 -292 177 200 45 147 -119 -14 233 23 134 -49 -235 -184 -3 -198 -160 -28 139 244 -102 38
4237 38 143 -79 -221 -93 23 30 134 30 -188 107 136 39 -78 -64 -227 239 -42 110 -27 -194 -73 203
4259 203 59 -234 -144 77 331 -28 -130 -95 111 77 68 -71 -195 60 186 -29 6 444 -327 271 -29 -325
4281 -325 -122 3 294 115 -62 -128 152 117 157 99 -138 -120 -107 47 -175 -106 -117 194 -17 -61 -110 36 100 -105
4305 -105 217 152 -70 153 82 164 133 13 -190 75 202 104 191 -69 70 -31 96 150 122 255 51 14 -163
4328 -163 232 -210 -75 -153 71 53 -39 90 21 218 -114 -12 -316 102 -63 160 64 -24 -187 164 -4 -135
4350 -135 44 37 280 51 -156 -132 -207 -223 -6 39 39 182 -58 -73 141 -83 54 -117 251 247 204 -247 59 -27
4374 -27 23 -81 88 -253 -146 -185 194 88 -168 -199 -202 -210 -97 -15 -62 -148 -63 48 304 43 -100 95 -19 334
4398C34l55j34j27J31L5M72m76J08j61J11p4o4J00jM6n0M7J67j71k62M57j8L7
4421A52l92j3K74r7J45J92j87m6l4l3J6J68l2j49N1j82K20J20k44J71k68K53J29
4444B14m9k48o6L2J70l8l7N7J14k14K09q9j07j21J60m1OR7K05n39L03M2j18J14
4468E6k98M25k08J62j16K13j25o6L03k46j5J07k97K40P0l45J10p1K39r3k16L14
4490A43J96n36J38M6M5P2j82K16J01j53j59J35K3k79L58m19M42j79J5j83k65M73
4512D8j38K11q3K14m38O9J53J94o1m04K61J71j68l03L09J51p9l28j6J54L6P6N8
4535H7j42J8O1j74K08k02m3J31m4P1j57QR3Q0q2J41j13K99m04O0K94j15O5r5j84
4560a39M11l73J67J21k55Q5r8J07m83K99q9P39l76k20q6J67j26K51j8j5K42m02
$$ plain form
4398 334 -21 -155 -282 -151 -116 356 -120 -12 -173 -62 -136 -200 -100 -101 -55 -105 -58 109 -62 -324 133 115 152
4421 152 -240 -253 21 -76 69 261 74 28 -6 -39 -23 145 113 -36 15 -167 53 173 -71 100 -168 85 214
4444 214 165 -83 -149 -117 53 15 -22 35 149 -65 144 55 -52 -173 -13 -54 -48 49 254 -285 18 60 -58 56
4468 56 -242 183 -25 137 21 234 109 43 346 100 85 192 -105 135 205 -140 -30 -101 138 45 -171 143
4490 143 339 -197 -59 -13 32 104 -78 138 239 86 -73 62 85 -194 164 -255 187 8 23 -160 -425 48
4512 48 -90 121 38 252 -186 -117 36 230 169 -235 26 197 29 -274 35 186 107 -221 -237 -83 -47 29 87
4535 87 -55 -37 24 -150 58 -144 -187 -56 -100 -29 -186 -178 -85 -5 -87 54 -59 240 -164 -104 190 75 140 45 -139
4560 -139 272 -101 66 187 -68 17 -81 26 -457 -158 -247 492 116 -104 -190 -23 -149 102 84 69 311 -91
4582i1K71m67L12j77R6J6J05R7m68Q4M29k73K5L06k88J29l71K52k26K51J51r1
4604G2k77J60J98R8k35j35J65r0J46p7j26j53R5K20J83k65M8J9Qj0m0K42l51J80
4628G5l7k18J54K16l10K61Q7J0l85l1J38O3k35J68J81m38J27K12J08jl1l10J30
4651f6J29j18L38m97L08k95M0R5j41pJ24p6M9k49K95K18N7J40k46jj47K12q4k3
4675E5mk9n0rq4M1Q9K10j86k8j05L19l00K0J9K9m76L18M02k89n2J76r8q7J99J40
4701B20l66j2J22q1K61p9k0l38L62j13J57R1k83J36j34J48l40M83j43r4Q7L8J9
4724A21oj9k24J03J28Qk44K80k83K04l21M80r8l9j49n9J98L44l05p2O9k49J21
4747a2M1j40R5j31J07K87j92l99L88Q6k57J10k9n4j2K28j4J08j55rJ77k70J12
$$ plain form
4582 -91 180 -287 25 -152 -56 -40 65 162 -306 -222 207 -66 -41 265 -23 106 -265 -13 -239 12 163 72
4604 72 -205 -45 153 251 16 -119 46 -44 102 25 -101 -254 -159 61 244 -21 27 46 54 44 4 246 -105 75
4628 75 38 -180 -26 190 -120 141 228 238 -147 -178 -40 23 -212 -44 137 -301 -174 38 146 145 114 -196 -66
4651 -66 63 -55 283 -214 94 -201 -161 -66 -207 -214 -90 -166 -117 -366 -71 147 204 344 98 97 -50 162 78 55
4675 55 51 22 -28 -37 -121 -80 9 219 33 5 -100 219 -81 -61 -42 -13 -489 -171 231 -58 -110 66 -32 -119 80 220
4701 220 -146 -158 -36 -117 144 65 45 -293 69 -44 113 204 -79 57 -77 71 -269 214 71 -23 64 102 121
4724 121 115 96 -128 -25 103 111 -133 147 -136 68 -253 227 129 90 -59 -118 80 424 119 47 116 -133 -12
4747 -12 29 -111 -16 -147 -40 247 55 -344 44 130 -127 -17 -46 -100 -112 116 102 210 55 46 223 -47 65
4770F5j98M2Qk24O38l52j37L71k60j8M09k86l06L54k0l84M02j10M9j47J16j06
4792i4j36J63k3K54j36j37J87Q9P1l51K35k5O6l32K64j04K9k20M20m50L87K6l85
4815b02M33k15J38l71K24K2m9J11k42K04j56L64l98l2J38j19J64j12J11O0m7j35
4837a09J50K47l62K96l40j46J96j45m8J96M39l38J75l6l9N9k9l18p5J98j85R2
4859a22M59k31Km9j32l0K4N9k54L52k09J31k55L33Q1j15j67L17l89J55J2j63K23
4882C2%n8k4k19L79l0P7j34n3k55L93j81j03J89j41m1J68O6j82n1Q2K08j6j4j93
4907a01K46j41K12J72k49j46K6j02o3J91j47J32Q3j07J81j05P9R4p2p6r8l10K50
4930e1O1q1K12k61k57J97K05o3Q6o2J10k43J57J6p2L29n57J14L1K13k9j00J8J65
$$ plain form
4770 65 -133 -91 -83 -307 331 -21 -158 213 -47 -65 344 58 -248 106 86 -298 104 -6 43 -104 12 -94
4792 -94 -230 -67 -90 164 28 -109 78 167 238 -113 122 97 163 -169 95 -9 20 -200 220 -230 157 183 -202
4815 -202 231 16 154 -217 7 29 -20 91 -151 53 -103 261 -137 -169 -31 -150 14 -98 13 73 26 -109
4837 -109 41 288 -74 222 -118 -264 -68 -213 -261 -65 374 36 211 175 136 195 166 -152 -227 -29 -214 -122
4859 -122 337 106 108 59 -73 -103 -79 -20 -274 78 -131 0 -255 78 159 44 -123 194 -195 -40 -28 -191 32
4882 32 32 -26 -50 -269 110 80 157 23 -30 -285 108 -73 -176 13 -128 -169 -1 65 -117 -168 -86 122 106 92 -101
4907 -101 145 4 216 388 139 -7 19 -83 -146 45 -102 30 113 6 187 82 161 255 183 107 9 -301 -51
4930 -51 10 -71 141 -120 -377 -180 25 -38 48 -14 96 -147 10 26 -46 283 -274 -160 -129 84 55 -45 -27 138
4954A38j93K36l89R7J92N7l42M53j41j69M3N3o5Q0k3%k53J23Q5p2J68j24J97P8
4978B29j04j59n4j0O2q2J43n0j86M53k30q3J25j70j31L73m5l17J2Q6m1J31J28
5001H0j57O9RqO5o8P5j15j33J74j32J99j87o7K60j24R9K8j30J56k8l27J68J18
5025B4j28P0K2m1r5K03M8Nj07L6J26k01k92M90n2o5J04k75o3l05L30K43M4j35
5049a4k70K21j52L68o0J43l97R2K00l85J94J34k03p9L44k30j89K76N3L0k7o3n5
5072f9MJ02J09l8k9l20R5Q0r4M64k04j55j13j80K31J32O5q5k83R3L38l26J49q9
5096a23K97k34K64k74J79j66O6p3J28k60K91j83J88l81J48j86L29J8p4o2J88J14
5118A94l67K49J0J75m51K59o4Q2q5P0N9J8j92L41k39N5l5n12M31L95o36Oj49L38
$$ plain form
4954 138 -55 181 -208 -111 81 138 -204 249 108 -61 -18 35 -30 50 27 27 -226 -103 -18 -90 78 -46 151 229
4978 229 125 -34 -88 -98 -36 -118 25 -25 -211 242 12 -71 54 -116 -247 126 81 -236 -224 -138 -179 -48 80
5001 80 -77 -8 1 -7 58 -10 65 -50 -183 -9 -141 58 -129 -196 64 -60 39 67 -63 93 65 -262 -94 24
5025 24 -104 -34 -12 -53 -148 55 103 108 1 37 163 -38 -330 160 108 43 147 -128 -191 -496 -166 77 121 -14
5049 -14 -284 -63 -215 153 93 236 -161 -69 131 -254 -60 74 -129 -208 136 -94 -283 -7 46 76 49 -14 -69
5072 -69 -65 37 146 108 79 -241 -146 -66 -160 304 100 -55 -168 -348 -117 15 80 -5 -288 -195 143 -183 -34 -123
5096 -123 174 -60 204 -70 109 -57 9 -64 64 -196 95 -88 100 -281 -133 -319 10 28 -46 -108 80 194
5118 194 -173 76 86 261 -190 69 5 87 2 72 131 149 -43 298 59 114 79 -433 -2 393 -243 -237 -386 -48
5142d8K2QJ89J0l12L63o5p7R3k67J31k9J71k37j18M3L44k29r9m5J9J05k1J68J2
5167A31P0k05Q0l7k63K30n6P3r4O2K79o2j26j06j61L70K8r1k28M26k62k67J65
5190d4j4N4J22j95J31L5k51J83j40J34rj90N8K02o9M9j6P8l8n1j12M8J32l36N3
5215a86J57j81K9J59%n6K0j75M75j11k33M1ro5M4j16K48L4K7q0j44j43K25l0O0
5240a0N8M0J42n05K27j25K29L0J71m43J57R5j35L73l51J63r5J47k99N1p0M2r2
5263b00J40K31k9j25Qk61L81l97L58n3j44R7J1k7j63K35J2j4j62q8J48J17n7k2
5287dK32l97K46k57J87R5L08k36k06q4R5L1k11J86PJ63L1j44K31k90lo1J52k57
5311a86M93j94k20L60j37o01M31j68J59j32O3J18J02J60l54L04j79M2j80K26k03
$$ plain form
5142 -48 -26 -18 171 181 -131 232 167 90 183 -84 47 18 189 -48 -166 -123 221 -8 -107 -152 -133 -28 -49 119 131
5167 131 201 -4 76 39 -224 6 -50 23 -71 -9 270 208 82 -24 -185 185 213 122 -106 320 58 -209 -44
5190 -44 -58 -4 118 -77 54 89 -162 21 -119 15 6 -184 -126 76 7 56 40 118 80 29 -83 -35 97 -239 -186
5215 -186 -29 -210 -181 -22 -22 -78 -58 -233 242 131 -102 -61 -70 -135 -91 -207 41 75 102 22 -122 -265 -40 -70 -10
5240 -10 48 88 230 -275 -48 -173 56 86 257 -186 -29 66 -69 304 -47 116 21 168 -131 -80 -150 -108 -200
5263 -200 -60 171 142 17 25 -236 145 -252 106 53 -91 6 17 -10 -173 62 74 60 -102 -190 -42 75 18 -4
5287 -4 228 -169 77 -180 7 102 410 174 -32 -116 -21 10 -201 -15 -8 155 186 42 273 -17 -20 -81 71 -186
5311 -186 307 113 -107 253 116 -485 -54 -222 -63 -195 -132 -14 88 248 -106 198 19 61 -119 107 -96
5332i6o2q1j79K09P9J82j82j20N30l06R7j10N6J31j38j09P2j00M8J53J10l56J81
5355Ik60L97k97M8K1L4J44j92O5P9K2l59M15k50J17o3O3O2k57K11J16k24J11j46
5379a34K37Pj24M2j28j65M5j41K95N8m13N48K33n49P0M85l43o1j03J18K05k04
5401b2K8q9j19K19N3j23q5K61k12j22J36j48M20k70P9P2R2k08M83k70L1m17L17
5424A06%j12R9NM4k29J72R6m01J20qJ67l99j9M46R5O6l18K02m6J26l93QK51j04
5449b6j92J87K06j30k49L32l11J20M05l68k8k39m9K24L10k44l7M25j75l81L58
5470A38J41m22O6LK94l0k00q7M26l49L8l9j94K89j39K43j98M5j39j35K08Pk0q3
5494a37j65L67O7j81J6M18l38j32J67l21J6M63k44q4j19P9O9K47k26K57l30J63
$$ plain form
5332 -96 -158 -239 -418 -209 -130 52 -130 -250 280 -26 71 -39 17 148 10 -99 -27 -127 -79 74 184 -172 9
5355 9 -251 146 -151 -103 -82 -48 96 -96 -31 48 70 -289 126 -124 -7 -70 -7 55 -202 9 125 -99 12 -134
5379 -134 103 110 -14 28 -100 -265 -220 -361 -66 -8 -421 127 360 -189 -119 366 23 -38 -141 -23 182 -22
5401 -22 6 -83 -202 17 70 -53 -138 123 -89 -211 -75 -223 197 -73 6 78 170 -38 445 175 206 -211 106
5424 106 106 -6 93 98 142 -87 85 181 -220 -100 -108 59 -340 -359 87 182 248 -70 132 86 212 -181 -173 78 -26
5449 -26 -218 -31 175 45 -204 128 -183 -63 342 -26 -54 -293 -342 -118 192 -52 -89 336 161 -220 138
5470 138 279 -143 -77 -74 220 190 -10 -97 329 -20 18 -21 -215 74 -65 178 -20 25 -114 -249 -41 -34 -54 -137
5494 -137 -302 65 132 -49 -33 385 47 -85 82 -239 -223 240 -4 -88 -207 -128 -59 188 -38 219 -111 52
5516E2n5J4O3K06k28M2j77K38j00j21K27l40J27RJ53K57m52K35l60J08q2K40j
5539E5p2n9j40J42l7J06j94K07j10R2K44q7j16q5P8k31K94o9J55J2p2k45kJ20
5563a4J89k38J2k27K27K67m43J87R9k35L53ml10M75j87R5m06K85j71j7K80l26
5585a09Q2kO3k29M96l00j34q1J55K95k78L21j76m6l66J16K53J04l65P7J97m9n7
5608c3m3L70j55k95J33J5k77N3K11L0oJ41j69J65J6k02L7L6j93P9L7k99N16P4
5632B41l15L10k25p7O5j78M52m49l6L68j90m5%J90K14n19J38Q6J10k92k9J09M5
5655b7P2m3q7K95k78RJ1Q6lrr6j00J64L8K96m64J48j48J90J25k74r7L44m2k30
5680a20R5K3k5j24M9L24k62j06K26k22L54l19J22K28m98M73j26k65J40J24m5J38
$$ plain form
5516 52 -3 11 74 280 52 94 -83 155 55 -66 161 -179 -52 -43 110 367 -85 150 -210 -102 -184 56 55
5539 55 -17 -76 -216 -74 -111 -5 -199 8 -102 -10 234 147 31 -54 24 -207 87 18 173 185 113 -132 -134 -14
5563 -14 175 -63 -51 -278 -51 216 -227 -40 59 -176 177 173 -137 338 151 246 -160 125 -46 -63 217 -109
5585 -109 -27 -29 34 -195 301 1 -133 -214 -59 236 -42 279 103 57 -309 -193 60 164 -201 -124 73 24 -33
5608 -33 -76 294 139 -156 -23 -8 -285 -232 -21 9 3 144 -25 140 156 -46 -9 27 -166 -87 -50 -349 167 241
5632 241 -74 236 11 -66 -1 -179 273 -176 -212 156 -34 -79 -79 111 325 -194 -56 30 140 -152 -181 -72 -27
5655 -27 45 2 -85 210 -68 -59 -48 38 35 26 -70 -170 -6 32 328 -136 12 -136 54 179 -95 -192 152 110 -120
5680 -120 -25 -2 -27 -151 -102 222 -40 -146 80 -142 212 -107 15 243 -255 218 92 -173 -33 91 46 184
5702A84k77J58o6Q5J39k99R2J31N1M7J59o52K53p6l9OL55j80M22l78k40j52M06
5725A29l2n3k35J80L49l78J16kJ03k12J48r4J48j12O3k41J48m6K7m5j06p3K71
5748E3l21K39M8r0J98k91J61k16J61j82L10j83L30k95j50J62q9K28j3K33k91J53
5770A55o5k07Q6J39j67k7K03k04M0J29L1j57j47K20j91J25J7R4J09l06N8N6K12
5793B03p0k9k15K84m32J98Q1K76m97K14j99O8L49k30r2J97j04o3O5k18N48n06
5815a72J3J40j02J62j5J12k65Q3l1K18J24m37L0n9K20l2j22L55k66J92ok07M25
5838C60j86J2m1k31n0K18N5m10J24%l1K17o7k4J05k62K22p4K43K9Q0j19k50J67
5862H7M0j85QK47o3K21k51l01L05l03j8O5j93M21q8K04k36K9M3j59J62J08k50
$$ plain form
5702 184 -93 65 -1 84 223 -76 16 147 198 245 404 -248 5 -71 -110 -104 251 71 493 115 -125 -277 129
5725 129 97 44 -191 -11 338 -40 76 74 177 -35 113 19 167 55 118 -123 25 -21 6 -39 -145 -218 53
5748 53 -268 -29 19 -71 127 -164 -3 -219 -58 -240 70 -113 217 -78 -228 -66 -155 73 60 293 2 155
5770 155 90 -117 -31 108 -59 -86 117 -87 -47 82 113 -44 -191 29 -162 -37 -20 74 183 -123 -65 -9 203
5793 203 133 104 -111 173 -259 -61 20 296 -201 13 -186 -118 231 1 -91 106 2 -61 4 -214 334 -172
5815 -172 -159 -19 -121 41 26 138 -127 -44 -75 143 267 -170 -140 -199 21 -11 -133 222 -44 148 142 -65 360
5838 360 174 186 145 -86 -136 82 137 -273 -149 -149 -180 37 -30 -54 51 -211 11 -63 180 209 289 170 -80 87
5862 87 127 -58 -50 197 134 355 104 -197 108 -195 -213 -148 -341 80 -8 196 -40 -11 32 -127 35 143 -107
5885a07M6k9L70m06oK74r1L5J3j97K62j00K6r2J79k83j78K59j15m8L06L6J50l83
5909g9NJ38p4K2J40j39j01q3L72k09k00K44j11K02p2R6l73K90j70O8K43j05N2
5932A56k65J43j3K4k02o7L50p8k26J17m8R7n1p8J34Q2j53K44j22J72l45N9J2r7
5956a55PQ6J47o6J80J9m76J03J16k1R7j99L04k18J63l49L99j60K0Q0j84J93R5
5979A81J16K9r5m22L86r6j81J39j55L5J05L29k63O4Kj54j25l75O06j15P5j68L2
6002e0K20p3j67Q7K42j39k95K37k35K85L5k49k44K05p6K10j55L2J63j68J77mJ22
6025A60J39l65j14q8J57J33j50Jj31L32n0r2j91N01k99J56k00J15r3n2M8N4k72
6048c01P5P9K38N4k6j85P6p9K30k07J80J76k77k30L87l58j43K72L00k8r8M4j2
$$ plain form
5885 -107 -61 -90 280 -126 -132 142 51 86 99 -98 164 64 90 -2 177 -106 -284 -25 -140 -188 118 154 304 -79
5909 -79 -74 64 -10 12 152 13 -88 -171 201 -8 -208 36 -75 127 55 151 -222 68 -102 -34 209 104 156
5932 156 -109 34 21 45 -157 -224 126 48 -178 -61 -109 -12 -63 -141 -7 75 -78 166 44 216 -129 -70 -58 -155
5956 -155 -148 -62 85 19 199 218 -258 -155 -39 -60 37 -162 142 -76 87 -262 137 -23 -3 77 -107 86 181
5979 181 297 326 231 -191 195 99 -82 57 -98 -63 42 371 108 172 174 20 -105 -480 126 11 86 -82 -50
6002 -50 170 97 -70 17 259 120 -175 62 -173 112 147 -102 -346 -141 -217 -7 -162 -130 33 -135 42 38 160
6025 160 299 -66 -180 -268 -111 22 -128 -127 -258 74 24 -68 -259 242 -57 99 -101 14 -79 -131 -83 -29 -301
6048 -301 -226 -147 91 145 119 -66 10 -69 161 -46 134 310 33 -197 190 -168 -311 -39 261 233 135 179 167
6071A67qqk39r4L45k62j76K60J37K13j16j1k19j01K65m52M76k48M9M3m53N62m64
6094c34R3J16K33j31K9J27J0%j30J66m66J21N5k6J8L00n9n4r3k4K96j65j44K1
6118d1J81j19K98l36k9q9K35J77r9l03k7m1K25P4j84J9J42j84L54l93k31J70M01
6141B00k44K90l23r3Q9Kk9k1K01J09j82n7j41j7L23j51l1j33J71r8J95J97n6k08
6165gK08m60L47j6q1m89M92r1J62J34q5o9n1q8K85j14Nj0J29N4l46K20j83K15
6189A61r4l3J40k9j33j40K2J92m8k9L5l66M79K6K1k32O4J15k94J92O5P0K43M9
6213D76l08j82j34j89M90j03q2k84L06J45M5k56M2J94q0n9j31K69k16l4L77k35
6235E1k33M36j1p2j41Q5j39k79L09m14L22J33K02o9j37J69J73R1p63J90o2J25
$$ plain form
6071 167 159 151 -88 -182 163 -99 -275 -15 122 335 219 208 -11 -112 153 -299 177 -71 -22 21 -432 130 -334
6094 -334 -241 -125 108 -23 6 133 143 143 13 179 -287 -166 -111 -137 -119 181 122 68 -25 -49 247 82 -62 -41
6118 -41 140 21 319 -17 -46 -135 100 277 178 -125 -152 -193 32 106 -78 -59 83 -101 253 -140 -371 -201 200
6141 200 -44 246 -77 -170 -81 -79 -108 -129 72 181 -1 -58 -199 -216 107 -44 -75 -208 -37 -135 60 257 201 -7
6165 -7 201 -259 88 72 -9 -498 -6 -97 65 199 114 45 -6 -94 191 77 82 72 201 255 -91 129 -54 161
6189 161 67 34 174 145 12 -128 -106 86 38 9 44 -322 157 183 204 -28 36 151 -143 49 114 184 427 476
6213 476 168 -14 -148 -337 153 50 -32 -316 -10 135 180 -76 -34 160 80 21 -110 159 -57 -91 286 51
6235 51 -182 254 243 171 30 115 -24 -303 6 -408 -86 47 249 180 43 212 385 476 -287 -97 -159 -34
6257c4j28Q0M12l88J77m8p5j08L59n14K05j16L17k46j48J36j26M29j99K19K7n19
6279b88K52J01l4j32j79L26Q9l53j41L34j60M25j58m7p6J57k58P1m5J01J87kl5
6302A35Jn9l1ll3m18K63K25k19j7L64k05j54L16j14J25J50m91K04J57p8m20L39
6325C7q0K31P9k12K65m55K45k19O0J94k76Rj21K12L9M4r4J11j37L39k44j6j53
6348a42L17j24J03j32L1J24k66J53k57M92k71p3j39n4R0J10n6L20j54k86M38m18
6370a94R1j20O4J8n3L78j88K77j54L24n05R6k1L6o7K02J4L27m68L42o88K34K44
6393A89l34j68M22k07O0J42k36J42m12N16j70K38k61J15j13jl6k2K72k9J38J66
6415D11n09j33L41n6k42L65m07M50l27J02j89O7J65J12l28K36J00N8j92O9j46
$$ plain form
6257 -34 -162 -82 330 -58 119 71 -4 -112 247 -267 -62 -178 139 -107 -255 -119 -245 184 -15 204 231 -288
6279 -288 -36 65 31 -101 -280 46 135 -218 -359 -25 -185 240 82 35 -41 116 -142 -71 -116 -15 172 170 135
6302 135 136 77 46 43 10 -408 -145 80 -139 -156 208 3 -151 165 51 176 326 -165 39 196 118 -302 37
6325 37 -43 188 267 55 320 -135 110 -109 -49 145 -131 -122 -243 -31 8 52 -42 69 -68 271 27 11 -142
6348 -142 175 51 154 22 53 177 -89 64 -193 299 28 -45 -184 -238 -148 -38 -94 226 72 -214 224 -194
6370 -194 -103 -223 -159 -141 -194 184 -4 273 119 443 -62 34 13 49 -18 184 198 525 57 399 -289 -55 189
6393 189 -145 -313 109 -98 -38 104 -132 10 -402 114 -56 182 -79 36 -77 -78 -114 -136 136 107 245 411
6415 411 -98 -231 110 54 -188 177 -230 220 -107 -5 -194 -127 38 150 -178 58 158 216 24 93 -53
6436e3k54L23q6K63m63L59J1j03k02J94J51j83J21m0J46k21P6j26K00J36k92j26
6458a69P4J52K4j57k22L77p1n5K45k23N4J48j65o5q0O8k07M50J64j74M8m3k85
6481a12L42j8j61j45j3K0k0K29p9k86k9K63R0j45J9p1L3nK61j36j60K11j87N7
6505d2m2k2J39q9k46K73K68k88j51N96m12l0J91k0l1j90J01K22l11P9N3K15l39
6528g6J1l1p6K24l25M40j70J14N0k23J19j86kK80j34Ln6j67j79L00q3K22k79M5
6552a79J73j15Lk43M87J80k56j12N2k23M52l67q5J22J86o0R2jJ71k08j83j8J53
6575B1j34O6K49k99K18k8l14M11j7m18L11j83J02o7J07r0N9J56j46l0r0J20j63
6598a59J01J42k23L03j82J58l36j62J29K66J46k8j2k40K8rM2J3k56K58L2l8nk2
$$ plain form
6436 -53 -307 16 -70 193 -270 89 100 -3 -205 -11 140 -43 78 38 184 -37 39 -87 113 249 -43 -169
6458 -169 -95 57 81 -76 -298 79 8 -47 198 -25 29 177 12 -53 -133 -65 -272 178 342 168 216 173 -112
6481 -112 230 212 51 -94 -107 -87 -107 122 43 -243 -272 -9 81 -64 -45 -116 -83 -88 173 37 -123 88 -99 -42
6505 -42 -84 -106 33 -56 -302 -29 239 -49 -200 396 -16 -46 145 125 94 -96 5 227 -84 -5 48 263 -76
6528 -76 -65 -96 -172 52 -273 167 -3 111 161 -62 57 -129 -131 149 15 18 -38 -205 -384 -84 -167 55 -224 -179
6552 -179 -6 -121 -118 -361 126 306 50 -62 -10 -233 219 -148 -233 -111 75 15 107 106 277 69 -114 -132 21
6575 21 -113 -47 202 -97 121 93 -221 190 173 -245 66 -117 -15 -82 25 -65 -6 150 4 -26 -116 4 -159
6598 -159 -58 84 -139 164 -18 140 -196 -358 -229 37 183 155 143 -97 -69 -78 -36 -23 -279 -21 11 -27 -32 -54
6622e4L29l18on5j90K76O6J30o5Qj89k4J20l0k98O06m50J08o4J60l35K93m3O8
6646D3J81l03m3O0o1Q3J38P6l20K51o6q6j0Q4l75N65j75j36R8N8j01m2J56j80
6670a05J91n0K33j26k46m9j2N07m06j89L42k94K30J15k19R3K59q4l3r6Q3j49P
6693BQj1j12K14q7j05K58k61K82q7j41N0K6l2r9p8L20%k67l00M94J20m43J94J05
6718E0J99j23j7j93j03L92l43J7J51l65L31l7j3k16J20n4K94k24j19J35M50l41
6740ir8J56k2L5j71p0nL47J5J48K38p03K80j84J69j41L9j71M06r6j43k5K54n85
6764c36M06j29m9j76K60k90R9J66KkP8J17l32J53J32l05K42j24rq1N5K01j66k28
6788c16J71K23J76J4k54J11k70M7j36L49j53r3J52j00J1N0k9K07j52L27l46q5
$$ plain form
6622 -54 275 -43 -49 -104 -294 -18 48 178 113 121 -68 -92 28 -2 -300 306 -144 -36 -100 60 -275 18 -25 43
6646 43 224 -79 -122 -62 -123 -40 98 174 -146 105 39 -47 -57 27 -348 217 42 -94 4 62 -39 -81 75 -105
6670 -105 86 36 269 143 -103 -152 -164 343 -63 -252 90 -204 26 141 -78 15 274 190 157 61 144 -5 2
6693 2 10 -1 -113 101 14 -91 167 -94 188 101 -40 10 36 4 -95 -173 147 147 -120 -420 74 194 -249 -55 50
6718 50 249 126 109 -84 -187 205 -138 -121 30 -335 -4 -41 -54 -270 -150 -204 90 -134 -253 -118 332 -9
6740 -9 -107 49 27 62 -109 -179 -184 163 178 326 564 -139 141 -43 126 -15 24 -147 259 163 20 -5 249 -336
6764 -336 70 -59 -108 -284 -24 -314 -215 -49 -47 -49 29 146 -186 -33 99 -206 36 -88 -97 -178 -123 78 -88 -316
6788 -316 -145 78 254 268 14 125 -145 -98 -234 115 -38 -131 21 -79 -68 -18 -47 160 8 335 -11 -96
6810i6j65L28k81MJ70l5L37k40j9q0J32J1k64J94P9j81J31K0j34K48j52J39r8
6833D8K05j32j64k8L2m8K34j35mn4q5J41L2l0R5k90n3K92M1k85K9R3J41l20L3
6858b12k0L67k75K42j47PJ40k81J73k49J11o9J90J00l23K09M0R1j07J62n0j16
6880a7k51L82l19J96K29j18k63P2K73k54J55j60L89n88L57R8l8k27o8O8O8j34
6902a50K07j65J5J2k2n2K45j55J69l9J2n4J43l58K15J14jk66L7J28j39R5j62J49
6926b2J0q2O5K1m0K45p0j03kJ10k30K7q1K54O5j95r6J99k21L05k7k08k8k7L63
6951B32k16Q9J37k5j39l34K39j35K28m2J05j03j01K43J0l32N02l42L3p4k41J46
6973a20m7K88mj01J8M3j19K12j89j05L2j07J43j2L51j99J16j29k69K13J13L0j19
$$ plain form
6810 -96 -261 67 -214 -210 -40 -75 262 22 3 -77 55 66 -198 -4 75 -106 25 45 -89 159 7 146 48
6833 48 253 121 -43 -71 -39 -87 147 12 8 -46 -131 10 42 12 107 -183 -236 56 97 -188 -159 -66 75 -245 -212
6858 -212 -232 135 -140 102 -45 -38 102 -179 -6 -255 -144 -213 -23 77 -246 -37 3 94 -13 149 99 -17
6880 -17 -268 114 -205 -9 220 102 -161 -89 184 -70 85 -75 314 -274 83 181 143 -84 -152 -84 -16 -150
6902 -150 57 -108 -93 -81 -103 -155 90 -65 104 65 77 23 166 -192 23 137 136 -130 -93 35 -104 -9 -171 -22
6926 -22 -12 -94 -29 -8 -48 197 127 24 22 132 -98 -71 -152 102 167 -28 -124 75 -146 159 132 -76 -104 -131 232
6951 232 16 105 242 217 78 -256 -17 -152 76 34 139 36 -65 178 188 -144 358 16 49 -25 -266 -120
6973 -120 -167 121 117 16 34 77 -42 170 -19 -124 -92 -199 -56 -68 283 84 200 71 -198 15 128 158 39
6996C9l74M45k04J62k54K6m3L13o0j55N2o2L46j64l0k58L37j6j70J58k12r1R4
7019a21j13J53m5N5Rr0J81k30p5L62K1k61R9j46L00Q9j9O2k88o1K21j24J19O9
7043A67l29J07J50p0q8J12j24J31q3L10k85j61L50j46j4m1k27J21lQ0J0K58j92
7066C3Q8Q2n28L78K4l6k18K65j41J90L0j46p5l1R0n2K12k5k37J11k42K73K69l86
7090g2P3j18K36pk67J19J15k35J68j39j23J8K15R7j00J01j26J94l95L68kl22K55
7113E3k6J17m17M96O6m55j3J81P5l06K3K26K90m98l6J33J75m00L6L78k15Q4o3
7136i6M1J31Km3k13J43L38m4L6n29K19r1l3N8J28N0J26k52K13j12l26O11k94m30
7160c67N27j09j65J89M1L31m19j96N8L6K12m7j5j58o6L08j37l4Q1l79K11J29m9
$$ plain form
6996 39 -335 110 -94 68 -186 -160 -203 110 50 -105 -53 -115 231 67 37 -221 116 100 -70 88 -124 -215 -121
7019 -121 -234 -81 -126 -71 -62 -152 29 -201 -276 86 107 -154 -55 -201 99 188 169 231 -57 -118 103 -21 98 167
7043 167 -162 -55 95 25 -63 49 -75 56 -27 283 -2 -163 187 41 27 -14 -241 -120 -123 -43 -33 225 33
7066 33 121 203 -325 53 77 41 -177 88 -53 137 167 21 -54 -85 5 -47 165 140 -97 14 -228 45 314 -72
7090 -72 1 -117 119 112 -155 -36 79 -156 12 -127 -250 -232 -17 80 -20 81 -45 149 -246 122 120 -202 53
7113 53 27 144 -273 223 289 -166 -179 2 77 -229 -206 20 310 -188 -224 -91 84 -316 -280 98 -117 -33 -96
7136 -96 -55 76 78 35 -178 -35 303 259 295 -234 -15 -106 -139 -81 47 97 223 -29 184 72 -254 357 63 -367
7160 -367 160 51 -114 75 116 447 28 -168 -110 -74 138 91 76 -82 -148 160 23 -11 70 -309 -98 31 -18
7183a8j52o6N53m42jK20J72n5j95q2Q0K14o8j21l56L67j58J00J07j95R4J97k27
7206c2M05m98L32j24k52p6K46J44j70j47M25l02K64j34l45L21j18L41l60k1k28
7227c29K65J8L00n28K60k93M10j66k16L91l26Q6R0J99k51%OL15l29M85l93k05
7249b11O46n70L41j98O1j0J60j82J63j34m9m7P1J1K42l77L08l21Q1J03j20j33
7271a65K11o0k16L35j52J4pk13K17Q3J66Jj54l7N1lj65L4K02l99L41j21j75K70
7295E8j49L4K56J19j39j18Nk87%K38J1j98L74J49j15q7J08n52K86j31O8J50j53
7318g3J87l92K24J69k06J63J0l59J07J22L32l47L28k38n7n5k34J99K69k11qq9
7340a59J46J15j39Lr1PO0P0J27l64K16k38J74m9m5j9p5K92m1j1K31j90M9j11J63
$$ plain form
7183 -18 -170 -236 317 -125 -126 94 266 211 16 -66 14 228 160 39 -317 50 -108 -8 99 -96 -2 195 -32
7206 -32 373 -125 207 83 -169 -245 1 145 -25 -172 253 -49 215 81 -264 57 -61 280 -80 -101 -329
7227 -329 -64 -46 254 -274 -14 -307 103 -63 -279 112 -214 -128 -38 161 -90 -90 -84 231 -98 387 -6 -211
7249 -211 435 -135 206 8 69 59 219 37 200 66 17 -30 41 52 294 -83 225 -96 -15 88 -32 -165
7271 -165 46 -14 -230 105 -47 -33 -40 -253 -36 47 213 214 60 23 74 71 -94 -60 142 -257 84 -37 -212 58
7295 58 -91 -57 199 318 179 61 66 -221 -221 17 28 -170 204 353 238 151 259 -293 -7 -138 -70 80 -73
7318 -73 114 -278 -54 115 -91 72 82 -277 -170 -48 284 -63 265 27 -30 -85 -319 -120 149 -62 -70 -159
7340 -159 -13 102 -37 -34 -125 -118 -58 12 139 -225 -9 -247 -73 -122 -167 -186 -261 31 -10 -21 210 20 69 -42 121
7365A21m47L74m5J42j74j69K4M12l11k94K47K57j19q6K47n12J82L16k28J07O7
7386A11L8l15J60L19k78j1j60K43J17k09k12K80M8k67L54Q7l45j75L67J15l08
7407d1J33L8j60J17J41m53J69J44k68K8L37k30j48M7m1N86m75L48k54m50J12M18
7429I8q0J55j02o2K49l51RoK31k71M27o9l03J65k40P0J56L6j67j05J82K4O6r6
7453A6k62J88J38j64J46j24j61k9K12J74N2r8l15L59k28M42k33r0L23j96K6j41
7475C5j6j78n0K69j16l9J39o1L40o21M72l17L36j22J26j00l36K35K82m19p4J30
7497h5J12Pm8j82M5K44k25K19j75J17J41l39J32J83j2p1l85K85M03m31J54j23
7519c4L7j41l9K28j05K29n3K0k03O9k6m2L54n70K90J89k7k13m0N1J49l13K24R4
$$ plain form
7365 121 -326 48 3 145 -29 -198 -174 238 -73 -367 -120 137 18 -68 179 -333 -151 165 -63 44 111
7386 111 149 -166 -6 313 35 24 -136 107 224 15 -197 83 131 -136 218 305 -40 -215 152 267 -41
7407 -41 92 130 -30 87 228 -225 -56 88 -180 -152 185 -45 -193 -146 -187 399 -76 272 18 -432 -320 98
7429 98 18 173 71 9 258 -93 -84 -90 141 -130 297 228 -75 90 -150 -80 76 112 -55 -160 22 46 112 16
7453 16 -246 -58 80 -84 62 -62 -223 -252 -40 134 186 88 -227 132 -96 346 113 23 346 150 176 35
7475 35 19 -159 -209 60 -56 -95 44 -17 323 -298 174 -143 193 71 197 97 -239 -4 278 -141 -215 -85
7497 -85 27 34 -14 -196 -151 93 -132 87 -88 29 170 -169 -37 146 134 63 -322 -37 366 -65 89 -34
7519 -34 3 -138 -177 51 -54 175 122 142 -61 8 -18 -60 294 -276 14 203 176 -37 -77 -26 123 -190 34 128
7543A28R2j1j26k38K77j25O1J12l12J08O8nj44M04m06j2K08J37k10j38K47J08
7565B23m15P5J19R5l32K00O0o8J47j63J00J31o6k49K67L23k53j81J5L8Q9j27K64
7588B92k12m7K21k13j77K69p8k9n8j72M3O5q9K06R4l4k92K52j02N1j79O2J89j72
7612a10J40J48j86J56k17j3P6j80K4J09M8j5L2J05l1j90R4j50M4M32o22N90p30
7635d46M48J76j78J13j81N8O3l4Q1j8R4m17J26J06o0M8J35j09m6k33J62J84Np6
7659AL12j19j9l02J66J67m95K96K86m70K15p5J21k15J25p7K0M4m9J75j82j02M19
7682B42j96l3J5j89J47L5P3l2Q5m22L56j88J86k33J28J21l8Lk43M18p7r2J2j51
7706g3j1Q0J3n2l44K53J77J05R4l13J68k11J8Pj13K32l80K32J7K35j61K43O8m47
$$ plain form
7543 128 220 209 83 -155 122 -3 58 170 -142 -34 34 29 -115 289 -117 -129 79 216 6 -132 115 223
7565 223 -192 -117 2 97 -235 -35 25 -43 104 -59 41 172 106 -143 124 447 194 13 28 66 155 28 292
7588 292 80 33 254 41 -136 133 55 26 -32 -204 -161 -96 -185 21 115 81 -211 41 -61 -10 -189 -127 62 -110
7612 -110 30 178 -8 148 -69 -82 -6 -186 -162 -53 -5 -20 12 117 86 -104 -10 -160 -116 316 -306 284 -446
7635 -446 2 178 0 113 -68 -10 53 19 100 82 176 -241 -115 -9 -69 -21 114 5 -41 -274 -112 72 77 1
7659 1 313 194 175 -127 39 206 -289 7 293 -177 38 -37 84 -131 -6 -83 -63 -19 -68 107 -75 -177 242
7682 242 46 13 28 -161 -14 21 94 62 147 -275 81 -107 79 -154 -26 95 57 60 -183 235 158 66 78 -73
7706 -73 -84 -4 9 -43 -387 -134 43 148 242 -71 97 -114 -96 -89 -202 30 -350 -118 -101 134 -27 216 284 -163
7730a63K06J1J29l78M48m9k72Q1j5J99k21K16k14Ln7J12M49m54K10j78j51J69
7752H1l43L96k8q4j2nj11L96l56K94k00R0L3k35K99p1l63LK63k50J72j46J03J46
7776G2l0j07p0L8r6L64K7l71M33m87L09k7j8n7m64L60N1k29K30Q5k93N40k62N4
7800E2j81J80m3o8l13M97n0J9jj00P7q2K45k4k38L51l21n5N3k95J33J57j73K67
7824H7j8j61P4r4l2L4J37R1j06j74L44J17p8m19J50K20q9k58J94K4m7j60M0J18
7848fJ89Qm76K17k02K91J2J68r6K0j35J80j82k0J91KO1k01L9J00l10N51l48m5
7872Hr5l1L9K20k06J1M94m10j8m02L89o7k02O32l06j78J72j62n4K18K08l10K7
7895b3K7j98K67L9J0N4l6l58J1N9K79P5M7l09J79Qm2K27l95L12k48j12L06j88
$$ plain form
7730 -163 43 54 183 -195 253 204 -68 13 -2 197 -24 192 -22 -19 -76 36 485 31 241 63 -88 81
7752 81 -262 134 106 22 10 5 -106 290 -66 228 28 118 151 -84 215 144 -219 -216 47 -203 -31 -177 -74 72
7776 72 42 -65 -135 -97 -193 171 198 -173 260 -227 82 55 37 -20 -484 -124 -73 -302 -72 13 -280 260 -2 52
7800 52 -129 51 8 -60 -373 124 74 93 92 -8 69 -13 232 208 -30 321 0 -55 -2 -297 -164 -7 -180 87
7824 87 69 -92 -18 -112 -144 -110 27 118 12 -162 182 299 221 -198 -48 172 83 -175 19 43 -4 -164 -124 -6
7848 -6 183 191 -285 -68 -270 21 33 201 105 125 -10 170 -12 -32 159 161 222 21 60 160 -150 401 53 8
7872 8 -87 -118 -79 141 -65 -54 440 30 12 -390 -1 -68 -270 362 56 -122 50 -112 -166 52 260 -50 -23
7895 -23 4 -194 73 112 122 176 140 -218 -207 -148 131 206 253 -56 123 131 89 316 -79 233 -15 -127 179 -9
7919iM0N4m5K21m74K20L75j67j88L37j43j13k12q9M4L14l38K28k15J2J32r4J41
7942C1j41L23j79j70L34N7j3m68O1J22J24m8n36L67k23O59l59J15%P3j17q1K54
7965A85k93M9k21K85j35K82j70O1J69k77J52j45k35P2K58k75M11j36J21n7P5l68
7987a92j00K63l2j9k62J85J84J46l26O1K41m08J91J05K81m29O6o4L05k74O2k4
8009d0Q9l0R8j47K85l28M2j19j00L03j3j40j06P2J20k68K65J98K6j0L8k86r9K30
8033H0j82J10K4m7nL2k80L55Rk90O2J50j89kM2J84o8m1N3k4J24L7m40K62q5K64
8059A35k2k79L25j59j97N25l20M5K7M9j41R9m4l4J79k16P4J23l12K06m3K32k9
8082B23k63j58J86J9j43J81K89k88K4k90K92J13k41j22J50Q2J39k47J16M3j37
$$ plain form
7919 -9 31 85 40 261 -213 7 382 215 27 364 221 108 -104 -193 -149 165 -173 55 -160 -148 -16 -110 31
7942 31 -110 213 34 -136 198 255 242 -226 -165 -43 81 33 -503 -136 -359 300 -59 56 56 129 12 -69 185
7965 185 -108 -59 -280 5 -130 152 -18 43 212 -65 87 -58 -293 -221 37 -238 173 37 158 101 176 -192
7987 -192 -292 -29 -61 -80 -342 -157 27 173 -153 -92 149 -259 -68 37 318 -111 -45 -109 196 -78 -16 -40
8009 -40 49 19 117 -30 255 -73 -31 -150 -250 53 40 -100 -206 -134 -14 -282 -17 181 207 197 235 -51 -150 80
8033 80 -102 8 32 -15 -20 12 -268 87 96 -194 -132 18 -171 -173 -131 53 -15 -56 -3 -27 97 134 -306 -44 -129 135
8059 135 113 -166 159 0 -197 328 8 53 80 129 -12 87 43 9 188 -28 46 169 -143 63 20 252 223
8082 223 -40 -198 -12 7 -136 45 334 46 70 -220 72 185 -56 -178 -28 54 193 -54 62 105 -32
8103c2M6K33m42M27m04j0M25k98L05qm07M55l16J61k28J1k69L72l2n0O0j01K55
8126A53j68J83l26K50k64L73l13J26j60J46R9k8j38J33m9k21L50r2Q7l97J29K20
8148I3q7K23j49N3l34K23j03J8K95l76P5O3J72J59l23k69K02J45l1n4L8k45K64
8171E2J04m8l67L24M5k97L46k36P5J56m76J53L51j67k84L57k48K47nL3
$$ plain form
8103 -32 14 247 -195 232 -172 -182 243 -55 250 242 -165 290 -26 135 -93 -82 -351 21 -11 -61 -1 -102 153
8126 153 -15 168 -158 92 -172 201 -112 14 -146 0 99 71 -67 66 17 -204 146 54 141 -256 -127 93
8148 93 6 229 80 133 -201 22 -81 -63 232 -144 -69 -6 166 325 2 -267 -65 80 49 -5 33 -212 52
8171 52 156 108 -259 65 110 -187 159 -77 -2 154 -322 -169 182 15 -269 88 -160 87 82 115
8191A15
$$ Imaginary data points
##PAGE= N=2
##DATA TABLE= (X++(I..I)), XYDATA
0@%%%%%%%%%%%JrJ6j6J6j6K0k8L2l4M2m9N6o5P4q7R8j09J24j40J57j77J99k20
35a15K44k74L05l37L73m14M60n10N63o22O92p70Q56r56J074j211J373j574J826
54I83k153K599l245M269o153J0736l9247p5614N5596N5833L0946J2241m518l0816
68A1457n669O746j0761j1670R938M420K799N257j5068k9597RJ8549P764Q21l040
83h045j5831p575O914J690j892R802O026n251j325L72m020M077R300R74k552J317
99f019k785k868N135L334l64L616K404n044l464J321J09K819M772k272m887J63
115d030J46j021K760J734k332j53J537k219j411K058L89L59K537m16k940J68R81
132a853K5J885J754j976r53R87k08J09J288L74j240J037J83j127j91M46l81K51
$$ plain form
0 0 0 0 0 0 0 0 0 0 0 0 0 1 -8 8 -8 8 -8 12 -16 16 -18 24 -25 31 -34 40 -47 51 -58 66 -74 83 -94 105 -115
35 -115 129 -145 160 -177 196 -218 242 -268 295 -327 365 -405 451 -505 569 -642 731 -843 983
54 983 -1170 1429 -1816 2453 -3700 7036 -32211 -107825 -52229 3604 34550 46791 42273 11457
68 11457 5788 12534 1773 -9897 41 4461 7260 12517 -2551 -32148 -32139 -13590 -5826 -5005 -8045
83 -8045 -23876 -31451 -24537 -22847 -24739 -14937 -8911 -14162 -15487 -15115 -19135 -15058 -5758 -4784 -7336 -6019
99 -6019 -8804 -11672 -6537 -3203 -3567 49 2453 -2591 -6055 -4734 -4625 -1806 2966 694 -4193 -4030
115 -4030 -3884 -4905 -2145 -411 -2743 -2896 -1359 -3578 -4989 -2931 -2542 -2183 354 -62 -3002 -2834 -1853
132 -1853 -1828 57 1811 -165 -1118 -131 -339 -230 1058 1432 192 1229 1412 285 94 540 159 410
150D10R99p23j040K17l7l9P73P9j140k70M84n01J73R8l67k80J019q3p97J06K94
171f25p61N33M97k09j60q8K76j16L97K22n05N36K21q17l11Q70j59l75J33L78j25
192a88l11J05j29L85j90k20j48K52K8m83N57J00n85R6M37m47J97K27k54l8M25
213a84Q3j44K11r0l48N64J7m42K39k2O8K19J24k10l91J70O1N0J51j46j16K2K91
236A77k14k25J62j0k5L21j50J12m40j00l9J77L44Q7l29M3m82P64m9k92k6K88k71
259a77j43N70l92J96j51M09l73J7K55k3k0j51Q1J70k27l35L41n2J55j44K13o0
281A59j48j35J5L07k80j83L98lN0l01J15K69n6j61j41L13k09j12ln9J55J74k44
304h0P2l0m3J46n70M96oqP8qn3k73L71n3L45j18l72m5L82j39m81M57n2J10k85
$$ plain form
150 410 1409 686 -354 -137 -174 -213 560 639 -501 -771 -287 -788 -615 -517 -884 -1164 -145 -228 -1025 -919 -625
171 -625 -1386 -853 -356 -565 -725 -813 -537 -653 -256 -34 -539 -3 218 -599 -910 -40 -199 -574 -441 -63 -188
192 -188 -499 -394 -523 -138 -328 -548 -696 -444 -416 -899 -342 -242 -827 -731 -294 -741 -544 -317 -571 -609 -184
213 -184 -101 -245 -34 -124 -472 92 109 -333 -94 -116 -48 171 295 85 -306 -136 -75 -25 126 -20 -136 -114 177
236 177 -37 -262 -100 -110 -135 186 36 148 -292 -392 -431 -254 90 177 -152 -109 -591 173 124 -168 -194 94 -177
259 -177 -320 250 -142 54 -97 312 -61 -44 211 188 168 17 98 268 41 -294 47 -5 150 6 219 159
281 159 11 -124 -109 198 -82 -265 133 130 180 -121 -6 263 207 46 -95 218 9 -103 -106 -165 -10 164 -80
304 -80 -8 -38 -81 65 -505 -9 -15 -23 55 47 -6 -279 92 39 384 266 -106 -151 231 92 -389 68 16 126 -159
329a59J40j96K74k04qO9K82J86m01k25M8L0J97o6J55j39k46M06j99N4J48J1k29
352g2O2r0j07K30QJJ03p6Q8l98J22J05J75k74J0rK26J68k69k12K53k12Q4J77j8
377G5J06m61N7K48J66m60K97p2M8k22R7J84m7n7K19k62KP6R7m11K36R5K51l96
401a34J33k82M5J17j25Q9J45l4r3m8M12k31K51k84l8O3J2M9j57Q5mL1j31R5j22
426a56q7J55L53j13O2P0l72j80N2N11k25k45J28J25n0k06Q8K79l78K35J13l31
448a72J75o1K93l41K13j53j62n9K30l03L60O2j93J31J05m0J80m07o7Q9J71j66
470a15j35L51k10K27m9j8q9j01k86P91j10m24J03L86n07Q2O5J19o1Q3K1l5K26
493C14l30J76P0k19n0M9j5N8p8l6Q3M3k30J29q0N7K14j47p5K9l43O32j62j6n2
$$ plain form
329 -159 -19 -215 59 -145 -153 -84 198 384 -17 -242 -194 -164 33 -33 122 -17 -263 143 -56 -2 146 157 -72
352 -72 -10 -100 -207 23 31 32 135 59 147 -251 -129 -24 151 -123 -113 -122 104 272 3 -209 44 -168 -84 93 75
377 75 181 -280 -223 25 191 -269 28 -44 4 -218 -121 63 16 -41 178 -84 -82 -6 91 -320 -84 11 262 -134
401 -134 -1 -283 -238 -121 -246 -157 -12 -46 -139 -187 225 -6 245 -39 -77 -14 -2 47 -110 -25 -29 2 -129 -34 -156
426 -156 -243 -88 265 152 214 284 -88 -268 -216 295 70 -175 -47 78 28 -178 -90 189 -189 46 159 -172
448 -172 3 -58 235 -106 107 -46 -208 -267 -37 -340 20 82 -111 20 125 85 265 -142 -209 -120 51 -115
470 -115 -250 101 -109 118 69 51 -38 -139 -425 366 256 -168 -65 321 -186 -104 -39 80 19 102 123 88 314
493 314 -16 160 230 11 -39 10 -5 53 -25 -61 22 65 -165 -36 -116 -59 155 8 -67 -38 -381 251 89 73 21
518B1P1j59n1L22l20L4K59l7k28L56k7k08J14j62P8j94p3L53k68Q3K77j76l5J5
542D5r0K54j05m70N52j14J7n7J53o2k58L81j25r1J58q5R8n32L16J74P3j87k33
565a88k12L72L09j24l81J95Q9l97L86j83K6pJ4K51q5K5l74N54k48l8J79o6l4L48
589D11n45o9L68k26p6O2j70K44R5j79m1j0j31L42M0k16j9J09k15K89j4l02L18
612F5k18L47k41J27j7J10j06L0q7J3O5l81J59NO6Q2j01L32o48N03K4J4j06k65
636b28L16j75j8J21k11R8pR7J19LJ9O0j14j37j44K88Rj88j08k1k0J53j0M15m04
661h7J98k54j4N08m03J9J46l58o5M44k66Q2p8J65J41k93J70j41R3r7R8R5l38L79
685A44r6j90J04L10k80M12n54J7J06L7l0J59j14j32J79l4L7J66n54M54r9K68l93
$$ plain form
518 21 92 -67 -118 204 -116 -82 177 140 -88 268 241 33 147 -15 63 -131 -204 149 -119 -36 241 65 30 45
542 45 -45 209 104 -366 186 72 89 32 185 123 -135 246 121 30 188 103 201 -331 -15 159 232 45 -188
565 -188 -400 -28 281 157 -224 -29 60 -337 49 -134 -108 -115 -101 150 65 90 -284 270 22 -16 163 97 63 411
589 411 -134 -203 165 -61 -137 -75 -245 -1 94 -85 -126 -136 -267 75 115 -101 -120 -11 -226 63 49 -253 65
612 65 -153 194 -47 80 63 173 67 97 10 23 88 -293 -134 -129 -63 19 -82 250 -398 105 129 143 37 -228
636 -228 88 -87 -105 16 -195 -97 -104 -7 112 115 134 194 80 -57 -201 87 96 -92 -200 -221 -241 -88 -98 317 -87
661 -87 111 -143 -157 351 -52 -33 113 -245 -310 134 -132 -50 -128 37 178 -115 55 -86 7 -90 8 103 -235 144
685 144 48 -142 -38 272 -8 404 -150 -133 -27 10 -20 139 25 -107 72 38 75 241 -313 141 42 310 -83
708h3O9l12K86J19k6m2p5j18J37M13m7p15M50o2J71j30J25N2l37l5R9J64K21j72
732A52m1k52J81q9r1J38pj3L1J15k25j23L53K63l57M2l3R8m00L12j18j68J98J59
756A25m9R2l5j97N8J87l56Rp1L70Q3l59L54j90p2K73m09L06j09n9j95M05l95K05
780b9J39k84K23j95R1K02L4n4J87m95o7J77K75m5q2q6j83L5K36m01K30K99k55
803d8K25o9j55J84k90K22q6q3K56l67L08k8J1n0K5k64J53J49k23J59J8K7k0j27
827g3K07K28m63K76j15N4j75P0ko9N8k02J22J45k53K51j00K36j89k65J38n6L50
850A73m03K17N7j7K04l93L9J82k62J01J77k22J54j51M14l76R5N1K30o77K27K83
872A03L8j29%L1j5J9j43J04J44l7n5m2r9O0J3J56l5r8j49KR1n9J07J50j47mN3
$$ plain form
708 -83 -14 -326 -40 79 53 11 -64 -182 -45 368 321 -394 56 -6 165 35 160 212 -125 -160 -61 103 324 152
732 152 111 -141 40 -49 -140 -2 -9 -22 9 124 -101 -224 129 392 35 77 44 142 -258 54 -64 -232 -34 125
756 125 76 168 133 -64 -6 181 -175 -166 -237 133 216 -143 211 21 -51 222 -187 119 10 -49 -244 161 -234 -29
780 -29 110 -174 49 -146 -55 147 181 127 314 -181 -248 -71 204 159 77 -9 -192 -157 79 -322 -92 207 -48
803 -48 177 108 -47 137 -153 69 -17 -100 156 -211 97 69 80 30 55 -209 -56 93 -130 29 47 74 54 -73
827 -73 134 362 -101 175 60 114 -61 9 7 -62 -4 -206 -84 61 -192 59 -41 195 6 -259 -121 -177 173
850 173 -230 -13 44 27 231 -162 -123 59 -203 -102 75 -147 7 -144 270 -106 -11 40 270 -407 -180 103
872 103 141 12 12 43 28 47 -96 8 152 115 60 18 -81 -21 -8 148 113 15 -134 -132 -41 -100 7 157 10 6 59
899E9J81j43Q2J9j74Q1l14J93J97o9j19j63K28j37p6J20K65k11j19L23l6j2j17
922E8j55k29K14Q3R5J31j35J60l5L5j76M2Jq3k59L78j03K11J03q1j91N5P2k57
946f6K4L65k18l04L17j92J95j07R5k97J94J60m00O3k5J18j38J1k01K53K69j77
968f1j84J67Jj7J38K31j43j91k66M43m33K5K96R9r5j82K19l8J50j70J5K45j52
991I7L1l27P9J88q9O8J04q6J54o4j83o4J31j24O3J7L25k53k26J35P3k80L71j29
1015A1k60L60k9K4l69J89P6J32j47K2k23J95q2l3K56j45J98l2l7K03k14j57J26
1038F4J81j64j75R4q8K80k28J97j08P3n5j54J39k34L55k88J53K02q8oj5pl42J87
1062b7j4m0j82L13p5O8j58K6Q8l9p0L51l52K09j52n9K46l03O7p3J10p9q1J7M29
$$ plain form
899 59 240 97 179 198 24 105 -209 -16 181 112 -7 -170 58 -79 -155 -35 230 19 -100 223 187 175 58
922 58 -97 -326 -112 -29 66 197 62 222 187 222 46 88 89 6 -253 125 22 233 336 255 64 119 191 -66
946 -66 -42 323 105 -199 118 -74 121 14 109 -188 6 166 -234 -171 -196 -78 -216 -205 -406 -153 116 -61
968 -61 -245 -78 -77 -94 44 275 132 -59 -325 118 -315 -290 6 105 10 -172 47 9 159 -11 4 249 97
991 97 128 -199 -120 68 -21 47 151 65 219 155 -28 -92 39 -85 -22 -5 320 67 -159 -24 49 -231 140 11
1015 11 -249 111 82 106 -263 -74 2 134 -13 9 -214 -19 -101 -134 122 -23 175 143 106 309 95 -62 64
1038 64 245 81 -94 0 -88 192 -36 161 53 126 71 -83 56 -178 177 -111 42 244 156 150 135 128 -214 -27
1062 -27 -41 -81 -263 50 -25 43 -115 -89 -1 -40 -110 241 -111 98 -54 -113 133 -170 -103 -176 -66 -145 -226 -209 220
1087B20k25j8kq9R5o6K73j32j55J71j20r2MK28j99lk2L14j46J33Q8l78M9K31L2
1112A91m10L33N7m69J45QK07N2j39k09M04k73J07l28M60k46K8J43k68L03J82p0
1134B08l74J48n3K01k65N1J97k86K26n6k78K07K35j92J49J41j55j38K19l22K4
1155a13J08J93l5j57K08m31J07j8K53r8l35L5K16j97J72J96k47K36r9r1P8N3M4
1178G8p8J6j52L07n9m2j13j01L42k15J99j98n6kn9K26m3j64K41m0k9Q7l09J82
1202A8J02j57K99l43R3j72J40R4j69J33k56J71p7J33q3N4l09N06j80K47j50NJ22
1225B21j05n2P5j06k41M02J6m0l83J30R5j34K15j99J30N5j8j83L62j50j58J96
1247A28k93K62J45k50l03J49K56j07j85K98P2k70J13K41r7J39k98J35l67L32k83
$$ plain form
1087 220 -5 -23 -25 -114 -19 -85 188 56 -99 72 -48 -140 -136 92 -107 -110 -132 182 36 169 257 -121 -72 159 191
1112 191 -219 114 171 -298 -153 -145 62 114 -25 -234 170 -103 4 -324 136 -110 -82 61 -207 96 278 208
1134 208 -166 -18 -71 130 -135 -84 113 -173 53 -3 -281 -74 161 -31 118 259 104 -34 185 -137 -113
1155 -113 -5 188 153 -4 204 -227 -120 -138 115 17 -318 -283 -67 -264 -92 104 -143 93 -6 -97 -19 34 78
1178 78 0 16 -136 171 112 70 -43 -144 198 -17 182 -16 -72 -74 -133 93 50 -114 127 87 58 145 -164 18
1202 18 120 -37 262 -81 12 -160 -20 74 -95 38 -218 -47 -124 9 -74 -20 -329 177 -3 244 94 99 221
1225 221 116 64 139 33 -208 194 210 170 -213 -83 12 -122 93 -106 24 79 61 -122 240 90 -68 128
1247 128 -165 97 242 -8 -311 -162 94 -13 -198 100 172 -98 15 256 159 298 0 135 -232 100 -183
1268a83L80o3k14M34k05J2p2l74J33L6J19N0J54k57J78j32k00N49k58l44K54j32
1290a35L4L72l18J51l83K47O2k9j23L44j75n0O2j00Q8l5j08l2n8L79j95p3N2K98
1314B75l53K8J49r3r4r6L38m5k05P2J93q4l5k71K87l6n5k10K96qm51M02J16j69
1338d9L5p2L20l93J49k9J18l24L38j69J01K0q8J87k77j17K05o1L58l13M34o23
1360b50N22mk17J8Rn5NlJ5L00o24M70r2K4k15J48N2o5O3o2j20k81M26M0l46J79
1386f3j5K29Q0o02K23J13kO0l00L10K05o24L77m5M6m6J84j51P3p8j99N09l87K76
1410A73k80j15J90P0k19n5N1L74k60M9J31qk8J45l29P9J19j21j25l0J77R3q2j25
1434a26K43O6r8K8l12J28j34P4l5J50k51J93J82l12J58R8j84J98p7k58K46r2P6
$$ plain form
1268 -183 197 134 -80 354 149 161 89 -285 -152 -116 3 53 207 -50 128 -4 -204 345 87 -257 -3 -135
1290 -135 -101 271 -47 104 -279 -32 30 1 -122 222 47 -3 59 -41 47 12 -96 -128 -186 193 -2 -75 -23 275
1314 275 -78 -50 99 6 -88 -184 154 109 -96 -24 169 85 50 -221 66 30 -25 -235 61 53 -398 4 120 -49
1338 -49 -14 -86 234 -159 -10 -39 79 -245 93 -76 25 45 -43 144 -133 -250 -45 -106 252 -61 373 -250
1360 -250 272 268 51 69 78 23 28 25 40 340 -284 186 94 118 -97 51 103 38 101 39 -81 -362 64 104 -242 -63
1386 -63 -78 151 231 -371 -148 -35 -37 23 -277 33 238 -386 -9 -54 -8 -54 130 -21 52 -26 -225 284 -103 173
1410 173 -107 -222 -32 38 -181 -236 -185 189 -71 -22 109 101 73 218 -111 -32 87 -34 -159 -189 -12 81 -1 -126
1434 -126 117 183 85 113 -199 -71 -205 -131 -166 -16 -267 -74 108 -204 -46 52 -132 66 -11 -269 -23 -115 -39
1457c9k24L28k34J18O9J02k61L41j81k22J71P7N1j30m2J55m3Q6L4k27K08K0o3
1480I4R1k93J74L6K9J61n28J00M59l01On3O5P6J8J7n46L29K01k32J5Q1k15L45
1504A29l98N70k88j03K35j04Q2p1j28j2J52J08l74K62l70K23j27K9j09M75l67
1525a86L59J80m56k10K63K47k67O1m3J99k69J66Q9l32L01j2k03O9K2k06J67L02
1547B41j33n3q4N6k17M56l40J54q3J54j61o0R4j55J41j21J03k17K77k92K31j19
1569a28K12n7K12%j48l1k9L21n05K4K36k85L8M59j64j63k4k47M61J7k1k42j27
1592a91M61k39j45N17l68n9L0k2k16K06M24o64K54k18J04L84l49PJ05l7N8q7K46
1615B01m29M45k85J40Q6j10j29R3oJ62j13j73r2L02K0j69j6j72K57m2K39j52j8
$$ plain form
1457 -39 -263 65 -169 -51 18 120 -141 200 19 -203 -32 45 96 -34 -76 79 36 122 156 -71 137 157 94
1480 94 185 -108 66 102 131 292 -236 -136 323 22 28 -25 40 116 134 151 -395 -66 135 -97 -82 -1 -216 129
1504 129 -269 301 13 -90 145 41 123 52 -76 -88 64 172 -202 60 -310 -87 -214 -185 -294 181 -186
1525 -186 173 353 -103 -313 -50 197 -70 -9 -52 147 -122 44 133 -199 102 90 -113 -44 -22 -228 -61 241
1547 241 108 55 -29 27 -190 266 -74 80 -3 151 -10 -70 24 -131 10 -111 -8 -225 52 -240 -9 -128
1569 -128 84 27 239 239 91 60 31 352 -153 -129 107 -178 -140 319 155 -8 -32 -279 182 199 178 -64 -191
1592 -191 270 31 -114 403 35 -24 6 -16 -232 -26 398 -266 -12 -230 -126 258 -91 -84 21 -16 42 -45 201
1615 201 -228 217 -68 72 158 48 -81 12 6 168 55 -118 -210 92 112 -57 -73 -245 12 -30 209 57 39
1638C9R0k85J94j74K3K58l14L97k26n7M7o9J14M6J5k5P1j25M3l0K04l42M27l08
1662A3k48N06l8K3j83j45k66J89K04k56L96l00L19j29l86L24j80K98j66M7R9o8
1684E3k8P0K2k92M43l09R9J8j82j2K28n8j2m7K70j4o2l20J79J71k03K7J61m74
1708b72J39j58L90q8m3J68k69k3K89P1k93L0n0J08j86L19l26J48o0K41k22K15
1730A28nj26l7j54L12K39j55k11n0J06l22L01j81J56n9j73M64m00J29k3P3o3j85
1753b36J71Q9J95l42j87K60K6l4m0J31p5P7q1J03k81M41j40j47J35k30J9J86j47
1776a07O7j25J27j16K96K3k74K99l49J77k30O7O9J38j19Q2k03J18J45j69M82j95
1798B03p4j57k11J47Q2q3L24j21q9K29k5rl86J82k10J88Q5K9p4r7o6J51J56j65
$$ plain form
1638 39 129 -156 38 -136 -113 145 -169 228 2 -55 -8 -77 37 83 98 73 144 19 62 32 236 -106 321 13
1662 13 -235 271 233 256 73 -72 -338 -149 55 -201 195 -105 214 85 -301 23 -157 141 -25 22 121 53
1684 53 25 95 117 -175 268 -41 58 76 -106 -118 110 52 40 -7 263 249 187 -133 46 217 14 41 202 -272
1708 -272 -133 -291 99 11 -32 136 -133 -156 133 204 -89 -59 -109 -1 -187 132 -194 -46 -106 135 -87 128
1730 128 123 -3 -40 -194 118 357 202 -9 -59 47 -275 26 -155 1 -58 -231 233 -167 -38 -61 12 -51 -236
1753 -236 -65 24 219 -123 -310 -50 -24 -58 -98 33 -42 35 -46 57 -224 217 77 -70 65 -165 -146 40 -107
1776 -107 -40 -165 -38 -154 142 165 -109 190 -159 18 -212 -145 -76 62 -57 25 -178 -60 85 -84 398 203
1798 203 129 -28 -239 -92 -10 -93 231 110 21 250 225 216 -170 12 -198 -10 75 104 30 -67 -133 18 174 9
1822Ik7J33K01l16n5nK8k95M56k02K41m35M31l11P0M5M2P7Q4j82m3M4K53Pp5P4
1848B49j85k78K27k47J24j45O5J92k17K58mL1k69L28q7k07J09K06l03J22o8K39
1870A40l99N9J49m1k54K52p5J13L15l49K58l07l1J85p2p8r9M55j39k19pj5J71
1893A2K8j68J91L6j61k29K48K84k48k07J03L85k70q1j9J19J60oQ5r9k1n49L56
1916e1M97m81M0Rk02L54k07j30p5K40k85K66J18n2k39P7J67k24M68l46J1K11k20
1939e4R1k62J47R9L1j98L40k71Mm8k7J42P0j27J01M4k07K13n1o8K16J47k62l33
1963b63L98k44K59j72m0k5Q1J4o5R8k2j86J12N6L6R6k70Q1M3l19K33J93p2j02
1987h0J19P7o0P2j38L17k04lk30J61k44K06r5J8k65K58K01k43J44R4j74o6K33
$$ plain form
1822 9 -18 115 316 0 -55 -60 -32 -327 129 -73 168 -267 164 -147 -77 -32 10 87 171 -11 -54 -10 243 250 175 249
1848 249 64 -214 13 -234 -110 -255 -190 2 -215 43 39 70 -199 129 42 -165 -56 150 -153 -31 -99 140
1870 140 -259 -200 -51 -92 -346 -94 -169 -56 259 -90 168 -139 -170 15 -57 -135 -234 221 82 -137 -144 -159 12
1893 12 40 -128 63 99 -62 -291 -43 241 -7 -214 -111 274 4 -77 -96 23 183 177 262 163 142 -407 -51
1916 -51 446 -35 5 14 -188 166 -41 -171 -246 -6 -291 -25 93 41 -198 -121 46 -178 290 -56 -45 166 -54
1939 -54 37 -225 -78 21 52 -146 194 -77 -73 -121 -148 -6 64 -63 38 82 -125 88 37 -31 185 332 70 -263
1963 -263 135 -109 150 -22 -62 -87 -6 8 -57 41 19 -167 -55 1 37 133 -137 -56 -13 -332 -99 94 22 -80
1987 -80 39 116 56 128 -10 307 103 100 -130 31 -213 -7 -102 -84 -349 -91 110 -133 11 105 -69 -135 98
2010I8k38l9K4pO3L26j07k06%J24J63j50j74k20N3K22L15j45j00l0J3j05j20J31
2034a09M43p6k27l9j95j66M27Q6j24l07L39l4K65j02l35K86j78R1n8J7J50j18
2056C6K12k70j13K03o8m7L60j19o8k36J35k82K86J85l32L86Pj63j06m3j21k7L19
2079A34k53K02K8m1l17L91k03P3k81M60j61r6J03l47K88P0l9K01l45J95j5P6k07
2102h4K52K3l80J61j29K23m7j32j20J43J07k40K64LJ24k42M70m20N4j43M9J04
2124D0k0J12K06n60M30k45j44K79k9L8k2j41j10J43m8M0m0J85l50J18J13R6nk88
2148b02J82R8J28q7n2K3L7j62J09k16K31K28k21j31J54Q7k58O3k15J72J63k02
2170g1K07K37l49J13l34J76r0K11jM9j26j75J89r4J86p7k12N6k10L21J13k24q2
$$ plain form
2010 98 -140 -179 -155 -162 -99 227 120 -86 -86 38 201 51 -123 -343 -290 -68 247 102 2 -28 -15 -120 -240 -109
2034 -109 334 258 31 -8 -203 -369 58 144 20 -287 52 18 283 181 -154 132 -46 45 -13 4 154 36
2056 36 248 -22 -135 68 0 -47 313 194 126 -110 25 -257 29 214 -118 268 275 112 6 -37 -158 -185 134
2079 134 -119 83 111 70 -247 144 -59 14 -267 193 32 -64 39 -308 -20 50 11 212 -133 62 47 123 -84
2102 -84 168 191 -189 -28 -157 66 19 -113 -233 -90 17 -223 41 44 168 -74 396 -24 30 -113 -64 40
2124 40 20 132 338 -222 208 -37 -181 98 69 107 85 -56 -166 -23 -71 -31 -71 114 -236 -118 -5 91 86 -202
2148 -202 -20 78 206 119 67 90 127 -35 74 -142 89 317 96 -35 119 206 -52 11 -204 -32 131 -71
2170 -71 136 373 24 137 -197 -21 -111 100 99 148 22 -153 36 -58 128 51 -161 -105 -315 6 119 -105 -187
2193a87J07K74o1j06L6PJ6j11k09N73n78K17L17k81k62K91q4k77N70j66Qk26j63
2216b95N52o4m72K13j20J2L80j9m9l43K87n4L9J5k86M45k45L83j51M3o49M19P8
2239A19O8o1%j61J05j45K8J22j09K05O2M0m48K92n19L53N2l5K02Q8l04K7J52l07
2263a74Q0K44q5n5k9j05K82R8j22p3j65R4J27J0j05p9J32O2K06k34n5N8J64m37
2287a61J94j10K9K51j74J73j8k09k00L27j81L0j94R7k5K22P3r8J93k61oQK43l38
2311a35j74M63k05o7L01l33M1N08k70j97K33p0k05q2L56l51K21M0J29k21k15L44
2333A11l91K23L28l80K64n8j06l6J67p5p4j66J32R8k8j33L23k60J04Q9Rj87k1
2356f7n2j21K81L50m14J76k43L7J85k50J6K6j11r5M52o7p2m5L13k70k1j93K88
$$ plain form
2193 -187 -80 194 133 27 63 70 86 -25 -234 339 -239 -22 295 14 -248 43 -41 -318 252 86 94 -132 -295
2216 -295 257 193 -279 -66 -186 -174 206 187 138 -205 82 28 67 82 -204 241 -4 379 228 271 -378 41 119
2239 119 187 126 126 -35 70 -75 -47 75 -34 171 233 273 -175 117 -402 -49 3 -32 170 258 -46 -19 133 -174
2263 -174 -94 150 65 10 -19 -124 158 256 134 61 -104 -10 117 127 22 -57 75 137 343 109 54 112 276 -161
2287 -161 33 -77 -48 203 29 202 184 -25 -225 102 -79 -49 -243 -146 -171 51 124 26 219 -42 -48 -40 203 -135
2311 -135 -309 154 -51 -118 183 -150 -109 399 129 -68 165 95 -110 -192 164 -187 34 74 203 -18 -233 111
2333 111 -280 -57 271 -109 155 97 -9 -45 122 47 -27 -193 -61 37 9 -124 199 -61 43 132 141 -46 -67
2356 -67 -119 -240 41 391 -23 153 -90 -53 132 -118 -102 -76 -187 -282 170 103 31 -14 299 29 8 -185 103
2379A03P1k88J09M3J5k24L13o9j34p5N3J56j14K6K31p0n4l10K34Q7l78L87R0m58
2403b56j19J91j6K05J93k16r2K18l59M63k34N6l4J78k59P9J25o0J43K2k79J10
2425E9j84J41J59l35K18j51M54j74l39J5J40K1R2j60J88J4j66n1l70N40N4n17
2447c52N09J39k93K6J54j26J19k52m8n2R9R7J5j95R7J80J56k86j00m1J93j35K4
2470g2J45k08M11m81Q5L26k17M0j82M2M1m1J94j46J34O6K4j58K57k84M6j32J22
2493A2l5l93M85k36J33j46l26L71N7K96k42j00K07n2k31%l2M64j62j36R8JM2j08
2517c3L2O3J50q5j05q6J09l24O32n66K28o2p2P8r8J27J69j92o0j0J55J20j56j00
2541h6J84j4k15k19J75J89l37J74r3P1K00j42K17j14K09k18J22j82j70J73j80
$$ plain form
2379 103 174 -114 -5 38 53 -171 142 73 -61 -136 -83 73 -41 -15 216 146 92 -218 16 103 -275 112 202 -256
2403 -256 -375 -184 -200 5 198 -18 -110 108 -251 212 -22 34 0 178 -81 -2 123 63 206 228 -51 59
2425 59 -125 16 175 -160 58 -93 361 187 -152 -137 3 24 116 -44 144 158 -8 -59 -429 111 165 -352
2447 -352 157 296 3 29 183 57 176 -76 -124 -176 -77 20 35 -160 -63 117 273 -13 -113 -154 39 -96 -72
2470 -72 73 -135 276 -205 -120 206 -11 29 -153 -111 -70 -111 83 -63 71 137 161 3 260 -24 22 -110 12
2493 12 -23 -416 69 -167 -34 -180 -506 -135 -78 218 -24 -124 83 31 -200 -200 -232 232 70 -66 32 33 75 -33
2517 -33 -1 62 212 127 22 -64 45 -279 353 -213 15 -47 -119 -41 -139 -12 157 -35 -95 -105 50 170 14 -86
2541 -86 98 84 -131 -350 -175 14 -323 -149 -242 -171 29 -113 104 -10 199 -19 103 -79 -249 -76 -256
2562b56L19q2O2j20q1L5K7P7M4L3k54Q4K36o7j76j20N07j11j65O1k33K15j87J09
2586d3j43J04l1J3M4J91K09l90J37pJ97j20k52r7L38j93NJ14j34r7J61J49k92
2609a37K96k55O4Q6j77Nj51L50j12on6P4M2J72l15J52j28J48J65k84J59k70l3
2632b11M27m2n69J00L17j6lj33Q7L1J96j86J67qj94K02j34M7j38k4K12P1l23k5
2656a49L51k86q2L70j33K6R0k09J60l41J52j9K7K64j78j78K0L99l35l17K32oO0
2679h2p2J24R6o6o0K06j89p4J28j94M06k30j21N5K72n19L58r9K35k02j74K40L1
2702F9J38l83M14j62L3k37L5J58N5N3k01J25j88j44M70j67o6j18J22P8K2j70j25
2725a89J54K89l01N0J58j96J61j52K7j29J33K44j42k38QQ4k8k37J90n0M2J16J0
$$ plain form
2562 -256 63 -19 43 -77 -158 -123 -96 -19 25 58 -196 -112 124 57 -119 -239 268 157 -8 53 -180 35 -152 -43
2586 -43 -186 -82 -113 -100 -56 135 344 -46 91 84 281 161 -91 -188 150 -43 -38 76 -58 -155 6 155 -137
2609 -137 159 -96 -32 54 -123 -118 -269 81 -31 -37 -93 -19 23 195 -120 32 -96 52 217 -67 92 -178 -211
2632 -211 216 174 -395 -295 22 6 3 -130 -43 -12 184 -2 165 157 -37 165 31 78 -60 -84 128 199 -124 -149
2656 -149 202 -84 -166 204 71 97 187 -22 138 -203 -51 -70 -43 221 43 -135 -115 284 -51 -368 -136 -142 -82
2679 -82 -154 -30 66 0 -60 146 -43 -117 11 -183 223 -7 -128 -73 199 -320 38 -61 174 -28 -202 38 69
2702 69 207 -176 238 76 109 -128 -93 65 120 173 -28 97 -91 -235 235 68 2 -116 6 84 106 -64 -189
2725 -189 -35 254 -47 3 161 -35 126 -26 1 -128 5 249 107 -131 -123 -39 -67 -304 -114 -164 -122 -6 4
2748DQ5J05j04j60j16K35j46J54J30j72N4J24k60pm7j24L18j40J42k32L79k18
2770Dj75M23k10P3K26l61J02j24m0J65k03M53l06j34k4L56k1j32n3J06k11J2K2
2793e2J41l08L59n4L1J9j97J72k77O2P9k53L11j4k97J59K12k64q1M12j10nJ10
2816A55j51j62J02J36k35K70p4l35L85j80R7j90J20j89K71k79K19j06rK62l4k27
2838a54mL21l5k36K13k85K25J0J3l4j41j38N05o4m05P5J19o5q8j6M6M85n86K19
2862b0q1J52J75o5K22j19k81J9J57j64K90l72l3J80K11n9j17J94p1O5l73j47J08
2885a29j08M50j51Rq0J91q6k12J33l8J35Q5k69J58m48J87K00K2n6k58J36k54N49
2908A66o5n10L96J87r7k07j4K02k5J34k78K97m6K22k53k19j12L95j50N5K38n13
$$ plain form
2748 4 89 194 90 -70 -186 49 -97 57 187 15 69 193 -67 -74 -121 -245 73 -67 75 -157 222 4
2770 4 -171 252 42 115 341 -20 82 -42 -82 83 -120 333 27 -107 -131 225 204 72 19 125 -86 -74 -52
2793 -52 89 -219 140 86 117 136 -61 111 -166 -104 -25 -278 33 19 -278 -119 93 -171 -252 160 50 45 155
2816 155 4 -158 -56 80 -155 115 41 -294 91 -89 8 -182 -62 -251 20 -259 -40 -146 -155 107 73 -154
2838 -154 -158 163 128 -108 105 -180 45 55 68 34 -107 -245 260 196 -209 -134 -15 -80 -168 -184 -138 347 -239 -20
2862 -20 -101 51 226 161 383 264 -17 2 159 -5 285 -87 -120 60 271 212 95 289 218 283 -90 -237 -129
2885 -129 -237 213 62 71 -9 182 96 -116 17 -21 114 199 -70 88 -360 -173 27 49 -7 -265 -129 -383 166
2908 166 101 -409 -13 174 77 -130 -144 58 33 167 -111 186 140 362 109 -110 -222 173 23 78 316 -197
2930a97k1R8J31j97J10N2o6J78k03R7k39J98J15k66J79N3j41qQ8J9k57M10j85
2953e2j42o3L76Q7k68P2J59l95J94j06J40l7p0K88k27J49k26M17k93K59k61q0
2975g9N6J77k65P9m8R3k54J8K07l29K02L14ok56K86q8q4qJ76k35Q9k00R8Q7l3
3000cO2l2P6l64M58k18l8P2O7l45N08j1r8l58r1L72J33l39R4k8M0R3M9ok49L41
3026A85o1l44L64k60J64O9j64r5j34K63j5J25l89L99m08M02k48J73j47p2M8m5
3048a90K68N8K5j00k10j6L42m11J55K9Q3j38p9J30m9J33N8j44L1M27j09k15k27
3071a49K63m68L24J09o9M5j20K3M1P4qj9N5K15k54k10L21j66K3j84K81m79M21
3094F9K05j86j62O9j83RL5K48O2j32q0M3P9M3k71L9K43k13L9k6J79k31J93k5O5
$$ plain form
2930 -197 -218 -120 11 -186 -76 -24 -90 88 -115 -18 -257 -59 56 -210 -31 22 -119 -127 -39 -20 -277 133 -52
2953 -52 -194 -257 119 206 -62 10 169 -226 -32 -138 2 -35 -105 183 -44 105 -121 296 3 262 1 -79
2975 -79 -23 154 -111 -32 -80 13 -241 -223 -16 -345 -143 171 165 -91 195 107 23 15 191 -44 45 -155 -57 30 -3
3000 -3 59 27 103 -261 197 -21 -59 13 80 -265 243 232 134 -224 -315 57 190 -149 -55 -83 -43 50 99 93 -156 185
3026 185 124 -220 144 -116 48 117 -47 -142 -276 -13 -28 97 -292 107 -301 101 -147 26 -121 -193 -145 -190
3048 -190 78 136 161 61 -149 -165 177 -234 -79 -50 33 -105 -184 -54 -103 30 88 -56 -25 402 293 78 -149
3071 -149 114 -354 -30 79 10 55 -65 -42 -1 73 65 46 101 316 62 -148 173 7 30 -154 127 -352 69
3094 69 274 88 -74 -5 -188 -179 -144 104 166 34 -46 -3 76 119 -152 -113 130 -83 -44 -70 109 -122 71 46 111
3119A11j40J76j20k9l09j0M56l34K29k5K98l83J1M0J28j65j87J05o8K49Om0k44
3142b45J13K12Q2n40R8M92p2j62k21K44q0o2K36P5Pl47k23K51J53j06J39Q5k02
3165g3K29k18J13j94p1L39j73k19M70m57J72K11j60J20j58O9j55K42O8l37K25
3186D3j63K55k26Q2K00k03J53l56O1r3J90q2NP3J35k64J02o7Q3K39k14K14j68
3209ar1mK4r3L55n1K1j3q6j5J28n02N76j69j52J44L48l98j12J22j00K86k02J66
3233A81j83j31j8J04j06J34l8k7K14j44J00j72N8K11%q9k1N0j67O4p9k21L28n8
3257a0m9L92m29K21j33J00j52J81j1K4k96K46o4n4J91l71J29L52k93J41m37M60
3279A38O2l04N0K08l85N22k67Q0Q4k85Q3J33l93O23k29J12l81K63p7k0R6k16L6
$$ plain form
3119 111 -29 147 27 -2 -311 -321 135 -199 30 5 303 -80 -69 -29 99 -66 -253 -148 -216 33 39 -1 -245
3142 -245 -132 80 162 -378 -280 212 140 -22 -243 1 -79 -141 95 170 177 -170 -393 -142 11 -95 44 129 -73
3165 -73 156 -62 51 -143 -214 125 -48 -267 203 -254 -82 129 -31 89 -69 0 -155 87 155 -182 43
3186 43 -120 135 -91 -9 191 -12 141 -215 -154 -247 -57 -139 -134 -61 74 -190 -88 -155 -72 167 -47 167 -1
3209 -1 -92 -96 -72 -165 190 139 160 147 61 46 174 -328 248 79 -73 71 419 21 -91 31 -69 217 15 181
3233 181 -2 -133 -151 -47 -153 -19 -57 -84 130 -14 86 -86 -28 183 183 94 73 123 -44 20 -59 -280 48 -10
3257 -10 -59 333 -96 125 -8 92 -60 121 110 134 -162 84 20 -34 157 -214 -85 267 -26 115 -322 138
3279 138 200 -104 -54 154 -231 291 24 104 188 -97 -14 119 -274 349 120 232 -149 114 37 17 113 -103 -67
3302f7j28K47k38j22J12J53p2J61K1j10mq3M00m06l0K61j02j15K73l40K11K4O2
3325A08k80L18l11K7L87l40KP3J39K7J21l08J15J77l41j0j96L63k55J10K79l24
3347a19N0R9L2K9L6kR8k51k2K50M7j85j07R9k37M1K54k08r9L74k00k7M2M2J68
3372B04k48Q7K5k4k19L54jJ4j84Pj66J11o8r5J62j59K21r0o5K25j23J4P1j53O6
3397c4Q9j52J95q8P4O4j99J22j60R0k34K51J5J42J69l68Q9P7l1o5j38l5j2J32
3421gQ5n8k21L18j43L8l30K47J14m08J26L41j55o5L11l95L17l20J38J9n6l6K19
3444G9k87M79k05j46K29k12k2N9l1R8k12j45K64J13K1K4k95M61j22j28J58k42
3466f2pJ13j43q8L74n2r9O4J68m48K49J18j83K45n33M90k59n8n0M96l69J26j27
$$ plain form
3302 -67 -195 52 -186 -308 -196 -43 -115 46 67 -43 -47 -130 270 -136 -166 95 -7 -122 151 -189 22 46 108
3325 108 -172 146 -165 -138 249 -91 -89 -16 123 150 271 -37 78 255 -86 -96 -292 71 -184 -74 205 -119
3347 -119 -69 30 62 91 127 125 223 -28 -50 200 247 62 -45 54 -183 -142 112 -96 -195 179 -21 -48 -6 36 204
3372 204 -44 43 68 44 -175 179 178 192 8 15 -151 -40 -108 -203 -41 -200 21 -69 -134 91 -32 -18 53 -100 -34
3397 -34 55 -97 98 10 84 148 -51 71 -89 1 -233 18 33 175 344 -24 65 142 111 46 -92 -127 -139 -7
3421 -7 78 20 -201 117 -26 12 -318 -71 43 -365 -239 102 -53 -118 193 -202 115 -205 -67 -48 -104 -140 79
3444 79 -208 271 66 -80 149 -63 -85 -26 -57 41 -171 -316 -52 61 82 106 -189 272 150 22 180 -62
3466 -62 -69 44 -99 -187 187 135 36 100 268 -180 69 187 4 249 -284 206 -53 -111 -161 335 -34 92 -35
3489c5L0j29J76j59J07J18j2O5N8k98M6J99k74L6k9L19j65L0K16l01N2L53o83
3512b80M11j30K12m42L98k69j43J12J56JJ00o4m2J20k90K46l33K66l7J5P5K21
3534C03m62M8M3mk5M1j11J76K09l03R4r4J49p6o4J10j33L77l96j12L12J21o6j74
3558c7K33l59K09J69r2J57n1k96M6P2j26j50NK30p0P2r6j85L64Q2j64J05l2k23
3582a37L02j95o1L3K08q6n8q1m1j32k1O9K97K91k49j82mmm7J95J1l0j95q4Q6j29
3608b44J2L41m24L13K4k89N09l03j9J65J81l29j60K76J20k71J85k65K58%N8j49
3630a1J1k17M42k25mj9p9J39m7J16k49L76j53K26l15o5k1K06k62L26n89nJ45L12
3654C8K5q7J25J22j85Q1nj78L02j70M3j2j46R3j43J40K70l82P7j42L22P1k90L75
$$ plain form
3489 -35 -5 -134 42 -117 -10 108 96 161 219 -79 -33 166 -108 -72 -101 218 53 83 299 -2 50 403 -280
3512 -280 131 1 213 -229 169 -100 -243 -131 25 26 126 62 20 140 -150 96 -237 29 -8 7 82 303
3534 303 -159 -111 -68 -72 -97 -56 -167 9 218 -85 9 -85 64 -12 -76 34 -99 278 -118 -230 82 203 137 -37
3558 -37 196 -163 46 215 123 280 229 -67 -21 51 -75 -225 -220 10 -60 12 -84 -269 95 177 13 118 86 -137
3582 -137 165 -30 -91 -58 150 64 6 -75 -116 -248 -269 -200 97 388 139 -43 -47 -51 -98 97 108 78 -117 -201 -115 -244
3608 -244 -232 109 -315 -2 22 -267 242 -61 -80 85 266 -63 -223 53 173 -98 87 -178 80 80 138 -11
3630 -11 0 -217 225 0 -4 -23 -102 37 -10 106 -143 233 80 306 -9 -74 -95 111 -151 175 -414 -419 -274 38
3654 38 63 -24 101 223 38 119 114 -64 238 68 111 99 -47 46 -97 43 313 -69 8 -134 188 259 -31 344
3678C44l07O7r3m3K26r1l3J3j01Ko8j02L60p5r8j92L28m59M41mj17j04J03j3m3
3703e9j0J38O6l5j54K87j54p6m23N15O7j8l82J20K29k06J15j9j47L66j78j5j05
3726g8J18l9j19J3M7J05k08J96k51M21l93L45k38R8j01k51J98J41J46j57K75N1
3748C19m83P7K35k65L21j45r8k73J39J83J0P3j26J12P9k20J23NL6J37k95j50J22
3771h4J6J85J88l92nk6J40J58j9M3k32j39K51q7j44J14j34M28l55J50k16L8Q9
3794c3K86l5m75ML60j27j11N03l45j13RJ65No6k98K52K2J34j37j13K5L42l58N8
3818d6J22q9J41n6R8k08j28r4L90q5k55L34lL3Q6j30j16j24N5J17j9l0J90L1j99
3843A5J63L10o29K13k44J54k06R9K38j22K32l77K07k19K30j60K04j04Kj39j24
$$ plain form
3678 344 37 104 11 -32 194 103 70 83 -18 -16 -84 -186 174 99 1 -191 137 -322 119 115 -2 -106 -3 -16 -59
3703 -59 -69 69 135 100 -54 233 79 3 -420 95 162 144 -238 -118 111 -95 20 1 -146 220 42 27 -78
3726 -78 40 1 -118 -105 -58 47 -161 35 -216 205 -188 157 -81 17 -84 -335 -137 4 150 -7 268 319
3748 319 -164 -87 148 -117 204 59 -39 -312 -173 10 20 93 -33 79 158 -62 61 66 102 239 -56 -206 -84
3771 -84 -68 117 305 -87 -92 -118 22 180 161 204 -28 -167 84 -3 -147 -33 -167 261 -94 56 -160 -122 -33
3794 -33 253 218 -257 -253 107 -20 -131 372 27 -86 -77 88 93 27 -271 -19 3 137 0 -113 -88 254 -104 -46
3818 -46 76 -13 128 72 170 -38 -166 -260 130 45 -210 124 121 154 240 110 -6 -130 -75 42 23 -7 183 214 15
3843 15 178 488 -141 72 -172 -18 -224 -125 113 -9 223 -154 53 -166 64 -96 108 4 6 -133 -257
3864b57J29Q8Ll8R7l6L2J27j64M0J81k31p3N5L46m97J55q8J89l86M90J6j96O6
3888D8l4R7l68L52J86k54l2J07j79O3l2l69M99K32l31k1q4P0J28m6O9J35k0n87
3912c71J47K92J79k42j94K79k21K97o3l28k11K59J04j52L61k71K92k03q7K65n6
3933G6k06K01j13J01m8k00K28Pp8j11K63l85K49j84R2K99m53J54J66r9k77M65
3955A47l5J68j96j45K2J62K5k97O0K01o0j96J15%J43j1RK25n29L74j11j33q6j0
3979a58K89j4j62O3J11J7l44J33J07j01m2J94O8m29L72k50K28k29j91K54J60j77
4001a01J23j94K32j22L7R3o4O2p8j35K47j47K14k40j2K25k41j25K94j80R5m2k2
4024h1J01J9K4k37J51K2N6J65m83N32l8r8k47J97j75J71J68l31K80l43LJ26j18
$$ plain form
3864 -257 -128 -40 -37 -75 22 -14 18 145 -19 21 202 -29 -102 -47 299 -198 -43 -131 58 -328 162 178 -18 48
3888 48 14 111 -257 95 281 27 -5 102 -77 -14 -46 -415 84 316 -15 -36 -120 -50 78 32 101 236 216 -371
3912 -371 -224 68 247 5 -189 90 -131 166 103 -225 -436 -177 -73 -225 136 -135 157 -46 -133 132 76
3933 76 -130 71 -42 59 11 -189 39 46 -32 -143 120 -265 -16 -200 -108 191 -262 -108 58 -41 -318 147
3955 147 112 280 84 -61 -39 123 148 -149 -89 112 52 -144 -29 -29 114 103 112 337 -192 182 71 -62 -148 -158
3979 -158 131 117 -45 18 129 146 -198 -65 42 -59 -101 93 161 -268 104 -146 82 -147 -338 -84 76 -101
4001 -101 22 -172 60 -62 -25 68 4 66 -12 -147 100 -47 167 -73 -85 140 -101 -226 68 -112 -17 -59 -81
4024 -81 20 39 63 -174 -23 -1 55 220 -263 269 231 133 -114 83 -92 79 247 -84 196 -147 -144 -18 -136
4047a36K80j25j10O8k9K58m9n13R3K17l01P2O8J81K70L4p5l77J21j38J60L66l45
4070a0J51o61Q97l38l81N11j38j44L76n99L24K43k28Q3q8j60K00j54K09r4r1j
4092i3m8j86J71K29j77J22m9J6n0L51k36l7J3j23P1R2J90k83J38l10M05O9l88
4115a13L16j62k62J44J45k72l69P35P3k73N6Q2j44K3K36n7j68R0j28J71j48m45
4137d70L68l7M26q2k90J36o7K5M2l11R5J92P5n8n4J79k75J81J93k09k70k4M46
4160B11j09m67O68o02K66K1J23j74m1M7Q6R8k86j1j58M45k23j0P4MJ25R8k67J47
4184F5k42n4J47L6j11K59m19O35k29K7kl02K82j69J92q2M2J41j32k56K39N9J25
4207B51l88K76k97M9K01k04k13M07j03J75j81J41l41O4J48j69K18k43M06k44m6
$$ plain form
4047 -136 144 19 -91 -23 -52 206 157 -356 -263 -46 -347 -275 -207 -26 244 278 203 -174 -53 -191 -31 335 -10
4070 -10 141 -520 377 39 -342 169 31 -113 263 -336 -12 231 3 86 -2 -162 38 -116 93 -1 -92 -93
4092 -93 -141 -327 -156 73 -104 18 -31 -15 -65 286 50 13 26 -97 -26 66 256 -27 111 -199 206 275 -113
4115 -113 203 41 -221 -77 68 -204 -573 162 235 -38 18 100 -44 -21 215 158 -10 80 -48 123 -25 -470
4137 -470 -102 -139 287 205 -85 51 -16 9 51 -260 -165 27 102 44 -10 169 -106 75 268 59 -211 -235 211
4160 211 102 -365 303 -299 -33 -12 111 -63 -104 -57 29 127 -159 -170 -328 117 -106 -116 -42 -38 87 185 -82 65
4184 65 -177 -231 -84 -48 -159 100 -319 316 87 114 112 -190 92 -77 115 33 75 216 84 -172 67 126 251
4207 251 -137 139 -158 -109 92 -112 -325 82 -21 154 -27 114 -227 -163 -15 -184 34 -209 197 -47 -93
4228i3p4j47L88j18R4J30k3l25J6J23j19J22J68p9j41K32M5j34O1J60l63J28Q2
4251A33q8l03R1K17J5R1j02J3j85J74J96j99q7J74j73J06l1L4N9Mj32j14J37j96
4275a66L18k09o8J58K3R2j06n13N56m0P6j36J4K28m97J83J48k96N8j29L36J37
4297A67j75K21l81N4J48k1k04K00P9j25k0J09pk6P7k69N8K5P2N9L59l84l6O5J75
4322B20k10p5j61K93k90J73J93j71J55j64J07l22J83K40j10j61K00l71M90l85
4342a66j48L74j5m4k50M30k94K7k2j42M08Nk05l5K89Oj09k27J61j69K97k88J56
4365C9K13k44p0p9J73n5j15J06l29J9M47l25J6K78k08J6M3J05p9L96l25jM0j88
4389a27L01j95k3q4K43k10o0l3j41M75k40Q7J01j34J23j2l7K5M7j44K14k01o2
$$ plain form
4228 -93 -167 -314 74 -44 50 180 157 -168 -152 -29 -148 -26 142 63 -78 154 199 65 126 286 -77 51 133
4251 133 45 -258 -167 50 65 156 54 67 -118 56 252 53 -34 140 -33 73 42 76 135 139 7 -107 30 -166
4275 -166 152 -57 -125 33 56 148 42 -471 85 45 121 -15 -1 227 -270 -87 61 -235 -177 -306 30 167
4297 167 -8 213 -168 -114 34 13 -191 9 88 -37 -57 52 45 19 96 -173 -115 -90 -18 41 400 16 -20 45 220
4322 220 10 -65 -226 67 -223 -50 143 -28 127 -37 70 -252 -69 171 61 -100 100 -271 219 -166
4342 -166 -314 60 45 1 -249 181 -113 -86 -108 -250 158 163 -42 -77 212 218 109 -118 43 -126 171 -117 39
4365 39 252 8 -62 -141 32 -23 -138 -32 -361 -342 105 -220 -204 74 -134 -118 -75 30 -49 347 22 21 61 -127
4389 -127 174 -21 -44 -128 115 -95 -155 -188 -329 146 -94 -7 94 -40 83 71 34 59 106 -38 176 -25 -87
4412h7O9j4m7J17m4pr5J11k5M3q6K6O7p5p9o1L05j95k26K02J52j20k52P58l83
4437E4K21j95Jn8O3P4j02k79Q0L46m14L65j09j01J69j04k78K30ML5N3k42K03P1
4461H7k97N18m95M77k38j35J95J26l67j03J05K74k80o0L40l07k22L89J27j7p6
4482D1j4oM5J73n37K02J24oj77J71l57K82k19K60J97j52l94O24r3k48K58L6m3
4505A67k89K31l67L02Q7k90P7J1o8R2K42j45j96M72n3j13N4l43K93j30k7K31j9
4528B19j71p7l87K52J68o2m2NR2J45l65L6K48n8K64l85K68q5Q9k57n2J52K24j07
4552A14k92K49O1l26K77lj93J47k25J53J6K07k23L8rk00J42J31j50K45r8J7q6
4575hJ23k49L09J41l12r3J29k98K03J30j17J23l73M35j55j52M41j4k30K75l43
$$ plain form
4412 -87 -18 -32 -79 38 -6 -13 -108 3 -22 21 -65 -39 28 -47 -126 -187 118 -77 -303 -101 51 -69 -321 437 54
4437 54 275 80 81 23 86 160 58 -221 -141 205 -209 156 47 -54 115 11 -267 -37 -33 2 55 -187 16 87
4461 87 -210 308 -187 290 52 -83 112 238 -129 -232 -127 147 -133 -193 147 -160 -382 7 134 117 41
4482 41 27 21 66 239 -298 -96 28 22 -155 16 -341 -59 -278 -18 179 27 -367 257 164 -84 174 210 167
4505 167 -122 109 -258 44 131 -159 -82 -71 -139 -47 195 50 -146 326 273 160 214 -129 164 34 7 238 219
4528 219 48 -29 -416 -164 4 -58 -100 -95 -3 142 -223 -187 61 3 267 -118 150 65 154 -103 -155 -3 221 114
4552 114 -178 71 132 -194 83 80 -113 34 -191 -38 -22 185 -38 0 -9 -209 -67 64 -86 159 61 78 -8
4575 -8 115 -134 175 316 4 -89 40 -258 -55 75 -42 81 -292 143 -12 -164 277 263 33 308 -35
4596c5n3L16k69K13k29J9Q4k2k06p7%J95J85J35k65j39M2p4k26M48o3mP6j82K55
$$ plain form
4596 -35 -88 228 -41 172 -57 -38 46 24 -182 -259 -259 -64 121 256 -9 -148 -106 -180 -406 42 -21 -25 51 -131 124
$$ [...]
8191H6
##END NTUPLES=NMR FID
##END=
