##TITLE=1H_EC-3189(52)
 CDCl3, 8 sc, 
 22.10.2019
##JCAMPDX= 6.0         $$ Bruker NMR JCAMP-DX V2.0
##DATA TYPE= NMR FID
##DATA CLASS= NTUPLES
##ORIGIN= UXNMR, Bruker Analytische Messtechnik GmbH
##OWNER= root
$$ XWIN-NMR		Version 3.5
$$ Tue Oct 22 14:59:59 2019 Russian Standard Time (UT+4h)  she@DPX200
##.OBSERVE FREQUENCY= 200.1315
##.OBSERVE NUCLEUS= ^1H
##.DELAY= (6, 6)
##.ACQUISITION MODE= SIMULTANEOUS
##.ACQUISITION SCHEME= undefined
##.AVERAGES= 8
##.DIGITISER RES= 18
##SPECTROMETER/DATA SYSTEM= spect
##.PULSE SEQUENCE= zg30
##.SOLVENT NAME= CDCl3
##.SHIFT REFERENCE= (INTERNAL, CDCl3, 0, 15.7039)
##AUDIT TRAIL= $$ (NUMBER, WHEN, WHO, WHERE, WHAT)
$$ ##TITLE= Audit trail, XWIN-NMR		Version 3.5
$$ ##JCAMPDX= 5.01
$$ ##ORIGIN= Bruker BioSpin GmbH
$$ ##OWNER= she
$$ F:/spectra/data/she/nmr/H-F/1/audita.txt
$$ ##AUDIT TRAIL=  $$ (NUMBER, WHEN, WHO, WHERE, WHAT)
(   1,<2019-10-22 14:58:56.15 +0400>,<she>,<DPX200>,
      <created by zg, POWCHK disabled, PULCHK disabled
       configuration hash MD5:
       00 E9 B6 7A A2 85 ED C7 34 08 36 98 17 FE 4E 26
       data hash MD5: 16K
       F2 6C 4C 22 B6 42 54 21 1C 53 33 04 54 CE CD F7>)
$$ ##END=
$$ 
$$ hash MD5
$$ 33 83 AF 25 B4 86 35 34 A5 5C 4F E7 24 21 DA 18
##$RELAX= 
##$RELAX= 
##$RELAX= 
##$RELAX= 
##$RELAX= 
##$RELAX= 
$$ Bruker specific parameters
$$ --------------------------
##$DU= <F:/spectra>
##$EXPNO= 1
##$NAME= <H-F>
##$PROCNO= 1
##$TYPE= <nmr>
##$USER= <she>
##$AMP= (0..31)
100 100 100 100 100 100 100 100 100 100 100 100 100 100 100 100 100 100 
100 100 100 100 100 100 100 100 100 100 100 100 100 100 
##$AQSEQ= 0
##$AQ_mod= 1
##$AUNM= <au_zg>
##$AUTOPOS= <>
##$BF1= 200.13
##$BF2= 200.13
##$BF3= 200.13
##$BF4= 200.13
##$BF5= 200.13
##$BF6= 200.13
##$BF7= 200.13
##$BF8= 200.13
##$BYTORDA= 1
##$CFDGTYP= 0
##$CFRGTYP= 5
##$CHEMSTR= <none>
##$CNST= (0..31)
1 1 145 1 1 1 1 1 1 1 1 1 1 1 1 1 1 1 1 1 1 1 1 1 1 1 1 1 1 1 1 1 
##$CPDPRG= <>
##$CPDPRG1= <>
##$CPDPRG2= <>
##$CPDPRG3= <>
##$CPDPRG4= <mlev>
##$CPDPRG5= <mlev>
##$CPDPRG6= <mlev>
##$CPDPRG7= <mlev>
##$CPDPRG8= <mlev>
##$CPDPRGB= <>
##$CPDPRGT= <>
##$D= (0..31)
0 1.2 0 0 0 0 0 0 0 0.06 0 0.03 0 0 0 0 0.0002 0 0 0 0 0 0 0 0 0 0 0 0 
0 0 0 
##$DATE= 1571741935
##$DBL= (0..7)
120 120 120 120 120 120 120 120 
##$DBP= (0..7)
150 150 150 150 150 150 150 150 
##$DBP07= 0
##$DBPNAM0= <>
##$DBPNAM1= <>
##$DBPNAM2= <>
##$DBPNAM3= <>
##$DBPNAM4= <>
##$DBPNAM5= <>
##$DBPNAM6= <>
##$DBPNAM7= <>
##$DBPOAL= (0..7)
0.5 0.5 0.5 0.5 0.5 0.5 0.5 0.5 
##$DBPOFFS= (0..7)
0 0 0 0 0 0 0 0 
##$DE= 6
##$DECBNUC= <off>
##$DECIM= 24
##$DECNUC= <off>
##$DECSTAT= 4
##$DIGMOD= 1
##$DIGTYP= 9
##$DL= (0..7)
0 120 120 120 120 120 120 120 
##$DP= (0..7)
150 150 150 150 150 150 150 150 
##$DP07= 0
##$DPNAME0= <>
##$DPNAME1= <>
##$DPNAME2= <>
##$DPNAME3= <>
##$DPNAME4= <>
##$DPNAME5= <>
##$DPNAME6= <>
##$DPNAME7= <>
##$DPOAL= (0..7)
0.5 0.5 0.5 0.5 0.5 0.5 0.5 0.5 
##$DPOFFS= (0..7)
0 0 0 0 0 0 0 0 
##$DQDMODE= 0
##$DR= 18
##$DS= 0
##$DSLIST= <SSSSSSSSSSSSSSS>
$$ [...]
##$SUBNAM2= <"">
##$SUBNAM3= <"">
##$SUBNAM4= <"">
##$SUBNAM5= <"">
##$SUBNAM6= <"">
##$SUBNAM7= <"">
##$SUBNAM8= <"">
##$SUBNAM9= <"">
##$SW= 24.0689530833862
##$SWIBOX= (0..15)
0 0 2 0 0 0 0 0 0 0 0 0 0 0 0 0 
##$SW_h= 4816.95568400771
##$TD= 16384
##$TD0= 1
##$TE= 0
##$TE2= 300
##$TE3= 300
##$TEG= 300
##$TL= (0..7)
0 120 120 120 120 120 120 120 
##$TP= (0..7)
150 150 150 150 150 150 150 150 
##$TP07= 0
##$TPNAME0= <>
##$TPNAME1= <>
##$TPNAME2= <>
##$TPNAME3= <>
##$TPNAME4= <>
##$TPNAME5= <>
##$TPNAME6= <>
##$TPNAME7= <>
##$TPOAL= (0..7)
0.5 0.5 0.5 0.5 0.5 0.5 0.5 0.5 
##$TPOFFS= (0..7)
0 0 0 0 0 0 0 0 
##$TUNHIN= 0
##$TUNHOUT= 0
##$TUNXOUT= 0
##$USERA1= <user>
##$USERA2= <user>
##$USERA3= <user>
##$USERA4= <user>
##$USERA5= <user>
##$V9= 5
##$VALIST= <valist>
##$VCLIST= <CCCCCCCCCCCCCCC>
##$VD= 0
##$VDLIST= <DDDDDDDDDDDDDDD>
##$VPLIST= <PPPPPPPPPPPPPPP>
##$VTLIST= <TTTTTTTTTTTTTTT>
##$WBST= 1024
##$WBSW= 4
##$XGAIN= (0..3)
0 0 0 0 
##$XL= 0
##$YL= 0
##$YMAX_a= 412917
##$YMIN_a= -434901
##$ZGOPTNS= <>
##$ZL1= 120
##$ZL2= 120
##$ZL3= 120
##$ZL4= 120
##$ABSF1= 10
##$ABSF2= 0
##$ABSG= 5
##$ABSL= 3
##$ALPHA= 0
##$AQORDER= 0
##$ASSFAC= 0
##$ASSFACI= 0
##$ASSFACX= 0
##$ASSWID= 0
##$AUNMP= <proc_1d>
##$AZFE= 0.1
##$AZFW= 0.1
##$BCFW= 1
##$BC_mod= 2
##$BYTORDP= 1
##$COROFFS= 0
##$CY= 11.3945322036743
##$DATMOD= 1
##$DC= 2
##$DFILT= <>
##$DTYPP= 0
##$F1P= 20.1720416913024
##$F2P= 0.152960286110954
##$FCOR= 0.5
##$FTSIZE= 0
##$FT_mod= 4
##$GAMMA= 1
##$GB= 0.15
##$INTBC= 1
##$INTSCL= 1
##$ISEN= 128
##$LB= 0.24
##$LEV0= 0
##$LPBIN= 0
##$MAXI= 10000
##$MC2= 0
##$MEAN= 0
##$ME_mod= 0
##$MI= 1.114404
##$NCOEF= 0
##$NC_proc= 0
##$NLEV= 6
##$NOISF1= 3.799351
##$NOISF2= 2.8
##$NSP= 1
##$NTH_PI= 0
##$NZP= 0
##$OFFSET= 15.70392
##$PC= 1
##$PHC0= -9573.494
##$PHC1= 18.20086
##$PH_mod= 1
##$PKNL= yes
##$PPARMOD= 0
##$PSCAL= 0
##$PSIGN= 0
##$REVERSE= no
##$SF= 200.130013532006
##$SI= 16384
##$SIGF1= 3
##$SIGF2= 2
##$SINO= 400
##$SIOLD= 16384
##$SREGLST= <1H.CDCl3>
##$SSB= 0
##$STSI= 0
##$STSR= 0
##$SW_p= 3612.71676300578
##$SYMM= 0
##$S_DEV= 0
##$TDeff= 0
##$TDoff= 0
##$TI= <>
##$TILT= no
##$TM1= 0
##$TM2= 0
##$TOPLEV= 0
##$USERP1= <user>
##$USERP2= <user>
##$USERP3= <user>
##$USERP4= <user>
##$USERP5= <user>
##$WDW= 1
##$XDIM= 8192
##$YMAX_p= 0
##$YMIN_p= 0
$$ End of Bruker specific parameters
$$ ---------------------------------
##NTUPLES= NMR FID
##VAR_NAME=  TIME,          FID/REAL,        FID/IMAG
##SYMBOL=    X,             R,               I
##VAR_TYPE=  INDEPENDENT,   DEPENDENT,       DEPENDENT
##VAR_FORM=  AFFN,          ASDF,            ASDF
##VAR_DIM=   8192,          8192,            8192
##UNITS=     SECONDS,       ARBITRARY UNITS, ARBITRARY UNITS
##FACTOR=    0.0002076,     1,               1
##FIRST=     0,             0,               0
##LAST=      1.7004516,     0,               0
##MIN=       0,             -434901,         0
##MAX=       1.7004516,     412917,          0
$$ Real data points
##PAGE= N=1
##DATA TABLE= (X++(R..R)), XYDATA
0 0 0 0 0 -8 8 -8 8 -9 16 -24 32 -32 48 -56 70 -80 97 -118 137 -161 192 -223 257 -296 342 -391 448
27 448 -506 576 -650 733 -823 922 -1033 1152 -1284 1429 -1588 1761 -1951 2162 -2392 2650
43 2650 -2934 3253 -3605 4006 -4462 4984 -5592 6307 -7164 8214 -9536 11257 -13604 17015
57 17015 -22445 32485 -57398 251791 297018 -23964 295698 316915 139580 201428 412917
68 412917 233965 74606 179916 228549 33431 22146 195221 226675 62979 7053 42841
79 42841 16831 -36540 35505 97498 26812 -46496 2884 17053 -48165 -48863 33287 53582 14722
92 14722 -7490 722 5814 -7031 -9169 48489 76288 -181 -29501 47814 20233 -78089 2743
105 2743 102000 -20800 -91406 31823 2811 -156830 -69908 74137 -61456 -163893 -16744
116 -16744 -3809 -183525 -150353 18883 -43151 -167446 -72353 10626 -108669 -157889 -15996
127 -15996 27692 -95066 -89263 48179 20738 -102678 -31195 96049 21884 -55515 45242
138 45242 87476 -9129 -1706 91651 62789 -6304 26969 66944 40340 15120 18489 38397
150 38397 47327 4021 -21645 31313 37365 -33857 -9854 62970 -212 -65033 20550 54532
162 54532 -43096 -36411 63243 31555 -41262 17674 70450 6246 -18314 53012 70457 14211
174 14211 19093 78863 64277 5298 32081 86253 40791 752 69644 86678 -5828 -9051
186 -9051 70833 35266 -31356 26941 58182 -24044 -36358 27378 2480 -51222 -15383 15339
198 15339 -20867 -40218 -23446 -15488 -19245 -27292 -22334 1219 -9314 -44500 -17817 24473 -11432
211 -11432 -33032 21170 25653 -34201 -20149 32700 10056 -22878 8460 27058 -6284 -25081
223 -25081 -2333 13684 -8335 -28071 -2452 13359 -32054 -49639 -887 -2822 -54974 -29343
235 -29343 13587 -35702 -65100 -10879 -6552 -54309 -32208 4961 -24085 -39350 -11321 -13081
247 -13081 -27825 -12273 -2342 -8341 -5054 -7099 -10133 2426 -182 -9023 8375 11129 -14747 -7735
261 -7735 13424 -7139 -16596 11090 2490 -25662 -7955 4095 -22155 -20494 1961 -9815 -24196
274 -24196 -15161 -15243 -18884 -10488 -13293 -15823 -5736 -14744 -24394 -1186 575 -25017 -6447 21259
288 21259 -9470 -26394 9368 11012 -15544 2781 19040 -6696 -10217 10681 5134 -4320 2591
301 2591 1208 1412 7400 -5881 -12643 5860 2692 -12230 3989 8970 -19033 -14616 10919 -4050
315 -4050 -17940 3148 3810 -10243 70 422 -15719 -3454 10373 -2756 -1833 9018 -5911
328 -5911 -9327 11483 4501 -10892 6596 14424 -3027 -1272 3138 -9321 -1770 12996 -405
341 -405 -6612 5640 -4903 -14309 4437 2805 -17655 -2559 11215 -11361 -15910 41 -7705
354 -7705 -13338 1471 -1577 -13723 -5168 -6067 -16522 -4200 -638 -17535 -9517 5161 -12948 -19875
368 -19875 -1250 -8431 -21918 -3844 764 -15745 -11072 -4290 -16896 -12980 -2503 -13844 -12974
381 -12974 2739 -9299 -19808 -1747 -4242 -21708 -5335 7853 -11414 -13913 1141 -7842 -13006
394 -13006 633 -1788 -8992 984 -1814 -10663 447 1304 -12883 795 13824 -6021 -10158 9009
408 9009 1108 -10111 8155 9665 -7698 2223 12920 -1311 -1592 9803 2560 4138 16758 6486
422 6486 -3073 11727 13130 2232 11909 15769 2459 8528 17878 5061 4089 16005 6654 3004
436 3004 18545 8806 -8538 8784 17467 -2832 -610 13605 -1095 -8829 7787 6149 -6708
449 -6708 -682 2946 -2452 -90 -4748 -10930 2987 5427 -11916 -4533 8327 -13444 -18974 9192
463 9192 3998 -21990 -5488 9554 -14489 -20889 -1506 -4737 -16321 -7862 -5272 -13447 -16300 -18208
477 -18208 -14668 -6646 -15539 -23266 -8615 -9955 -31471 -21285 -3626 -22558 -27507 -1983 -9216
490 -9216 -33452 -18243 -4395 -21690 -19023 -1630 -10594 -20174 -9323 -7839 -13654 -8609 -6843 -6201
504 -6201 -385 -6715 -14181 -1721 -1722 -15194 -1115 11800 -12335 -17674 8494 847 -22023 -2335
518 -2335 13715 -9445 -14118 6596 1248 -14450 -4978 8030 4138 -4382 -4515 6265 8720 -6221
532 -6221 -2609 20866 11144 -10664 11845 27727 -4409 -7507 31089 22840 -8985 10735 30806
545 30806 5838 -1598 21781 19780 2874 7742 18238 15663 6886 2576 12780 19808 3604
558 3604 -722 20995 16118 -7513 8176 27036 1553 -6569 24012 21248 -5384 7568 26094
571 26094 9330 1713 18989 22248 10628 9682 18323 21278 12067 6344 21306 27994 7018 5613
585 5613 29296 17600 -7641 15568 33851 1319 -4700 29308 17415 -14283 5570 25852
597 25852 1580 -6800 16462 14547 -5924 -4008 9953 11275 1499 -1434 11377 13931 -6754
610 -6754 -5683 19395 10660 -12713 8913 27283 -4273 -15619 16619 15728 -11378 222 19490
623 19490 2350 -12340 1067 8142 -3533 -11814 -2225 9337 -4554 -22253 -5720 7479 -18594
636 -18594 -23825 7918 447 -32484 -12166 11558 -20583 -32659 3682 3842 -26215 -14408 6016
649 6016 -11125 -21613 -4747 683 -10771 -11783 -1681 2787 -7830 -15943 -2610 6302 -10847
662 -10847 -13285 8536 1957 -20362 -5065 9607 -12864 -16791 9927 6420 -15880 -7623 6468
675 6468 -3740 -10153 -442 6692 3972 -2301 -337 9415 2896 -9560 10870 28549 3492 -5915
689 -5915 25169 22505 -8281 10383 37761 12549 638 31293 29873 -2396 5744 32021 23056
702 23056 9038 18805 26464 15485 5213 11488 22347 15243 5906 20372 27529 2036 -5247
715 -5247 19776 18328 -1736 11700 26798 5995 -2486 14205 11531 -798 9558 19506 12826
728 12826 6268 2839 2544 8209 6648 2381 13283 13813 -5752 -3332 11016 -4428 -14391 10758
742 10758 13543 -14200 -11207 5422 -12268 -21977 452 3019 -16409 -14148 -3216 -11611 -21637
755 -21637 -14926 -4733 -5494 -14820 -14768 -6231 -14140 -24420 -8008 4338 -14925 -19390 2110 -4399
769 -4399 -25700 -9937 6632 -9952 -13446 3113 -3649 -18107 -9310 -1129 -5409 -6315 -6191 -7751
783 -7751 -4257 -8056 -15047 -3952 2672 -11455 -10028 4458 -7073 -18339 124 6281 -10817
796 -10817 -7599 7103 -2024 -9208 1761 4706 -908 925 4362 3568 3454 1495 3776 11219 5605
811 5605 -1239 8362 10285 -2108 3260 15228 2393 -3704 12051 7963 -7879 2804 12069 -2249
825 -2249 -3028 8818 718 -8324 1238 3638 -3334 -850 884 -3431 -912 -1786 -5954 -402 2771
840 2771 -6146 -3276 5147 -5710 -11133 2716 2415 -10282 -3890 3494 -6961 -9052 -1163 -4768
854 -4768 -8829 -4492 -6471 -8840 -6921 -11342 -13207 -4500 -7823 -18049 -10251 -5241 -17961 -16550 -4400
869 -4400 -12183 -19884 -7730 -7181 -18508 -13096 -6203 -13480 -11687 -4820 -11068 -13077 -6010 -9235 -11869
884 -11869 -3454 -4161 -10924 -5231 -3434 -10635 -6521 -394 -7073 -6518 546 -6103 -9058 -256 -3030
899 -3030 -8847 -201 1095 -9255 -5035 2139 -5274 -5804 3112 -1073 -5686 1440 421 -4577 1356
914 1356 3262 -2632 3037 6574 -2409 -308 8789 2087 -1019 9125 6824 -1822 4755 8166 736
929 736 3619 8936 2726 1898 6791 1334 -141 7606 4190 -1251 5992 4971 -4563 1171 7432 -983
945 -983 -1191 6470 839 -4080 2984 2097 -2814 3712 4535 -3070 397 2529 -4614 -889 6681 -301
961 -301 -3773 4338 -209 -7049 836 2971 -3904 7 3595 -4638 -4601 1150 -3708 -4559 3232 -481
977 -481 -7056 -626 -1543 -8861 -2653 2652 -4964 -4641 1014 -5651 -7989 -908 -2834 -6655 768 238
993 238 -8130 -4210 -1026 -8178 -4448 3589 -3410 -6806 339 -2665 -8555 -2468 -644 -5077 -501
1008 -501 1030 -7063 -5664 -449 -4978 -3843 4230 -1873 -6929 1209 -251 -8528 -1278 4273 -3268
1023 -3268 -1950 3989 -2967 -6298 1239 666 -2451 3111 1251 -4324 1215 2617 -5074 -481 6175
1038 6175 -1025 -1860 5942 -251 -5858 3736 5054 -1409 3001 6100 -1350 104 5885 1091 458
1053 458 7350 4440 765 6317 4249 -1225 5531 8124 1661 4420 8116 804 1016 8112 4026
1068 4026 945 8424 6022 -1338 4390 6562 -1198 2669 8969 2105 -235 5327 1490 -2069 5220
1083 5220 4276 -1521 3595 4061 -3570 664 5747 -2354 -1473 7654 1706 -5085 2242 2837 -4648 1122
1099 1122 5746 -1919 -3136 1337 -1477 -3014 142 -2298 -2417 1289 -3181 -7098 -1699 -3597 -8424
1114 -8424 -753 1991 -9459 -8497 -430 -7328 -10967 -888 -2633 -9722 -3273 -1898 -10781 -8033 -1737
1129 -1737 -6709 -5160 488 -6239 -9733 -1870 -3576 -8908 -1197 911 -7477 -4411 973 -6836 -8205
1144 -8205 1020 -506 -5702 -808 -820 -6795 -4504 -739 -3434 -2351 -221 -3245 -2237 -1242 -5232 -2366
1160 -2366 2910 -2025 -3126 4813 -309 -6981 3042 6525 -4162 44 9861 90 -4069 7047
1174 7047 5515 -2822 4838 9247 743 1461 6366 1293 1035 7053 3615 1485 6641 3201 -1776
1189 -1776 4639 5686 -1435 2828 7737 614 -1630 4924 3085 -606 3468 3914 1278 2535 1995
1204 1995 1639 4215 1709 -891 5565 5855 -3074 1342 8612 -755 -3323 8376 4398 -5532 4035
1219 4035 8635 -4319 -2679 7694 862 -4782 4309 3686 -4561 -98 3632 -2569 -1613 2680 -826
1234 -826 -988 1878 -1557 -2062 2462 -130 -2375 3121 1767 -3368 1123 3880 -1718 -104 4587 1399
1250 1399 -126 2965 944 -193 3654 1280 211 5506 2522 -3400 4182 5828 -4145 392 9797
1265 9797 399 -4799 7607 4920 -6834 2162 9644 -746 -1865 7751 2925 -3539 2703 5011
1279 5011 121 2562 4738 2155 2331 1742 -476 3127 5081 612 2347 6035 -465 -2591 4519
1294 4519 2374 -2543 3683 4883 -1978 -1098 2065 -2073 -1702 3325 -89 -1127 2408 -2034 -5411
1309 -5411 1404 110 -5557 1366 4757 -6070 -5011 3572 -2957 -6960 4126 3808 -6163 -1588 3415
1324 3415 -4302 -5204 3193 1487 -2423 239 -96 -2794 -1626 -1850 -1517 2440 34 -3626 797 152
1340 152 -6360 -1151 5134 -2272 -4380 3343 135 -6751 135 3409 -3391 -1342 3600 -972 -2594
1355 -2594 1002 -1606 -962 3871 -550 -3057 3217 1602 -4391 2199 4659 -3685 -1326 6442 -286
1370 -286 -5087 3333 3316 -4018 -496 3093 -2379 -1808 2563 -499 -2380 -882 -2306 -1083 1544 -2322
1386 -2322 -2953 2705 -440 -5430 -86 1315 -5513 -904 5090 -2684 -5786 2261 438 -4979 556
1401 556 2619 -2913 -1042 2352 -2626 -3138 693 -868 -879 2313 -2007 -4526 1323 10 -4641 1045
1417 1045 2889 -4529 -1925 3535 -3341 -5524 2864 2027 -3388 588 2341 -3600 -1629 1817 -533
1432 -533 -90 2415 -800 -313 2965 -920 -1460 4982 2203 -2691 3603 4344 -3501 -95 6444 339
1448 339 -2057 4436 2098 -3071 2140 3367 -1729 741 2812 -849 155 1872 -2307 -855 4003
1463 4003 -293 -3222 3119 1275 -3558 2145 2934 -4266 -955 4546 -1133 -2842 2746 -5 -3022
1478 -3022 1723 1235 -3695 -293 1903 -2593 -1246 1171 -3152 -2610 1244 -2315 -4394 965 -1161
1493 -1161 -5809 -516 -346 -6707 -2957 2149 -4432 -5302 868 -2442 -6271 -866 -247 -5024 -1766 -157
1509 -157 -4291 -2412 14 -3436 -2139 1438 -2906 -3424 2198 -966 -5441 1143 2629 -3564 -1165
1524 -1165 2651 -2910 -3146 3022 -42 -2873 1482 938 -2256 1087 1215 -2591 1277 3924 -1570 -807
1540 -807 3942 -7 -1517 4842 2588 -1557 3593 4464 -964 1690 5049 734 1816 6520 2266
1555 2266 7 5002 3903 680 4729 5236 490 3400 5854 620 1650 5616 2135 1203 5815
1570 5815 2390 -1442 4047 4463 -1328 2373 5322 -240 -205 4507 1050 -1589 3529 2376 -923 2425
1586 2425 2198 -2028 1043 2689 -1807 43 3436 -1358 -2518 3183 -345 -3884 1547 1789 -4204
1601 -4204 -1210 1753 -3005 -2865 963 -2392 -3848 210 -2091 -5023 -631 -1556 -5901 -1534 -235
1616 -235 -5666 -3409 342 -4630 -5350 106 -2845 -6340 -753 -816 -5527 -2892 -384 -5224 -4054 -254
1632 -254 -3634 -4206 -76 -2486 -5427 -709 -1761 -5292 -1318 544 -4362 -2021 1306 -3916 -3953 1339
1648 1339 -1182 -4191 875 646 -4131 -1022 1873 -2281 -1514 2001 -697 -1806 1641 -713 -1923
1663 -1923 2631 1070 -2081 2466 2795 -2841 367 3999 -820 -877 4949 1959 -1971 2613 3184 -1317
1679 -1317 1183 4087 588 941 3252 439 896 3636 584 329 5021 2394 -1205 3400 3787 -1549
1695 -1549 1634 5473 -229 -1026 4400 1687 -1729 2657 2999 -1170 1303 2656 -1034 62 2401
1710 2401 -989 -167 2785 -1261 -2190 2369 131 -3274 1750 1665 -3832 -381 3001 -2950 -3197 2776
1726 2776 -167 -3703 268 577 -3121 -1317 759 -1988 -1301 299 -2575 -1469 382 -3251 -2325 1690
1742 1690 -2292 -4997 492 -392 -6243 -1706 2274 -4175 -4984 1181 -1693 -5987 -1174 -238 -4009 -1926
1758 -1926 -567 -3588 -2134 -1355 -3582 -1035 837 -3350 -2750 2275 -1812 -4700 1655 1829 -4198 -833
1774 -833 3645 -2181 -3574 1991 711 -2322 708 1508 -1103 -76 -50 -1217 912 1023 -1259 1380
1790 1380 2406 -2425 -624 4462 53 -2259 4355 3409 -3214 1578 5551 -992 -1051 5781 2934 -722
1806 -722 3249 3821 713 2225 3572 2137 3038 3029 632 3427 4282 -302 1601 6101 1127 -1527 4598
1823 4598 3808 -2700 1176 5361 -135 -1096 3697 1998 -1578 1342 1907 285 768 -67 -208 2329
1839 2329 266 -2576 1620 2823 -2987 -744 4757 -1595 -4581 2963 2672 -4877 -935 3804 -2147
1854 -2147 -3846 1700 -96 -3931 -571 136 -2073 -2071 -2099 -2282 -812 -2197 -4110 -696 -330 -4719 -2882
1871 -2882 1098 -4051 -5767 1080 -170 -5595 -1974 985 -3922 -3516 914 -1435 -3085 -14 -444
1886 -444 -2001 -767 -1984 -1579 1674 -245 -3448 1226 1932 -3923 -1382 4662 -983 -3910 3679 3131
1902 3131 -4365 -991 4337 -651 -1633 3181 2406 -1131 410 1774 1147 1580 817 1889 3691 1240
1918 1240 -975 3544 3954 -820 2456 6832 883 -1536 5160 3677 -1193 3121 6108 1117 1455
1933 1455 4589 1805 650 3223 2836 2491 4163 1859 197 3474 2007 -733 3700 4504 -931 394
1949 394 5114 329 -2902 3751 3864 -1814 1226 3767 -659 -1722 2182 1594 -46 917 627 751
1965 751 392 -1590 -347 2666 -437 -2649 2319 1498 -4436 -997 3556 -2303 -3743 2624 881 -4949
1981 -4949 -1265 1451 -2690 -2036 851 -1458 -2477 -433 -2019 -2347 -601 -2216 -2417 461 -1500 -4545
1997 -4545 -914 712 -4143 -2372 1604 -2366 -3913 779 -67 -4081 -1205 665 -2265 -1570 116
2012 116 -1797 -1330 146 -1738 -1022 649 -2011 -1489 2325 -917 -3237 1294 1432 -3438 -508 3692
2028 3692 -1604 -2572 3264 1646 -3213 471 2720 -946 -51 2391 432 -122 1335 519 711 2317
2044 2317 209 201 3381 1111 -1006 2690 2961 -956 1610 4632 313 -758 3816 2191 -493 2901
2060 2901 3449 440 1513 3096 810 1545 2791 368 1799 3718 758 212 3709 1621 -1100 2922
2076 2922 3810 -1183 1326 4064 -493 -1218 3743 1962 -1165 1894 2216 -952 394 1994 -317 653
2092 653 1858 -85 150 1340 -1026 -883 2258 226 -2010 1667 1187 -3192 -589 2154 -1952 -1875
2108 -1875 1835 -686 -3539 75 116 -2833 -633 -94 -2242 -1051 19 -2965 -1986 190 -2395 -2492
2124 -2492 684 -1613 -4459 -42 195 -3941 -1968 821 -2596 -2966 534 -1705 -3458 -662 -214 -3062
2140 -3062 -1234 -304 -2516 -983 -182 -2353 -1568 422 -1937 -2163 988 -1100 -2971 760 716 -3242
2156 -3242 -558 1535 -1922 -1726 2081 -356 -1972 1665 1053 -834 1105 1345 -810 1079 1747 -430
2172 -430 788 2795 213 127 3134 958 -968 2982 3219 -490 1603 3787 329 433 3823 1539
2188 1539 376 3188 2269 48 2222 2295 618 2219 3227 80 1176 3270 222 440 3795 1704
2204 1704 -62 2766 2249 -1287 1367 3308 -79 409 3030 496 -395 1867 812 -685 1782 1133
2220 1133 -842 607 876 -1615 29 1758 -1507 -1493 1570 -1074 -2913 721 -57 -3285 -570 1045
2236 1045 -2661 -1990 465 -1665 -2783 -35 -1108 -2813 -727 -1380 -3259 -1480 -473 -3502 -1499
2251 -1499 212 -3217 -2999 -39 -2152 -3523 -190 -524 -3365 -1529 -213 -3194 -2178 -63 -2394
2266 -2394 -2029 16 -1738 -2791 -87 -976 -2500 43 338 -3157 -724 663 -2580 -1632 1673 -483
2282 -483 -2289 1641 739 -2148 585 1776 -1295 -285 2189 -19 -396 1565 520 -233 1737 838
2298 838 -530 1698 1787 -911 1476 2974 -195 400 3429 679 -530 2549 2382 -581 2075 2757
2314 2757 17 1203 3024 935 926 2569 838 690 3270 1254 -447 2984 2518 -936 1757 3255
2330 3255 -848 185 3626 1160 -579 2452 2155 -772 1145 1993 -658 540 1578 13 120 1385
2346 1385 -375 -401 1499 -24 -1505 1457 871 -2244 228 1375 -1984 -1331 1683 -974 -2259 792
2362 792 -139 -2578 -576 231 -1834 -823 -90 -1836 -1541 123 -1646 -1990 412 -1750 -2645 185 -984
2379 -984 -3708 -719 841 -2883 -2323 776 -1667 -3361 -82 -166 -2675 -1174 52 -2009 -1261 -894
2395 -894 -2168 -1223 268 -1841 -1771 796 -1787 -2185 1025 -105 -3144 -68 1269 -2347 -1706 1645
2411 1645 -934 -1989 1083 303 -1767 305 521 -1310 126 1130 -468 638 1559 -832 -274 2173
2427 2173 -188 -1013 2847 1354 -1722 1446 2664 -995 144 3019 713 -630 2645 1499 -425
2442 -425 1125 2033 404 1326 1810 182 1081 2062 -397 647 2985 176 -237 2834 1622 -1556 1747
2459 1747 3048 -479 179 2749 654 -766 1929 1090 -591 1164 1077 -31 760 415 -1028 949
2475 949 1267 -1695 -753 1865 -1295 -2245 1489 -118 -3155 464 1309 -2609 -1937 1053 -1328 -2376
2491 -2376 242 -600 -2291 -411 -258 -1994 -597 -429 -2448 -652 -43 -2730 -1385 479 -2096 -2525
2507 -2525 687 -1022 -3854 -238 277 -3194 -2296 202 -1821 -2180 -95 -1236 -2454 -584 -978 -2134
2523 -2134 -278 -683 -2338 -145 -85 -2698 -1142 1158 -1821 -2280 1694 161 -2546 433 1784 -1606
2539 -1606 -614 2448 242 -518 1235 591 -547 1106 762 192 1718 1033 -337 1706 1711 -832 995
2556 995 2806 -60 -192 3142 1353 -1017 2074 2440 -131 1325 2744 148 278 2559 1037 761
2572 761 2575 1345 368 2533 1667 -287 2064 2581 144 1468 3335 204 -368 3108 1466 -980
2588 -980 2042 2400 -689 255 1865 -503 -333 1503 223 -331 774 -522 -908 570 -187 -1492 810
2605 810 652 -2086 -389 1441 -1992 -1753 1773 -136 -2353 600 828 -2507 -913 1260 -1221 -1114
2621 -1114 528 -985 -1292 55 -1377 -1778 192 -748 -2364 -54 -290 -2935 -1050 812 -2009 -2491
2637 -2491 359 -1062 -2951 -326 57 -2706 -1072 -95 -1925 -1365 23 -1708 -1130 522 -847 -1361
2653 -1361 880 -247 -1730 878 706 -2163 -145 1597 -1191 -1011 2006 82 -1766 1366 974 -1573
2669 -1573 372 1813 -679 -126 1187 -120 -472 1641 147 -229 1587 782 -966 1456 1326 -1067
2685 -1067 1048 2911 -351 -5 2531 806 -729 2162 2012 136 1484 2236 129 1130 2228 -214
2701 -214 1174 2571 541 -85 2094 867 -646 1745 1998 -1031 836 2286 -652 -577 2089 209
2717 209 -1142 1401 979 -1492 608 1048 -1337 -46 903 -819 -945 1118 -793 -1127 1018 -281
2733 -281 -1329 316 118 -2196 -584 828 -1936 -1295 918 -1354 -2647 242 -380 -2565 -1041 -501
2749 -501 -2337 -1228 -377 -2431 -1733 -315 -2030 -2636 -235 -1568 -2733 -247 -699 -3333 -1456 180
2765 180 -2459 -2150 482 -1585 -2529 -78 -820 -2724 -364 -96 -1743 -795 260 -2046 -1253 481 -1085
2782 -1085 -1568 1015 -328 -1964 578 194 -2003 236 1039 -1204 -449 1370 -460 -1025 1436 426
2798 426 -1015 1248 1257 -591 604 1439 -173 629 2013 -280 -147 2312 901 -329 2373 1475 -618
2815 -618 1630 2473 -443 630 2674 672 89 2480 1518 -202 1991 1844 27 1451 2213 306
2831 306 999 2090 205 422 2201 951 -393 1932 1752 -310 1342 1763 -449 392 1712 96
2847 96 -171 1910 244 -712 1396 582 -1142 928 1279 -1248 29 1028 -1305 -418 1536 -604 -1554
2864 -1554 909 -55 -1528 194 845 -1623 -207 1374 -1421 -1725 924 -457 -1535 530 56 -2127
2880 -2127 -587 376 -1745 -598 627 -865 -875 751 -1095 -1674 580 -11 -1924 413 226 -1744
2896 -1744 -140 771 -1450 -816 1338 89 -876 1016 316 -1179 1106 1049 -761 718 1426 -954 -701
2913 -701 2052 179 -600 2002 1213 -891 1185 1578 -373 498 2250 409 254 1917 429 -86 1945
2930 1945 1234 87 1879 1269 -221 1392 2159 122 984 2367 650 256 2165 1138 -128 2167
2946 2167 1900 -45 1062 2142 56 744 2461 532 199 2397 1339 -335 1508 1447 -412 1224
2962 1224 2163 -281 82 1968 435 -586 1616 895 -820 948 832 -934 109 1206 -510 -96
2978 -96 1420 -273 -637 910 -223 -709 1044 216 -1713 379 524 -1578 -315 1152 -1183 -1325 1232
2995 1232 -500 -1878 739 329 -1880 52 791 -1593 -1118 745 -1112 -1406 563 -503 -1708 129
3011 129 35 -1944 -240 595 -1273 -705 569 -885 -1269 506 -136 -1200 431 324 -1368 -129 588
3028 588 -1113 -56 899 -961 -439 1219 -370 -1138 1362 303 -1565 732 1302 -1703 -102 1666
3044 1666 -836 -670 1568 287 -994 1109 1259 -1052 701 1468 -197 314 1468 337 -432 1781
3060 1781 783 -240 1429 1239 -124 1048 1340 -261 711 1628 110 11 1874 366 -140 1560 729
3077 729 -595 1221 1380 -828 1144 1918 -565 -234 2106 -14 -780 1386 448 -884 1222 1378 -1081
3094 -1081 -64 1640 -270 -392 1320 195 -629 1524 96 -957 173 446 -942 0 456 -1237
3110 -1237 -728 572 -945 -1198 530 -597 -1583 34 79 -1543 -364 472 -1572 -1040 292 -1043 -1549
3127 -1549 555 -566 -1822 -5 -407 -2033 -637 395 -1458 -1097 674 -826 -2105 450 -300 -2048
3143 -2048 -119 205 -1767 -1080 239 -1460 -1056 259 -603 -1392 342 96 -1583 212 -125 -1390 -103
3160 -103 732 -800 -169 754 -671 -682 1487 278 -1054 806 776 -1151 750 1412 -295 145 1956
3177 1956 -5 -206 1616 679 -671 1595 1682 -624 1082 1715 -260 571 2247 6 -17 1549 782
3194 782 -295 1365 1670 -268 845 1573 -50 413 1403 549 281 1828 200 -194 1247 908 -373
3211 -373 889 1495 -389 402 1500 -359 -565 1421 204 -1049 1469 502 -1021 364 771 -1034
3227 -1034 -405 833 -1079 -804 674 -219 -1455 318 83 -1635 -166 191 -1681 -581 746 -853
3243 -853 -1141 731 -704 -1499 17 -161 -1679 -542 145 -1210 -930 33 -1156 -1291 269 -980 -1277
3260 -1277 225 -479 -1910 -6 -13 -1940 -562 622 -1422 -977 635 -471 -1375 138 263 -1333 139
3277 139 292 -1009 101 820 -916 -705 1038 -712 -911 1022 317 -988 647 430 -1133 -87 1140
3294 1140 -439 -281 1263 261 -748 863 446 -510 944 815 -623 439 1287 -452 -20 1362
3310 1362 -330 -232 1666 571 -463 888 1372 -689 516 1772 -333 -225 1288 149 -634 1278
3326 1278 662 -647 943 1047 -453 553 985 -670 -246 1105 -112 -494 1531 165 -961 767
3342 767 678 -1090 138 910 -571 -417 1174 -324 -434 701 73 -931 234 -64 -1171 -239 294
3359 294 -1049 -627 874 -859 -962 646 -165 -1561 430 273 -1466 -41 681 -1427 -1143 575 -1006
3376 -1006 -997 556 -623 -1636 -249 -83 -1204 -403 401 -1258 -719 429 -1010 -961 495 -296 -1411
3393 -1411 368 2 -1551 -199 483 -1060 -981 533 -879 -825 407 1 -755 206 333 -1183 292
3410 292 201 -969 48 958 -491 -384 1303 273 -613 855 762 -485 691 1466 3 443 1386 295
3428 295 575 1309 827 148 1438 1101 -243 1718 1788 -60 933 1949 362 538 1981 959 94 1779
3446 1779 1503 -189 1187 1889 337 1038 2071 260 299 1675 1086 352 1504 1114 383 1494 1225
3463 1225 -258 690 1686 347 504 1606 81 35 1501 1037 -594 971 1035 -135 182 1115 -317
3480 -317 147 1156 145 -176 955 289 -684 802 464 -1064 393 668 -814 -516 1191 -122 -822
3497 -822 701 221 -1104 565 379 -904 -136 448 -859 -691 442 -560 -867 505 -327 -1330 182
3514 182 397 -1306 -89 751 -971 -939 681 22 -944 712 325 -973 358 962 -613 -48 703 -350
3532 -350 -144 898 -222 -177 965 516 -329 1125 908 -287 747 1296 -396 103 1981 321 -151
3549 -151 1567 1001 111 1264 1466 -20 1089 1782 425 1218 2144 627 380 2074 983 446 2002
3566 2002 1221 323 1699 2012 526 830 1974 675 408 1703 1294 621 1333 1469 355 1238 1249 220
3584 220 854 1393 235 488 1264 413 -198 1428 824 -621 600 1095 -568 97 1306 -229 -738 936
3602 936 198 -670 403 379 -678 -228 185 -686 -121 495 -629 -821 597 -522 -1286 355 -311 -1454
3620 -1454 -272 82 -1538 -953 469 -1151 -1523 -109 -797 -1214 -343 -488 -1349 -489 -150 -1247 -758 -127
3638 -127 -1512 -1091 195 -931 -1345 97 -261 -1504 -334 311 -1170 -940 477 -561 -804 234 -439
3655 -439 -1029 141 143 -779 -93 106 -976 91 721 -828 145 937 -257 -916 863 258 -710 770
3673 770 909 -386 414 1364 -123 -301 984 300 -92 847 696 97 604 980 -357 405 1052 -80
3691 -80 -32 1151 265 -643 1118 546 -423 595 1032 -372 284 1130 -1 -197 761 120 -342 409 279
3710 279 -371 648 27 -476 366 794 -666 76 1352 1 -403 1403 475 -1084 353 555 -1133
3727 -1133 -283 606 -810 -109 511 -76 -981 32 -390 -1230 -10 -324 -1315 -539 73 -1022 -665 372
3745 372 -988 -1197 237 -536 -1496 -137 -58 -1467 -616 225 -994 -804 97 -844 -793 25 -892 -1068 153
3764 153 -178 -1198 -275 254 -1526 -1005 371 -827 -1523 220 -102 -1468 -80 113 -1107 -626 394
3781 394 -441 -414 287 -480 -282 540 -142 -627 513 337 -571 420 832 -657 251 1291 -546 -264 1068
3800 1068 555 -696 854 843 -690 316 1107 -472 34 977 91 30 1392 302 -37 788 563 -401
3818 -401 660 1294 -533 312 1114 26 70 1409 669 -419 782 1024 311 592 1012 175 125 1088 87
3837 87 104 1212 258 -55 988 175 -494 727 652 -672 102 932 -311 68 821 89 -1078 302 340
3856 340 -1037 26 142 -763 -316 480 -822 -630 582 -712 -978 158 -66 -1006 227 -41 -1368
3873 -1368 -821 263 -1046 -997 107 -676 -1519 -203 -384 -1264 -629 -353 -1150 -878 -242 -1377 -988 -267
3891 -267 -1008 -1134 233 -677 -1435 97 -163 -1530 -664 126 -1349 -847 468 -321 -1305 124 167 -797
3909 -797 -32 397 -578 -259 416 -262 4 470 -576 -590 838 10 -775 775 667 -625 133 975 -480
3928 -480 -292 997 259 -271 808 603 -379 491 1153 145 433 801 119 663 1308 -267 236 1281
3946 1281 627 -33 1051 1182 -387 668 1482 33 -145 1613 360 152 874 599 -108 453 576 -124
3964 -124 489 609 -257 433 700 -423 72 914 -185 -788 697 314 -836 -141 757 -836 -626 869
3982 869 -189 -824 122 134 -921 -81 -31 -956 -176 -80 -865 -501 -167 -995 -1041 226 -676 -1574 139 -200
4002 -200 -1460 -636 -224 -1132 -953 -132 -841 -1406 -337 -713 -1039 -173 -768 -948 33 -122 -1011 -132 217
4021 217 -1120 -652 618 -625 -1382 285 -18 -1498 46 438 -1026 -388 555 -304 -629 310 -78 -503
4039 -503 166 186 -528 379 561 -198 22 908 -407 -146 918 -11 -488 1234 512 -493 690 1170 -381
4058 -381 369 1024 127 124 1189 309 26 897 632 39 1023 1115 -307 1041 1279 -227 309 1699 372
4077 372 -406 1285 1020 -245 755 1370 72 326 1148 415 -100 471 692 347 552 692 -125 940
4095 940 741 -314 1152 712 -575 123 909 -190 -283 1110 350 -776 450 752 -290 -119 777 -413
4113 -413 -513 422 -346 -676 361 -289 -401 385 232 -814 219 345 -954 -637 983 -650 -1127 570
4131 570 253 -1333 -229 138 -982 -542 -248 -313 -612 -116 -518 -392 123 -853 -958 519 -234 -1206 -27
4150 -27 4 -1325 -423 585 -620 -885 573 -248 -1023 243 52 -692 -406 307 -527 -325 193 -405 -469
4169 -469 455 -213 -907 578 150 -815 277 767 -405 -477 957 -399 -570 825 479 -523 627 779
4187 779 -268 329 659 -135 429 732 172 460 1023 289 -28 1103 652 -418 902 893 -528 423 1485
4206 1485 385 -631 1141 617 -446 558 1189 -265 123 498 -236 355 433 -30 179 1044 -4 -108
4224 -108 766 229 -567 843 717 -729 92 1042 -491 -413 809 245 -641 452 -197 -807 97 -218 -967
4243 -967 -326 23 -1007 -509 489 -897 -846 365 -589 -1780 -431 254 -1513 -889 155 -1070 -1299 -94
4261 -94 -694 -1533 -621 -578 -1139 -596 -656 -981 -513 -346 -1144 -422 -280 -967 -1175 192 -694 -1651 -25 -151
4281 -151 -1179 -421 266 -962 -833 24 -559 -1564 -427 -310 -917 -112 164 -999 -195 130 -909 14
4299 14 552 -500 -331 589 45 -578 654 699 -410 85 916 -143 214 750 413 173 1007 350 199
4318 199 564 704 -205 818 887 -123 546 948 108 -250 1180 382 -375 922 919 -473 357 945 -318
4337 -318 -194 944 150 -68 1104 266 -103 693 514 -102 551 556 -322 36 780 -426 -412 552 66 -904
4357 -904 344 242 -603 -215 9 -928 -553 58 -525 -800 -342 -386 -973 -85 -604 -1086 -153 -376 -1146 -395
4377 -395 11 -839 -871 126 -569 -1350 -270 -134 -1311 -432 364 -1131 -841 67 -525 -928 -156 -635 -791
4396 -791 -195 -615 -1112 -94 -119 -912 -699 305 -558 -844 328 -434 -895 243 383 -1020 -277 413 -740
4415 -740 -441 663 -273 -201 435 225 -309 610 459 -239 976 450 -447 589 1227 63 -103 1275 127
4434 127 -267 759 546 -468 603 781 -137 92 467 195 -105 803 136 105 643 299 -145 734 596
4453 596 -587 457 905 -237 246 1364 218 -400 807 669 -238 615 663 -93 60 989 50 38 610
4472 610 131 -185 694 195 -477 406 -48 -927 95 434 -753 -545 282 -596 -1096 -3 -170 -705 -371
4491 -371 76 -1054 -377 -130 -451 -481 -339 -515 -465 54 -217 -1002 103 -25 -969 -114 245 -804 -558 330
4511 330 -850 -1012 -9 -412 -1423 -357 -413 -1226 -498 -155 -966 -765 -49 -857 -779 81 -572 -1175 19
4530 19 -191 -1068 -133 134 -824 -435 656 -338 -1087 601 432 -742 192 216 -420 114 311 -258 -101 277
4550 277 -361 151 737 12 -516 641 551 -439 284 917 -580 -126 831 -242 -524 637 333 -88 443
4569 443 692 -93 330 725 28 589 837 324 256 1068 270 -93 919 573 -359 891 1199 -253 225
4588 225 857 192 104 472 619 -201 549 368 -209 452 483 -81 341 663 -142 37 744 -31 -337 282 141
4609 141 -1087 219 693 -479 -208 651 -188 -636 273 51 -685 266 122 -632 71 -285 -386 -159 126
4628 126 -933 -348 -10 -838 -945 293 -335 -1092 -145 195 -1187 -743 6 -630 -738 11 -219 -930 -106
4647 -106 -232 -819 -27 -155 -788 -161 133 -849 -207 369 -604 -606 469 99 -690 180 94 -498 26 612 -232
4668 -232 -464 639 148 -428 -100 202 -187 223 338 -321 351 228 -310 297 538 -171 -291 849 308
4687 308 -368 503 1039 -108 255 950 -55 61 1037 529 -19 708 698 214 664 590 103 824 844 32
4707 32 438 831 -18 -60 1095 496 -302 601 572 -193 437 659 152 121 545 323 205 554 298 -39 491
4728 491 230 -233 392 146 -380 -25 937 -97 -226 463 78 -801 441 449 -870 -180 374 -528 -387 389
4748 389 -490 -457 51 -82 -734 441 -65 -618 -54 85 -835 -135 418 -360 -681 573 -281 -632 -47 118
4768 118 -764 -23 206 -524 -445 -48 -17 -345 9 -524 -490 142 -355 -868 146 114 -421 182 637 -320 -468
4789 -468 465 77 -351 582 131 -320 209 260 -245 132 621 25 -25 197 201 -223 744 202 -397 468 317
4810 317 -156 181 614 -233 -337 755 430 -353 369 693 -595 491 854 6 255 750 160 117 750
4829 750 50 265 647 393 -94 565 436 -267 430 760 41 -283 716 282 -303 584 370 -5 57 369
4849 369 -362 392 464 -292 118 418 89 -457 345 91 -472 193 539 -744 43 542 -427 -368 220 -191
4869 -191 -163 262 67 -555 129 222 -601 26 231 -356 -295 558 -326 -436 238 -42 -655 2 26 -671 -22
4890 -22 91 -544 -583 -144 -435 -696 117 -310 -612 -189 -176 -240 98 128 -486 -233 61 -517 -129 171 -388 -867
4912 -867 167 241 -823 -62 405 -164 -374 568 47 -667 219 -93 -542 130 244 -825 125 272 -406
4931 -406 -389 339 41 -42 162 -89 -174 609 432 -351 214 634 -41 217 770 151 310 340 343 184 826 449
4953 449 -315 630 736 -21 411 661 -358 -43 970 256 -371 519 496 -169 26 400 -213 -67 714 -41
4973 -41 42 454 -83 -127 277 285 -26 358 383 -43 264 314 -465 8 625 -326 -378 141 184 -421 -194 335 -159
4996 -159 -392 323 -430 -198 265 -130 -400 -100 -175 -428 -105 29 -807 -542 203 -515 -749 50 -347 -650
5016 -650 -138 -268 -790 -143 -129 -515 -465 130 -382 -638 94 -469 -541 6 -99 -512 213 -102 -544 -399 -23
5037 -23 -493 -554 543 -453 -722 155 -32 -377 -81 -192 -709 104 209 24 -333 456 131 -149 479 146
5057 146 -407 296 503 38 444 518 -265 -13 566 120 -61 609 570 71 456 592 -54 308 451 207 30
5078 30 638 87 49 642 120 -303 595 511 39 437 365 -190 100 930 193 15 222 71 -216 349 569
5099 569 28 121 418 -14 60 225 163 -366 399 219 -264 255 179 -599 335 307 -236 -319 199 -21 -393 -43
5121 -43 -205 -461 177 -131 -629 -480 248 -435 -175 25 -454 -225 71 -151 -396 36 -124 -748 -248 43
5141 43 -536 -242 104 -478 -555 -214 -139 -750 -418 -49 -618 -277 -132 -651 -294 72 -551 -602 50 -311 -620
5162 -620 2 -227 -602 121 -115 -553 -35 279 -276 -311 155 -46 -501 177 50 -438 396 120 -331 186
5182 186 387 -24 -252 406 86 28 492 396 -99 379 607 -62 36 639 185 174 423 187 -297 488 352
5203 352 1 498 361 219 277 576 197 244 584 338 -339 294 461 175 256 637 -6 279 490 166 -109
5224 -109 652 133 -107 338 154 159 112 91 -355 -320 356 -316 -106 115 -210 -238 451 150 -530 -107 -76 -159 -304
5247 -304 49 -415 -162 267 -275 -187 97 -144 -486 -186 -6 -498 -231 279 -580 -389 75 -424 -639 364
5267 364 -20 -847 19 -177 -261 -240 95 -583 -289 4 -136 -102 -150 -337 -441 -215 -67 -481 -299 291 -554
5288 -554 -15 449 62 -356 239 -120 -199 -188 117 -524 31 310 -285 40 91 -120 -25 605 46 -40 203 109
5310 109 -265 231 249 -61 126 481 153 -96 419 -145 97 546 419 43 261 317 100 500 867 -29 -210
5331 -210 702 379 222 455 395 -202 361 349 -113 95 770 110 -23 584 -69 -161 409 248 -230 -41 490
5352 490 213 -25 533 -244 -85 298 151 -344 243 133 -684 172 331 -141 -62 355 -313 -447 252 16
5372 16 -356 130 -231 -496 130 -22 -496 -206 318 -266 -422 191 -205 -618 -145 -103 -583 -155 -305 -677 -509
5393 -509 -211 -455 -410 226 -119 -488 -272 -293 -555 91 -200 -375 -319 130 -123 -78 232 36 -458 110 175 -392
5415 -392 182 104 -484 109 271 2 -360 29 5 -600 427 -152 -277 216 548 -147 165 277 -345 47
5435 47 541 3 -142 619 250 -489 291 403 -89 258 366 143 115 593 54 -22 520 201 118 424 426 -76
5457 -76 176 439 170 214 428 108 -124 462 -8 -81 300 481 -7 305 475 -27 211 343 74 -146 239
5478 239 126 21 83 141 -148 306 -38 -421 -187 240 41 -98 335 -19 -181 234 -128 -304 12 255 -422
5499 -422 -191 195 -42 -127 17 -33 -591 22 -186 -702 -60 -93 -277 -282 171 -368 -634 361 -260 -620 128 264
5521 264 -743 -279 -118 -68 -161 89 -239 -43 286 -46 -394 108 -365 -296 198 384 -137 -27 62 -112 -389
5542 -389 261 -47 -282 -233 -10 -241 193 390 -164 283 65 -273 -127 256 -282 -249 225 288 11 295 450
5563 450 -203 -50 388 172 -180 382 186 58 343 182 129 -64 251 74 221 398 -75 -25 233 177 149
5584 149 646 127 -196 367 133 -260 138 698 -43 129 297 170 -152 566 102 53 245 417 -398 128
5604 128 256 -199 44 266 -97 -13 31 36 -226 190 430 -382 -309 373 -165 -155 410 -103 -627 89 -402 -398 -69
5627 -69 -9 -327 -127 -66 -52 -205 62 -422 -259 130 -273 -332 -41 -91 -495 -10 -86 -353 -605 463 -250 -410
5649 -410 -146 -130 -427 -78 -18 -71 -322 -39 -478 -190 172 -827 -371 26 -80 -468 199 -102 -366 -4 171
5670 171 -109 -364 179 84 -355 219 126 -371 127 114 -152 59 324 -276 71 476 -48 -8 361 -46 -272
5691 -272 328 179 -191 101 412 -30 78 557 180 -219 135 15 -7 359 373 -161 253 240 -81 264 504
5712 504 -155 37 195 101 -278 432 119 -77 -170 352 -215 -128 345 130 -223 335 -9 -175 418 138 -148
5733 -148 48 165 -143 11 508 -39 -407 273 7 -404 243 -178 -220 -135 0 -78 -315 238 -210 -247 137
5754 137 -241 -320 66 -13 -617 215 -164 -384 165 217 -207 -499 39 -127 -455 -69 -33 -296 -190 -275 -563 -96
5776 -96 251 -340 32 4 -67 -15 123 -208 -77 -82 -255 -154 -111 327 -407 -386 89 -113 -432 108 156 -525 52
5799 52 5 -273 -216 -11 -10 -93 432 41 98 398 -86 83 166 227 -312 88 246 -170 -40 511 -187 -13 272
5822 272 100 -354 317 502 -30 302 132 -31 189 319 238 93 438 211 -14 250 256 -77 -52 486 247
5843 247 -69 440 3 -352 422 190 -106 191 251 -84 60 358 -323 -160 106 -178 -21 435 -153 -264
5863 -264 327 42 -234 34 90 -406 -99 224 157 -212 173 -298 -299 275 64 -307 -303 101 -464 -55 7 -574
5885 -574 -151 15 -443 -538 164 -489 -571 -56 152 -329 -464 -48 -263 -366 -140 127 -675 -258 6 -64 -169
5906 -169 80 -237 -179 -173 -478 -143 -43 -30 -365 138 -9 -540 -44 124 -178 -364 275 -152 -296 93 190 -116
5928 -116 -44 20 -155 125 -159 97 -234 375 -346 7 450 -103 -167 393 64 -473 478 261 -349 301 670
5949 670 49 -105 275 75 -164 337 348 46 229 245 -47 170 296 -64 -89 284 119 33 259 304 -164 193
5971 193 150 -103 -31 293 363 31 39 240 145 215 215 36 -32 -25 -60 71 426 146 180 63 47 -305 173 193 11
5996 11 -84 45 -152 -501 -65 -75 39 120 -39 -294 119 -22 -422 -273 -124 -279 111 -191 -611 -201 32
6017 32 -246 -419 -320 -157 -142 -91 -45 -274 -38 209 -85 -266 7 -87 -331 -79 -316 32 7 26 -215 166 210
6040 210 -165 -135 163 -554 -284 398 -136 -451 11 266 -197 -107 518 36 -315 176 -188 -62 362 112 67
6061 67 313 216 -30 177 100 -4 -217 440 218 114 345 33 5 175 653 -68 164 364 333 287 539 308
6083 308 12 444 142 236 272 431 -37 468 502 -127 -63 423 96 56 274 157 -276 3 241 81 5 170
6105 170 -108 319 345 105 -3 337 -61 -26 26 -81 -68 128 428 -308 -58 437 -167 49 108 -98 -581 -22
6127 -22 -204 -311 -22 -232 -269 -32 -57 -386 -346 97 -82 -430 -136 -194 -235 253 193 -271 192 -170 -701 -227
6149 -227 347 -254 -153 -48 81 -126 190 83 -91 -66 192 -274 65 -119 -101 -96 -42 -66 -235 -70 49 48 76
6172 76 282 -253 -274 -14 -172 -231 29 440 -5 -51 190 -36 38 65 46 69 361 53 126 201 153 -143 346 209
6196 209 93 203 -105 -9 468 124 153 -38 379 302 -103 278 343 -104 -30 382 26 17 604 -27 -50 199 323
6219 323 -148 279 335 -41 35 182 -240 -32 383 81 23 249 4 136 -33 191 77 126 334 -224 -14
6240 -14 185 -255 71 99 -11 -395 207 16 -488 48 -34 -19 -261 -98 -317 54 77 -223 -176 -283 155 -117
6262 -117 -226 281 -328 -145 -237 -261 14 9 -423 -341 26 109 -262 -126 20 -571 -180 206 -206 -119 87 -111
6284 -111 -419 -174 21 -221 17 -349 -344 -17 76 -230 -148 -18 -51 -482 109 -18 -265 82 128 -110 -31 152
6306 152 273 262 -17 -213 -148 -266 77 -119 52 452 -179 80 222 -111 -15 209 108 78 380 399 -135 463
6328 463 189 154 25 336 -79 -6 53 175 38 421 156 13 120 82 287 367 -31 313 -131 202 315 65
6350 65 127 99 129 163 171 -12 348 268 -221 -47 228 178 21 202 161 -105 11 78 -9 64 127 -123 -154 50 -42
6375 -42 -248 76 -33 -178 98 12 -358 6 183 -64 -22 -117 -102 21 -221 -194 -364 -199 8 -290 -105 120
6397 120 -359 -415 -29 -314 -459 -198 143 -598 89 291 -169 53 92 -309 -253 -171 -356 -248 200 53 -314
6418 -314 -74 -1 -449 27 301 28 87 319 -223 -51 469 140 -228 63 220 -175 209 168 30 94 199
6439 199 245 -118 246 168 -298 60 99 -217 87 84 -207 -240 461 102 -66 121 232 -221 281 336 18 329
6461 329 435 222 134 398 -20 78 76 -83 158 303 59 12 302 281 27 205 288 33 -102 210 274 -143 204
6484 204 212 -28 -37 -12 37 38 186 -31 -240 198 -89 3 5 117 -110 -141 241 61 -267 36 -202 -190 -29 -107 -204
6509 -204 -30 -107 -223 -95 -49 126 -351 -32 -104 -187 -265 -263 72 -79 -121 -503 -334 -230 -295 73 -83 -333 19
6532 19 272 -17 -294 -129 69 -214 -160 86 -345 -168 -130 -234 -26 -138 -327 -322 -24 105 -237 202 102 -247
6554 -247 -41 169 49 -167 290 -159 50 139 182 -52 -253 297 -208 364 372 79 133 454 179 -318 210 191
6576 191 -285 388 102 85 -173 310 218 -105 309 115 -30 127 31 84 417 158 87 139 277 -239 -161 -26
6598 -26 -6 122 68 52 -185 169 -106 -167 -74 211 382 106 -32 16 -104 129 32 -205 -101 -172 -317 164 51
6621 51 -263 -29 34 279 -25 223 -88 -113 -53 247 124 -144 -244 -256 -291 -62 -113 -202 -16 -96 40 35 -25 -34 -183
6646 -183 6 -348 -289 -124 -413 -261 55 -305 -174 29 50 -540 -115 115 -164 3 -6 54 -242 -112 -27 -200
6668 -200 94 233 -301 -252 -47 -259 27 -53 -225 13 21 -11 -187 72 241 76 71 106 54 121 495 130 -185
6691 -185 445 83 -226 347 327 -74 88 2 50 23 149 123 -317 182 383 165 233 121 -277 101 221 -51
6713 -51 203 -53 247 -48 73 -31 213 269 -136 103 -1 266 -68 -52 169 142 -254 316 -31 110 110 114 48
6736 48 95 276 266 -104 227 -11 75 72 234 -1 68 216 -237 1 -77 -305 -52 83 -156 -339 205 -14 -334
6759 -334 -271 -94 -100 -236 127 -81 130 222 47 -116 -37 -343 -5 194 -376 -114 -108 -95 -61 78 -194 -101 -282
6782 -282 54 -113 -655 15 -38 -90 -158 252 -179 -94 -238 -315 -445 100 -138 -34 -107 -62 -275 85 97 -284 -80
6805 -80 -56 -382 -5 13 -4 -216 47 152 -215 -45 251 -70 45 52 31 -214 78 -163 -372 41 -161 -223 9
6828 9 51 -47 205 154 -308 -278 261 40 -30 443 23 60 -8 -63 306 -207 292 -92 -168 -31 -28 -182 227 -114
6852 -114 -294 469 225 0 48 291 144 186 270 -8 -56 279 -79 225 -44 13 -168 -92 204 175 40 320
6874 320 -1 -54 386 5 -185 88 -137 -310 -221 79 -25 104 -28 167 -93 -96 -16 31 -333 -26 -223 -351
6896 -351 -87 -151 -99 -53 -86 -111 -108 -178 -290 159 -4 113 -12 -305 -59 4 75 -170 -195 185 17 -72 -71 -49 -274
6921 -274 150 216 -186 82 172 71 -533 -192 -143 -211 -201 -153 -213 171 -60 -310 -3 -357 -3 -37 150 -69 332
6944 332 64 394 -130 -24 -123 293 -24 27 13 116 -190 -84 -266 212 148 -267 237 -72 -44 4 140 -86
6966 -86 -127 252 263 -72 -33 98 -3 191 266 21 238 143 263 146 185 29 301 103 147 140 287 265 -181 -128
6990 -128 182 101 -93 -162 -262 267 164 105 23 152 64 -179 -65 198 -227 -133 58 -64 -50 168 40 -168
7012 -168 -144 203 -92 100 -80 -99 -57 16 -71 1 -157 82 -341 -48 -98 -81 -198 371 -173 56 95 65 21 52
7036 52 -58 -191 190 71 22 -62 4 -281 288 63 165 141 -32 35 23 147 -21 191 36 -34 92 -140 145
7059 145 153 -263 -59 68 198 160 138 -67 329 520 -80 -154 -139 -21 -224 287 80 76 143 -74 -393 -106 -13
7082 -13 -62 52 -84 -170 101 215 23 -270 249 16 -14 -465 -41 71 69 -49 -13 -32 14 196 -139 -84 208
7105 208 90 387 -103 -128 296 83 135 -2 19 58 -290 197 99 -235 -143 -35 -424 -159 -16 -30 60 39 -91
7128 -91 -73 -49 -79 -362 -56 -199 -87 -49 74 -68 -56 -152 -23 -225 -163 134 -255 -177 189 -196 -102 59 154 -254
7152 -254 167 162 -105 158 -171 -10 -16 164 -199 -17 17 -144 -227 -117 -29 -51 181 -205 -212 -167 -20 -249 100 131
7176 131 16 -110 127 106 -110 266 193 -229 44 178 -28 23 19 -364 30 167 -117 -60 -80 -278 14 -162
7198 -162 -14 -137 289 29 -114 -10 108 -12 -216 82 -148 -48 220 337 61 208 -14 122 107 191 -102
7219 -102 -105 231 -2 -250 37 121 303 93 -155 164 -175 300 97 146 -24 -47 104 78 139 -27 -241 -19
7241 -19 31 191 -44 9 71 -45 -209 -65 -121 -366 24 107 78 18 118 105 -333 202 164 -155 71 -100 270
7264 270 -124 -49 187 146 96 -254 -691 -173 292 147 -145 -40 132 -40 43 64 -68 -231 -140 92 -150 -30
7286 -30 75 -325 256 190 -198 17 75 -62 -151 -118 -183 34 324 -67 -157 11 112 -130 192 214 6 103 -59
7309 -59 -222 -58 159 -61 -112 -13 -307 -169 31 108 -2 9 130 -172 -147 23 -323 -142 33 -241 140 8
7331 8 -67 58 -120 8 -102 -130 245 170 -24 40 49 35 111 339 147 176 -78 20 -32 -68 169 -16 -50 -99 -177 -257
7357 -257 342 4 -8 -60 -140 -215 -231 34 -63 196 -155 258 28 -69 -219 200 298 -385 316 -13 -154 195 -272
7380 -272 -20 -9 -7 -249 -270 -83 226 -194 -345 110 212 -259 -72 -80 34 -57 -128 -33 -408 -96 111 -223 -92
7403 -92 25 -115 411 164 -314 -109 214 109 56 127 -182 -67 -148 67 71 235 -348 4 -70 -118 12 3 -26 -55
7427 -55 -110 -30 -4 -66 35 23 -403 -148 -46 -109 -42 100 -265 173 179 -50 -92 -81 -104 -29 281 23 -262 169 -20
7452 -20 58 -38 64 -181 68 283 -11 147 -71 216 -249 -64 261 -4 -79 49 -359 363 218 47 189
7473 189 -38 50 -93 225 107 51 -84 -74 -70 74 121 -114 171 240 90 -149 181 -17 -239 -81 -15 177 58
7496 58 217 -35 12 -187 23 -259 -101 -55 -43 -28 116 -154 -133 -123 -257 -254 99 110 33 -214 159 -176 -102 -2
7520 -2 -122 -10 89 -163 -245 -29 -196 -181 -208 187 -17 -213 -99 78 -36 -67 -105 188 -86 -163 117 -187 94
7543 94 88 -72 90 -248 22 51 -117 34 201 -30 -329 76 338 26 -316 80 -3 273 -220 -203 -123 72
7565 72 143 -105 262 -25 -72 -66 202 -40 -20 280 -73 -58 -16 -388 -206 289 -159 -135 28 160 80 124 -114 -142
7589 -142 118 122 258 172 -5 -32 1 -91 143 -124 164 -35 362 -94 328 -112 212 -111 22 -7 -24 187 49
7612 49 73 -82 61 79 -102 26 12 -185 29 -78 98 175 54 407 -63 263 80 0 -21 -233 -240 70 22
7635 22 -97 2 -31 -142 21 -334 69 -62 -26 -115 -97 49 -165 -288 -7 10 -276 249 39 -70 69 1 -65
7658 -65 168 36 -464 -35 199 -143 -195 -71 -22 238 17 13 -90 -241 -78 79 238 24 45 -35 -187 212
7680 212 -44 156 36 -296 98 -60 -1 -193 141 165 -104 142 -140 7 200 -329 3 91 65 -205 39
7701 39 38 -83 -7 140 -121 -88 -17 155 -11 -61 94 127 271 -11 247 100 99 40 165 116 40 -24 308 -48 -205
7726 -205 152 263 281 -201 238 -237 -105 135 -198 -316 224 -75 -112 -24 -10 55 133 -25 -170 210 -39 -234
7748 -234 -113 185 25 -184 79 -85 -86 -259 -157 -15 -309 45 -201 110 116 -116 9 -16 30 -282 218 323
7770 323 133 -286 -169 267 -136 -45 193 -393 -45 33 -341 -119 123 -22 -69 252 -117 142 108 -306 69
7791 69 -52 105 -61 -186 -235 -243 -222 -200 37 131 -248 147 164 114 135 44 -65 115 11 -181 257 100 -91 -156
7815 -156 222 54 -64 167 -393 294 117 -248 145 8 -126 187 -228 -121 96 133 -122 -69 171 336 -147
7836 -147 75 242 271 171 -15 131 5 -10 -37 -169 26 -17 -48 -24 195 21 -345 115 -186 46 379 83
7858 83 -124 300 -38 210 204 242 -220 -33 -44 -98 -47 -23 -130 -189 6 -133 12 194 369 24 157 188 -287
7881 -287 -328 46 126 -41 12 214 -202 133 65 -203 -398 157 -80 -95 270 -59 100 -25 -148 -111 -44 -46 -86
7904 -86 129 -53 146 252 -190 -40 84 -146 -31 43 256 2 -119 223 89 -163 -119 -155 160 114 -118 75
7926 75 236 -15 -144 -208 -19 -14 172 -104 212 -414 141 -269 -115 -213 -184 215 73 55 131 -28 47 -7 -6 -80
7950 -80 311 190 198 96 343 14 26 44 97 -82 47 -251 -37 -1 254 298 -63 -79 95 9 -225 -324 208 94
7974 94 123 82 -78 198 -339 131 -68 324 81 -119 154 261 20 -87 -153 39 215 41 176 -77 85
7995 85 68 -125 10 -148 184 -67 -301 5 -137 -30 69 117 57 -224 196 114 -481 230 -298 -333 -404 198 -287
8018 -287 -142 178 6 -185 116 -145 -53 59 -36 -163 -163 272 -200 -70 -110 -27 -49 113 1 107 10 -76 -134
8041 -134 222 -55 -95 -38 377 -309 -63 32 231 289 239 94 -171 50 -94 -100 226 -81 -4 -161 -111 128 -156
8064 -156 -70 182 150 36 81 -21 179 -10 -131 33 251 -224 45 28 63 198 131 158 -129 -102 353 7 -108
8087 -108 63 -175 4 -47 165 105 49 112 24 -27 153 -59 -34 197 365 89 41 136 114 -174 -170 -162 73 -7 -221
8112 -221 -49 -195 154 -108 22 148 -125 -196 -354 82 -37 -7 63 -180 37 137 279 48 -60 63 -23
8133 -23 -66 -235 10 -366 83 111 -19 -222 48 22 -76 -231 124 -180 -63 24 94 48 -68 171 -209 133 11
8156 11 165 -96 29 106 45 -74 -452 -92 86 -59 -206 272 -72 300 -8 131 129 -89 -235 410 177 104
8178 104 221 98 -101 40 -133 -77 240 206 -77 11 32 -148 221
8191B21
$$ Imaginary data points
##PAGE= N=2
##DATA TABLE= (X++(I..I)), XYDATA
0 0 0 0 0 0 0 0 0 8 -8 8 -8 16 -16 20 -24 29 -36 40 -48 56 -68 78 -91 102 -118 136 -156 174 -199 224 -251
31 -251 281 -316 351 -393 435 -485 537 -599 661 -732 809 -899 992 -1101 1224 -1362 1520
48 1520 -1700 1915 -2173 2482 -2868 3367 -4029 4965 -6381 8765 -13513 26574 -132733 -434901
62 -434901 -81975 67996 -139896 -120497 88175 -54565 -241676 -106539 4090 -145902
72 -145902 -160756 23775 37853 -151416 -210810 -126406 -113103 -158462 -109472 -63429 -149715 -235242
84 -235242 -186080 -150199 -208729 -215021 -138478 -132541 -197143 -222452 -199617 -181081 -178167 -169711 -124706
97 -124706 -100837 -160209 -183717 -94280 -75884 -148424 -78830 36151 -58538 -140617 -8092 23888
109 23888 -109899 -40960 121378 9663 -117676 23562 80081 -86471 -74288 101923 49213
120 49213 -105258 -33334 63043 -50101 -118623 11122 55216 -80230 -102696 25122 8546
131 8546 -120988 -67227 64069 -4668 -104326 -10567 55464 -37907 -47081 56731 42828 -33486
143 -33486 5929 65699 38497 12037 30234 52249 55733 25142 4774 50814 66551 -403
155 -403 2497 69951 19974 -59336 9875 54771 -44730 -64854 29735 3522 -89882 -48149 10593
168 10593 -55630 -95216 -26923 -6736 -70257 -75513 -17247 -24897 -81601 -56833 4956 -25988
180 -25988 -69638 -8675 23552 -55975 -63867 27886 14972 -57493 -9088 40135 -33213 -56912
192 -56912 16417 7269 -55019 -25636 12707 -29042 -57552 -34054 -25193 -37608 -46851 -46692 -34756
205 -34756 -43339 -75037 -55993 -15446 -45524 -78070 -30491 -15480 -71482 -62271 -467 -15324
217 -15324 -54740 -23154 5218 -24768 -39060 -7437 12974 -5326 -21434 2820 21500 -13379
229 -13379 -30505 17739 26650 -25525 -13114 32969 -7224 -46932 4743 20718 -33681 -25427
241 -25427 16159 -13305 -41553 -12868 -7458 -29157 -18264 -5674 -17338 -19038 -16023 -18297 -8470
254 -8470 -5123 -13963 -2236 6282 -14434 -10594 16888 4642 -9731 16499 17653 -11008 3202
267 3202 24310 1504 -3919 20983 12358 -8495 1315 7035 -832 3034 1955 -6237 -518 -4795
281 -4795 -16424 -547 6356 -19159 -11433 15993 -9858 -33281 2720 13476 -17718 -7936 14941
294 14941 -7535 -16938 9051 8654 -5815 2549 6899 2875 7870 1610 -5946 11608 14713 -3440
308 -3440 5712 15375 -8816 -9634 18634 7766 -13256 4806 10882 -8823 -4734 2304 -12227 -5786
322 -5786 10292 -3762 -11627 735 -8098 -16045 3420 2432 -16246 -3027 8718 -9876 -12904
335 -12904 -658 -8033 -5210 10370 -1618 -13504 30 -2121 -13939 2171 6735 -14070 -5731
348 -5731 11365 -8963 -19241 1440 -97 -11488 1494 1750 -13678 -6723 -813 -10830 -3220
361 -3220 5010 -10461 -7913 8750 -5133 -16444 3192 3577 -12301 1302 11142 -7009 -6837 5651
375 5651 -3559 -4437 9178 1743 -3710 10936 4470 -9187 7277 12112 -5556 4876 21498 2885
389 2885 -4932 13396 10168 87 13551 15057 3591 10735 13024 2630 10328 16365 2855 9428
403 9428 23936 6009 -3770 16718 14541 -1465 12532 18548 -520 3148 16964 3702 -1921
416 -1921 11357 7063 1090 11185 4476 -8119 4750 10504 -3521 770 7864 -4795 -3424 8227
430 8227 -2118 -7762 5597 923 -8171 4579 1245 -16656 -2914 10753 -9594 -13989 3286
443 3286 -6542 -18664 -2285 -167 -16572 -12539 -4790 -12379 -12965 -12576 -17448 -8078 -3325 -19732 -18355
458 -18355 -2555 -16800 -25854 229 1222 -26750 -15060 6481 -14211 -24151 -188 1827 -13235
471 -13235 -5861 791 -7935 -8898 -5020 -1470 5238 -487 -8928 3437 6979 -11099 -5228 15941
485 15941 1876 -9947 12743 11371 -14328 -2320 17841 1699 -3223 15103 8710 -5290 5841
498 5841 12158 4113 7561 12605 10314 13015 10615 3813 14303 19708 7614 15325 29488 10201
512 10201 93 26828 26420 1458 15768 35558 12772 1559 24045 23012 3793 11930 25905
525 25905 17857 6400 7452 15847 17441 4488 3742 22873 16469 -7470 8572 28210 215
538 215 -9782 27061 24508 -11270 3209 29604 6788 -6606 19015 21073 761 5070 18162
551 18162 13807 4748 3552 12154 18354 4983 -2180 15852 15541 -8709 327 21808 -86 -14947
565 -14947 12764 14736 -15813 -8432 14118 -2442 -15770 2066 6472 -9001 -10283 -575 393
578 393 -6991 -11159 960 7520 -9295 -14590 8192 4120 -20652 -2406 20233 -8834 -21579
591 -21579 12011 8552 -25664 -9603 16728 -7108 -22174 1206 2700 -20420 -18597 -2342 -3393
604 -3393 -15315 -18894 -9198 -6527 -23798 -25159 -1840 -5966 -30592 -15952 5885 -21698 -36272
617 -36272 -2462 3554 -25581 -18177 5808 -9217 -25056 -8632 2443 -8930 -15597 -5161 4469
630 4469 -6656 -21385 -6393 10168 -11174 -21486 8151 7054 -26755 -13857 15380 -11360
642 -11360 -29871 5418 11443 -22212 -16057 9349 -5376 -20473 -1395 7128 -6052 -7544 3483
655 3483 6471 -2050 -7157 5468 16474 2558 -2662 17837 17008 -4742 6547 26710 8118
668 8118 -963 24660 24478 -1480 4241 22699 12905 2866 12708 18373 11407 4165 4773 12023 8145
683 8145 -3163 9664 24940 1570 -14167 14039 17519 -14076 -2853 27474 5054 -16018
695 -16018 12279 16908 -15913 -9273 20887 12249 -8457 656 9543 -1495 -10199 -2637 7871
708 7871 1382 -9944 -1016 5445 -16259 -24971 45 2887 -21015 -14361 1491 -17851 -31311
721 -31311 -12904 -10460 -25314 -18051 -7292 -17631 -26630 -25201 -22276 -16094 -15046 -20008 -13683 -11024
735 -11024 -26903 -26374 -7478 -14770 -26629 -5070 1678 -25966 -25982 -3448 -13116 -25546 -4126 2157
749 2157 -19680 -20261 -5148 -10943 -20690 -12187 -2133 -5859 -15927 -16345 -8068 -10617 -19462 -6803
763 -6803 5939 -11783 -20706 521 258 -20812 -8173 13108 -2604 -12652 4698 3466 -11698
776 -11698 -2169 10898 4414 797 3547 2512 4743 4302 -893 7325 14450 892 -2354 11479
790 11479 4657 -9008 6259 15136 -3883 -6103 9525 2238 -8583 1543 6140 -2645 -3314 1171
804 1171 -811 -1945 -2487 -1424 3396 7 -7765 73 5138 -6346 -4560 8459 -960 -10487 3690
819 3690 4996 -11716 -4291 8357 -4663 -10633 1818 -2525 -13799 -4870 445 -9469 -9605 -5457
833 -5457 -10538 -10926 -8740 -12537 -9781 -5716 -13725 -14533 -5642 -12174 -19333 -6295 -3043 -16421 -12215
848 -12215 -1806 -10112 -14043 -3960 -4208 -9827 -4954 -3596 -7033 -3756 -4654 -6540 295 685 -9385
863 -9385 -3615 4119 -6245 -7953 5399 475 -9864 712 4605 -7882 -4479 5374 -1334 -3482
877 -3482 4178 121 -4376 3518 3514 -880 5858 7360 -466 3525 8506 1998 4188 12098 6308 4108
893 4108 11422 7650 2622 10929 11671 3774 9820 13940 3389 4623 13695 7150 3084 11447 8763
908 8763 1184 7098 8513 1577 5387 8570 1405 3487 8068 596 -790 8421 3891 -2428 6284
923 6284 6537 -3347 1391 7770 436 57 7199 1710 -1686 4458 1506 -1702 5237 4363 -3518 1809
939 1809 3611 -5773 -2133 6006 -1682 -4986 2870 -827 -7927 -882 1166 -5557 -1239 1214 -6575
954 -6575 -5150 -313 -5482 -4556 3635 -2660 -8699 -307 -898 -8562 -2011 3329 -4361 -3608 1897 -4745
970 -4745 -6670 1515 -1016 -4314 2839 1030 -6979 -1818 1654 -5283 -1153 5646 -1883 -4867 2399
985 2399 -1357 -6253 1834 2786 -3223 2035 3404 -4871 -2419 3434 -1754 -1166 6724 1323 -4926 2611
1001 2611 3047 -3895 1721 6253 371 1817 5231 -1797 -1977 5550 2828 915 7765 3737 -3502
1016 -3502 3902 5854 -2381 2715 9990 2636 -101 6959 2728 -2013 6237 7611 2443 5570 5828
1031 5828 -167 3858 7624 1230 2821 10428 4181 -227 7229 4475 -2799 5343 9147 311 1620
1046 1620 6785 -203 -1464 5745 2589 -739 5318 4100 -2265 2208 3001 -2864 2395 6186 -737
1061 -737 -1008 3852 -1609 -3497 4786 2228 -3248 2658 2558 -5105 -1107 3836 -3563 -2436 4490 -1532
1077 -1532 -6617 90 -1392 -6215 -216 749 -7065 -3820 -732 -8219 -6192 338 -5976 -8251 361
1092 361 -3687 -11911 -4817 -1044 -8328 -5096 1257 -6244 -9284 -2327 -3300 -6006 -2214 -2494 -4171 -1060
1108 -1060 -2911 -7029 -1887 -428 -5563 -425 3664 -6330 -7586 2458 -1499 -7065 2194 2868 -6099
1123 -6099 -2147 2143 -5551 -4225 3901 439 -2122 3633 -863 -5263 2594 4115 -2414 2704 7453
1138 7453 -894 -713 6968 1755 -1090 8359 8453 963 4270 6887 1185 3723 8686 5604 4685 6962
1154 6962 4528 3980 5937 3203 3988 9184 4914 1036 7398 4948 -2647 5400 10763 82 225
1169 225 10347 3076 -4536 6789 8181 -1242 3343 9971 1246 -1016 5963 3242 907 6523 4913
1184 4913 -341 4318 3686 -1884 2982 6204 -1180 376 6361 -482 -4207 2937 2713 -2667 534
1199 534 2004 -1805 -1554 -940 -2119 206 -613 -4086 142 2152 -6066 -3904 4606 -1795 -7308 3623
1215 3623 3260 -8229 -947 6685 -4524 -6170 6191 1868 -6539 2040 4526 -4738 -1710 4743
1229 4743 -1362 -2409 2842 287 -2024 1495 -128 -2727 2051 1084 -3025 1239 1776 -3548 -794
1244 -794 3434 -1787 -2047 3724 1021 -2461 1396 999 -1057 2168 1983 -804 3087 2294 -3760 1675
1260 1675 5698 -3367 -1707 8295 437 -6884 4149 5230 -7518 -1477 8577 -1645 -6816 3624
1274 3624 1124 -7466 -1572 3188 -3206 -2777 159 -2813 -3498 -2300 -3949 -1651 921 -3422 -3529 361
1290 361 -4036 -7130 450 826 -5556 -1158 2253 -5132 -5518 293 -2614 -3936 1373 -1052 -4810 -907
1306 -907 -2942 -6702 -654 991 -5745 -1509 2881 -6623 -7613 2581 -1128 -7844 1773 3613 -7584
1321 -7584 -4981 3281 -3347 -5813 3231 2601 -3882 -1338 275 -2098 -968 572 269 2522 917
1336 917 -3177 170 2186 -3645 -502 6461 -159 -4630 2759 1861 -5681 -5 4934 -2142 -2512 3380
1352 3380 -1027 -3861 665 101 -1828 1830 -21 -4350 999 1578 -4723 -659 4197 -3305 -3539 4951
1368 4951 129 -6373 1895 4095 -4396 -2223 3489 -1363 -2835 2366 488 -2942 -715 -195 -1058
1383 -1058 1532 -1308 -3468 1507 269 -5248 -1055 2409 -4356 -2222 4666 -2136 -7048 1616 2137
1398 2137 -4673 -328 3933 -2427 -2208 2900 -1133 -2856 2445 1453 -437 2483 58 -3135 2227
1413 2227 2831 -2168 1750 5275 -1718 -1770 4777 -136 -4114 3998 4591 -2789 -101 3539 -2104 -1592
1429 -1592 3518 802 -531 1845 -445 -1574 1751 -537 -2295 3156 2091 -4041 677 3908 -3552
1444 -3552 -2163 5660 558 -4365 2468 2286 -3776 -1 3052 -2338 -1177 2088 -1491 -2353 967
1459 967 -2264 -2920 2196 -1123 -5392 -159 29 -5524 -1388 1572 -5312 -4472 1659 -2183 -5962 -216
1475 -216 -593 -5282 -1046 535 -4565 -2613 1332 -2249 -2897 614 -2555 -3432 1325 -665 -4129 1039
1491 1039 864 -4201 -340 1888 -3483 -1795 3997 -1280 -4252 2089 641 -4281 349 2920 -2422
1506 -2422 -634 2209 -1604 -1088 2911 -150 -547 3737 620 -1803 3765 3052 -2314 2744 6168 -325
1522 -325 -30 5678 1413 -300 5664 4126 -541 3657 4554 631 2688 4354 536 2405 5909 808
1538 808 -623 4492 2018 -1090 4813 3439 -2276 1770 4653 -1297 -626 4033 630 -1045 3807
1553 3807 665 -2997 1951 2365 -1850 530 2653 -1805 -1109 2804 -1330 -2598 2049 -241 -3116
1568 -3116 772 -211 -5099 -901 1550 -4288 -2649 1502 -3638 -5112 168 -2152 -5928 -1458 -1170
1583 -1170 -5687 -3395 -1819 -5460 -3638 -813 -5041 -4773 -371 -4321 -6427 -722 -1921 -6819 -1975
1598 -1975 197 -5815 -4312 460 -3907 -4971 -454 -2394 -4710 -749 -1370 -4799 -1362 -227 -4576
1613 -4576 -1853 1082 -3444 -3220 1593 -1738 -4229 1333 762 -3806 174 2326 -2461 -1224 2641
1628 2641 -1180 -1527 2799 641 -1418 2799 1798 -2109 2057 3086 -787 1675 4404 -98 418
1643 418 4370 1090 -702 4832 3791 -744 3509 4836 -717 1318 5390 1490 858 5015 2525
1658 2525 380 3585 2851 33 3751 4038 -180 2684 4405 -675 819 5777 1284 -862 5126
1673 5126 2981 -2297 1440 3790 -1000 368 3751 -42 -1282 2197 188 -854 2352 290 -1818
1688 -1818 2181 851 -3712 230 2679 -2862 -1420 3226 -1542 -3774 1996 1133 -3708 406 1749
1703 1749 -2770 -1401 1275 -2280 -2533 637 -1352 -2449 554 -1681 -3630 455 -463 -4545 -424
1718 -424 1046 -4324 -2810 2022 -2746 -4839 1213 40 -4945 -1279 1168 -3452 -2235 783 -1643
1733 -1643 -1867 -95 -1464 -1481 716 -1389 -2125 2551 -304 -3743 1469 2744 -3322 -124 4845 -947
1749 -947 -3056 3296 1973 -3152 1309 3534 -848 -403 2329 -389 -155 2119 -100 1103 3449 -67
1765 -67 -976 4224 1740 -2024 2918 5288 -1130 499 5897 842 -1500 4851 4806 -67 2647 4902
1781 4902 1406 1931 3437 2120 3022 3662 1570 2768 4147 171 8 5501 2433 -1712 3944 4653
1797 4653 -2267 327 5669 -89 -2506 4270 3068 -2849 837 3230 -957 -115 2019 333 131
1812 131 1006 -1140 521 2204 -1028 -984 3245 17 -3981 1958 2396 -3989 -1763 3756 -1478 -4128
1828 -4128 1512 525 -4109 -1705 389 -2245 -1998 -1751 -2534 -1035 -1944 -4663 -1564 993 -4758 -4250
1844 -4250 2177 -2422 -6756 720 2223 -5883 -3159 2999 -2112 -4900 1018 550 -3955 -919 1587
1859 1587 -1433 -1504 -146 -744 166 59 -2019 405 2028 -2029 -1116 3060 -423 -3069 3248 3587 -3256
1876 -3256 -452 4131 -575 -1310 3369 1922 -1060 2102 2807 278 1191 1491 1221 3838 2866 -661
1892 -661 2632 5268 -486 634 7165 2818 -1699 5029 6083 -1908 668 7125 2756 -751 4316
1907 4316 4316 -451 1238 3389 2124 2062 1705 1695 2858 1479 -1586 2537 3992 -1187 593 4904 -30
1924 -30 -3713 2728 3233 -2841 221 4581 -931 -2488 1663 68 -2099 1069 1339 -662 328 -763
1940 -763 -2630 69 306 -3214 4 2260 -3379 -3334 2110 -1970 -5208 755 1883 -4514 -2890 1043
1956 1043 -3182 -4714 -305 -89 -2836 -2074 -1480 -2474 -2339 -3095 -2400 123 -1226 -4455 -514 507 -5327
1973 -5327 -3099 2496 -1756 -5203 1344 1105 -5620 -2170 2392 -1983 -3076 1073 -589 -2821 -204
1988 -204 -649 -1603 176 -339 -1329 1004 166 -3136 -46 2550 -2009 -1375 2921 -63 -2859 1586 2106
2005 2106 -1971 -199 2871 34 -525 1939 916 88 2098 899 726 2361 669 -144 3597 2117
2021 2117 -1552 2317 4199 -1033 360 5493 848 -1744 3987 3205 -1821 1241 4559 485 -264
2036 -264 3009 1494 -234 1862 1718 603 2334 921 -251 2656 1594 -1359 1766 3002 -1423
2051 -1423 43 3780 -183 -2739 2324 1878 -1691 243 2435 -1100 -764 1512 -544 -697 969 -282
2067 -282 -1087 1346 -1063 -2792 961 150 -3526 -65 1653 -2954 -2526 1635 -2127 -4029 868 437
2083 437 -4019 -1681 154 -3311 -2748 -68 -2058 -2543 -585 -2070 -3011 -1000 -2542 -3410 42 -1029
2099 -1029 -4075 -1035 -108 -3919 -2423 1284 -2113 -3778 496 -643 -4282 -1073 498 -2817 -1395
2114 -1395 389 -2133 -1895 475 -2000 -2233 701 -846 -2159 414 -336 -3042 47 1892 -2376 -1186
2130 -1186 2224 -961 -2056 1997 828 -1956 1083 1877 -1032 -77 2057 -125 563 2165 182 281
2146 281 2651 1044 -306 3063 1818 -795 2198 3216 -711 758 4270 911 -421 3552 2059
2161 2059 -349 2359 3194 338 1372 2482 206 992 2978 909 695 3360 565 -257 2695 1640
2177 1640 -1045 1957 2941 -1030 366 3286 -107 -863 2646 1030 -1366 1333 1113 -1579 468 1652
2193 1652 -870 -405 1343 -1252 -1646 1227 -727 -1955 858 -382 -3017 -482 223 -3626 -2002 706
2209 706 -2531 -3001 176 -1812 -3537 -1010 -821 -2985 -1189 -547 -3166 -1978 -595 -2973 -2541 92
2225 92 -2232 -3346 -385 -1550 -4167 -561 -12 -3506 -1906 625 -2402 -3223 5 -1203 -2978 -135
2241 -135 -243 -2494 -853 -382 -2380 -779 933 -1756 -760 1657 -1155 -2072 1343 640 -1646 1173
2257 1173 1919 -1251 -170 2474 -159 53 2375 955 -103 2350 1228 -328 1966 1928 -97 2032
2273 2032 3201 -293 918 3618 620 76 3617 2157 -354 2747 3014 -580 1461 3895 1048
2288 1048 501 3276 1564 -30 2685 2254 637 2564 2138 386 2055 2650 -185 1113 3652 360
2304 360 -537 2935 1185 -1431 1912 2654 -1070 238 2050 -412 -329 1779 266 -708 1228 115
2320 115 -969 984 138 -2375 234 1411 -2243 -952 1650 -1658 -2218 1453 -444 -3060 60 618
2336 618 -2755 -1491 649 -2198 -1877 251 -1076 -2117 -569 -1131 -2478 -308 -687 -2618 141 130
2352 130 -3032 -1724 808 -2107 -2458 1002 -1180 -3382 -421 142 -2848 -1087 770 -1810 -1440 379
2368 379 -1235 -1688 429 -1049 -1525 682 -569 -2274 411 377 -2657 -107 2340 -1326 -1843 1633
2384 1633 66 -2126 936 1882 -1266 27 1624 -326 -54 1542 239 590 2168 262 -19 2169
2400 2169 1005 -867 2069 2371 -990 1343 3369 -349 -647 3260 1522 -869 2341 2262 -287 705
2416 705 2542 565 1020 2018 430 1178 2266 72 163 2503 1076 -549 2447 2414 -1330 1024 3271
2433 3271 -418 -616 3001 979 -1234 1756 1948 -1197 345 1893 -359 -213 1040 -694 -379 668
2449 668 -958 -1012 1089 -371 -1660 535 406 -2727 -676 1413 -2376 -2320 983 -721 -2637 9
2465 9 73 -2225 -1128 113 -1835 -1184 -456 -1826 -946 631 -2067 -2007 760 -1477 -3149 579 225 -3535
2483 -3535 -1003 1209 -2503 -3013 733 -880 -2894 -316 -193 -2488 -779 3 -1817 -838 259 -1239
2499 -1239 -594 974 -1731 -997 1228 -240 -1515 1482 1323 -1798 1133 2466 -1348 -785 2434 569
2515 569 -595 1935 1247 -375 1367 1978 132 1193 1662 7 1120 2363 -307 185 3180 1253
2531 1253 -603 2657 2383 -1024 1487 3416 342 -53 3418 1634 16 2366 2358 502 1622 2214
2547 2214 1182 1730 1886 467 1657 2645 103 765 3195 731 -581 2338 1847 -1176 1108 2828
2563 2828 -887 -545 1720 -34 -1249 990 248 -1233 493 133 -1473 162 332 -1495 -283 943
2579 943 -1654 -1232 1230 -1014 -2555 996 548 -2670 -480 1098 -2076 -1864 715 -988 -2208 183
2595 183 -37 -2153 -1037 -786 -2248 -764 -695 -2462 -607 -325 -3058 -1971 631 -1944 -2848 940 -14
2612 -14 -3439 -988 315 -2498 -1626 932 -856 -1674 498 -406 -1608 114 -244 -1251 958 242 -1361
2629 -1361 72 1071 -1368 -581 2158 -84 -1589 1568 899 -1530 733 1603 -698 -110 1678 -95
2645 -95 -694 1583 709 -530 1481 879 -402 1527 992 -527 1325 1771 -640 374 3088 665 -351
2662 -351 2676 1750 -933 1951 2695 -464 822 2884 787 179 2188 614 -65 1861 1037 -162
2678 -162 1707 1045 -963 762 1864 -1141 161 2522 -494 -1585 1395 809 -1769 746 1060 -1232
2694 -1232 -222 1118 -573 -1090 1094 -564 -1022 1216 -478 -1802 376 142 -1884 382 1043 -1910
2710 -1910 -797 676 -1297 -2233 626 -348 -2482 -263 -345 -2628 -1487 259 -2161 -1862 -196 -1878
2726 -1878 -2466 -154 -1397 -2567 -265 -889 -2583 -652 -201 -2585 -1433 750 -1664 -2160 660 -473
2742 -473 -2419 -10 379 -1750 -570 636 -1272 -795 395 -1308 -718 868 -237 -1312 1096 423
2758 423 -1373 768 1394 -1312 71 2130 -298 -648 2299 779 -942 1361 1646 -584 988 1953
2774 1953 94 707 2305 684 644 2696 1167 522 2576 2336 28 1999 2770 138 1561 3065
2790 3065 570 397 2847 1257 337 2351 2067 -187 1797 2518 172 1096 2579 785 943 2655
2806 2655 1185 109 2417 1641 -72 1755 2123 -585 1041 2430 -249 -136 2209 312 -802 1566
2822 1566 1031 -822 505 1344 -903 326 1476 -485 -7 1455 -572 -1189 1041 262 -1640 528
2838 528 760 -1632 -560 903 -1287 -1136 966 -654 -1683 524 69 -1816 126 5 -1689 -420
2854 -420 597 -1670 -1154 618 -1050 -1552 907 -382 -2077 317 165 -1769 -440 1077 -933 -706
2870 -706 1391 -733 -1647 953 590 -1028 864 1008 -1069 -221 1767 -412 -312 1552 353 -452 1446
2887 1446 658 -532 1500 1455 -501 782 1705 -405 102 2253 606 -18 2089 945 -152 1320
2903 1320 1423 -331 1500 2178 216 806 2568 208 -20 2754 1517 -340 2177 2143 -552 1182
2919 1182 2329 80 486 2380 826 -85 1591 777 -349 1289 1383 -251 753 1475 -252 402 1650
2936 1650 -56 -395 1596 229 -943 953 412 -1536 775 1201 -1216 -546 1363 -965 -1167 1270
2952 1270 -303 -1537 878 258 -1904 -220 570 -1453 -743 994 -1451 -1944 773 -542 -1892 248
2968 248 133 -2167 -595 39 -1663 -1202 117 -1239 -1224 -6 -1093 -1405 40 -495 -1518 51 77
2985 77 -1836 -602 833 -1691 -1404 1186 -910 -1658 881 -93 -2148 189 958 -1713 -758 1170 -1083
3002 -1083 -1029 1024 -392 -1375 818 820 -1163 -4 1095 -1143 -123 1561 -355 -597 1220 -174 -1132
3019 -1132 982 771 -565 892 1038 -293 365 1291 -242 392 1688 95 -148 1617 361 -1062
3035 -1062 1381 1519 -702 770 2020 -917 -366 1900 283 -889 1719 1177 -1522 882 1245 -797
3051 -797 10 1855 -214 -594 1176 -29 -740 1329 523 -721 641 930 -775 45 921 -707 -17
3068 -17 1114 -284 -848 926 -359 -1023 857 625 -1482 107 714 -1485 -785 904 -1148 -1474 726
3085 726 -637 -2030 211 -20 -2185 -528 858 -2055 -1357 976 -994 -1811 33 -311 -1962 -74
3101 -74 -12 -1863 -963 114 -1309 -1047 272 -1259 -1420 469 -554 -1478 104 -234 -1875 -370 70
3118 70 -1442 -803 580 -1202 -1271 700 -491 -1533 804 431 -1232 -129 858 -1239 -218 1176 -820
3135 -820 -838 1721 -7 -1419 1146 1318 -988 267 1953 -314 169 1569 183 -51 1557 793 -415
3152 -415 1062 1112 -140 956 1519 -283 488 1858 332 346 1919 533 -343 1771 1226 -447 1039
3169 1039 1682 -573 479 2001 -162 -138 1950 616 -541 1530 857 -640 1002 1244 -887 -385
3185 -385 1609 -280 -463 1630 -109 -1279 854 540 -1048 275 812 -1265 -478 613 -893 -734
3201 -734 477 -493 -941 127 -233 -1507 -210 206 -1488 -648 395 -1596 -1342 470 -1329 -1967 188
3218 188 -294 -1908 25 -199 -2067 -818 510 -1498 -1420 357 -963 -1594 251 -272 -1714 -391 367
3235 367 -1790 -876 389 -1334 -980 566 -649 -1310 533 -374 -1428 9 522 -1124 -429 576 -769
3252 -769 -788 670 -590 -839 804 166 -801 883 615 -1055 416 1067 -446 -166 1427 -191 -409
3269 -409 1538 913 -959 932 1250 -412 450 1360 -188 145 1709 238 -64 1449 471 -394 1499
3286 1499 1088 -772 553 1742 -42 149 1570 500 -407 1445 777 -181 751 994 -435 391 1077
3303 1077 -319 210 1509 30 -373 1045 382 -453 1080 536 -966 308 764 -725 -208 1398 -683
3320 -683 -582 753 11 -1121 441 638 -1026 -419 312 -817 -562 544 -809 -589 899 -293 -1415
3337 -1415 279 -13 -1434 15 672 -1241 -585 823 -544 -1083 181 -511 -1437 187 74 -1002 -305
3354 -305 162 -1081 -426 644 -835 -1085 828 -513 -1274 589 331 -1039 178 636 -731 -429 797
3371 797 -743 -750 1034 -165 -661 616 552 -947 461 956 -508 80 1479 -467 -25 1457 187
3388 187 -411 1355 896 -204 987 1250 -376 847 1563 130 128 1773 859 -57 1500 1456 106 1299
3406 1299 1500 292 650 1476 241 495 2018 537 36 1897 1536 -265 1625 1605 35 703 2370
3423 2370 396 331 1796 583 444 1262 1041 97 1529 1162 -287 1034 1547 -22 -31 1562 134 -304
3441 -304 1391 1012 -437 416 1071 -571 185 1028 -529 -272 1134 -384 -659 691 -81 -637 159 583
3459 583 -1060 -136 480 -1130 -501 517 -582 -1166 273 -262 -1280 61 160 -1391 -711 327 -1152
3476 -1152 -1124 57 -726 -1311 -4 -639 -1425 10 -388 -1417 -433 -93 -1586 -686 563 -1167 -1324 193
3494 193 -747 -1276 5 365 -1281 -196 766 -671 -461 519 -446 -729 528 143 -750 551 438 -1163
3512 -1163 527 1069 -761 -184 1137 -381 -798 1031 240 -759 634 903 -797 249 1189 -81 58
3529 58 1012 139 58 1327 326 -160 880 984 -119 976 1124 -224 525 1696 -142 -57 1401 292
3547 292 -396 1027 811 -521 639 673 -495 -512 756 -205 -242 843 -134 -552 477 -41 -1119 61
3565 61 287 -1092 -500 667 -822 -975 389 -617 -1569 89 37 -1781 -455 -274 -1294 -780 -108 -1117
3583 -1117 -1629 -505 -1178 -1712 -247 -1180 -2346 -979 -593 -2208 -1552 -448 -1910 -1978 -154 -1419 -2204
3600 -2204 -709 -1074 -2002 -1113 -637 -1727 -1509 -215 -1590 -1471 -794 -1402 -1751 -477 -1106 -1912 -467 -521
3618 -521 -1644 -998 -102 -1776 -1506 215 -869 -1717 -8 -63 -1185 -240 -156 -1124 -485 102 -1044 -599
3636 -599 473 -624 -946 418 116 -1003 359 411 -927 181 1272 -388 -209 1369 -218 -831 916
3653 916 568 -628 447 878 -319 419 704 -411 -50 936 -240 -200 1328 171 -740 779 648 -731
3671 -731 100 1267 -422 57 1040 -287 -655 756 186 -538 603 376 -489 -225 737 -601 -299 887
3689 887 -244 -633 398 -318 -1476 86 434 -1185 -587 412 -1271 -969 -8 -1070 -892 4 -453 -1386
3707 -1386 -341 -306 -1535 -410 -333 -1233 -918 20 -1471 -1131 199 -880 -1596 -22 -161 -1916 -700
3724 -700 186 -1318 -1070 264 -736 -1071 238 -429 -1475 -40 -80 -928 -369 -170 -1115 -740 65 -1034
3742 -1034 -1038 363 -370 -1275 288 -171 -1573 -267 379 -879 -459 491 -750 -905 512 -74 -812 391
3760 391 234 -377 883 632 -626 -4 1002 -323 -412 1451 -81 -626 773 879 -519 234 1197 -31
3778 -31 -134 1088 190 -362 1052 442 -250 482 577 -2 810 570 -238 779 1228 -82 6 1250 324
3797 324 -409 1104 646 -348 924 1070 -232 147 1259 214 88 874 404 -93 707 188 -143 627
3815 627 343 -748 168 677 -712 -804 873 -130 -1060 602 584 -930 -192 738 -979 -698 278 -698
3833 -698 -314 84 -584 -752 -160 -481 -1117 254 -147 -1393 -423 203 -1345 -912 487 -1158 -1208 230
3851 230 -400 -1487 -408 -174 -1217 -759 3 -978 -1223 59 -665 -945 -35 -503 -1185 -138 -212 -1208 -449
3870 -449 365 -1229 -826 482 -568 -846 508 -232 -1109 177 201 -524 -217 800 -557 -288 628 31
3888 31 -65 664 296 -357 890 393 -572 552 1038 -311 4 928 233 -369 1198 631 -296 693 1177
3907 1177 -38 359 938 375 -29 1199 705 706 1418 398 149 1622 888 -339 1066 1376 15 298
3925 298 1495 230 -130 1017 914 -22 610 696 -299 165 539 124 266 1027 -412 -58 664 95 -525
3944 -525 860 30 -837 229 657 -776 -408 739 -535 -942 157 -317 -997 -39 -113 -688 -169 169
3962 169 -900 -347 -141 -914 -663 201 -867 -959 -71 -641 -1396 -68 46 -1366 -586 382 -932 -1398 64
3981 64 -445 -1102 -103 -50 -1298 -332 -309 -1065 -285 -161 -647 -854 321 -702 -924 349 84 -1241 383
4000 383 354 -694 25 821 -741 -395 752 232 -812 403 353 -343 408 569 -115 349 700 -291 98
4019 98 1157 -41 -326 1349 586 -322 1101 1073 -256 372 1551 343 -100 1403 851 -66 982 782
4037 782 156 918 850 67 687 1085 599 656 1242 200 383 1374 419 197 976 856 -478 577 909 -151
4057 -151 236 1198 571 -161 635 592 -40 526 549 -298 558 587 -749 59 928 -538 -643 1021 68 -932
4077 -932 537 474 -1203 -194 614 -772 -842 216 17 -868 45 -104 -874 -383 76 -718 -309 -137 -1108
4096 -1108 -388 208 -1013 -678 225 -534 -1393 -93 -467 -1340 -610 110 -679 -1064 -20 -744 -1297 90
4114 90 -586 -723 -124 -491 -969 -521 -38 -1247 -465 345 -964 -909 547 -257 -1046 142 271 -1048 -464
4133 -464 306 -846 -1021 185 -349 -606 105 -77 -519 203 -14 -531 620 319 -932 199 1127 -975
4151 -975 -113 989 -7 -661 812 644 -684 181 978 -368 -65 883 -214 -281 459 397 107 787 552
4170 552 -104 670 778 -69 323 823 -157 14 1180 225 -237 776 817 -383 435 793 -287 63 604
4189 604 -63 9 424 -195 -230 512 -129 -437 616 211 -678 134 989 -818 -412 1027 -172 -1164 374
4208 374 281 -1170 -211 129 -796 -863 196 -566 -920 -184 -552 -650 -326 -384 -1189 -19 -702 -1445 -684 145
4228 145 -1087 -1135 -170 -1190 -1539 -464 -429 -1687 -616 -301 -978 -668 -367 -1112 -952 -146 -965 -1000 -4
4247 -4 -675 -1062 -49 -402 -1257 -577 334 -1388 -1259 204 -579 -1481 -150 140 -1158 -404 216 -664 -331
4266 -331 165 -431 -586 350 -433 -247 878 -341 -343 947 77 -468 535 1061 -416 -74 1475 308
4284 308 -199 1056 287 -199 735 914 190 627 919 -161 339 688 -157 -53 965 231 -497 979 967
4303 967 -537 882 1265 -133 397 1255 422 -214 1015 629 -94 669 739 14 548 503 -72 568 792
4322 792 -103 67 767 -141 -593 516 275 -877 275 657 -821 -498 253 -709 -822 234 -409 -1064
4340 -1064 -180 47 -1137 -235 -23 -867 -713 138 -1026 -831 -72 -666 -1297 -139 -142 -1311 -210 -21 -851
4359 -851 -653 364 -719 -780 -48 -160 -936 -403 -481 -1009 187 -42 -963 -445 -210 -979 -661 470 -614
4378 -614 -935 208 59 -941 191 501 -664 63 814 -197 -422 679 126 -333 538 663 -43 838
4396 838 925 49 642 1099 -117 319 1145 177 301 1061 563 -23 483 1174 -164 147 1184 70 110
4415 110 828 394 41 883 563 63 708 468 5 610 815 -222 241 1076 359 -31 852 374 -166 842
4435 842 832 -334 532 908 31 -125 776 234 -234 435 169 -261 154 195 -652 -40 653 -481 -459 524
4455 524 -547 -896 232 -150 -1156 -168 103 -761 -488 166 -228 -509 97 -235 -612 -72 -120 -668 -96
4474 -96 -132 -746 -7 -112 -871 -380 124 -571 -1040 -2 -422 -1115 99 55 -1145 -428 270 -688 -801 -86
4494 -86 -670 -885 -187 -476 -879 82 -334 -834 -214 82 -580 -98 469 -148 -596 587 -4 -579 539 593
4514 593 -293 303 665 174 -217 567 102 6 594 166 -261 597 216 -551 895 557 -324 320 804 -242
4534 -242 -237 1055 538 -85 448 513 -74 384 1004 286 808 871 551 50 662 746 397 751 641 60 895
4555 895 719 -54 532 858 241 -41 1104 287 -502 497 562 -379 54 441 -231 353 473 -249 -354 462
4575 462 -111 -95 347 -320 -522 751 324 -506 154 793 -609 -457 685 -231 -700 211 658 -465 -85
4594 -85 209 -479 -306 439 -420 -395 -94 -586 -310 234 -325 -832 -212 -146 -1023 -46 431 -818 -957 200
4614 200 -418 -636 25 84 -829 112 31 -610 -416 -3 -590 -317 142 -324 -487 523 -265 -667 629 192
4634 192 -413 91 679 -407 -147 323 19 -216 723 380 -138 -123 278 -183 391 744 12 124 601 -29
4654 -29 -47 748 235 4 977 466 -302 451 987 -119 -57 1276 327 -105 860 612 -152 660 729 40 422
4675 422 613 225 -17 997 198 587 1071 473 -18 986 537 -286 578 716 2 60 750 272 -341 581
4695 581 481 -300 233 195 -321 127 210 -296 179 325 -557 -253 573 -167 -691 368 128 -809 -104 542
4715 542 -659 -354 286 -334 -571 234 -31 -776 150 -203 -444 -150 -1 -556 -74 42 -555 -279 441 -726
4735 -726 -853 109 -166 -792 -171 352 -908 -682 -24 -720 -609 -126 -661 -559 -192 -90 -732 202 149 -305
4755 -305 -170 -18 -608 -148 406 -91 -853 525 147 -605 166 391 -521 -173 362 -110 -503 171 52 -371
4775 -371 276 262 -320 431 111 -437 181 613 -148 -64 661 17 -301 539 445 -556 343 754 137 -106 722
4796 722 285 116 578 169 253 797 463 -218 562 370 -250 148 495 -187 83 751 81 -179 540 355
4816 355 -511 356 585 100 162 344 21 -279 466 35 -28 223 3 -562 315 48 -272 -92 515 -675
4836 -675 -614 334 -227 -578 260 38 -543 261 194 -405 -366 386 -441 -253 8 -152 -350 487 -94 -739 133
4857 133 54 -803 -226 -29 -1001 -508 236 -430 -633 -32 -216 -937 -196 73 -620 -9 227 -475 -110 221
4877 221 -424 -263 316 -144 -567 369 311 -310 116 370 -336 -437 154 -229 -323 -140 87 -485 119 504 -473
4898 -473 90 133 -408 -94 378 -378 -99 394 137 -214 523 430 -91 694 540 -208 105 702 -33 -19 834
4919 834 437 -269 714 552 247 455 711 -170 191 771 69 -30 713 147 45 692 353 -177 218 498
4939 498 173 24 824 153 134 531 288 -204 230 289 -222 337 66 -21 352 373 -264 -325 451 -282 -346 846
4961 846 201 -694 307 272 -655 -345 568 -439 -725 225 -265 -516 -339 236 -588 -162 22 -645 -405 87
4981 87 -246 -200 226 -383 -582 -228 -340 -1132 -112 -197 -705 -34 120 -433 -616 -148 -216 -653 -83 -64 -584
5002 -584 -117 -10 -550 -301 128 -551 -269 219 -373 -369 349 -4 -702 308 175 -635 82 322 -209 -155 638
5023 638 82 -71 374 288 -33 256 477 -38 343 482 -126 166 698 -225 84 477 594 190 538 473 -53
5044 -53 366 779 362 81 533 213 -26 491 415 86 681 261 -79 256 725 -164 403 706 -11 -178 546
5065 546 381 -180 586 559 -196 401 602 110 79 333 16 -35 413 -8 -229 284 103 -355 28 376 -365
5086 -365 -134 594 -522 -365 147 -107 -468 -20 111 -579 -202 -217 -510 -112 -240 -107 -557 122 -312 -446
5106 -446 28 -342 -663 -86 -210 -403 -165 197 -680 -534 103 -436 -603 79 -234 -505 -159 221 -477 -493
5126 -493 353 -351 -417 -156 39 -835 196 142 -265 248 338 -536 -19 289 -340 -178 656 -143 -354 679
5146 679 136 -470 3 148 -162 126 551 -49 -39 605 -74 -72 573 272 186 274 444 -158 172 795 -132 13
5168 13 895 -88 -19 263 244 -85 421 585 -345 443 560 98 170 369 275 95 467 24 -103 493 278 -172
5190 -172 148 708 -216 -161 735 -145 -281 533 44 -209 15 223 -301 126 296 -279 138 487 -11 68 340
5211 340 -67 -443 108 17 -459 -296 20 -334 -140 319 -210 -387 253 -69 -629 -70 140 -535 -356 24
5231 24 -382 -406 203 -317 -755 -129 -285 -464 221 -40 -712 -132 11 -450 -325 -48 -305 -545 96 -41 -549
5252 -549 294 109 -549 -26 -105 -381 67 337 -141 -332 444 134 -244 126 -31 -153 303 580 -448 -28
5272 -28 547 -73 -143 415 162 -185 189 -43 -128 348 389 36 273 401 65 -88 642 156 -79 335 153
5293 153 -411 514 454 108 -126 547 366 18 221 -107 235 483 504 87 684 321 -24 175 407 203 -29
5314 -29 603 142 79 242 356 -81 133 278 42 32 405 -196 91 263 -96 -92 184 -47 -584 136 322 -389
5336 -389 7 422 52 -68 157 131 -536 79 -266 -681 -253 -3 -413 -238 120 -274 -309 -148 -50 -345 -214
5357 -214 -356 -559 -166 -162 -486 -328 32 -675 -368 155 -266 -407 -40 191 -539 11 339 -447 -265 517 -456
5378 -456 -187 -3 -249 -295 32 -8 -360 60 409 -458 -236 97 -271 -168 479 -61 -92 172 147 -170 106
5399 106 0 -95 123 259 126 183 344 133 -90 390 198 -155 363 216 -62 -78 332 322 316 420 171 154
5421 154 351 436 -227 284 304 -90 84 308 -222 -88 319 172 261 457 -86 -44 585 318 -103 185 374
5442 374 -79 -337 322 -28 -331 326 196 -278 -65 88 -191 220 68 -229 -107 297 -278 -525 234 -169
5462 -169 -616 133 -71 -426 -100 -1 -396 -291 97 -457 -588 -23 -345 -497 -143 16 -455 -208 8 -775
5482 -775 -158 97 -525 -484 158 36 -695 61 -91 -332 -186 -48 -373 -332 103 -597 -503 104 -222 -305 61
5503 61 -116 -634 -127 83 -740 -335 237 -48 -456 554 -144 -353 -27 213 -382 -38 525 -60 -292 578
5523 578 -21 9 416 22 47 442 139 -40 440 437 -81 301 255 -48 18 549 115 -46 94 200 46 273
5545 273 30 -192 286 505 -176 27 642 283 43 417 262 -134 317 334 -84 222 355 304 -98 428 173
5566 173 -348 448 302 -550 249 366 -46 -34 286 164 102 239 4 -77 171 -24 -176 382 5 -426 90
5587 90 85 -368 -41 443 -189 -598 86 -256 -431 -76 -42 -585 -284 99 -477 -240 91 -213 -631 -149 -236 -172
5609 -172 -120 -69 -303 -226 -81 -356 -484 -173 -497 -476 7 -7 -982 -125 195 -382 -472 -61 -357 -21 -21 -551 -299
5632 -299 -25 -151 -367 166 118 -332 97 -23 -432 -361 130 -177 -171 301 -23 -24 327 85 -297 77 154 -66
5654 -66 130 64 -182 16 421 334 -274 544 108 154 172 615 -513 -56 548 77 -22 294 68 38 595 491
5676 491 31 142 123 10 267 285 -140 59 624 -16 -42 409 324 -325 412 450 -334 105 334 -227 119 440
5698 440 214 -252 107 41 -46 143 154 -319 119 -65 -382 -5 -38 -70 -374 4 300 -375 -155 91 -211 -326
5720 -326 292 -60 -94 302 -136 -121 -22 164 -505 17 -113 -463 -270 -98 -383 -313 160 -519 -391 134 -372
5741 -372 -563 -95 201 -443 -40 327 -288 -557 227 -342 -355 -74 -178 -690 -322 -214 -464 284 219 -51 -83
5762 -83 175 -353 -226 -21 300 -604 380 365 -63 -83 444 -176 -204 -21 -142 -288 150 219 -285 257 85 -49
5784 -49 113 192 -78 -273 402 -181 -26 331 7 -116 431 437 22 51 386 -31 -66 310 163 261 308 105 22
5807 22 359 454 -301 -94 230 -90 109 246 -10 41 653 23 -151 378 206 -238 -158 114 -80 -58 86 -15
5829 -15 -33 -102 -113 52 -135 100 -230 33 -155 -376 39 415 63 -365 183 38 -642 65 62 -338 -171 206
5851 206 -127 -166 96 -138 -242 -93 -347 -316 122 -110 -471 -76 -154 -531 -76 -123 -624 -237 330 -103 -286
5872 -286 -115 144 -403 -16 325 -116 -187 -8 -365 -214 -2 -432 -123 145 -217 -262 154 178 -486 -241 171
5893 171 32 -375 239 115 -348 6 267 -337 169 47 -90 200 358 -86 15 184 -85 17 325 76
5913 76 28 443 431 -64 464 376 71 259 788 138 -163 462 32 -22 340 409 65 128 533 -87 63 505
5935 505 92 -166 372 -25 -102 419 194 77 53 417 85 -152 314 66 -218 295 269 -175 173 270 35
5956 35 69 107 266 -102 249 -172 -195 223 -11 -44 379 236 -391 53 215 -192 -77 297 -146 -278 53 -26
5978 -26 -589 -98 83 -313 -134 1 -186 -396 34 -402 -462 363 -342 -177 -103 -78 -164 -81 283 -318 -248 108
6000 108 -27 -144 -23 154 -213 -212 235 -214 53 146 -20 -118 240 37 -238 5 -279 -109 -125 36 -500 54
6022 54 289 -300 -202 23 -397 -173 196 -48 -261 124 125 43 190 251 -132 107 328 -141 135 476 104 14
6044 14 484 167 55 261 574 -79 -224 432 204 -56 227 282 58 500 363 -278 256 131 -145 28 171
6065 171 -76 97 545 -107 147 165 286 -62 216 400 -85 -47 435 61 -45 -153 85 -125 -11 64 -141
6086 -141 202 -67 -188 -38 22 -456 52 241 -50 -349 -214 78 -325 -206 89 -365 -224 -22 -200 -519
6106 -519 90 -234 23 10 -166 -340 153 -200 -313 -101 132 -369 -203 201 -492 -673 -121 45 -489 74
6126 74 106 -121 170 -7 -175 -347 277 95 -256 -303 149 -185 290 184 -207 -30 153 -194 -224 421 -125
6147 -125 -383 163 -271 -352 230 82 -189 120 306 -192 -192 370 145 -95 541 111 -111 384 415 -39 -35 351
6169 351 -19 136 532 -52 179 361 60 94 167 169 224 247 71 -19 -74 337 28 300 291 56 -86 86 11 239
6193 239 387 316 -258 -41 355 136 -166 249 -7 -141 183 314 -106 -173 202 -91 -86 276 -66 46 278
6214 278 -55 -403 30 5 88 -85 3 -299 -65 -120 -411 -135 45 16 -348 5 -70 -318 -266 102 17 -101 -50
6237 -50 -126 -184 137 -205 -234 70 -178 -234 56 -24 -437 -109 202 90 -90 280 -214 -164 -83 11 -142 -427 26
6260 26 -250 -135 141 -212 -154 4 -103 -115 186 226 -97 90 77 -329 -141 385 -123 -207 427 159 -2 159
6282 159 426 40 122 416 -175 52 306 396 50 249 -24 227 211 186 -70 235 163 25 -109 114 14 151
6304 151 396 -72 282 414 239 206 20 -48 34 46 106 150 -122 11 -114 53 251 103 -605 340 154 -493
6326 -493 -53 265 -6 -93 82 58 8 11 23 -63 3 -148 -221 -106 -161 -169 -350 156 -363 -273 -89 -142 -115 44 47 10
6352 10 -45 93 -239 -294 -15 -434 -300 201 136 -174 -41 -85 -586 -170 -58 -338 -214 -295 -65 -311 -26 -232
6374 -232 -303 -305 107 -243 -267 15 -391 -575 46 -36 -145 -14 -52 -83 -18 -35 -39 -49 183 -115 -243 471 -282 -58
6398 -58 314 108 -319 -22 151 -280 -38 436 -164 98 -16 -97 -125 70 -38 -113 -24 -98 -209 47 358 -313
6420 -313 161 469 -42 197 39 321 -160 -25 321 17 -64 239 -61 163 376 205 28 361 154 159 -25
6441 -25 159 191 187 142 84 93 184 -31 -33 273 115 -96 238 -148 -307 223 8 -153 -244 196 -292 -213 -62 -34 -28
6466 -28 20 -165 50 124 -20 -113 -180 -32 -462 -229 286 -177 -345 -182 -249 -256 -344 -92 -271 -329 44 -184 -103 -170
6490 -170 74 -222 -199 50 -280 22 174 -127 -68 -131 -198 -236 -78 -99 -338 92 221 -367 95 -23 -38 -309
6512 -309 7 -218 -193 -181 -31 -319 -121 50 -44 99 -59 24 -23 661 221 -496 136 -37 -105 -25 -46 35 139
6535 139 192 28 -102 305 27 -101 174 4 360 -111 175 83 233 156 27 119 220 -293 55 394 215
6556 215 68 330 139 -211 200 281 -275 -2 160 -166 83 258 57 -246 129 -158 -101 -139 -337 78 -24
6577 -24 232 -334 -159 222 -25 9 275 224 -169 -39 37 -238 43 -177 -166 -234 -23 138 -144 76 129 -232
6599 -232 59 -173 -359 96 -66 -210 -144 -232 -181 -444 -54 186 -107 41 -228 -144 275 28 -186 31 105 0
6621 0 -161 0 -188 -63 76 158 -261 -118 252 -443 -128 -13 -24 -85 -104 -41 -296 79 -96 -409 134 -97
6643 -97 -82 -170 -2 -77 -95 -171 113 -243 175 153 -183 -26 372 -203 -69 368 -23 -298 78 -123 17 -106
6665 -106 -69 -36 220 27 -156 255 251 168 229 420 267 82 65 7 -434 36 133 114 -40 271 38 -178 287
6688 287 -68 -59 -1 258 245 -92 282 4 309 298 -59 -263 52 147 -164 254 -22 4 -16 534 -154 -3 178
6711 178 -69 -110 254 -186 -535 88 99 27 148 35 -248 -68 -54 -80 -84 -54 -289 17 157 -49 156 -114 -55
6734 -55 -178 -69 -53 -104 98 5 -341 -79 240 239 -147 -88 -58 -160 186 -149 -219 -157 -65 -191 -115 -138 186 -58
6758 -58 49 -116 -278 -274 -167 -176 -278 163 -44 -199 -117 179 32 25 -49 36 174 -175 -48 -12 183 -68 -138 -40
6782 -40 218 -138 139 119 -302 44 79 62 -11 -230 90 294 430 -81 -9 -32 122 -138 13 185 31 131
6804 131 214 126 -13 37 138 -336 191 209 178 251 105 177 -11 181 -211 84 255 79 9 194 133 245 230
6827 230 117 52 62 243 -135 32 246 109 -96 124 9 -332 -98 248 -10 138 47 -264 18 116 -207
6848 -207 -173 42 -74 -97 101 95 -76 179 164 -255 -108 2 -284 -225 -173 56 -232 244 -79 -204 -98 319
6870 319 -112 -228 7 47 -86 -149 -32 -164 92 -156 -250 -175 48 -160 -119 -90 8 -394 33 -30 58 105 141 -114
6894 -114 -115 159 -255 -71 60 -109 -133 400 8 81 79 49 52 -206 283 -89 -305 -99 -38 37 67 123 21 58 84
6919 84 -79 -75 43 -71 169 145 228 200 93 299 -27 272 428 -105 -84 78 201 -19 187 -73 -92 468 195
6942 195 150 25 288 -19 -97 -97 66 165 211 11 106 192 138 6 130 23 -81 271 146 -136 -126 1 316
6965 316 -126 -59 70 -33 128 22 -233 -162 114 -30 -169 -51 199 -189 163 -30 -309 -75 -116 -202 -161 284
6987 284 -117 -210 -175 -226 139 -53 -152 48 1 23 -159 -246 -9 17 -5 112 -467 89 8 -267 -223 165 -58 -19
7011 -19 -46 68 -94 75 -80 -195 -115 -146 178 -156 -251 -65 -210 -92 -185 133 -138 161 -128 -42 -43 -55 -63 327
7035 327 176 51 -23 455 91 6 182 71 -125 -34 258 -74 -43 6 -44 -351 144 -160 188 -16 -116 -81
7057 -81 143 -81 125 99 -320 133 176 205 -23 245 167 281 37 -126 -299 -266 557 189 -141 33 -98 223
7079 223 223 -43 -370 -207 125 -81 15 67 -56 -93 -9 103 -122 -6 -61 -267 -111 251 -67 -182 219 -193
7101 -193 -154 -103 79 -388 112 13 40 -149 -49 16 -332 86 305 -161 -29 -144 -268 -227 124 -312 -10 -148
7123 -148 -196 -44 -143 192 234 -142 -83 -167 -209 -85 -97 -396 3 210 -304 16 -241 -125 -25 181 63 -50
7145 -50 -194 172 -86 124 -159 61 165 -19 -116 119 137 -26 -53 100 -75 -113 181 102 -76 26 121 84 -34
7168 -34 -8 -222 212 88 190 -7 447 23 -122 276 37 168 -231 290 174 193 264 173 -93 472 137 -92
7190 -92 125 101 -69 145 223 104 37 135 124 -102 130 -12 146 191 3 115 22 201 48 96 179 196 142 -58
7214 -58 -33 97 290 -128 -31 -238 -98 1 -4 43 -13 124 132 9 -171 -54 -285 54 10 -327 21 -132 -174 -178 -4
7239 -4 -85 -202 -36 -178 -426 -79 66 -67 -76 -36 -184 -322 10 45 141 -252 28 -21 -357 107 -271 -269 -114 304
7263 304 -150 65 -79 -83 195 50 -284 -161 82 73 -70 322 -79 -11 39 -100 90 2 271 42 21 290 -168
7286 -168 -48 247 98 -130 115 112 -44 -298 63 237 256 247 322 -55 -165 -42 -172 -23 225 160 79 141 30
7309 30 -179 39 58 170 268 -251 102 -218 246 59 151 177 -73 38 -160 86 49 78 -45 -243 88 169 100
7332 100 152 218 -35 -320 -122 -27 39 55 -103 -271 132 13 -362 100 127 45 -31 24 -146 -146 6 44 -47 -45 104
7357 104 37 22 -280 61 -55 -165 -114 -203 32 65 -72 -13 -53 43 194 -59 -2 14 133 -120 -202 -4 44 -71
7381 -71 -91 453 -182 -22 17 138 93 142 -105 -60 91 102 21 1 228 97 43 340 241 -66 315 339 94 -165
7405 -165 -75 66 178 120 270 -128 238 63 76 176 -195 -190 -78 92 22 7 -18 -91 10 25 88 -193 -154 11
7429 11 -56 -70 28 273 -20 69 129 45 102 110 -31 184 -63 69 -32 -111 -16 50 203 -41 -13 225 -340 24 88
7454 88 64 -307 121 -57 -74 -88 -141 -166 394 47 -114 -71 -243 -109 76 250 89 -118 -324 -100 81 44 112
7477 112 -52 29 1 -6 147 183 40 86 -90 -18 -172 -55 -135 25 -232 133 -26 -25 145 151 -102 97 -48 -199
7501 -199 128 58 -189 -303 142 -251 -36 -167 147 -120 -177 -31 61 23 151 -312 262 356 -6 68 69 -182 -122
7524 -122 142 296 198 -59 205 22 -236 -6 182 153 102 91 128 51 -112 95 103 -29 171 65 -76 -132 94
7547 94 151 15 -59 92 202 140 11 151 -81 -33 191 -35 -107 -54 79 138 88 46 -313 132 -146 54 -127
7570 -127 -33 144 39 310 47 129 -5 -32 -90 61 184 -166 14 199 241 -31 381 15 -361 -178 109 -81
7592 -81 -57 -42 166 94 -152 -142 -110 -154 -89 -221 -27 -297 -333 -114 36 -101 28 89 -139 46 42 -148 65 -384
7616 -384 251 -274 -151 -123 -245 45 -366 180 -170 79 88 -80 98 139 -93 -156 68 -288 -186 -268 276 -142
7638 -142 113 222 5 26 -9 -433 177 -38 -133 -32 103 -51 -249 -114 -45 41 139 -135 -459 272 55 8
7660 8 -89 -200 91 -108 51 -57 133 271 -138 -280 50 -192 -13 -149 226 110 199 197 -211 69 -272 159
7682 159 33 -42 321 -55 2 -121 -42 -188 210 52 112 159 59 78 -43 -25 83 101 -242 -245 75 45 168 -2
7706 -2 397 189 229 -126 129 -211 -59 -54 46 137 316 43 -18 141 -180 -164 220 -22 192 103 215 39 -118
7729 -118 -196 -204 -49 179 97 -277 -50 18 -2 -225 -342 179 -12 272 210 -98 72 -112 -52 -104 -118 -36 57 -142
7753 -142 -147 -29 -71 -123 -341 95 106 -339 -5 -29 -250 153 -143 135 -45 -301 -7 -47 -71 377 16 133 376
7776 376 56 190 164 -129 138 16 -233 -291 -33 -239 -98 -15 -40 -317 83 189 -134 -4 -100 -90 120 -65
7798 -65 20 53 218 36 -2 -67 120 -79 -44 22 82 18 72 442 86 256 -36 172 -92 134 -49 151 124 -237
7822 -237 287 -226 96 -93 -243 74 -384 -73 75 202 184 101 107 136 261 -172 -115 -11 -145 198 -57 -266
7844 -266 -79 212 258 -249 -150 89 -259 -21 -163 49 -70 40 165 -171 -168 -8 -47 -109 -126 -30 -159 -46 -65
7867 -65 -117 0 75 -107 -58 50 -225 50 55 -177 -281 -113 -36 177 28 -134 57 0 -95 -244 134 126 -106 62
7891 62 -78 102 18 248 -69 27 -154 274 -189 188 21 75 12 80 182 1 -44 -29 -133 -26 252 160 7
7914 7 -224 -126 -319 148 -87 92 85 274 -26 -209 -70 -176 -102 290 204 171 62 139 134 153 25 118 234 59
7938 59 54 -46 -73 43 131 42 -51 -113 132 196 231 -80 204 224 -145 221 2 -161 14 -170 -142 97 -49 -156
7962 -156 63 -10 -144 -96 -61 -302 3 85 -185 197 170 -193 -67 141 23 -113 -138 94 -26 -51 -171 -24
7984 -24 -156 -103 -48 -309 141 -232 -286 213 -149 -246 -18 207 273 84 -279 -194 -56 -140 14 -165 -26 194 41
8007 41 -241 8 52 -216 237 55 -186 -18 -39 -36 -164 60 -19 34 -35 215 -253 192 -365 -273 84 42 276
8030 276 -47 -141 217 -90 -120 -99 -6 18 161 176 65 -32 -298 6 75 39 46 181 112 -75 42 -29 -129 57
8054 57 -77 135 21 75 44 -34 77 -41 -203 -52 149 214 198 65 153 178 -159 -330 89 177 88 383 244
8077 244 147 -142 -29 -31 -157 170 80 -201 93 -52 -34 106 -47 77 97 -165 173 16 -353 -101 -78 -103 272
8100 272 -244 -85 128 234 -27 28 108 -318 54 -126 -313 85 -123 -40 -14 -207 127 -63 -177 92 -184
8121 -184 119 77 167 -136 -178 24 82 127 -241 321 -297 -66 -103 409 42 -242 -104 147 7 -112 373 203
8143 203 -146 170 137 -193 -68 -127 -235 -71 -60 -283 285 -102 -19 -15 -28 54 169 263 146 82 155 5 -158 10
8167 10 218 -127 -79 161 79 55 -192 -244 -136 -178 95 -220 134 151 -4 -164 187 -245 -93 101 -10 -67 261
8190 261 274
8191B74
##END NTUPLES=NMR FID
##END=
