##TITLE=1H_EC-3189(43)
 CDCl3, 8 sc, 
 18.10.2019
##JCAMPDX= 6.0         $$ Bruker NMR JCAMP-DX V2.0
##DATA TYPE= NMR FID
##DATA CLASS= NTUPLES
##ORIGIN= UXNMR, Bruker Analytische Messtechnik GmbH
##OWNER= root
$$ XWIN-NMR		Version 3.5
$$ Fri Oct 18 15:10:14 2019 Russian Standard Time (UT+4h)  she@DPX200
##.OBSERVE FREQUENCY= 200.1315
##.OBSERVE NUCLEUS= ^1H
##.DELAY= (6, 6)
##.ACQUISITION MODE= SIMULTANEOUS
##.ACQUISITION SCHEME= undefined
##.AVERAGES= 8
##.DIGITISER RES= 18
##SPECTROMETER/DATA SYSTEM= spect
##.PULSE SEQUENCE= zg30
##.SOLVENT NAME= CDCl3
##.SHIFT REFERENCE= (INTERNAL, CDCl3, 0, 15.7039)
##AUDIT TRAIL= $$ (NUMBER, WHEN, WHO, WHERE, WHAT)
$$ ##TITLE= Audit trail, XWIN-NMR		Version 3.5
$$ ##JCAMPDX= 5.01
$$ ##ORIGIN= Bruker BioSpin GmbH
$$ ##OWNER= she
$$ F:/spectra/data/she/nmr/H-F/1/audita.txt
$$ ##AUDIT TRAIL=  $$ (NUMBER, WHEN, WHO, WHERE, WHAT)
(   1,<2019-10-18 15:08:51.34 +0400>,<she>,<DPX200>,
      <created by zg, POWCHK disabled, PULCHK disabled
       configuration hash MD5:
       00 E9 B6 7A A2 85 ED C7 34 08 36 98 17 FE 4E 26
       data hash MD5: 16K
       32 5A 2B FE E7 1F 18 13 84 B7 80 52 48 FB 59 D5>)
$$ ##END=
$$ 
$$ hash MD5
$$ 85 B8 74 D9 79 25 CD 3A 1A 23 36 DC EF BB 20 72
##$RELAX= 
##$RELAX= 
##$RELAX= 
##$RELAX= 
##$RELAX= 
##$RELAX= 
$$ Bruker specific parameters
$$ --------------------------
##$DU= <F:/spectra>
##$EXPNO= 1
##$NAME= <H-F>
##$PROCNO= 1
##$TYPE= <nmr>
##$USER= <she>
##$AMP= (0..31)
100 100 100 100 100 100 100 100 100 100 100 100 100 100 100 100 100 100 
100 100 100 100 100 100 100 100 100 100 100 100 100 100 
##$AQSEQ= 0
##$AQ_mod= 1
##$AUNM= <au_zg>
##$AUTOPOS= <>
##$BF1= 200.13
##$BF2= 200.13
##$BF3= 200.13
##$BF4= 200.13
##$BF5= 200.13
##$BF6= 200.13
##$BF7= 200.13
##$BF8= 200.13
##$BYTORDA= 1
##$CFDGTYP= 0
##$CFRGTYP= 5
##$CHEMSTR= <none>
##$CNST= (0..31)
1 1 145 1 1 1 1 1 1 1 1 1 1 1 1 1 1 1 1 1 1 1 1 1 1 1 1 1 1 1 1 1 
##$CPDPRG= <>
##$CPDPRG1= <>
##$CPDPRG2= <>
##$CPDPRG3= <>
##$CPDPRG4= <mlev>
##$CPDPRG5= <mlev>
##$CPDPRG6= <mlev>
##$CPDPRG7= <mlev>
##$CPDPRG8= <mlev>
##$CPDPRGB= <>
##$CPDPRGT= <>
##$D= (0..31)
0 1.2 0 0 0 0 0 0 0 0.06 0 0.03 0 0 0 0 0.0002 0 0 0 0 0 0 0 0 0 0 0 0 
0 0 0 
##$DATE= 1571396930
##$DBL= (0..7)
120 120 120 120 120 120 120 120 
##$DBP= (0..7)
150 150 150 150 150 150 150 150 
##$DBP07= 0
##$DBPNAM0= <>
##$DBPNAM1= <>
##$DBPNAM2= <>
##$DBPNAM3= <>
##$DBPNAM4= <>
##$DBPNAM5= <>
##$DBPNAM6= <>
##$DBPNAM7= <>
##$DBPOAL= (0..7)
0.5 0.5 0.5 0.5 0.5 0.5 0.5 0.5 
##$DBPOFFS= (0..7)
0 0 0 0 0 0 0 0 
##$DE= 6
##$DECBNUC= <off>
##$DECIM= 24
##$DECNUC= <off>
##$DECSTAT= 4
##$DIGMOD= 1
##$DIGTYP= 9
##$DL= (0..7)
0 120 120 120 120 120 120 120 
##$DP= (0..7)
150 150 150 150 150 150 150 150 
##$DP07= 0
##$DPNAME0= <>
##$DPNAME1= <>
##$DPNAME2= <>
##$DPNAME3= <>
##$DPNAME4= <>
##$DPNAME5= <>
##$DPNAME6= <>
##$DPNAME7= <>
##$DPOAL= (0..7)
0.5 0.5 0.5 0.5 0.5 0.5 0.5 0.5 
##$DPOFFS= (0..7)
0 0 0 0 0 0 0 0 
##$DQDMODE= 0
##$DR= 18
##$DS= 0
##$DSLIST= <SSSSSSSSSSSSSSS>
$$ [...]
##$SUBNAM2= <"">
##$SUBNAM3= <"">
##$SUBNAM4= <"">
##$SUBNAM5= <"">
##$SUBNAM6= <"">
##$SUBNAM7= <"">
##$SUBNAM8= <"">
##$SUBNAM9= <"">
##$SW= 24.0689530833862
##$SWIBOX= (0..15)
0 0 2 0 0 0 0 0 0 0 0 0 0 0 0 0 
##$SW_h= 4816.95568400771
##$TD= 16384
##$TD0= 1
##$TE= 0
##$TE2= 300
##$TE3= 300
##$TEG= 300
##$TL= (0..7)
0 120 120 120 120 120 120 120 
##$TP= (0..7)
150 150 150 150 150 150 150 150 
##$TP07= 0
##$TPNAME0= <>
##$TPNAME1= <>
##$TPNAME2= <>
##$TPNAME3= <>
##$TPNAME4= <>
##$TPNAME5= <>
##$TPNAME6= <>
##$TPNAME7= <>
##$TPOAL= (0..7)
0.5 0.5 0.5 0.5 0.5 0.5 0.5 0.5 
##$TPOFFS= (0..7)
0 0 0 0 0 0 0 0 
##$TUNHIN= 0
##$TUNHOUT= 0
##$TUNXOUT= 0
##$USERA1= <user>
##$USERA2= <user>
##$USERA3= <user>
##$USERA4= <user>
##$USERA5= <user>
##$V9= 5
##$VALIST= <valist>
##$VCLIST= <CCCCCCCCCCCCCCC>
##$VD= 0
##$VDLIST= <DDDDDDDDDDDDDDD>
##$VPLIST= <PPPPPPPPPPPPPPP>
##$VTLIST= <TTTTTTTTTTTTTTT>
##$WBST= 1024
##$WBSW= 4
##$XGAIN= (0..3)
0 0 0 0 
##$XL= 0
##$YL= 0
##$YMAX_a= 345869
##$YMIN_a= -331369
##$ZGOPTNS= <>
##$ZL1= 120
##$ZL2= 120
##$ZL3= 120
##$ZL4= 120
##$ABSF1= 10
##$ABSF2= 0
##$ABSG= 5
##$ABSL= 3
##$ALPHA= 0
##$AQORDER= 0
##$ASSFAC= 0
##$ASSFACI= 0
##$ASSFACX= 0
##$ASSWID= 0
##$AUNMP= <proc_1d>
##$AZFE= 0.1
##$AZFW= 0.1
##$BCFW= 1
##$BC_mod= 2
##$BYTORDP= 1
##$COROFFS= 0
##$CY= 11.3945322036743
##$DATMOD= 1
##$DC= 2
##$DFILT= <>
##$DTYPP= 0
##$F1P= 20.1720416913024
##$F2P= 0.152960286110954
##$FCOR= 0.5
##$FTSIZE= 0
##$FT_mod= 4
##$GAMMA= 1
##$GB= 0.15
##$INTBC= 1
##$INTSCL= 1
##$ISEN= 128
##$LB= 0.24
##$LEV0= 0
##$LPBIN= 0
##$MAXI= 10000
##$MC2= 0
##$MEAN= 0
##$ME_mod= 0
##$MI= 1.114404
##$NCOEF= 0
##$NC_proc= 0
##$NLEV= 6
##$NOISF1= 3.799351
##$NOISF2= 2.8
##$NSP= 1
##$NTH_PI= 0
##$NZP= 0
##$OFFSET= 15.70392
##$PC= 1
##$PHC0= -9575.412
##$PHC1= 29.80088
##$PH_mod= 1
##$PKNL= yes
##$PPARMOD= 0
##$PSCAL= 0
##$PSIGN= 0
##$REVERSE= no
##$SF= 200.130013532006
##$SI= 16384
##$SIGF1= 3
##$SIGF2= 2
##$SINO= 400
##$SIOLD= 16384
##$SREGLST= <1H.CDCl3>
##$SSB= 0
##$STSI= 0
##$STSR= 0
##$SW_p= 3612.71676300578
##$SYMM= 0
##$S_DEV= 0
##$TDeff= 0
##$TDoff= 0
##$TI= <>
##$TILT= no
##$TM1= 0
##$TM2= 0
##$TOPLEV= 0
##$USERP1= <user>
##$USERP2= <user>
##$USERP3= <user>
##$USERP4= <user>
##$USERP5= <user>
##$WDW= 1
##$XDIM= 8192
##$YMAX_p= 0
##$YMIN_p= 0
$$ End of Bruker specific parameters
$$ ---------------------------------
##NTUPLES= NMR FID
##VAR_NAME=  TIME,          FID/REAL,        FID/IMAG
##SYMBOL=    X,             R,               I
##VAR_TYPE=  INDEPENDENT,   DEPENDENT,       DEPENDENT
##VAR_FORM=  AFFN,          ASDF,            ASDF
##VAR_DIM=   8192,          8192,            8192
##UNITS=     SECONDS,       ARBITRARY UNITS, ARBITRARY UNITS
##FACTOR=    0.0002076,     1,               1
##FIRST=     0,             0,               0
##LAST=      1.7004516,     0,               0
##MIN=       0,             -331369,         0
##MAX=       1.7004516,     345869,          0
$$ Real data points
##PAGE= N=1
##DATA TABLE= (X++(R..R)), XYDATA
$$ [...]
1863B97j24m05J96j72O9K37l04O43n56K83k3n1j31k1J87J06l26N5l9L9j5L0K4
$$ 297 173 -232 -36 -208 -139 98 -206 437 -119 164 141 90 -41 -62 125 231 -95 -40 -79 -40 -55 -25 -1
1886aR4j63M5J72j62L6j60p6M39k72J8J1m2j04K71J41l68N7K41Q2k90%J81k54
$$ -1 93 -70 -25 147 -15 21 -139 -215 224 -48 -30 -19 -61 -165 106 247 -121 -64 177 259 -31 -31 150 -104
1910a04K75m43J15K05k7j65K29L1k93M86k18J71j02k61M4R4M2J52k38j05MQk15
$$ -104 171 -272 -157 48 21 -144 85 116 -177 309 91 262 160 -101 -57 37 79 231 -7 -112 -108 -100 -315
1933c15K02M0m2J86j28m86O21r0K0q7o6K22j98J91qj06J48l27K58o5M4j10l2J79
$$ -315 -113 -73 -115 71 -57 -543 78 -12 8 -79 -145 77 -121 70 62 -44 104 -223 35 -30 14 -96 -128 51
1957E1k3Q0K7j08j97R8j06K12k14K13QL8k25oJ0j29N18k26k22J32k05N4L62j61
$$ 51 28 108 135 27 -170 -72 -178 34 -180 33 41 79 -146 -152 -142 -271 247 21 -201 -69 -274 -220 142 -19
1981a9J90J49j37j55j0J56l70r8R7R4J36J69k45k21m8J25R7J71jk08K04M5k10
$$ -19 171 320 183 28 18 174 -196 -294 -197 -103 33 202 -43 -264 -312 -187 -90 81 80 -128 76 121 -89
2004h9L72k08j60J48k43O7N4j3P2J63L2j86N3j42K16l88K41j22J87J35l8o7N2
$$ -89 283 75 -85 63 -180 -113 -59 -72 0 163 195 9 62 -80 136 -252 -11 -133 54 189 151 84 136
2027A36j56K13l04K92l1N9l99K49K91m92J62j15K3j49K00J49m07L45k31M0J83
$$ 136 -20 193 -111 181 150 209 -190 59 350 -142 20 -95 -72 -221 -21 128 -279 66 -165 -125 58
2048E8j02K8jo5J19n0m0N3o3K93m39M49p4J4n03L33J48l53J27q8J7J23j9k28L38
$$ 58 -44 -16 -17 -82 37 -13 -53 0 -63 230 -209 240 166 180 -323 10 158 -195 -68 -156 -139 -16 -35 -263 75
2073G5J8j67k42M30l17M43k16L62l97q7J76J9l7m2l51N25k72j88L13j03k3K63
$$ 75 93 -74 -316 114 -203 240 24 386 -11 -98 78 97 60 18 -333 192 -80 -268 45 -58 -81 182
2095A82j23j55k18L78Q8k61K29m8J86l80J8J61J40j60l7j88J46P2oJ81j63R6Q3
$$ 182 59 -96 -314 64 152 -109 120 72 258 -122 -104 57 197 37 0 -188 -42 30 24 205 42 138 221
2118B21k23N0K49j24k2j63nJ72n14M30j21L8k4q3J15Q0k30R1K28m54J22J11Q9
$$ 221 -2 48 297 173 151 -12 -17 155 -359 71 -50 -12 -36 -119 -4 76 -154 -63 165 -289 -167 -56 33
2141C3n5l4K91k74j9k6j41m9K36R4L20n81L59l68J2O4k69M62L8Mn7o9K92j98J4
$$ 33 -22 -56 235 -39 -58 -84 -225 -274 -38 56 376 -205 154 -214 -202 -138 -407 55 93 97 40 -29 263 65 79
2166G9j6m6q1%L1k69K9J03K79l2l19N28k65j22K87j97K90j57K23k43k14K6J16
$$ 79 63 17 -64 -64 -33 -302 -273 -170 109 77 -242 286 21 -101 186 -11 279 122 345 102 -112 -86 30
2189C0j31O9j40J02O2l2J96k75J69J4k76L88r3j45J13K3P5j57J88j58j17K34L4
$$ 30 -101 -32 -172 -70 -8 -40 156 -119 50 64 -212 176 83 -62 51 74 149 -8 180 22 -95 139 173
2212A73J17n08L7K32p7r3L25j07l70L05j96K02j39K71m81N11l23J56O2j7p8k2
$$ 173 290 -218 -181 51 -26 -119 206 99 -271 34 -162 40 -99 172 -309 202 -121 35 97 80 2 -20
2234b0K13j73J46j49q9K37j70Q0J4l32J35o1K38j69L8K81k50L2Q4k26L3K74n3
$$ -20 193 20 166 17 -72 165 -5 75 89 -243 -108 -169 69 -100 -62 219 -31 1 85 -141 -108 166 113
2257A13PL2q0N6j9J28l01L06k91Q2j43K10l11K08N4k78K34kJ06J45l09O0j92J33
$$ 113 120 152 72 128 109 237 -64 242 -49 33 -110 100 -211 -3 51 -227 7 5 111 256 -53 7 -185 -52
2281e2l6m5J00j33K43j53j7J07k97KN39l84M4L10k86l18R07o32J07m4K00j84R8
$$ -52 -88 -133 -33 -166 77 -76 -93 14 -283 -281 258 -126 -82 228 -58 -376 531 -101 6 -38 162 -22 76
2304G6k0M20m49q8n6k7K63k27J34j44J45K29l59K25q3L5rj93l1K60k49o5%K62
$$ 76 56 476 27 -61 -117 -144 119 -108 26 -118 27 256 -103 122 39 74 65 -128 -159 101 -148 -213 -213 49
2328D9l9L9p8k64L57k35P0M25l78j61L00j25L17k38j34K9K1K2j50K5MJ48n6M8
$$ 49 10 49 -29 -293 64 -171 -101 324 -54 -215 85 -40 277 39 -95 -66 -45 -23 -173 -148 -144 4 -52 -4
2352dK40l35K9R0M5j48J27pj23M08n84M28l6k58j15J06K82k60L32j37j35R8k03
$$ -4 236 -99 -70 20 65 -83 44 37 -86 322 -262 166 130 -128 -243 -137 145 -115 217 80 -55 43 -160
2375a60J73J89q2p5j22j08J48k4L18o4J32l05j74k1L14Q6k7r7j65J93k10J21o8
$$ -160 13 202 120 45 -77 -185 -37 -61 257 193 325 20 -154 -175 139 225 198 101 -64 129 -81 40 -28
2398b8K79k58L6K47m07J4M25k36K18n17M63j79j11J27l9n0R8M0o31M94J07p6j56
$$ -28 251 -7 29 276 -131 -117 308 72 290 -227 236 57 -54 73 34 -16 82 122 -509 -15 92 16 -140
2421a40L08k87J90J7J7q0M0J34k5l08o1K05J43l4j40R0k98k7K35L6J22r6Q0j4
$$ -140 168 -119 71 88 105 25 65 199 174 -134 -195 10 153 119 -21 69 -229 -256 -21 15 137 41 121 107
2445A07Q6J95l17j45J58k11J01o2J4K39k22J01m6n0k34L13Kn9j54P7J54K0j39
$$ 107 193 388 71 -74 84 -127 -26 -88 -74 165 -57 44 -2 -52 -286 27 29 -30 -184 -107 47 67 -72
2468g2R7j73j0Q9j34M48l10q8L10k8Km5k43K48j99L11l6l80K30j59J58l9k54J60
$$ -72 25 -148 -158 -69 -203 245 -65 -153 157 129 131 86 -157 91 -108 203 167 -213 17 -142 16 -23 -277 -117
2492a17j41M38o1k4k35P1L13l81K33J03l68K88j16J3k38K21M8P2O5j38K75l13
$$ -117 -258 180 119 95 -140 -69 244 -137 96 199 -169 119 3 16 -222 -1 47 119 184 46 321 8
2514HM6l05M52k25q7L86Nj98P0k75L6J57o10N89L08m68q4L13j97M0R5N2j43M6
$$ 8 54 -251 201 -24 -111 275 280 82 152 -123 -87 70 -540 49 357 -111 -195 118 -79 -39 56 108 -35 11
2538A1J80p6k74K79j00r3q6L86k69n5J45j64K84J12l11l0K17j77k5j80L23j38
$$ 11 191 115 -159 120 20 -73 -159 227 -42 -97 48 -116 168 280 -31 -61 156 -21 -46 -226 97 -41
2560d1K15k96K70k28L7L7J2R0K06m35P4P4n3P4J08L4Rp5O8m48L44mP9k61L13m78
$$ -41 174 -122 148 -80 -43 -6 6 96 302 -133 -59 15 -38 36 144 178 187 112 180 -268 76 72 151 -110 203 -275
2586b75L65j24J31j18m9M9p9J11J98n72K00K83j54o2j5M9j0M9j72K80O6j99L7
$$ -275 90 -34 97 -21 -70 -21 -100 11 209 -363 -163 120 -34 -96 -111 -62 -72 -23 -195 85 151 -48 -11
2609a1J19j85J70J24j65l04o7L81Q2m22M30j48L9l32L43j97J38j64M9J77o2M2
$$ -11 108 -77 93 217 52 -252 -319 62 144 -278 152 4 43 -289 54 -143 -5 -169 -120 57 -5 37
2631C7J73n29M52m3k34N16o04K21L42k98j68J81Oj62J73p1Q2k01N6O5q5K18j58
$$ 37 210 -319 133 90 -144 372 -232 -11 331 33 -135 46 52 -110 63 -8 74 -127 -71 -6 -91 127 -31
2654c1K13l70J31M64m74j19K51j65J20J18j62n8l38K05L44k6R9j80N5l11K53o0
$$ -31 182 -188 -57 407 -67 -186 65 -100 20 138 -24 -82 -420 -215 129 103 202 22 77 -234 19 -41
2676d1o2L22l16j63L89k79K46J1k99K41k80L24MO6j86K11qL6m36K49Q9l6K30l61
$$ -41 -103 219 -97 -260 129 -150 96 107 -192 49 -231 93 97 163 -23 188 180 216 -220 29 118 82 312 -49
2700d9J98j38k3r3K69k86J27p6j43J40K67l73K80l2J00j09j75J55pj92P0LL21
$$ -49 149 11 -12 -105 164 -122 5 -71 -214 -74 193 -180 100 68 168 59 -116 39 32 -160 -90 -87 234
2723B34j34k12J07J05L8mj43j05K41n6q2k37J92K42l48J76P7k70K12k09ML48n07
$$ 234 100 -112 -5 100 138 134 -9 -114 127 71 -11 -248 -56 186 -162 14 91 -179 33 -176 -172 176 -331
2746c31L40O3j02K81l78j02L51k15J30j5K7M64l55j76n4j06K45J1l30r9K93m16
$$ -331 9 72 -30 251 -127 -229 122 -93 37 22 49 513 158 -18 -72 -178 67 78 -252 -351 -58 -474
2768d74M15k25K91j50K56j84L0j22K57q7l8K01p0n33J81K63k92R9P0J01n1O4q4
$$ -474 -59 -284 7 -143 113 -71 -41 -163 94 7 -31 170 100 -433 -252 11 -281 -182 -112 -11 -62 2 -82
2791h2m9j31K34j26J76k19J19J65R6k30j12M60p1j64M1l08N0q6J53O0j9r3J76
$$ -82 -131 -262 -28 -154 22 -197 -78 87 183 -47 -159 301 230 66 107 -201 -151 -237 -84 -24 -43 -136 40
2814D0k52O6J80J86j15l44M18j03l72N63m9k16K61l74j35M52j47O1k92J97l76
$$ 40 -212 -146 34 220 105 -239 179 76 -296 267 218 2 263 -111 -246 206 59 120 -172 25 -351
2835c51O02o9J0k75J0M3K29j22k31L71k45j99L76k06K9J40J2M3K7m8k16k7qK7
$$ -351 251 182 192 -83 -73 -30 199 77 -154 217 -28 -227 149 -57 -28 112 124 167 194 146 -70 -97 -105 -78
2859g8pq6M91q2l95J24OK96l62J21m1M3J96k22J84k28j48M35k51J52q9j90K14
$$ -78 -85 -171 320 238 -157 -33 -27 269 -93 28 -13 30 226 4 188 -40 -188 247 -4 148 59 -131 83
2882H3n0j82PJ40J52k38o2L47k26J7J75l59m2J64m2P0jJ34j31J97J3l29L88j37
$$ 83 33 -149 -142 -2 150 -88 -150 197 -29 -12 163 -196 -238 -74 -116 -46 -47 87 -44 153 166 -163 225 88
2906H8j32o0M5n4m7K62k44K65L6r2k31L07l35K96j22K5K4J10k00P0j66O6J93k3
$$ 88 -44 -104 -59 -113 -160 102 -142 123 159 67 -164 143 -192 104 -18 7 31 141 -59 11 -155 -89 104 81
2930H1K26k67l31L33J77o7k88k2M3M5N6N6k30J53N7P6l0M4Q0k41l41P13j63j05
$$ 81 307 40 -291 42 219 152 -136 -158 -115 -70 -14 42 -188 -35 22 98 68 112 192 -49 -390 323 160 55
2954E5k94K24M6k26L79l78L59r1l20J78J31R5r0j29K76N8j30J02q1k64M4K0Oj48
$$ 55 -239 -15 31 -195 184 -194 165 74 -246 -68 63 158 68 -61 215 273 143 245 164 -100 -56 -36 -30 -178
2978a78L11k05m6p5K06l22M19J31l68M12m03L10k32l8J45j29Q5J9q4K13R3o1j36
$$ -178 133 -72 -118 -193 13 -309 110 241 -127 285 -118 192 -40 -78 67 -62 23 42 -42 171 264 203 67
3001F7l18J42m9J89j24L0j78K42r5n9K05k60K85n7P4j86j27J70M0m6k34M67k86
$$ 67 -251 -109 -158 31 -93 -63 -241 1 -94 -153 52 -208 77 20 94 -92 -219 -49 -9 -55 -289 178 -108
3024a08J99k33K81j08j24K7j21L68k52L8j25K31J6l01J16q3L75K7k36K14K69m93
$$ -108 91 -142 139 31 -93 -66 -187 181 -71 -33 -158 73 89 -212 -96 -179 196 223 -13 201 470 -23
3046b3j30O5j76M45k30l3p9J73j97K90l91L25k70M8N13j60l84K57K31m73K14k32
$$ -23 -153 -88 -264 181 -49 -82 -161 12 -185 105 -286 39 -231 -183 330 170 -214 43 274 -199 15 -217
3068b17L14K1j23J70J16J17l64J64l99M67l7o4j85q5J97j29N8K2M1k90J04r4o8
$$ -217 97 118 -5 165 281 398 34 198 -201 266 229 165 -20 -105 92 -37 21 43 84 -206 -102 -196 -264
3091b64K60J74r4l72K72L77j94P6l27K83m66N1K31j3Q5m4j82K01j58N8l1j11K64
$$ -264 -4 170 76 -296 -24 353 159 235 -92 191 -275 -224 7 -6 79 35 -147 54 -104 -46 -77 -188 76
3114G6j01K23j04K38j46k56J28k35J91K08m30J23J06N5J30O7l49Lj28O27l08k25
$$ 76 -25 198 94 332 186 -70 58 -177 14 222 -208 -85 21 76 206 273 -76 -73 -201 426 118 -107
3136a07M9L03k70k03L34k87K17p7J23L6j98L00k17q0J8m6k19L93n5J91J36k43
$$ -107 -58 245 -25 -228 106 -181 36 -41 82 118 -80 220 3 -77 -59 -105 -324 69 14 205 341 98
3158I8j3m02M14k94k6j50L79j24L46k65N6J25K25o03K21j40K2J59k53qL14q0n3
$$ 98 85 -317 97 -197 -223 -373 6 -118 228 -37 19 144 369 -234 -13 -153 -131 28 -225 -233 81 1 -52
3181e2J01o4qj9J5J17p1J35r3k68J30J80m2j0L7Mp4j74N8k44M24N2K4k00P7j9
$$ -52 49 -15 -23 -42 -27 90 19 154 61 -207 -77 103 61 51 88 92 18 -156 -98 -342 82 134 158 -42 35 16
3207A6N3j39RQ1L8j12Q3J8P8M7j14L05m08n5j17L58k02j32J54j59J08r1L40q4
$$ 16 69 -70 -61 20 58 -54 29 47 125 172 58 363 -45 -100 -217 141 -61 -193 -39 -198 -90 -181 159 75
3231G5J79n22j01J77L19L1j95K17j73q0J78k3P5k68J69J10k84L35L1l10J45j68
$$ 75 254 -268 -369 -192 127 158 -37 180 7 -73 105 82 157 -111 58 168 -116 219 250 -60 85 -83
3253h3j01K07O9k23K32n9j35k50K5L30O0rQ0k26J05j0L0q3q7J23k3J36l71J36
$$ -83 -184 23 92 -131 101 42 -93 -343 -318 12 72 63 143 -83 22 12 42 -41 -128 -5 -28 108 -263 -127
3277a27K75l8j61J73K3l4N7k25k65N19o6k53j11J53K06j49M0M2P5k12j27J05j7
$$ -127 148 110 -51 122 145 111 168 -57 -322 197 131 -122 -233 -80 126 -23 17 59 134 -78 -205 -100 -117
3300a17J38K1O9J06j92r1p7M12j87m28L70M3j68M4m6J74O3o2n5L68o28K28J33
$$ -117 21 42 111 217 25 -66 -143 269 82 -346 24 67 -101 -57 -103 71 134 72 17 385 -243 -15 118
3323A18jk41K47M5J24l61M0K27j54L10k15M4j98J91J6j88q8n1j9J25R9j54J61
$$ 118 117 -124 123 168 292 -69 -29 198 44 354 139 183 -15 176 192 4 -84 -135 -154 -29 70 -84 77
3346G7k6j33J02M62p95K28J07O5j19j0r0m8Q6J6lK52j45r9L21k04r0J16j18L7
$$ 77 51 -82 20 482 -313 -85 22 87 -32 -42 -132 -180 -94 -78 -81 171 26 -73 248 44 -46 70 -48 -11
3370a1J81m64M25K2k15J46o6K28j03k05K70k11J7N2r2J33j49M3k1n2P2L2m6J38
$$ -11 170 -294 131 153 -62 84 18 246 143 -62 208 -3 14 66 -26 107 -42 1 -20 -72 0 32 -14 124
3394A24k20L09j97m6K98j54k36M96k90k51K85r7lj29K33N7j99j34K72J7l20K08
$$ 124 -96 213 16 -30 268 114 -122 374 84 -167 118 21 18 -111 122 179 -20 -154 118 135 -185 23
3416B3q4NL74n56K68o2r6J19L9J51Q6m02K36j49p1J13k70J51j50M78O4l74l2K63
$$ 23 -61 -56 318 -238 30 -32 -128 -9 30 181 267 -135 101 -48 -119 -6 -276 -125 -275 203 267 -107 -139 124
3440A24j16M5O5l5K15j56m03K57J20m68M02j73L73k60k81L84k98J62n8J22k56
$$ 124 8 53 118 83 298 142 -261 -4 116 -352 50 -123 250 -10 -291 93 -205 -43 -101 21 -235
3461b35J15mk04K24j93M11l70K83NJ8K39j77j80L2O6k98M20k74M8J76n6o5r0P6
$$ -235 -120 -124 -328 -104 -297 114 -256 27 32 50 289 112 -68 -36 30 -268 152 -122 -74 102 46 -19 -109 -33
3485c3j41j06L78n49M19j4j8O1m8J39j31p2J73n5Q6k35K26k75q9L77k10K01o4
$$ -33 -174 -280 98 -451 -32 -46 -64 -3 -51 88 -43 -115 58 3 89 -146 80 -195 -284 93 -117 84 20
3508B0M1j33%K68r0m7k01J36L8k4KK21j57q9J98k8l65J24J25J66p3ln5K00j56
$$ 20 61 -72 -72 196 106 59 -142 -6 32 8 10 231 74 -15 183 155 -210 -86 39 205 132 129 74 274 118
3533A18m31J26J54j83L27k68J84J19k17j43K26M69n34K39N8k88M4r9J48k85L48
$$ 118 -313 -187 -33 -216 111 -157 27 146 -71 -214 12 481 -53 186 244 -44 0 -99 49 -236 112
3554A12j31K35o1m22J2K41R4k4p1j2l10K40K7N5j98L22k20r5L19o0J04k28m2J19
$$ 112 -19 216 155 -267 -255 -14 80 56 -15 -27 -337 -97 -70 -15 -213 109 -111 -206 113 53 157 -71 -113 6
3578Fq9Q1L7k17L51j35J15m1j86J84J57k54K17m33J63K41m48K60J68j41k00K45
$$ 6 -83 -2 35 -182 169 34 149 108 -78 106 263 9 226 -207 -44 197 -251 9 177 36 -164 81
3600H1p9mJ03p2j9L03k17j62O9J35k59K94n5j79J02k6oO0j66P4n1J86Q5k84l7
$$ 81 2 -2 101 29 10 313 96 -66 3 138 -121 173 118 -61 41 15 9 69 -97 -23 -74 112 197 -87 -124
3625a24J87r8M5j52Q1J3p0O5j4Q8M0m14M34L6j84O2J06J81j55j13J52J00m54O87
$$ -124 63 -35 10 -142 -61 -48 -118 -53 -67 21 61 -353 81 117 -67 -5 101 282 127 14 166 266 -188 499
3649D99n40K64k61M3M8j64K8L38n30L41K13m58J54k32O59k37k01NN3k81L64j34
$$ 499 -41 223 -38 5 53 -111 -83 255 -275 66 279 -179 -25 -257 402 165 -36 -31 22 -259 105 -29
3671b9m9L1J78M9j18p4j67N9K44k85M1J74p0j85J89L92m19M68m40J44p0k06k2
$$ -29 -78 -47 131 180 62 -12 -179 -120 124 -161 -120 54 -16 -201 -12 380 -39 429 -11 133 63 -143 -165
3694a65LQ9qJ69J89k29j91J9j45J01K56N0k28j3L02k22k0l0J80j87J83l77K04
$$ -165 -162 -73 -81 88 277 48 -143 -124 -269 -168 88 138 -90 -103 199 -23 -43 -73 107 -80 103 -274 -70
3717g0r6k1K15k38L22l03L41n20M92j60l3L98l33j35J69j4m2J12q4J42o2j12J53
$$ -70 -166 -187 28 -210 112 -191 150 -370 122 -38 -71 327 -6 -141 28 14 -28 84 0 142 80 -32 121
3740A21l21J50j91M49l49j8K24k59K19j5J93j57K6k44J2L25k19j3J81Jj79j1O2
$$ 121 -200 -50 -241 208 -141 -159 65 -194 25 10 203 46 72 -172 -160 165 -54 -67 114 115 -64 -75 -13
3763a3q5P5RJ25m33J53L44n43M78o2k12J90r8Q6l7J74j23j29J36p6N5l63L94p6
$$ -13 -98 -23 -14 111 -322 -169 175 -368 110 48 -164 26 -72 14 -23 151 28 -101 35 -41 14 -349 45 -31
3787c1N9j14j01J35m2J17k70J61M6j50M3P0J83l29K97o1j23N4j96L00L2l02K41
$$ -31 28 -86 -187 -52 -94 23 -247 -86 -40 -190 -147 -77 106 -223 74 13 -110 -56 -252 48 80 -222 19
3810A9J25j07j35R2J69k94P4L41r4j81J1Q1l35P7K5K29j19k11K42j63J13j77N49
$$ 19 144 37 -98 -6 163 -131 -57 284 190 9 20 101 -234 -157 -132 97 -22 -233 9 -154 -41 -218 331
3833C31k57j75m4KrmJ38R8L2j42j00M13j65K0j64Np7K1J03j05j62N2J69R9m9k
$$ 331 74 -101 -145 -143 -152 -156 -18 80 112 -30 -130 283 118 138 -26 -21 -98 -77 26 -79 -241 -189 -20 79 30 28
3859B8j00O0o1J01p8K13P8m33J69L6R5m8l80M99Oj50k72M32J46l38l0j64J51q0
$$ 28 -72 -12 -73 28 -50 163 241 -192 -23 13 108 60 -320 179 185 35 -237 195 341 3 -27 -191 -40 -120
3883a20m0K87N6j03o2J99n8k09J2P9r2n8j60K57p8Mk13M39l98J23l7N3L58Q3l74
$$ -120 -160 127 183 80 18 217 159 -50 -38 41 -51 -109 -269 -12 -90 -86 -299 140 -258 -135 -172 -119 239 322 -52
3908e2R3m05K64l12J40J50N9q5K32k8l36K21K03j48P0L5p3J79k55J39o1k3k3P1
$$ -52 41 -364 -100 -412 -272 -122 -63 -148 84 56 -280 -59 144 -4 66 101 28 207 -48 91 30 7 -16 55
3932E5K78P7l41oJ57J14m53L37l52J84Q1J9j99k08J54o0L10n52M46o9J56j81n8
$$ 55 333 410 69 63 220 334 -119 218 -134 50 131 150 -49 -257 -103 -163 147 -405 41 -28 128 -53 -111
3955a11J12m8M3k6k24J09L27j24p8n6L71l82p4M6j48J53J95q5N3L1j17o9%r6J9
$$ -111 1 -47 -4 -30 -254 -145 182 58 -20 -76 295 -87 -161 -115 -263 -110 85 0 53 84 -33 -102 -102 -198 -179
3980a79K73k4o4j63J55K57m56M7J55J12k22j38J49M01o3j8k09P9r3p9M10k32k15
$$ -179 94 70 6 -157 -2 255 -201 -154 1 113 -109 -247 -98 303 240 222 13 92 -1 -80 330 98 -117
4003a17J94j16j38R9M6K02l37L02k31L26k51L8L1j30J80oK8m88M52l04O3Q5r0
$$ -117 77 -39 -177 -78 -32 170 -167 135 -96 230 -21 17 48 -82 98 92 120 -368 84 -220 -157 -72 -162
4026a62K28J96j40j04N8l3NJ3J52j68l37M3K47j87K13q2J22J05k37K38p0J2j36
$$ -162 66 262 122 18 76 43 48 61 213 45 -292 -249 -2 -189 24 -58 64 169 -68 170 100 112 -24
4049b4M6j32K25k21J51J29j46m2L1p1J86l6l3j65J24P7j37K5L13l47o4P0K43K7
$$ -24 22 -110 115 -106 45 174 28 -14 17 -54 132 96 63 -102 22 99 -38 -13 300 -47 -111 -41 202 229
4073B29j90l7n6J49n0j81J49j26j19J04N2J00j29M54k19p6j06nL87k5m74K13O4
$$ 229 39 2 -54 95 45 -136 13 -113 -232 -128 -76 24 -105 349 130 54 -52 -57 330 305 -169 44 108
4096A08j08k61P7j81K09J50k13N8J10j11J54j79K62k0J49o7l43J74j28K38j65
$$ 108 0 -261 -184 -365 -156 -6 -219 -161 -51 -162 -8 -187 75 55 204 137 -206 -32 -160 78 -87
4117h7j56L10j16J11L7j27K78j32p6J34j61k34K67J8K09k95Lj1O9j16j11L65n3
$$ -87 -243 67 -49 62 99 -28 250 118 42 176 15 -219 48 66 275 -20 -17 -28 41 -75 -186 179 126
4140A26k8J68j82j79Q7j58J43J81l47M98l25J8n4P8J1J11k87L58j33M0j89m3P3
$$ 126 98 266 84 -95 -8 -166 -23 158 -189 309 -16 2 -52 26 37 148 -139 219 86 126 -63 -106 -33
4163c3j66K17P8Oj58j01L10J31j60j21m6K30k06J0J12k66M98l04L5j00J46k57
$$ -33 -199 18 96 102 -56 -157 153 284 124 3 -43 187 -19 -9 103 -163 335 31 66 -34 112 -145
4185a45K0K50M2j48k71N72l32q7K5J40q4N7k72K17Q4L60m36Q9k93L00l9Q3k76
$$ -145 -125 125 167 19 -252 320 -12 -99 -74 66 -18 39 -233 -16 68 428 -8 81 -212 88 49 132 -144
4208a44j2j54K65k46K90J96k56N8q2J76L2j43k00J96L38m88J27KK35l1j87j1K23
$$ -144 -156 -310 -45 -291 -1 195 -61 -3 -85 91 123 -20 -220 -24 314 -174 -47 -45 190 159 -28 -39 184
4231A84n70L21J93l77K59r7j83K18L32k78j35l7M20k57J77p9R5N4m59K8M22k07
$$ 184 -386 -65 128 -249 10 -87 -270 -52 280 2 -133 -170 250 -7 170 91 186 240 -219 -191 231 24
4253B4k7j71J13j23L01N6l21L36j24j73j25L32p0j45K89O3k22k38J75J02p6J1
$$ 24 -3 -174 -61 -184 117 173 -148 188 64 -109 -234 98 28 -117 172 235 13 -225 -50 52 -24 -13
4275a3K00k08k14NL24K0j59K5P1K2j50J62r8n5L29m12J71m4m7R2j28O5j26K10
$$ -13 187 -21 -235 -230 94 114 -45 -20 51 73 -77 85 -13 -68 261 -151 20 -24 -71 21 -107 -42 -168 42
4299D2l03J92P1p4k22N50k57N8j33O2m0j43J0J04q1N8J18l1o9k6K76k60r4J68
$$ 42 -261 -69 2 -72 -294 256 -1 57 -76 -14 -54 -197 -187 -83 -164 -106 12 -19 -88 -114 162 -98 -192 -24
4323b4Q5J49l43J74o5J00J7j24j57J64J96k61K11n4Q9k5k65K28p2P4r9J19l6j69
$$ -24 61 210 -133 41 -24 76 93 -31 -188 -24 172 -89 122 68 157 132 -133 95 23 97 -2 117 81 -88
4347h8m7M04j80J35l18P3MP0m3m9J32J82j13J88k12j34j6L2j2Q4l8J14n5k03L57
$$ -88 -135 269 89 224 -94 -21 -17 53 10 -39 93 275 162 350 138 4 -12 20 8 92 54 168 113 -90 267
4372B67j46Kj16k7M0q2M0K38j24J63k66N5j88J83j84p9L53k16R8l29L85m0l7P7
$$ 267 121 123 7 -20 20 -62 -22 216 92 255 -11 44 -144 39 -145 -224 129 -87 11 -318 67 27 -10 67
4396F7J4m12K12K69l40K99j26J23m3j33K53j08p2R1l33J70kJ73k50N0K6K34o61
$$ 67 81 -331 -119 150 -190 109 -17 106 63 -70 183 75 3 94 -239 -69 -71 102 -148 -98 -72 162 -499
4419d99M08K29j45P0k63J54J24k26K25l05K08J54k03J29l14L75j32k13P6J27Q1
$$ -499 -91 138 -7 63 -200 -46 78 -148 77 -228 -20 134 -69 60 -254 121 -11 -224 -148 -21 60
4440F0l2N0r3k44K88L35k85Q9k77J17L33m11r3J64L8K35j98K5l89K82R6q2j28
$$ 60 28 78 -15 -259 29 364 79 168 -109 8 341 -70 -163 1 39 274 76 101 -288 -6 90 8 -120
4463a20J95p5mk22K99j91K08J47l34QP3j70M0K42Q7j66r4m1L22l02K08j79J03
$$ -120 75 0 -4 -226 73 -118 90 237 -97 -89 -16 -186 -146 96 183 17 -77 -118 204 -98 110 -69 34
4486C4j2k00J87k38L15j81O5Q0J93k87K18k1N6j30J9J22j37o8Q1J78m54M94l51
$$ 34 22 -178 9 -229 86 -95 -30 50 243 -44 174 153 209 79 98 220 83 15 96 274 -180 314 -37
4509c7J13L2k01K01j58R1O5j41l3J82l41K43J59j26J6j49K51l44K09k89L44j38
$$ -37 76 108 -93 108 -50 41 106 -35 -68 114 -227 16 175 49 65 -84 167 -177 32 -257 87 -51
4531e1p4L72l55J83M6k36o7J85j42P0P8l91N29k14J28l4q5K9j4J9J20k00j34J27
$$ -51 -125 247 -108 75 121 -115 -182 3 -139 -69 9 -382 147 -67 61 27 -58 -29 -43 -24 96 -104 -238 -111
4555a11O2k36P2J53L57k69N3M2k23j6j30N70l34J21j41r6p0J58j08j82Q0K86q3
$$ -111 -49 -285 -213 -60 297 28 81 123 -100 -116 -246 324 -10 111 -30 -126 -196 -38 -146 -328 -248 38 -45
4578d5j12j7J61r0J33j09m5K69p1j57P6J48l30NJ07J88j64L37n09L57k47j00J36
$$ -45 -157 -174 -13 -103 30 -79 -124 145 74 -83 -7 141 -189 -184 -77 111 -53 284 -225 132 -115 -215 -79
4601g9M1L05k17K11k93J19k33L83k23J37j60O9k82r4L41j53K79Q8l19K45j36j71
$$ -79 -38 267 50 261 -32 87 -146 237 14 151 -9 60 -222 -316 25 -128 151 239 -80 165 29 -142
4623a42J57q5J59l81L61J29J29j52j31J74j92j83K70k07j84L63J67k89J00r2L9
$$ -142 15 -70 89 -292 69 198 327 175 44 218 26 -157 113 -94 -278 85 252 -37 63 -29 10
4644A0j18L75k95L27j86J16k71K12R9o0k58K93n10L18o7k22K63j29J15j12J77
$$ 10 -108 267 -28 299 113 229 -42 170 269 209 -49 244 -266 52 -15 -237 26 -103 12 -100 77
4665G7j45K73J2k27o8K14k90K76k0j73p8J60J19k92K35K75o32M99j46j67L56m10
$$ 77 -68 205 217 -10 -78 136 -154 122 102 -71 -149 11 130 -162 73 348 -284 215 69 -98 258 -152
4687a52J20l2p3O6J81l33J56J82Ql90K85j13K05k00K88q8k6O9j59k31K31k5M06
$$ -152 -32 -64 -137 -71 110 -223 -67 115 123 -267 18 -95 110 -90 198 110 84 153 -6 -237 -6 -31 375
4710C75j38l4j50jk74J99K25L0j05j05l5l7L43l57J95p8Q0j35j47L04l01M9j41
$$ 375 237 203 53 52 -222 -23 202 232 127 22 -13 -50 293 -64 131 53 133 -2 -149 155 -146 -97 -238
4733b38L71L9k55J38M0K51n63L89l79N7N9M4r1N19m66J26j98L25l05K88q5j45
$$ -238 133 172 -83 55 95 346 -217 172 -207 -150 -91 -47 -138 381 -85 41 -157 168 -137 151 66 -79
4755g9J55k08K85l57M03k26j83K12J04P6k32r6J40k7j1J6K9k74L17L44m89r3L78
$$ -79 76 -132 153 -204 199 -27 -210 2 106 182 -50 -146 -6 -33 -44 -28 1 -273 44 388 -101 -194 184
4778A84k59j9L25l26j69L15N7n0J27k40K63k17K64l60K02j90K90m90L96L7k6l24
$$ 184 -75 -94 231 -95 -264 51 108 58 185 -55 208 -9 255 -105 97 -93 197 -293 103 140 114 -210
4800b10M1J08j26K77j96j5J10Mm7L12P3j67k51L88k71l41J81J20j07L9J22r8K4
$$ -210 -169 -61 -187 90 -106 -121 -11 -7 -54 258 331 164 -87 301 30 -311 -130 -10 -117 -78 44 -54 -30
4823c0j14R2k29J86M6j54K93R0k56J36j9J46j62k24J82O4l58K28M19l23j49R4
$$ -30 -144 -52 -281 -95 -49 -203 90 180 -76 60 41 187 25 -199 -17 47 -311 -83 336 13 -136 -42
4845d2j9l0O9R3L1K80l43J43r6Kp8j36J69J33l4j43O4O6k15Q5KQ4j89J33q3o1
$$ -42 -61 -91 -22 71 102 382 39 182 86 88 10 -126 43 176 142 -1 63 129 -86 -1 1 85 -104 29 -54 -115
4871a15J10K37j61j12L1J44j11ok67K84Q8l65L41j53K34j19j48K57j82p5j8O1
$$ -115 -5 232 71 -41 -10 134 23 17 -250 34 122 -243 98 -55 179 60 -88 169 -13 -88 -106 -45
4893d5r1K52j22j32K61J9k74o6J19M06m61l5L17p1P8k73O0J43j62J47k3O2k2j82
$$ -45 -136 116 -6 -138 123 142 -132 -198 -79 327 -134 -169 148 77 155 -118 -58 85 -77 70 47 109 87 -95
4917i5L4J42K00m12J76K96m03Pj36J5o7J99K62m86K75r0Qm8K36k21J1J67p1K02
$$ -95 -61 81 281 -131 45 341 -62 -55 -191 -176 -243 -44 218 -268 7 -83 -75 -123 113 -108 -97 70 -1 201
4941B01l82L34O7k90j34J49k5j3L53r0r6l06N5L70j58R7k75J42K35k74k36J54
$$ 201 -181 153 220 -70 -204 -55 -80 -93 260 170 74 -232 -177 193 35 132 -143 -1 234 -40 -276 -122
4963a22M3M54l15k4M9J66k33j38M9j49R0K17k4j36n0K5R3n0K65r1o9J03k40j53
$$ -122 -79 375 60 36 85 251 18 -120 -71 -220 -130 87 63 -73 -123 -98 -5 -55 210 119 50 153 -87 -240
4987b40J35j74M02l7q8j70O0j46J76K92m01N6J76J56l38K10n5j65J88J25k18J46
$$ -240 -105 -279 123 86 -2 -172 -112 -258 -82 210 -191 -135 41 197 -141 69 14 -151 37 162 -56 90
5009I0j74j03L49R7K4l52P0nj73M18m58R1K08j00K6K63l5k56m1K1L0lM3J11k95
$$ 90 -84 -187 162 259 283 -69 1 -4 -177 241 -217 -126 82 -18 8 271 236 -20 -61 -40 -10 -13 30 141 -154
5034a54J3K63k63q6M10k92J75L4j71oN9K22j87m2J75Ol55K88K0L42l25l11K51
$$ -154 -141 122 -141 -227 183 -109 66 100 -71 -77 -18 204 17 -25 150 156 -199 89 109 451 126 -185 66
5057F6n5l11K29J44j12l9K87m27M5L44L2k13J39lq2ML8k51K28o1J48r1J13k95
$$ 66 11 -300 -71 73 -39 -78 209 -218 -173 171 203 -10 129 126 44 48 86 -165 63 2 150 59 172 -123
5081a23L10j35J50k82J83j29K9o6K12l1O4J8l93L47L8j51k61L59n00M61k47r1
$$ -123 187 52 202 -80 103 -26 3 -63 149 118 182 200 -193 154 192 41 -220 139 -361 100 -147 -238
5103b38Pm1M80j64J16l99J96lj7p8K85k84L4q9K26l6j40J10j42L29m07L78p4M
$$ -238 -231 -272 208 44 160 -239 -43 -46 -63 -141 144 -140 -106 -195 31 -5 -145 -35 -177 152 -255 123 49 53
5127E3J9l24N29l97j41Q7N5M5J92m46K81L75l99J24l18K09j47j9K80r2K88j73
$$ 53 72 -252 277 -120 -261 -174 -119 -74 118 -328 -47 328 -71 53 -265 -56 -203 -222 58 -34 254 81
5149H1n9J79j84n3R3k54P3K93k10kk45J22m9L01j41m9L91o23L40J29o4j77L02
$$ 81 22 201 17 -36 57 -197 -124 169 -41 -43 -288 -166 -215 86 -55 -104 287 -336 4 133 69 -108 194
5172A94l14q8J18J6Q1J01K5l17Q4K44o4N0k42K32M0j61J63o5j09m24K98P5k9J07
$$ 194 -120 -208 -90 -74 7 108 133 -184 -100 144 80 130 -112 120 160 -1 162 97 -12 -436 -138 -63 -92 15
5196A5k21L54k37J95j14m6k1J21J57l11j20J45K22j64R5l50J5L88P1O4j68k51
$$ 15 -206 148 -89 106 -8 -54 -75 46 203 -108 -228 -83 139 -25 70 -280 -265 123 194 258 90 -161
5218a61L42l68j24J1L54k30J63P2k89J4J10l22L28J98p7O2J91m87J40J16j04P5
$$ -161 181 -187 -311 -300 54 -176 -13 59 -230 -216 -106 -428 -100 98 21 83 274 -213 -73 43 -61 14
5240A4j50m5K39j61j90L2P4K85l02J6K14k14L4L04k27K32mj60p1K19r4J9j27n2
$$ 14 -136 -181 58 -103 -293 -261 -187 98 -204 -188 26 -188 -154 150 -77 155 151 -9 -80 139 45 64 -63 -115
5264a15K8M7J62p9j93rQ1O6J9r6K10q6N6j9k14J28k40j05j4K74j56J36K79Nm16
$$ -115 -87 -40 122 43 -150 -159 -78 -12 7 -89 121 35 91 72 -142 -14 -254 -359 -373 -99 -255 -119 160 165 -251
5289b51j03M92m03K40J71K41l66k4j47K90J41m88L86j03k31J04r7L88k33l8q6
$$ -251 -354 138 -265 -25 146 387 21 -3 -150 140 281 -207 179 76 -155 -51 -148 240 7 -31 -117
5310a17K55J14k81J68j35j35K70J25j64l9m0PJ00k4n5r2J20J10l18K00q7n7j45
$$ -117 138 252 -29 139 4 -131 139 264 100 61 21 28 128 104 49 -43 77 187 -131 69 -18 -75 -220
5333b20J95L3o2P6%L73k45l97J12K89P4k1m33L47m0j79P9o9L9L71l17J20j86L59
$$ -220 -25 8 -54 22 22 395 150 -247 -135 154 228 207 -226 121 81 -98 -19 -88 -49 322 5 125 -61 298
5357B98n80K41L00k01l7n2J40J97j34m9l32J10KJ19n9r1J42M2q1K25k67j06L59
$$ 298 -282 -41 259 58 21 -31 109 306 172 123 -209 -99 -97 22 -37 -128 14 56 -25 200 -67 -173 186
5380A86l94J56R3k42L38j43k6m01M34K37j59j86N5J86p1K9m32M05j58m8K45j17
$$ 186 -208 -52 41 -201 137 -6 -32 -433 1 238 79 -107 -52 134 63 92 -340 65 -93 -141 104 -13
5402a3j63J10P6J15p5l2j63L22m51K74P6k32J13R8p1J46j20R7k98J12K04j44Q1
$$ -13 -176 -66 10 125 50 18 -145 177 -274 0 76 -156 -43 55 -16 130 10 107 -191 -79 125 -19 62
5425F2j43J55J29j59j7J75k64l5L24j31n8o9j39J95k58K92m8J76q9k49J14Oj7
$$ 62 -81 74 203 44 27 202 -62 -97 227 96 38 -31 -170 25 -233 59 11 187 98 -151 -37 -31 -48
5448d8J22J19k22J45J38n18N21k17j59J27J24k3k7M12l4l11m9l19J00LJ6K10j44
$$ -48 74 193 -29 116 254 -264 257 40 -119 8 132 109 82 494 460 149 100 -219 -119 -116 -100 110 -34
5471c4J22j97j83K85j4K43m79J41L89k58j93K78o1l7j2K39n2q3O3j72J91j33P9
$$ -34 88 -109 -292 -7 -21 222 -257 -116 273 15 -178 100 39 2 -10 229 177 94 157 -15 176 43 122
5494A22o7j99L20m31k5L80k38J20m31N85k08P0j18O7K56j88q2M1kL1k51Q5L06
$$ 122 55 -144 176 -255 -280 100 -138 -18 -449 136 -72 -2 -120 -53 203 15 -67 -26 -28 3 -248 -163 143
5517A43o7j63R9J31oj04p2O5j00p0m7Q6jJ30n0P7j66J39J28k25M9J5j08K26M3
$$ 143 76 -87 12 143 137 33 -39 26 -74 -144 -191 -105 -106 24 -26 51 -115 24 152 -73 -24 -9 -117 109 152
5542A52k75m0J16N8j10J48Q0j90L56k16r4p5Q1P7O4k74O8J74m7K3j24M6k63P8
$$ 152 -123 -163 -47 11 -99 49 129 -61 295 79 -15 -90 -9 68 132 -142 -74 100 53 76 -48 -2 -265 -187
5566a87L21J54m93K26o7o5j15L40j01J35Q1k91l1L56j28j11l0r4j49J65J71k95
$$ -187 134 288 -205 21 -46 -111 -226 114 13 148 229 -62 -93 263 135 24 -6 -100 -249 -84 87 -208
5588b08L02P3k09n1R5l8LK34m3m5q6Q7j6l45J8J91k68K65j01O6J27kk64K17J7
$$ -208 94 167 -42 -93 2 -36 -33 201 158 113 27 114 98 -247 -229 -38 -306 -41 -142 -76 51 49 -215 2 19
5613A9k04L13q8k07PK63m21R4Q8L04j90R1j37J95j92J78Qj5j62l56K73K42k17
$$ 19 -185 128 40 -167 -160 103 -318 -224 -136 168 -22 69 -68 127 -65 113 121 106 -56 -412 -139 103 -114
5636a14p0N8K27L7l52M64l36J9l9L31j55k41J46K12l74J44o6N5J94j66p8K71k11
$$ -114 -184 -126 101 138 -214 250 -86 -67 -106 225 70 -171 -25 187 -187 -43 -109 -54 140 -26 -104 167 -44
5659d4pJ36O6k2j04N4K58l30oj43P5K0J36j42j2J45k9m6J4Nj7j5k3M4K21l42j82
$$ -44 -51 85 151 129 25 79 337 7 1 -142 -67 -47 89 -53 -65 80 51 5 19 24 7 -8 -31 13 234 -108 -290
5686b90K96j17O3J30J7j87J8p1Q4On6R5p8L65m88J12Q9K87j22l23K89j69k46J94
$$ -290 6 -111 -48 82 99 -88 -70 -141 -57 -51 -107 -12 -90 275 -213 -101 -12 275 153 -170 119 -50 -296 -102
5710a02K12j49o0pR4k27N5K71k19N1J59l06O8l0K35L10m82J38j83M39k51l3K14
$$ -102 110 -39 -99 -106 -12 -239 -184 87 -132 -81 78 -228 -160 -190 45 355 -127 11 -172 267 16 -17 197
5733A97l2k2J73m45R3L27j10j07j2m59M89O0l69L56jm6p6L6r3k65M61K43m03l5
$$ 197 165 143 316 -129 -36 291 181 74 62 -397 92 152 -217 139 138 92 16 52 -41 -306 155 398 -5 -40
5757d0L4P3M9m7j79K16k03p7M20j38l47l7O35n59L37J4r5j15P1r1J80j17p6k26
$$ -40 -6 67 116 69 -110 106 -97 -174 246 108 -239 -276 359 -200 137 151 56 -59 12 -79 101 -16 -92 -318
5781c18M46Kj82K51k61K86m40J43r5J49l2L13k65kJ67k91j94L54r0J96j09k34
$$ -318 128 130 -52 199 -62 224 -216 -73 -168 -19 -51 262 -3 -5 162 -129 -323 31 -59 137 28 -206
5803b06K09JJ40q3n0n1J58k93J04J22m2j45K59J07j58O5q1P9j14J19k27R9J89
$$ -206 3 4 144 61 11 -40 118 -175 -71 51 9 -136 123 230 72 137 56 135 21 140 -87 12 201
5826B01L0k41P1K02l14n4L8K06P2p7k32n7M20l52K06k01M3q5J83oL5j70j69M22
$$ 201 231 -10 61 263 -51 -105 -67 139 211 134 -98 -155 265 -87 119 -82 -39 -124 59 53 88 -82 -251 171
5850A71o1r8j18K39k44J69J45j40J40p3j38p6J81j3J7J44l81M6O8J09o6k82L38
$$ 171 110 12 -106 133 -111 58 203 63 203 130 -8 -84 97 84 101 245 -136 -90 -22 87 21 -261 77
5873G7j19O7j12m1J86k26J11J23J74k38l71L48j19L71k62K83l34RJ32J14k69l0
$$ 77 -42 25 -87 -128 58 -168 -57 66 240 2 -369 -21 -140 231 -31 252 -82 -73 59 173 -96 -126
5895a26m3j7O11k40l55j9K83J9o5M9j99J94J39l64J28n6L1P3J13j72K56l21j36
$$ -126 -169 -186 425 185 -170 -189 94 113 48 97 -102 92 231 -133 -5 -61 -30 43 156 -16 240 -81 -217
5918b17J1M26j52k62J23L26l72j02K21K03k01J13J20j68o1M21l52l0l0%o8j6n1
$$ -217 -206 220 68 -194 -71 255 -117 -219 2 205 4 117 237 69 8 429 77 47 17 17 -51 -67 -118
5941a18J86l33N0L19j46J07Q8o5J64j63j5o8N4n1l7M30m56L88n57K85Q5j30L9
$$ -118 68 -265 -215 104 -42 65 153 88 252 89 74 6 60 9 -28 402 -54 334 -223 62 147 17 56
5964E6j62J0M08m61K04pq9k42M02mk65o2M22j28M9j97l6R5j53M17o1m93K15j34
$$ 56 -106 -96 312 -149 55 48 -41 -283 119 115 -150 -212 210 82 131 -66 -102 -7 -160 257 196 -297 -82 -216
5988b16k3J02l17N05N3j28L0l6j21L10l6k19K78j49J56O5j57J21j7j51j34J74
$$ -216 -239 -137 -454 51 104 -24 6 -30 -151 159 123 -96 182 33 189 254 97 218 201 50 -84 90
6010I0j80j7J43j5l29L22k67k7o0M00J0o0L47o98K96K03j27l6J52J5j51k12Q3
$$ 90 -90 -107 36 21 -308 14 -253 -280 -340 60 70 10 357 -341 -45 158 31 -5 147 162 11 -201 -118
6033a18J4J87j12K39j08l58M28k79K01k32j2K59k74n9L68k92J5p5K48k18K50j35
$$ -118 -104 83 -29 210 102 -256 172 -107 94 -138 -150 109 -165 -224 144 -148 -133 -208 40 -178 72 -63
6055f3j50Q5P4j64K81n5Pr1j67K86K46j51p6N5J24Ll79O0n5P4N6O8j10l3N5K11
$$ -63 -213 -128 -54 -218 63 8 15 -76 -243 43 289 138 62 117 241 244 -135 -75 -130 -56 0 68 -42 -75 -20 191
6081A91j15O3Ok34J05Kq0K0M7J06p7j36P4P0K29l70J89p6k6P4n3p8n4l8J74M9
$$ 191 76 139 145 -89 16 18 -62 -42 5 111 34 -102 -28 42 271 -99 90 14 -12 62 9 -69 -123 -161 13 62
6107F2o1J93k68k46M46r7K9J79Ol41M00l91J31R7l5o9k51R2M3k4J61j11k5K35
$$ 62 1 194 -74 -320 126 29 58 237 243 -98 302 -89 42 139 104 35 -216 -124 -81 -105 56 -55 -80 155
6131A55l8l7j66J24j74K56J19n2k91j10K46j07L9J38j39J8j20J1L24k18O3K3J81
$$ 155 117 80 -86 38 -136 120 239 187 -104 -214 32 -75 -36 102 -37 -19 -139 -128 196 -22 41 64 245
6154B45l48J21k33L67l63J43J78o1k61J23J82nJ33j77k14J6L97l30Q5O0j88K61
$$ 245 -103 18 -215 152 -211 -68 110 49 -212 -89 93 88 221 44 -170 -154 243 -87 -2 58 -130 131
6176A31j63m9m0K05j88L00l57J02J91n5m48J54K12J3rJ76j67M3n9j9k97L64J60
$$ 131 -32 -81 -121 84 -104 196 -161 -59 132 77 -371 -217 -5 8 -1 175 8 51 -8 -27 -324 40 200
6199B00rm75K82M03k79k86J28jj4K88o3j47k42P1N2J76j99r0K37mm8l1J22L4j68
$$ 200 191 -284 -2 401 122 -164 -36 -37 -51 237 174 27 -215 -144 -92 84 -115 -205 32 28 -20 -51 71 105 -63
6224f3k8k4K92K9l8l9KK9j25Q4j76J6r4L79k26J18J34j06r7j91L58j00j62J72
$$ -63 -91 -115 177 206 168 129 131 160 35 119 -57 -41 -135 244 18 136 270 164 67 -124 234 134 -28 144
6248A44k34qJ49J28N7q5j06o9j7k00J78N9q6J54K19k63L09m23l1J55oJ71n0n2
$$ 144 -90 -98 51 179 236 151 45 -24 -41 -241 -63 -4 -90 64 283 20 329 -94 -125 30 24 195 145 93
6272I3l73K37P3P4q6L6m4j32q3L81k53P7K01j57j41L06l87J48R2P7j80K90j69
$$ 93 -280 -43 30 104 18 54 10 -122 -205 176 -77 0 201 44 -97 209 -178 -30 62 139 -41 249 80
6295H0o3M1j68L2K20l06O0j22K29r5J17p3r3J08P1j6j49J00J16K89p50K17K93
$$ 80 17 58 -110 -78 142 -164 -104 -226 3 -92 25 -48 -141 -33 38 22 -127 -27 89 378 -372 -155 138
6318A38j39q7O9J9J78l51M55l47K45L5l69o5L45qj74l4l2K52j47L4M6k00J43K83
$$ 138 -1 -88 -19 0 178 -173 282 -65 180 215 -154 -219 126 118 -56 -90 -122 130 -17 17 63 -137 6 289
6342B89l38M0J30k64M28k90j79K39j02ko0J3P7j67NJ68jQ6K0J6j74J01k52M23
$$ 289 -49 -9 121 -143 285 -5 -184 55 -47 -49 -109 -96 -19 -186 -181 -13 -14 72 92 108 -66 35 -217 206
6366B06K86m69J61j26j23j41K43k2j23M06k41p3J17j96M1P5L8k7k39J44J79K30
$$ 206 492 23 184 58 -65 -206 37 15 -108 298 57 -16 101 -95 -54 21 59 32 -207 -63 116 346
6388C46l46l3q3P5k12L49k66P4j9j38K51J9L8j76J39J6j95m8K96Q3j36P1J82k11
$$ 346 0 -33 -116 -41 -253 96 -170 -96 -115 -253 -2 17 55 -121 18 34 -161 -209 87 170 34 105 287 76
6412G6k45J01pJ90j95K1R8jj63Q6N5l05O8M53l65K15j38J98q4o2K6R3j19m6K90
$$ 76 -169 -68 -75 115 -80 -59 39 38 -125 -39 16 -289 -221 232 -133 82 -56 142 58 -4 22 115 -4 -50 240
6437B40j03k45j6L01j55l45N81j35l10K18K2o4Q7j85l1L84k40l05O7L32j19J2
$$ 240 137 -108 -124 177 22 -323 258 123 -187 31 53 -11 76 -109 -140 244 4 -301 -234 98 -21 -9
6459ik05J6P2K78l33L51l37K9K8J71k19K6K51k45O7L71r6r3Q1q2m25M50k15l58
$$ -9 -214 -198 -126 152 -181 170 -167 -138 -110 61 -158 -132 119 -126 -59 312 216 123 204 122 -303 147 -68 -426
6483d26K06K31p3K5J37l3j08k34M78j53N7p6M1j50K52k44j52M59l56P4J54N4k00
$$ -426 -220 11 -62 -37 100 67 -41 -275 203 50 107 31 72 -78 174 -70 -222 237 -119 -45 109 163 -37
6506c7j63L82o2k03L13o26M43M4j20O9O8j45o5N02n74K36k95K45K31k73L23k36
$$ -37 -200 182 120 -83 230 -396 47 91 -29 40 108 -37 -102 400 -174 62 -233 12 243 -30 293 57
6528E7J46l8j83j05L9J14O3J6l44J44K65o4l9K01J0k65M0qqJ2Q1k31j39K43k77
$$ 57 203 165 -18 -123 -84 30 93 109 -235 -91 174 110 71 272 282 17 57 49 41 53 134 -97 -236 7 -270
6553b70K67j7k08O0R3R2J18q0j90J08m5l7O4J85K3L9j1j86l40J21M06q4l7j23
$$ -270 -3 -20 -228 -168 -75 17 135 55 -135 -27 -72 -109 -45 140 163 202 191 5 -335 -214 192 108 71 -52
6577e2J52Q4m23n8L20j46l5j05J87K40n2pL0p5p8j36J20L25l12J2n3j23N32n41
$$ -52 100 184 -239 -297 23 -123 -158 -263 -76 164 112 105 135 60 -18 -154 -34 291 -21 -9 -62 -185 347 -194
6601a94rL81l30J78p3K3J35l30L56p9K19l05N6N38l32r1m9Rj83k65K38K96k92
$$ -194 -203 178 -152 26 -47 -24 111 -219 137 58 277 -28 28 566 234 143 94 103 -80 -345 -107 189 -103
6624a03k2j4L57ln76M60k4k4K73r9j59j06K04k91P7j3j30n0M52j62q0m7N3L28
$$ -103 -125 -139 218 215 -361 99 75 51 324 225 66 -40 164 -127 -50 -63 -193 -243 209 47 -33 -80 -27 301
6648C01o04J27L34j28J36j69lK80k55K7j62Q9pO4Q9n5P2k55L45j42j94J5j04K52
$$ 301 -303 -176 158 30 166 -3 -6 274 19 46 -116 -27 -34 30 119 64 136 -119 226 84 -110 -95 -199 53
6672E3o8K3R8p0l95O26p6m83L80J2m14K28j21L17R2k12n1P1k64J36j16M00j57
$$ 53 -15 8 106 36 -359 267 191 -292 88 100 -314 -86 -207 110 202 -10 -61 10 -254 -118 -234 166 9
6695Ik62K48J28l8l19J63j21K72k25P2N4j86J57j07K86l5k49K49j3o4j03K8Q7
$$ 9 -253 -5 123 85 -234 -71 -192 80 -145 -73 -19 -205 -48 -155 131 96 -153 96 83 19 -84 -56 31
6718C1Q6k60j00M34m57%J4L16k97N11j1m37q0K47j40J17n3N3k0J33P8j12l0m6
$$ 31 117 -143 -243 191 -266 -266 -252 64 -233 278 267 -170 -250 -3 -143 -26 -79 -26 -46 87 165 53 23 -23
6742b3o0L00q9qp3K09l53K11J91m82K03j28N1M1L7k05J80k03L67l29K60J20j91
$$ -23 -83 217 128 120 47 256 -97 114 305 -177 26 -102 -51 -10 27 -178 2 -201 166 -163 97 217 26
6765B6j30K34k26K11j34J85nk66J27l22M14O0j82l61K68J01O5R9m20M21j48J4
$$ 26 -104 130 -96 115 -19 166 161 -105 22 -300 114 174 -8 -369 -101 0 65 164 -256 165 17 31
6787C1k12J89L38m43M12l16J6J5p7j73J49m4R1P5J11q7m66L19L9k91N75m52K24
$$ 31 -181 8 346 -97 315 -1 15 30 -47 -220 -71 -115 -24 51 162 75 -391 -72 -33 -324 251 -201 23
6810B3l60O10k92j75J30K23n8j74j85K24j58L70k18m1R3m5N6JJ97m9l89L49l65
$$ 23 -337 273 -19 -194 -64 159 101 -73 -258 -34 -192 178 -40 -81 12 -33 23 24 221 172 -217 132 -233
6833b33J45L7J66mKj17J5J03m0k11K78j56J70J52k63p4R3m70K18N29o36K66k57
$$ -233 -88 -51 115 111 113 -4 11 114 74 -137 141 -15 155 307 44 -30 63 -407 -189 340 -296 -30 -287
6856b87L19j55N77l00j07J47k67J16Pj95J78j20j4J08j18J98j24k20J89k88L47
$$ -287 32 -123 454 154 47 194 -73 43 50 -145 33 -87 -101 7 -111 87 -37 -257 -68 -356 -9
6877ikK9pN3J12k98J52l69M80k37J51k2R9k78K99l40L71k57K36m53L28j75K65
$$ -9 -11 18 11 64 176 -122 30 -339 141 -96 55 33 132 -146 153 -187 184 -73 163 -290 38 -137 128
6900A28j08R9r1k19K63l7J34L7l63J70L2J63k38J57m38K06N07k88j29N2J36j02
$$ 128 20 119 28 -191 72 35 169 206 -157 13 45 208 -30 127 -311 -105 402 114 -15 37 173 71
6922G1q3Po1P2k01J31j88J71rP4k85L15O9j27k4K8K8j50K18N3p2Mj64Q2J92j41
$$ 71 -12 -5 -66 6 -195 -64 -252 -81 -90 -16 -301 14 83 -44 -68 -40 -12 -162 56 109 37 41 -123 -41 151 10
6948A0k50K32J80k92L32J47m39PP8N0j97n6o7M56j83k20J06O4Rq8J95P5k60J72
$$ 10 -240 -8 172 -120 212 359 -80 -73 5 55 -142 -198 -265 191 8 -212 -106 -42 -33 -121 74 149 -111 61
6972F1p1L4k08r0L28l69K62J30p1l6r8q8M38m52K05O5J04J22m86M12j88j85J50
$$ 61 -10 24 -184 -274 54 -315 -53 77 6 -30 -128 -216 222 -230 -25 40 144 266 -220 192 4 -181 -31
6995c1M1j16J40O1lr5L0qo9J67j16m4l1J44k67L8K18j74m6K06n7J96j95j33J40
$$ -31 10 -106 34 95 92 -3 27 19 -50 117 1 -43 -74 70 -197 -159 59 -115 -161 45 -12 184 -11 -144 -4
7020dJ6m5M5j47J96j15l4K68j68j15N1j2j8PJ44l5r6j63N76p65K13K62k9o6P7
$$ -4 12 -33 12 -135 61 -54 -88 180 12 -103 -52 -64 -82 -75 69 34 -62 -225 351 -414 -201 61 32 -34 43
7045D3k20K30k7N0q0R7J74k26J59l66J30K19k07N4J6J10j62J76o7k49K39N9J16
$$ 43 -177 53 26 76 -4 93 267 41 200 -166 -36 183 -24 30 46 156 -6 170 103 -146 93 152 268
7068B68k68N6l7l1m1j6J83k18J29M5J17K7j98P5m7p1J65j90n0K81O7oo9m99J40
$$ 268 0 56 19 -12 -53 -69 114 -104 25 70 187 214 16 91 44 -27 138 -52 -102 179 246 240 171 -328 -188
7093a88L3K30j54J08k17l2N71m93J62j25n5L51j76O6k30K71j64j29J36K6j80k5
$$ -188 -155 75 -79 29 -188 -220 351 -142 20 -105 -160 191 15 81 -149 122 -42 -171 -35 -9 -189 -214
7115b14K33k24L85j65o5R3o1J59l40m9L58L3k86J13q7M50l86J20k9l16M26k24
$$ -214 19 -205 180 15 -50 43 -18 141 -199 -248 110 143 -143 -30 -117 333 -53 67 38 -278 148 -76
7137g6l1K85m54K42m0O8j1O7K39l63l07K23K91Nl33K03q7N6J12J20k40L6j99O9
$$ -76 -107 178 -276 -34 -74 -6 -17 50 289 -74 -381 -158 133 138 -195 8 -79 -23 89 209 -31 5 -194 -125
7161a25K59l5JJ39k88m2J24J1QJ60k36k50j00L05K47k09r3J67k88K58j2j35k48
$$ -125 134 99 100 239 -49 -91 33 44 52 212 -24 -274 -374 -69 178 -31 -124 43 -245 13 1 -134 -382
7184c82N16k60K15k84M02k68k8J51l68J97j30P9j02K24O6l7J57n4RR1l40K06p
$$ -382 134 -126 89 -195 207 -61 -89 62 -306 -109 -239 -160 -262 -38 28 -9 148 94 103 194 -146 60 53
7207E3j54L50kk74j9n4mJ22q1k6J21q6J6j61J47j92M98Rn24K40m21K76K10l76
$$ 53 -101 249 247 -27 -46 -100 -104 18 -63 -89 32 -54 -38 -199 -52 -244 254 263 -261 -21 -442 -166 44 -332
7231c32N48k43L32k37j1j72M27k69j21Q6K98k63R7J43k61K9P8j8j16K33k28L14
$$ -332 216 -27 305 68 57 -115 312 43 -78 8 306 43 140 283 22 51 129 111 -5 228 0 314
7253C14j34k34L58k63k63J83J4j2K63m29J89j85L06k56R2j57J18L39k59k01L89
$$ 314 180 -54 304 41 -222 -39 -25 -37 226 -203 -14 -199 107 -149 -57 -214 -96 243 -16 -217 172
7274A72j08O0j12K41l87K8J76j58j01L52q6j82J27q3k3l4L83j21q0k1j15J97j26
$$ 172 64 124 12 253 -134 -106 70 -88 -189 163 77 -105 22 -61 -84 -118 265 144 64 43 -72 125 -1
7297aP8Q5j34n9K44j24k49N8M3pL5j96J43L7M1O2K8k94L00l6m2J91j07o0K2K43
$$ -1 77 162 28 -31 213 89 -160 -102 -59 -66 -31 -227 -84 -47 -6 56 84 -210 90 54 12 203 96 36 58 301
7323C01m23J6j2L01r4l5m8n8m1K73j86k75L56k43L41k83j97l0K42J92n7o4m5J54
$$ 301 -122 -106 -118 183 89 54 6 -52 -93 180 -6 -281 75 -168 173 -110 -307 -337 -95 97 40 -24 -69 85
7347H5k13n5K66r1Q9K42j84j87j46N2J5O7j54N38j45K3l83K34O8k61Qj18L02M2
$$ 85 -128 -183 83 -8 81 323 139 -48 -194 -142 -127 -60 -214 324 179 202 -181 53 121 -140 -132 -250 52 94
7371I4L2N3Q7k72L27l25J08l24K63Lj2j84Q2k57L79l24P9K44k24J67L74k14k97
$$ 94 126 179 266 -6 321 -4 104 -220 43 46 34 -150 -68 -325 54 -270 -191 53 -171 -4 370 156 -141
7394a41J85j37k07K29p7J38O4o1j36j6j12K52l67K01Q3jJ02K1L48m19k21N8N0
$$ -141 44 -93 -300 -71 -148 -10 54 -7 -143 -159 -271 -19 -386 -185 -102 -103 -1 20 368 -51 -272 -214 -164
7417a64K28k99J87M7o4rJ62p9j23k08L36j16L13j62p8K34l38K88j7j03K6j87j6
$$ -164 64 -235 -48 -1 -65 -74 88 9 -114 -322 14 -102 211 49 -29 205 -133 155 138 35 61 -126 -142
7440a42pJ38L2R0r1K30q9k09M5p3r6K00O1l15L37p9j10k02M64k11k24K95r5P0
$$ -142 -149 -11 21 111 20 250 161 -48 -3 -76 -172 28 89 -226 111 32 -78 -280 184 -27 -251 44 -51 19
7464A9J81p5l10M4K46k81J70M7o2J00n9JNk5l4J71l65K99L1p0j17k6j5j50N83
$$ 19 200 125 -185 -141 105 -176 -6 41 -21 79 20 21 26 1 -33 138 -227 72 103 33 -84 -110 -125 -275 308
7489C08l97J97J97k15j65K83m12J91k9k4R0k2O0k54L1J2J70N5Q2M5l15J80n3q1
$$ 308 -89 108 305 90 -75 208 -204 -13 -42 -66 24 2 62 -192 -161 -149 21 76 158 203 -112 68 15 -66
7513f6j66L93j48kL3k0k18K07K9k3J0j06N4K07j04o1K25k45k25K47M9j72J76l44
$$ -66 -232 161 13 11 44 24 -194 13 42 19 29 -77 -23 184 80 19 244 -1 -226 21 70 -102 74 -270
7537b70L60k07L0K64Q2p8m19n2M71m53K56n0P5O1P3J28m73J33N4J73j76J65l26
$$ -270 90 -117 -87 177 259 181 -238 -290 181 -272 -16 -66 9 70 143 271 -202 -69 -15 158 -18 147 -179
7560a79P8n4K85R0k14J55k25J88p6N6M1k1k49L27m35J18L2j97L00J32k08M5n2
$$ -179 -101 -155 130 220 6 161 -64 124 48 104 145 124 -125 202 -233 -115 -83 -280 20 152 -56 -11 -63
7583f3O4M7P6j86K3N6mJ43k26J97j79l0K61K1k82o5K42j41J05N4O7j75PL11m21
$$ -63 1 48 124 -62 -39 17 13 156 -70 127 -52 -82 179 200 -82 -147 95 -46 59 113 180 5 12 323 -98
7608i8l4K0pK31j63Op4j6K68k1j88J9O1l3l8N2j48M8j31M26m48J62J97j59J58
$$ -98 -132 -112 -119 112 -51 -45 -119 -135 133 112 -76 -57 4 -29 -67 -15 -163 -115 -246 180 -268 -106 91 -68 90
7633I0r4J86j02r4K72m31L42k23M7J89j75K77k87q6J0Nnj6N1j49J77r7l0K84k84
$$ 90 -4 182 80 -14 258 -173 169 -54 -7 182 7 284 -3 -89 -79 -74 -79 -95 -44 -193 -16 -113 -143 141 -143
7658a43K30j10O7K7m4K12k47j29J55J3J32l12L55j08j78Nk55K12K37j3l7p8J69
$$ -143 87 -23 44 71 27 239 -8 -137 18 31 163 -149 206 98 -80 -75 -330 -118 119 106 69 -9 160
7681A60l75L94o9L7m4oj03J96o5k9K06m04rL31j83l21M52n5k92L98k41q6N7M6
$$ 160 -215 179 110 147 103 97 -6 190 125 96 302 -102 -111 220 37 -284 168 113 -179 219 -22 -108 -51 -5
7705ek22J75K97l08R5m6q2K36k65l1K48J39l93K13J86j81j04J62k14M04k95J21
$$ -5 -227 -52 245 -63 32 -14 -96 140 -125 -156 92 231 -162 51 237 56 -48 114 -100 304 9 130
7727A30j74k5K95k89J59k24K29j46J31O7l49J50K56k61J02o7j44L53Q7m3j08j71
$$ 130 -44 -69 226 -63 96 -128 101 -45 86 153 -196 -46 210 -51 51 -16 -160 193 280 237 129 -42
7749d2j17R5n1K14k1J08k64M89l43k26P4J39QK5J32j72j32K19j81p5LJ72p3J47
$$ -42 -159 -64 -115 99 78 186 -78 411 68 -158 -84 55 63 88 220 48 -84 135 -46 -121 -118 54 -19 128
7773A28q4l0nK6p2q2K2l6M5p8J39K2K71l51J04j3k28K40j50jJ83k46K98k01q7
$$ 128 44 14 9 35 -37 -119 -97 -133 -88 -166 -27 -5 266 -85 19 6 -222 18 -132 -133 50 -196 102 -99 -186
7798a86M3M3k4J96m1l62O17n09J48j15K37p8L16l60m9K31k02P9J88j88K18l53
$$ -186 -143 -100 -124 72 31 -331 286 -223 -75 -190 47 -31 285 -75 -124 107 -95 -16 172 -16 202 -151
7820a51K41j66J63R8m71K22L52k12m13N73j04k28o6O3K64Q7j58j81K14j5k89j44
$$ -151 90 -76 87 185 -286 -64 288 76 -337 236 132 -96 -162 -99 165 252 94 -87 127 112 -177 -321
7842c21J88K60k94K32j32L55o8M5l69m3J25L0k06Q4L32O3l4K6n5j63j43J47J09
$$ -321 -133 127 -167 65 -67 288 220 265 -104 -147 -22 8 -198 -114 218 281 247 273 218 55 -88 59 168
7865A68j14J1j16N4pJ6j69%K63P6j71l5R6J39k76M6j10N8O5K9NJ22j7l48K84K3
$$ 168 54 65 -51 3 -4 12 -157 -157 106 182 11 -24 72 211 -65 -19 -129 -71 -6 23 28 150 133 -215 69 92
7891I2p2PJ19k08Q1L3L42l14Q9J18l06L4J53j60j80j02n2K31O3j77J85k65J56
$$ 92 20 27 146 -62 19 52 394 80 169 287 -19 15 168 8 -172 -274 -326 -95 -32 -209 -24 -289 -133
7914a33J80J05l99PM71m81K78L70m34J89P2j20k58JK93k17j41N49o43J59J51j03
$$ -133 47 152 -247 -240 231 -250 28 398 -36 153 225 105 -153 -152 141 -76 -217 332 -311 -152 -1 -104
7936a04Jl1J15qRK2P3L40m02J3j66J89J0j34j7J25j18J42j94j12J87RR0J40k44
$$ -104 -103 -134 -19 -27 -18 4 77 417 15 28 -138 51 61 -73 -90 35 -83 59 -135 -247 -60 -51 39 179 -65
7961f5p2J0o7K65j29l8M2J60l94L65q7l0j7n8P1k73L26j83J67j05N1K43j34j65
$$ -65 -137 -127 -194 71 -58 -96 -54 106 -288 77 -10 -40 -57 -115 -44 -317 9 -174 -7 -112 -61 182 48 -117
7985a17J11R7o3Q8r8j76K00K8J4n2q3l0J77j09j60M06j57o3L9j19J10l5Q6k18
$$ -117 -6 91 28 116 18 -158 42 70 84 32 -51 -81 96 -13 -173 233 76 13 52 -67 43 8 94 -124
8009a24K84m64J64K09q5m7k09L25Q0j67J00r9r6J0N8Q6j26R3r9O8j1R8K0l39K51
$$ -124 160 -304 -140 69 -16 -63 -272 53 133 -34 66 -33 -129 -119 -61 25 -101 -8 -107 -39 -50 48 68 -271 -20
8034b0Nj66K13J66l03Oj70J57j43J29K59k17Mo7K45p9l85M64q2k3J63k07p2N9
$$ -20 -15 -181 32 198 -105 -99 -269 -112 -255 -126 133 -84 -80 -147 98 19 -366 98 16 -7 156 -51 -123 -64
8058f4L46m21L90j31p7k47J95K4n3p9rk9L36k67N8p0j81O6K15J15r0L48j2o26
$$ -64 282 -139 251 120 43 -204 -9 15 -38 -117 -126 -155 181 -86 -28 -98 -279 -213 2 117 27 375 363 -263
8082b63M28q0j08K21j48r3j46R4K50j00j67L41l87N2m0J64k6q3J9r7K82j54Mk57
$$ -263 165 85 -23 198 50 -43 -189 -95 155 55 -112 229 -158 -106 -146 18 -8 -91 -72 -169 113 -41 -37 -294
8106b94K86J3k9lJ1j12J70k08J13K33k18N9O7mj00k04K25R8n4k28Q6qK10m00K86
$$ -294 -8 5 -24 -27 -16 -128 42 -166 -53 180 -38 21 88 84 -16 -220 5 103 49 -179 -93 -101 109 -291 -5
8131eM2K6r9J70j75K9J11j66j47K47q5J08K33j39j34J46j29Ol43L95o7J4R6k31
$$ -5 37 63 -36 134 -41 -12 99 -67 -214 33 -52 56 289 150 16 162 33 39 -304 91 24 38 134 -97
8155i7j9q7K70O7j43mL6j05qo6K1L42l9P0k68J22n7j2j21K83m17J25q7k0K15m3
$$ -97 -116 -203 67 134 -9 -13 23 -82 -90 -156 -135 207 168 238 -30 92 35 23 -98 185 -232 -107 -194 -214 1 -42
8181d2J82o14J76K21J56l24lJ27L01l5
$$ -42 140 -474 -298 -77 79 -245 -248 -121 180 145
8191A45
$$ Imaginary data points
##PAGE= N=2
##DATA TABLE= (X++(I..I)), XYDATA
0@%%%%%%%%mJ2j6J6j9K7l2L8m6N5o5P5q9J04j22J41j59J83k11K38k68L03l42L85
$$ 0 0 0 0 0 0 0 0 0 -4 8 -8 8 -11 16 -16 22 -24 31 -34 41 -48 56 -66 75 -84 99 -112 126 -142 161 -181 204
32B04m32M83n41O04o70P40q22R14j013J122j240J372j520J686j874K087k333K618
$$ 204 -228 255 -286 318 -352 388 -434 480 -533 589 -651 721 -799 887 -987 1100 -1233 1385
50A385k953L357l854M480n294O409q040J0654j5523K7650j09932k39708J51331
$$ 1385 -1568 1789 -2065 2415 -2879 3530 -4510 6144 -9379 18271 -91661 -331369 -180038
63a80038K33084J11864o8562j13695n2352P8904P3807m3844j04790j7276P8675
$$ -180038 53046 164910 96348 -17347 -69699 9205 83012 39168 -65622 -82898 -4223
74d223R3012j1105j15658q3049N4979R2518J4298n4140m9829l481M8562K8366
$$ -4223 88789 77684 -37974 -121023 -66044 26474 40772 -13368 -63197 -66678 -18116 10250
86A0250m5729n5523K0472O4416K9470l4572o0851j4965N4357M9312j3308l9771
$$ 10250 -35479 -91002 -70530 -6114 23356 -11216 -72067 -87032 -32675 16637 3329 -36442
98c6442j4919J4919K9988J0380k8038j9124K8018L4317o076l0478j9829J0813
$$ -36442 -51361 -36442 -6454 3926 -24112 -43236 -15218 19099 13023 -17455 -37284 -26471
110b6471L3662J6175k0282k3040K161J3955Q745l771j5136m281J9022J2752j4692
$$ -26471 7191 23366 3084 -19956 -17795 -3840 4905 1134 -14002 -18283 739 13491 -1201
123a201j8078J80J1913J1628J474j1618q774N591P917N28l872k795L300Q768M25
$$ -1201 -19279 -19099 -7186 4442 5916 -5702 -14476 -8885 -968 -440 -4312 -7107 -3807 4961 5386
138E386j0886m669P805P234J995j459n659l307N244L772k868k197M89J498K002
$$ 5386 -5500 -10169 -2364 4870 6865 5406 -253 -3560 1684 5456 2588 391 880 2378 4380
153D380j019n065o66L701R87j648m38j626k093J586P82k135m29J779k21j125l72
$$ 4380 3361 -1704 -2370 1331 2318 670 232 -1394 -3487 -1901 -1119 -3254 -3683 -1904 -2125 -3250 -3622
170c622q60M02J479r3j112M20n30r01R67J124n9j83N76n80r28J893O88j660r8
$$ -3622 -4482 -4080 -2601 -2694 -3806 -3386 -3916 -4817 -3850 -2726 -2785 -2968 -2392 -2972 -3900 -2007 -1319 -2979 -3077
189c077L70L06R64j58j843p67K243N10o31o95r44m6K256K21k228o56J740P69O0
$$ -3077 -2707 -2401 -1437 -1595 -3438 -4205 -1962 -1452 -2083 -2778 -3722 -3768 -1512 -1291 -3519 -4175 -2435 -1666 -1606
208a606r89j763O28K883N74j769j153K57J458J781r09k187N48K369M74j231j132
$$ -1606 -2595 -4358 -3730 -847 -273 -2042 -3195 -2938 -1480 301 -608 -2795 -2247 122 596 -635 -1767
225a767j1J694J588j033k105L1J773J364p23j569j067K162J725j155k388m98J349
$$ -1767 -1778 -84 1504 471 -1634 -1603 170 1534 811 -758 -1825 337 2062 907 -1481 -1979 -630
242f30K021P8k482j973J959K549p19j631j313J010K262N06k681j785J539K414
$$ -630 1391 1469 -1013 -2986 -1027 1522 803 -828 -2141 -1131 1131 1637 -1044 -2829 -1290 1124
258A124L73j375k344K99K522J473k120k211O76K400J556j083l189j80K822J891
$$ 1124 1497 122 -2222 -1923 599 2072 -48 -2259 -1583 817 2373 1290 -1899 -2079 743 2634
274B634r37k753j100J437L122k07k741j497J768J768N32k067k298P01K816J483
$$ 2634 1697 -1056 -2156 -719 2403 2196 -545 -2042 -274 1494 2026 -41 -2339 -1638 1178 2661
290B661k369k356r2K252J457l78k614p88K263J624r30j448j527J259K492M53k524
$$ 2661 292 -2064 -2156 96 1553 1175 -1439 -2227 36 1660 730 -718 -2245 -986 1506 1959 -565
307e65j489J074J791N72p78k034n9K490R64j380j921k20J313K098n56j914j403
$$ -565 -2054 -980 811 1383 605 -1429 -1488 1002 1966 586 -1335 -1555 -242 1856 1300 -614 -2017
324b017J422K072L2j338j768L34K086M06j356j578P82J296J144o31k209l77J487
$$ -2017 -595 1477 1509 171 -1597 -1263 823 1229 -127 -1705 -923 373 1517 886 -1323 -1700 -213
341b13J367p81o45j249O97J684M22k138n69P19J294J41q88j229j03J797K87o26
$$ -213 1154 373 -272 -1521 -824 860 1282 -856 -1425 -706 588 729 -159 -1388 -1491 306 593 -33
359c3p63n15P75M92R7j378P3J236K36n89n68j6K42P43J4j232K51L16L21M1p1k23
$$ -33 -796 -1311 -536 -44 53 -1325 -1252 -16 220 -369 -937 -953 -711 32 46 -1186 -935 -619 -298 -257 -328 -551
381e51k56P42n1o31o0M41Q1J36K96m90J52M55o06j96N69L33o84K66L99m30Q3N58
$$ -551 -807 -65 -116 -747 -807 -366 -285 -149 147 -343 -191 264 -342 -538 31 364 -320 -54 345 -85 -2 556
403E56n27K31N60j69k81L1l58J86O81k53k73l49J03M57Q5k16j55k73O58j64k62
$$ 556 29 260 820 651 370 401 43 229 910 657 384 35 138 595 680 464 309 36 694 530 268
424B68k20OJ08P01k04p95k80Q61K27k68n63p2L13M47J44r30k89P35K64L21r17
$$ 268 48 54 162 863 659 -136 -416 445 672 404 -159 -231 82 529 673 -257 -546 189 453 774 -143
445a43m33P0R23L67r18n31L07K86O52n83j146K53Q59Q26q53n24p13Q65P74J5j174
$$ -143 -576 -506 417 784 -134 -665 -358 -72 580 -3 -1149 -896 -37 789 -64 -588 -1301 -436 338 353 -821
466h21o51P69J073j67q75r38K44J493N41j202j039J91J509R81r52j381R4J622
$$ -821 -1472 -703 370 203 -672 -1610 -1366 127 668 -534 -1573 -1382 127 1108 156 -1225 -1131 491
484D91M04p3j699k28J204J596l53j825n65P73J559N98j656j082L01J662N48j009
$$ 491 895 822 -877 -1105 99 1695 1342 -483 -1048 -275 1284 1882 226 -856 -555 1107 1655 646
502F46j412N3J493R43p64j512o06J867N46oj353j091J230J438J15j852l66O24
$$ 646 -766 -713 780 1723 959 -553 -1159 708 1254 1248 -105 -1196 34 1472 1587 -265 -631 -7
520gR79P55o93j712L06J196P57r37q66k69O26J507r53r98l10P04J269j87j295
$$ -7 972 1727 1034 -678 -372 824 1581 644 -222 -491 135 1642 689 -309 -619 85 1354 1167 -128
539a28p29M15J112N51j093q53J35J061J49n56r63L2J231L31j13j130k06N08Q27
$$ -128 -857 -442 670 1221 128 -725 -590 471 620 64 -899 -867 364 695 582 -548 -754 -246 581
558E81k13m60m48O13L88K85m94k84k30J026k56m27p0O3L51J21Q2m51l58L57L55
$$ 581 368 -92 -540 73 461 746 252 -32 -262 764 508 81 11 74 425 546 628 177 -181 176 531
579E31o3k55k83k20K77K43m05j13M65j17m7L73l55M2m4N3k49J00Oj19L30k3l4
$$ 531 468 213 -70 -290 -13 230 -175 -288 177 60 13 386 31 73 29 82 -167 -67 -61 -180 150 127 93
602I3q9m9O57l70J4l50L69j5J86k93k86J60K54l41K53K87m79J60p6j82K19Pk62
$$ 93 4 -45 612 242 256 -94 275 260 446 153 -133 27 281 -60 193 480 1 161 85 -97 122 129 -133
625a33K81m09P1J30M8j12N9L58K3l54j53O3J91L8l8M0k09K66o0j04Q3k25J99L7
$$ -133 148 -261 -190 -60 -12 -124 -65 293 316 -38 -191 -128 63 101 63 103 -106 160 100 -4 79 -146 53 90
649I0J85m22O6J37k15J38K02k86R5J26m3j26O3j5o8RJ89k49k2L23k37MJ97k96
$$ 90 275 -147 -81 56 -159 -21 181 -105 -10 116 73 -53 10 -5 -73 -64 125 -124 -146 177 -60 -56 141 -155
673a55M8J36P9p4J26j36o7q0N5q9J56j13R2j17J48K56l62Q3%J25r2K49j51j43
$$ -155 -107 29 108 34 160 24 -43 -123 -68 -157 -1 -114 -22 -139 9 265 -97 -14 -14 111 19 268 117 -26
697b6j44M1L09k48n3n3Q1J88j62l16K75J25M11j26n28M4L57k2k42q6o6L14L27
$$ -26 -170 -129 180 -68 -121 -174 -93 95 -67 -383 -108 17 428 302 -226 -182 175 153 -89 -175 -241 73 400
720D00m83r6j10PN26p0j9m94K40K88k66Q8J09rJ39k62j73n0Q5k1J33j14J02k33
$$ 400 -83 -179 -289 -282 244 174 155 -339 -99 189 -77 11 120 111 250 -12 -185 -235 -150 -171 -38 -152 -50 -283
744b83K21M26l39j54K0o4K10p6Q3n52L87K90j67k45J3K0M9M42k0k24m18K29J13
$$ -283 -62 364 25 -129 -109 -173 37 -39 44 -508 -121 169 2 -243 -230 -210 -161 281 261 37 -381 -152 -39
767c9J51j5j22j23J62K19j10k34j51J53N3K38l31L08J3k78O18l09m01J85K24o6
$$ -39 112 97 -25 -148 14 233 123 -111 -262 -109 -56 182 -149 159 172 -106 512 203 -198 -13 211 145
789A45k76l78K34J36M52j54r2l60K95j70J24j8J20k87M08m1j3j33k05J07K46P9
$$ 145 -131 -509 -275 -139 313 159 67 -293 2 -168 -44 -62 58 -229 179 138 125 -8 -213 -106 140 219
811B19l28J76L4qJ15J29m51J83Jk63J67J59j13j03J79k10K97m59L45j70n4N03
$$ 219 -109 67 101 93 208 337 -114 69 70 -193 -26 133 20 -83 96 -114 183 -276 69 -101 -155 348
833C48l23l60M20j13Q1k27K09k16K36O9n7l87K06O2l86L86K48k33nP7o3K52j41
$$ 348 25 -335 85 -28 53 -174 35 -181 55 124 67 -320 -114 -52 -438 -52 196 -37 -42 35 -28 224 83
856H3J03j37j15k03J33QR3o8Nj19q7L80j53j99k0L00j86J03J88j62J0j69K25J31
$$ 83 186 49 -66 -269 -136 -128 -35 -103 -98 -217 -304 76 -77 -276 -296 4 -182 -79 109 -53 -43 -212 13 144
880A44m2j86K08k28J09LN8j52J86p1J9J6k96L00j89j61K04j03L1M42n28M04j81
$$ 144 102 -84 124 -104 5 8 66 -86 100 29 48 64 -232 68 -121 -282 -78 -181 -150 292 -236 168 -13
903a3j09J77p1J68k77K83K39k83K0k48jK40l05N0J26j0K49K9j61j50j98L46r6
$$ -13 -122 55 -16 152 -125 158 397 114 134 -114 -115 125 -180 -130 -4 -14 235 264 103 -47 -245 101 5
926EK20m36j41J35L59O4k27j7J81j49K05j39Qk1N3o0K10q2j86k5L17J08n14K1
$$ 5 225 -211 -352 -217 142 206 -21 -38 143 -6 199 60 68 47 100 40 250 168 -18 -43 274 382 -132 -111
950a11k4J64J20k83J6j2K34K3k28n7R4r2M57m9m33N0L7L55j96k23n2K19P6n3j8
$$ -111 -135 29 149 -134 -118 -130 104 127 -101 -158 -64 -156 301 252 -181 -131 -94 261 65 -158 -210 9 85 32 14
975A4o2nO7L50j68k05N8Mk36R5R3l01M23J11q9l56m1J18K13j5j75kp4J90np9l
$$ 14 -48 -53 14 364 196 -9 49 53 -183 -88 5 -296 127 238 149 -207 -248 -130 83 68 -107 -109 -183 7 2 -77 -80
1002h0K2K22J02k38n1Kk10K30j22J20J31k91K24J10j76j72J25J49n0K6q5j63K02
$$ -80 -58 164 266 28 -23 -21 -231 -1 -123 -3 128 -163 61 171 -5 -177 -52 97 47 73 -12 -175 27
1025B7j32K8j2J81P9k48L76o54J65jJ44j08J85j22j21lK88j47J08J39l02P0M0
$$ 27 -105 -77 -89 92 171 -77 299 -355 -190 -191 -47 -155 30 -92 -213 -216 72 -75 33 172 -130 -60 -20
1048b0J31k71lK11l3J81j1k33J16r1j39L84k18L9K0Nk8P2Q1j49j11L26n43R4J04
$$ -20 111 -160 -163 48 15 196 185 -48 68 -23 -162 222 4 43 63 68 40 112 193 44 -67 259 -284 -190 -86
1073h6J56k23J34j81K73j63K77l9J25l59k50K86K80j77MK26n22M34k4j67j33O6
$$ -86 70 -153 -19 -200 73 -90 187 148 273 -86 -336 -50 230 53 57 283 -239 195 171 4 -129 -63
1095f3l18L63J87l00K66k59j1L36k51l5J03rm7L51l48M4K7j41P9O8j66n0L2K16
$$ -63 -381 -18 169 -131 135 -124 -135 201 -50 -85 18 9 -38 313 -35 9 36 -105 -26 42 -124 -174 -142 74
1119G4Jl32L63P8l05L61j31l16K77Nl3k39K54J54j18k4k66K21j82L30l12K61K9
$$ 74 75 -257 106 184 -121 240 109 -207 70 75 42 -197 57 211 93 69 -197 24 -158 172 -140 121 150
1142A50j50K7P0J36l19M3n0k4J48l9K27k73M8j72N10m66K4p3n7K33R9l33K36K9
$$ 150 0 27 97 233 -86 -43 -93 -117 31 -8 219 -54 -6 -178 332 -134 -110 -183 -240 -7 92 -241 -5 24
1166B4L1j55J99k28L36m20J10J5m9K19L1l2k34K06Rj44J87k26k11L39Mn0r2o6
$$ 24 55 -100 99 -129 207 -213 -103 -88 -137 82 113 81 -153 53 62 -82 105 -121 -332 7 11 -39 -131 -197
1190a97K49P6k05p9O0K02j76j03J9K41k51P7L84l91J64j04KJ84j32J21k56L04
$$ -197 52 128 -77 -156 -96 106 -70 -173 -154 87 -164 -87 297 -94 70 -34 -32 152 20 141 -115 189
1212A89q3K2m3j21L03l13K6r9J47j26K33l06J44n5k92K83K3J05m4j1j13J90K5
$$ 189 106 128 85 -36 267 -46 -20 -119 28 -98 135 -171 -27 -82 -374 -91 -68 37 -7 -18 -131 59 84
1235H4k3k77p9K98l2JJ54j00K09j06q9q2l0Q4j73JL77k34j29L24n1L1j89j22L5
$$ 84 61 -216 -295 3 -29 -28 126 26 235 129 40 -42 -72 12 -161 -160 217 -17 -146 178 127 158 -31 -153 -118
1260a18K17j63N8j31j35L34np8J11k08K6M58m21J77nk62J84O8j34P6J99k30lO6
$$ -118 99 -64 -6 -137 -272 62 57 -21 90 -118 -92 366 -55 122 117 -145 39 107 -27 49 248 18 15 81
1284H1l22p6L71L3j7J05j91nQ4O9j06l48M01j92J79rj84J55J1J63k58j3J9j08
$$ 81 -241 -317 54 87 70 175 -16 -21 63 132 26 -322 79 -113 66 57 -127 28 39 202 -56 -69 -50 -158
1308a58r9K23K1Q6k85J48N4j63K87j18j81J03L1N95m41k65N6j1P30q42J5L88r3
$$ -158 -257 -34 -13 73 -212 -64 -10 -173 114 -4 -185 -82 -51 544 103 -162 -106 -117 613 -229 -214 174 81
1331H1P5p2j98m3M0j79O9K32J07j9K6j51m5P9K44j22k53r7R7Q1K77n3k27o4j5
$$ 81 156 84 -114 -157 -117 -296 -227 5 112 93 119 -32 -77 2 246 124 -129 -226 -129 -48 229 176 -51 -115 -130
1356a30J6L59r3j96j1j0j01L60l70J15r5J91M55l80J87n20R5L35J79n99K57J16
$$ -130 -114 245 152 -44 -55 -65 -166 194 -176 -61 -156 35 490 110 297 -223 -128 207 386 -213 44 160
1378A60o0R2l02O8M3Pm5k90O03j04k04J27q8k52K52k6P4joj41j36J37R1J81m2
$$ 160 100 192 -110 -42 1 8 -37 -327 276 172 -32 95 7 -245 7 -19 55 54 48 -93 -229 -92 -1 180 138
1403A38r4J22j77r1K10j0k10J82O6Nk52K76M6l63K1K10M7P0p7j26l03N40l64O1
$$ 138 44 166 -11 -102 108 98 -112 70 136 141 -111 165 211 -152 -131 79 126 196 119 -7 -310 230 -134 -73
1427g3q7J47q2J74j4k10L20j66k3J61k5k67J68k35J87j28J82j94J79J37q0k69
$$ -73 -160 -13 -95 79 65 -145 175 9 -14 147 122 -145 23 -212 -25 -153 29 -165 14 151 71 -198
1449a98L9K89k5j5r5P1j53K54k54m4K52K2L7j69k81j7L25LJ74j74k84o6M40m72
$$ -198 -159 130 105 90 -5 66 -87 167 -87 -131 121 143 180 11 -270 -287 38 41 215 41 -243 -309 131 -341
1473c41L05J29m25N69l66J17j55m1J69n8M3j80M74j87Lj51J52J6j60J15K23l87
$$ -341 -36 93 -332 237 -129 -12 -167 -208 -39 -97 -54 -234 240 53 56 -95 57 73 -87 28 251 -136
1495a36r4R2J35q7J60rq8rPn2J92k79K89j58j48K00k4k36L40k31J81l7J08L1j93
$$ -136 -230 -138 -3 -90 70 61 -27 -36 -29 -81 111 -168 121 -37 -185 15 -9 -245 95 -136 45 8 116 147 -46
1520d6k4Kj91M26n07O2L18l00K49J35j24j35K38q3J01j12O7p5n7l86O63l5n14
$$ -46 -70 -68 -259 167 -340 -278 40 -260 -11 124 0 -135 103 20 121 9 76 1 -56 -442 221 186 -328
1543c28M12PJ38j57l59K55j0L7j17K57p8K02j73j82K37j57M4J13J9n22N53j22
$$ -328 84 91 229 72 -287 -32 -42 -5 -122 135 57 259 86 -96 141 -16 28 141 160 -362 191 69
1565F9j48K21j47QJ09j05K5M2j29p1L24J9p7k12j46M13k83K99l66K20l75M21j46
$$ 69 -79 142 -5 3 112 7 32 74 -55 -126 198 217 140 -72 -218 195 -88 211 -155 65 -310 111 -35
1588c5L5J34k86j1J15l2K12J23k17N2k42N2K5K69k28p5J33p3J98l1j52L9q2J01
$$ -35 0 134 -152 -163 -48 -80 132 255 38 90 -152 -100 -75 194 -34 -109 24 -49 149 118 -34 5 -77 24
1612B4j8J13j64K50l36J07K1l23M12j82M5J17j55o6J34k0L1J43M2l88j58M30O4
$$ 24 6 119 -45 205 -131 -24 -3 -326 86 -96 -51 66 -89 -155 -21 -41 -10 133 175 -213 -371 59 123
1635A23O5r6k34K42m8M0O8k67L80j90L0m02K41j49J88K24l72K33J89m60M52k45
$$ 123 188 92 -142 100 52 92 160 -107 273 83 113 -289 -48 -197 -9 215 -157 76 265 -195 257 12
1657A2K98l64j16K64k8j02J0q6j36N23N9k97oP9o1J38k92J66R4k31L2j46L4J26
$$ 12 310 -54 -170 94 66 -36 -26 -112 -248 275 334 37 31 110 49 187 -105 61 155 -76 -44 -190 -156 -30
1681c0K30N3l10o1K01l67N26k63Rp3J36Q5q3J88k00k43J50J59k20J1j64L26M7
$$ -30 200 253 -57 -118 83 -284 242 -21 -12 -85 51 136 53 241 41 -202 -52 107 -113 -102 -266 60 107
1704A07k66J26Q7N7j0o7m7J85j13O7j36J10j19j29K51m0n0k68K18k31J96j2J40
$$ 107 -159 -33 54 111 101 34 -13 172 59 126 -10 100 -19 -148 103 63 13 -255 -37 -268 -72 -84 56
1727E6l45K77J35k34o1J27N4k21J80j2j4j47NL11l0K11m00O6j9j67K25m3jl23
$$ 56 -289 -12 123 -111 -172 -45 9 -212 -32 -44 -58 -205 -200 111 81 292 -108 -42 -61 -228 -3 -46 -47 -370
1751c70K31K66M5Q7j24k34L78l63J5J2rn0l8K94K9M1j18j13j01j8K73l68K50L
$$ -370 -139 127 172 259 135 -99 279 -84 -69 -57 -66 -116 -154 140 169 210 92 -21 -122 -140 133 -235 15 18
1775A8q3n2L18k92l8K81k04m3J68J19l49J31L7q9j27o4M02j54l2Jk09L05K0k45
$$ 18 -65 -117 201 -91 -129 152 -52 -95 73 192 -157 -26 11 -78 -205 -269 133 -21 -53 -52 -261 44 64 -181
1799a81K44K74n06L87m27K79R0l96J41j23K48q0j21J22K38l12K51j86J53Kj77
$$ -181 63 337 -169 218 -209 70 160 -236 -95 -218 30 -50 -171 -49 189 -123 128 -58 95 97 -80
1820h0k1K00k9M7r2jN4k67P7L44l05m0J47j27K4L07l13K01k88J11j05Q1j90J11
$$ -80 -101 99 70 117 25 24 78 -189 -112 232 -73 -113 34 -93 -69 238 -75 126 -162 -51 -156 -75 -265 -154
1844a54K86l36K03j30J81k18J35J00k27J60mJ1Q0j17J64k27k6J37o0O6k9j72Q9
$$ -154 132 -204 -1 -131 50 -168 -33 67 -160 0 -4 7 87 -30 134 -93 -119 18 -42 24 -5 -177 -88
1867h8J46Qj76j64M04j66m9k69K95kJ39J63j49J75l09J52j32J47j90j04J45K31
$$ -88 58 66 -110 -274 130 -36 -85 -354 -59 -61 78 241 92 267 -42 110 -22 125 -65 -169 -24 207
1889B07k16l3K3l2j59J41j7K04k58K06J24k18k4k94L66N9l31K37k30M19n7l18
$$ 207 -9 -42 -19 -51 -210 -69 -86 118 -140 66 190 -28 -52 -346 20 79 -252 -15 -245 174 117 -201
1911b01J87j8j07K80K6l35K52j99O9J58k11N0o9N4J80j17J7k52K11j5j17M14k01
$$ -201 -14 -32 -139 141 167 -168 84 -115 -46 112 -99 -49 -118 -64 116 -1 16 -236 -25 -40 -157 257 56
1934E6J31j16l45J56J36j57K54M3m9k33N32k88M6N6l49K50j54j95N71m05n8M24
$$ 56 187 71 -274 -118 18 -139 115 158 109 -124 408 120 166 222 -127 123 -31 -226 345 -60 -118 306
1956C06j06q5n7nl18N87p5k55j67j50K05K7L77k36m9j45k4kM52l39N8K02l63K46
$$ 306 200 115 58 53 -265 322 247 -8 -175 -325 -120 -93 284 48 -1 -146 -170 -172 280 -59 -1 201 -162 84
1980H4m6P7J10k4k94M4J01N2k69J55l5R3j2M9l47L83j63N8n6J04j14J43k52L23
$$ 84 38 115 225 201 -93 -49 52 104 -165 -10 -45 48 36 85 -262 121 -42 16 -40 64 -50 93 -159 164
2004A64l74L14N4n44L14J65N1l21L99l55l4Q9K1o9L22n60L23q5o7K30l6j7O4k15
$$ 164 -210 104 158 -386 -72 93 144 -177 222 -133 -167 -78 -57 -126 196 -364 -41 -126 -193 37 1 -16 48 -167
2028a67L07J34k36j09r4K64j71l74J58L57J71l42J59j93K30p0j83K04j13L64k17
$$ -167 140 274 38 -71 -165 99 -72 -446 -288 69 240 -102 57 -136 94 24 -159 45 -68 296 79
2049G9k06L5K47l13L55j75l17K21lk7R2k66M09k52J02p3J20m11K47Q6K19k24J06
$$ 79 -127 -92 155 -158 197 22 -295 -74 -77 -104 -12 -278 131 -121 -19 -92 28 -383 -136 -50 169 -55 51
2072E1r8J3R3j09J95k81K84k99M78l18j79K39M8K9k68K71l11K30k76k3J64J86
$$ 51 -47 -34 59 -50 145 -136 148 -151 327 9 -170 69 117 146 -122 149 -162 68 -208 -231 -67 119
2094A19j20P0p2K10m06j95O80l67O9kk45K02Q2k1j19K3J48j15Lj55K39J02l71
$$ 119 -1 69 -3 207 -199 -394 286 -81 -12 -14 -259 -57 25 4 -115 -92 56 -59 -56 -211 28 130 -241
2117b41J66K28K2k73J22L8j05j19M05n56M61j86K80m27J68K49k35m5j27N2n1R4
$$ -241 -75 153 175 -98 24 62 -43 -162 243 -313 148 -38 242 -185 -17 232 -3 -48 -175 -123 -174 -80
2139h0L36k9j92j45M6P5K53k03j75m3J73R1j92J82j12k43M59k83K2j10NL75k15
$$ -80 256 227 35 -110 -64 11 264 61 -114 -157 16 107 -85 97 -15 -258 201 -82 -60 -170 -165 210 -5
2162ek62K46J48l1J42k30K7k53J54k27K97RM4j9rj90k6R1K69j9l23j01M25j11
$$ -5 -267 -21 127 96 238 8 35 -218 -64 -291 6 15 59 40 31 -159 -185 -94 175 156 -167 -268 157 46
2186D6q7L0p2nK47j08p1J00q5k5J38o9l5j9k84L10k14M25k44k7N9o7L63m25K31
$$ 46 -41 -11 -83 -88 159 51 -20 80 -5 -30 108 39 4 -15 -299 11 -203 222 -22 -49 10 -57 306 -119 112
2211A12r5Q6n4k45J72m3J92l59L10j9k45k1J51n0K78l68J44P3J55N9l5l01K84
$$ 112 17 103 49 -196 -24 -67 125 -234 76 57 -188 -209 -58 -108 170 -198 -54 19 174 233 198 -103 181
2234A81j72N7K21l62J14k5J5q4j17K11R0p7k7J27l08P5j57M41o0O3l14j62K40
$$ 181 9 66 287 -75 39 14 29 -55 -172 39 129 52 25 152 -156 -81 -238 203 143 206 -108 -270 -30
2257c0o2J02j54m0Q5J95j87J91k34K72j83L6J50N1n4j93J72j13J66M5r8K05l49
$$ -30 -92 10 -144 -184 -99 96 -91 100 -134 138 -45 -9 141 192 138 -55 117 4 170 215 117 322 -27
2280b7K12k59o2R2J18j47K20k92k27L76k11P1P8Q7r7J88J36k84J11k32J80q0R1
$$ -27 185 -74 -136 -44 74 -73 147 -145 -372 4 -207 -136 -58 29 -68 120 256 -28 83 -149 31 -49 42
2303D2k77J35M04m31j12K77k56K52j54K36n09O26j33J3RK06k33j25J69k74J48
$$ 42 -235 -100 304 -127 -239 38 -218 34 -120 116 -393 233 100 113 122 328 95 -30 139 -135 13
2324A3J85j02j54j30O1O3j20m8M80p4l31J19J29j77j9J7R8K26P9j73r3o1j04k7
$$ 13 198 96 -58 -188 -127 -64 -184 -232 248 174 -157 -38 91 -86 -105 -88 10 236 315 142 49 -12 -116 -143
2348a43J55l13L51o0Q2k05j13K8K34j08P1m9K26J24k75j76Q4P9M1J2MQ1k92M11
$$ -143 12 -301 50 -10 72 -133 -246 -218 16 -92 -21 -70 156 280 5 -171 -87 -8 33 45 49 130 -162 249
2372B49m72l3L0M06k55J7nJ01kq8K58n18J53mJ07K52m68J95k22Q7O50l48N6k52
$$ 249 -223 -256 -226 180 -75 -58 -63 38 36 -52 206 -312 -159 -163 -56 196 -272 -77 -299 -212 438 90 146 -106
2396a06R9m2K68l41K24p6p5K66k83L44l82K94k53K57l47NK36l2j6J21k32NJ18
$$ -106 -7 -49 219 -122 102 26 -49 217 -66 278 -104 190 -63 194 -153 -148 88 56 40 161 -71 -66 52
2419E2m4kQ8m6o3J17k18J24k64J47K12k94J61J18K03m43l3J00k5J03p7j76J13
$$ 52 8 6 94 48 -15 102 -116 8 -256 -109 103 -191 -30 88 291 -152 -185 -85 -110 -7 -84 -260 -147
2442a47J33K6n0K90l69M1K20l4k84P4L05l57J63j05J35j99J09j35J90L0j70M1
$$ -147 -14 12 -38 252 -117 -76 144 110 -174 -100 205 -152 11 -94 41 -158 -49 -184 6 36 -134 -93
2464i3K6J33J31n4J37l82J45M5n3r1K46m50L34J65j79m96M11k19N35j34l22L70
$$ -93 -67 66 197 143 280 -102 43 88 35 -56 190 -260 74 239 60 -436 -25 -244 291 157 -165 205
2486B05q2m7j27J08k22J70p9K24j00L9k52J0M54l10j12MJ87O1l25R7K88l79K20
$$ 205 123 76 -51 57 -165 5 -74 150 50 89 -163 -153 301 -9 -121 -117 70 131 -194 -97 191 -188 32
2509C2q1J97j74j60j15K24j08L30m44L98k69K50k2l42M10k86M90l77P8NL7N0j85
$$ 32 -49 148 -26 -186 -301 -77 -185 145 -299 99 -170 80 58 -284 126 -160 330 -47 31 36 73 123 -62
2532f2K2j43K54J30m50R9K8J19k79L24J42k81N6J09l18L59Ll9l8OqR1j57L78l03
$$ -62 -40 -183 71 201 -249 -150 -122 -3 -282 42 184 -97 -41 68 -250 109 112 73 35 41 33 124 -33 345 42
2557D2p2K57k25j77J15pk6K12j82K07j97L02j79J30k94nJ88j42J19p7J5j04j16
$$ 42 -30 227 2 -175 -60 -67 -93 119 -63 144 -53 249 70 200 -94 -99 89 -53 66 -11 4 -100 -216
2580b16J55J27M4m5j8j86K17K11p1m04L99k95pr9J07J31j8j53J21L7l8M50k81
$$ -216 -61 66 110 65 47 -139 78 289 218 -186 213 -82 -89 -188 -81 50 32 -121 0 37 -1 449 168
2603A68j91P0J04q6P6j36k69K15%j94J33L6L59j48k45L33r0m1n4N0k60J16L17
$$ 168 -23 47 151 65 141 5 -264 -49 -49 -243 -110 -74 285 137 -108 225 135 94 40 90 -170 -54 263
2626B63j01k81k5j03L02m3j22K60j95J65j32L18k18k83K13J37l61M52j09j71j25
$$ 263 162 -119 -144 -247 55 12 -110 150 -45 120 -12 306 88 -195 18 155 -206 246 137 -34 -159
2647a59O1J94J38l67j11L28K3j44l8j71K64r2L11Nj69j58J37K58j25k29l9M9k11
$$ -159 -98 96 234 -133 -244 84 107 -37 -75 -246 18 -74 237 242 73 -85 52 310 185 -44 -83 -34 -245
2670b45J24NJ03jl0N8j06Q7L3j10p9J1O18m78J25k17M6p3K21Oj06K51l44j20L69
$$ -245 -121 -116 -13 -14 -44 14 -92 -5 28 -82 -161 -150 468 -10 115 -102 -56 -129 92 98 -8 243 -101 -221 148
2695A48NP0l06J87k72K07j79K33p9oo4L06m01N6J9P8j71L28J04j70l81K4K34q1
$$ 148 153 223 -83 104 -168 39 -140 93 14 8 -56 250 -151 -95 -76 2 -169 159 263 93 -288 -264 -30 -111
2719a11K11m7j93k36N98j99O2J71l60K4r3K13j15K40m54K73L34k27L16l48j39
$$ -111 100 53 -140 -376 222 23 85 256 -104 -80 -173 40 -75 165 -289 -16 318 91 407 59 -80
2740h0M5K0j35O3K67l4l9j8k65O4K24j93L2L6P4P9k94P6K08j05K46k16l14j04
$$ -80 -35 -15 -150 -87 180 146 107 89 -176 -112 112 -81 -49 -13 61 140 -154 -78 130 25 271 55 -259 -363
2764c63K32l4K50j77M72m64K12k34J1L0M8J7J13j05J4k03J19l03K60J73K28k10
$$ -363 -131 -165 85 -92 380 -84 128 -106 -95 -65 -17 0 113 8 22 -181 -62 -365 -105 68 296 86
2786H6K9K1J04m14J26K19k61R4q6O6K13k29L3J07j63J41J6P7k97J67r4K26j5k63
$$ 86 115 136 240 -174 -48 171 -90 4 -82 -16 197 -32 1 108 -55 86 102 179 -118 49 -45 181 166 -97
2810i7o4Q6L01j86k30J35j7k7K6Nk19N97k06J6k27K74l51L62n28Q4K38k9K11m9
$$ -97 -161 -75 226 40 -190 -55 -72 -99 -73 -68 -287 310 104 120 -107 167 -184 178 -350 -266 -28 -57 154 105
2834A05J31j85J87j47j81L15m0l85M13k38K19l21J4L2j05L89j83J34m07K50p5
$$ 105 236 51 238 91 -90 225 185 -200 213 -25 194 -127 -113 -81 -186 203 20 154 -253 -3 -78
2855g8k9J25j91J53K07pj50q5K74M8m71MJ51n5L16r1J3l8Pk36N6K64j57l39N58
$$ -78 -107 18 -173 -20 187 180 30 -55 219 267 -204 -200 -49 -104 212 121 134 96 103 -133 -77 187 30 -309 249
2880B49j40j49J91M5k19Ml3j37M35j12l8k12K85j69J71j33L46n36R3N27o05l82
$$ 249 109 -40 151 196 -23 -19 -52 -189 246 134 96 -116 169 0 171 38 384 -152 -59 468 -137 -519
2902e19M90R8J70j15K3j72K65m3o7n1j78L15j32k01K9L2k8L59j79k72J09L22k06
$$ -519 -29 69 239 124 147 -25 240 197 130 79 -99 216 84 -117 -88 -56 -84 275 96 -176 -67 255 49
2925D9%O7j96n7L17L7m36M75p4j84J1J35j68J15j6J19m0l07L32j54j38q9Q0J37
$$ 49 49 116 -80 -137 180 217 -219 256 182 -2 9 144 -24 91 75 194 154 -153 179 25 -113 -202 -122 15
2949A5O5P8R5l58Q9k00K45n8JK5J22K32m25n1pL97j1k67m1J77r2L2N0j09r9K69
$$ 15 80 158 253 -105 -16 -216 29 -29 -28 -3 119 351 -74 -125 -132 265 254 -13 -54 123 31 63 113 4 -95 174
2975A74M5l22O6j38J34JQ1j83L80m99L56R2p2j83pp1M3K46m7j20rk10K78n7j21
$$ 174 219 -103 -37 -175 -41 -40 41 -142 238 -261 95 187 115 -68 -75 -146 -103 143 96 -24 -33 -243 35 -22 -143
3000a43M52m57J29J57j23r2j11J79J62p6p0j31qK65k58K96j33J40k71L9l48L22
$$ -143 309 -148 -19 138 15 -77 -188 -9 153 77 7 -124 -132 133 -125 171 38 178 -93 -54 -402 -80
3022h0J41K50j68m73L54o9K99l57K28k89J52K42n40M9R3J33l88L58J15n8p4R1
$$ -80 61 311 143 -330 24 -45 254 -103 125 -164 -12 230 -310 -261 -168 -35 -423 -65 50 -8 -82 9
3044In4J13Jk56K6J06L95n20QK76K96l63j00j69N01l09r5L13k3k99L7L34l10J90
$$ 9 -45 68 69 -187 -161 -55 340 -180 -172 104 400 37 -63 -232 269 -40 -135 178 155 -144 -107 227 -83 107
3068A07q1K37k16j15K40m50K96k8K9j2J23o6p7k12K71j29j08N9J69j30Q3J19L0
$$ 107 26 263 47 -68 172 -278 18 -10 19 7 130 64 -13 -225 46 -83 -191 -132 37 -93 -10 109 139
3091A39N1j51J48m8k75J09K74j93j56n2R4q3J67j38J04k1Q1k1j20J25Ll29J62
$$ 139 190 39 187 139 -136 -27 247 54 -102 -154 -60 -143 24 -114 -10 -31 50 29 -91 34 37 -292 -130
3114a30P2K76o2q2j80J55j17O6L8j77J5L47N3l18j76K28l9K3N4l15M19o5Oo8k18
$$ -130 -58 218 156 74 -106 49 -68 -2 36 -141 -126 221 274 -44 -220 8 -31 -8 46 -269 150 85 91 23 -195
3139a95J05QJ52p2MJ7M8j84Q9L82n42O6q5L08j62L78l43l11R3K61N7mj32o9J63
$$ -195 -90 -82 70 -2 2 19 67 -117 -28 354 -188 -122 -207 101 -61 317 -26 -337 -244 17 74 70 -62 -131 32
3164C2J06j91J96po0k07O3Q7q1m3L47j91l04N06l32j16K84j56J17j12r6j52K72
$$ 32 138 -53 143 136 76 -131 -68 19 -62 -105 242 51 -253 253 -79 -195 89 -67 50 -62 -158 -310 -38
3187c8L56n2m45L26j84J93L4l13k9q7K70j91J64QNj98K55m7J68m17J56Q0k55K02
$$ -38 318 266 -179 147 -37 156 190 -123 -152 -239 31 -160 4 12 17 -181 74 27 195 -222 -66 14 -241 -39
3211c9j39K00k04J08J08j17K59k21p1O5l2L9K87j33l18J9K78q7j86Q7j49L85l37
$$ -39 -178 22 -182 -74 34 -83 176 -45 -116 -51 -83 -44 243 110 -208 -189 89 2 -184 -97 -246 139 -198
3234a98M05l49p1J78j09L09n03L76j46J4O8J99P9l60L4j19K22j0M6j2j66q1K3
$$ -198 207 -142 -213 -35 -144 165 -338 38 -108 -94 -26 173 252 -108 -74 -193 29 19 65 53 -113 -194 -171
3257a71J46m6l6m8j08M6K57l08L01n9J62j59Q2O3k32k21K54J13k37K38j97J77
$$ -171 -25 -71 -107 -155 -263 -217 40 -268 33 -26 136 -23 59 122 -110 -331 -77 36 -201 37 -160 17
3279A7l03L61J05O0j24rr9M2J6O9k29j01P0L09l96Q4k11L76P9M5k17NR5J04j80
$$ 17 -286 75 180 240 116 107 8 50 66 135 -94 -195 -125 184 -212 -128 -339 37 116 161 -56 -51 44 148 -32
3304c2l1R6o7R3j30o1J09j80J16P7k1J13O7k85J35k2J3l4j64L27n8J33k26J35
$$ -32 -63 33 -34 59 -71 -132 -23 -203 -87 -10 -31 82 149 -136 -1 -23 -10 -44 -208 119 61 194 -32 103
3328A03j11M3K2M9j53K58j71n8j22n8L66m91N70k21k34J24JK97o1j42K08j00j44
$$ 103 -8 35 57 106 -47 211 40 -18 -140 -198 168 -323 247 26 -208 -84 -83 214 153 11 219 119 -25
3351b5o5j9K67m31m3K46K68j21k53K28J98j72R8p9j40J39n7j5J17l93L05o2L35
$$ -25 -90 -109 158 -273 -316 -70 198 77 -176 52 250 78 176 97 -43 96 39 24 141 -252 53 -9 326
3374C26k31Q1J82n17lJ32M2jn7M7J54k58J40Q3k94J3L54k77J55l25L02L6j38q
$$ 326 95 176 358 -159 -162 -30 12 11 -46 1 155 -103 37 120 -174 -161 193 -84 71 -254 48 84 -54 -62
3398f2m8L71k01j44o3J75k24K10J59k58J49r4k06K04L3m3J58l00M38j86j25R6
$$ -62 -110 261 60 -84 -147 28 -196 14 173 -85 64 -30 -236 -32 1 -42 116 -184 254 68 -57 39
3420C9L9J77k74J30Kl5m0j91L05j99L48l30j16K3k3J83j95J09kq4K74j71J54j11
$$ 39 78 255 -19 111 113 78 38 -153 152 -47 301 -29 -145 -122 -145 38 -157 -48 -50 -134 140 -31 123 12
3444A2k03J45K38j53k02O7p5M55j84l63K46qj49M4J63L08n16K63M4p3q4k39L66
$$ 12 -191 -46 192 39 -163 -96 -171 284 100 -263 -17 -25 -174 -130 33 341 -175 88 132 59 -25 -264 102
3467A02q3l28M00k81J37m9J56o7M1j64J80L54m19j0m9L35j54l5M2l48J77n9K2
$$ 102 19 -309 91 -190 -53 -102 54 -13 28 -136 44 398 -21 -31 -80 255 101 66 108 -240 -63 -122 -100
3490a00J43J44k33j55q6K94Q6n1j80J33J85l46L17j7k9j38k12L09R0l69J68L8
$$ -100 43 187 -46 -201 -287 7 93 42 -138 -5 180 -166 151 134 105 -33 -245 64 154 -215 -47 -9
3512ik18N35m68L30r3n7j53M3J40k52L94n6j92K2J75j4l51L38l5j03L23l19j6
$$ -9 -227 308 -160 170 77 20 -133 -90 50 -202 192 136 -56 -34 141 127 -224 114 79 -24 299 -20 -36
3535c6K82m0q3J28l51P6J85k18K65m18L88j34j13L78o55L34J15o1k00K64j45R
$$ -36 246 206 123 251 -100 -24 161 -57 208 -210 178 44 -69 309 -346 -12 103 42 -158 106 -39 -30
3557c0L49l59L62m31J22j98O8J98j66q3O2N2rL25r2k9ll54L12m4j90P3K72l77
$$ -30 319 -40 322 -109 13 -185 -117 81 -85 -168 -106 -54 -63 262 170 141 138 -216 96 52 -138 -65 207 -170
3581a70j46K97J9Rj30j55J21K23J35j47j24j12J42K79K6n07K11J7j10l3J60J13
$$ -170 -316 -19 0 9 -121 -276 -155 68 203 56 -68 -180 -38 241 267 -240 -29 -12 -122 -155 5 118
3603A18j01j26K44j33J8l9J0p6l9K6j5j6n2J16j88M0J2K26k66Q3L98l09K26j65
$$ 118 17 -109 135 2 20 -19 -9 -85 -124 -98 -113 -129 -181 -65 -253 -213 -201 25 -241 -158 240 -69 157 -8
3627hJ2r6M5R2J01l0l40N2J95O3l07j30K96P2O0l1k80J26k6R6p1n3J69j53pl1
$$ -8 4 -92 -47 45 146 116 -224 -172 23 86 -221 -351 -55 17 77 46 -234 -108 -134 -38 -109 -162 7 -146 -153 -184
3653a84Q8K90k15K39k03k36L59m38M47k69M28j52l35l6J26j54L65k98o9K53j13
$$ -184 -96 194 -21 218 15 -221 138 -300 147 -122 306 154 -181 -217 -91 -245 120 -178 -247 6 -107
3674a07J02K43k17K22l04J86q6k95J19Ql0O9N7j49J24J18O4J53k70K76j57j53
$$ -107 -5 238 21 243 -61 125 39 -256 -137 -129 -159 -90 -33 -182 -58 60 124 277 7 283 126 -27
3696b7L80m51k4L9J09j99N0K82j55R9j35J20k96L78N4m9M2n27J58k3M52k94N0
$$ -27 353 -98 -122 -83 26 -173 -123 159 4 103 -32 88 -208 170 224 175 217 -310 -152 -175 277 -17 33
3719C3k31J97K5L3M1k86L85m15N1K11L61k71l05J22J14L6%qk6N0r9k9K8r6K0J1
$$ 33 -198 -1 24 57 98 -188 197 -218 -167 44 405 134 -171 -49 65 101 101 93 67 117 18 -11 17 -79 -59 -48
3745d8p6K19j82P5K31j73j05j58M11k38J22j70K89l41K54j97L7J17k79M07l94
$$ -48 -124 95 -87 -12 219 46 -59 -217 194 -44 78 -92 197 -144 110 -87 -50 67 -212 195 -199
3766a99J4K07l21L16n8K8K92l43K0k52M16j88J84l38K9K31L2l52L5R2L71m80K14
$$ -199 -185 22 -299 17 -41 -13 279 -64 -44 -296 120 -68 116 -222 -193 38 70 -282 -247 -155 216 -264 -50
3789e0J62j33j37p7J87j47N7J59j67K70j78J34lj41o4L36l21N5j67L44l63L18
$$ -50 112 -21 -158 -235 -48 -195 -138 21 -146 124 -54 80 77 -64 -128 208 -113 -58 -225 119 -244 74
3811G4k1l1K69m68K19j53L92j88j46L78k32j40r2k5M23j97o9J70j64P4R3j87j64
$$ 74 53 22 291 -177 42 -111 281 93 -53 325 93 -47 -139 -164 259 62 -7 163 -1 73 166 -21 -185
3834a85k6L25m56M35k0J18j62J58k45k20J02J31K4M5J77m90J71j43M25k90L16
$$ -185 -211 114 -342 93 73 191 29 187 -58 -278 -176 -45 -21 24 201 -289 -118 -261 164 -126 190
3855A90k51L0J76l99K45J4Q2l55L78m65K79l5L01k35R3k29J43L54l09r3K44j49
$$ 190 -61 -31 145 -254 -9 5 87 -268 110 -355 -76 -111 190 -45 48 -181 -38 316 7 -86 158 9
3877IL9P2o1L7j75Q5k77K21P6Q1r7J79j61K4l52K28K79k14m8j12M22l25k71L65
$$ 9 48 120 59 96 -79 6 -271 -50 26 107 10 189 28 52 -300 -72 207 -7 -55 -167 255 -70 -341 24
3901B4J27l71J44j13J85j22P5R7J5r3J72J4J33n30J37J39k29R5oK10l3M3k3L5
$$ 24 151 -220 -76 -189 -4 -126 -51 46 61 -32 140 154 287 -243 -106 33 -196 -101 -107 103 70 113 90 125
3925A25kk95J26P0j85K29j03oP4l4J14K0K0j36j40j81K97K79n21J65p0L84j76
$$ 125 123 -172 -46 24 -161 68 -35 -41 33 -1 113 133 153 17 -123 -304 -7 272 -249 -84 -154 230 54
3948E4k10J66j85M90l17K5R4m2J61m63Q0K76kk48K16MJ84k20J53l7n2j70q6K38
$$ 54 -156 10 -175 315 -2 23 117 75 236 -227 -147 129 127 -121 95 99 283 63 216 179 127 -43 -129 109
3972A09N5k94N7J78K7k20j17J20K05k68N4P8J13j9oNj22J26k54L48k55L75k23
$$ 109 164 -130 -73 105 132 -88 -205 -85 120 -148 -94 -16 97 78 72 77 -45 81 -173 175 -80 295 72
3995G2j87J35q2j16J13O7RpJ72l63L03J90k50q5K85m71J72j79L87l49K24j99L47
$$ 72 -115 20 -62 -178 -65 2 11 4 176 -187 116 306 56 -29 256 -215 -43 -222 165 -184 40 -159 188
4018A88l10M43k14j90L07o6j43j03K94k27r3L9J56J46m66O2RL7P8K15k18nJ60
$$ 188 -122 321 107 -83 224 158 15 -88 206 -21 -114 -75 81 227 -239 -177 -168 -131 -53 162 -56 -61 99
4041I9l13K5Q2J56n07L82q7N7J30p1L40k12J23q3m1k94L33q9k36N51l29j34q2
$$ 99 -214 -189 -107 49 -458 -76 -163 -106 24 -47 293 81 204 121 80 -214 119 30 -206 345 16 -118 -200
4064b00K46j63j6L15q1L2l16o7K18k19J79O7O9l98jL96j8Q0m9r8J39j20K00j78
$$ -200 46 -117 -133 182 101 133 -183 -250 -32 -251 -72 -5 64 -334 -335 61 43 123 74 -24 115 -5 195 17
4088A7n0j4K26k87J62m7j13P6K75j81j85M04k40J53k87K41l11J78R5j28J50L7
$$ 17 -33 -47 179 -108 54 7 -106 -30 245 64 -121 283 43 196 -91 150 -161 17 112 -16 134 171
4110A71j67k09K63qk80l1j9L70K4k76J3J26k56M62k40LK9L4k73M33j83Kj35n5
$$ 171 4 -205 58 50 -230 -261 -280 90 114 -162 -149 -23 -279 183 -57 -54 -25 9 -264 169 -14 -12 -147 -202
4134b02J92J63k09J52k37N01m54J8l0q2K31j6j11J25o7j25N2J89j47Q5J81j83
$$ -202 -10 153 -56 96 -141 360 -94 -76 -106 -188 43 27 -84 41 -26 -151 -99 90 -57 28 209 26
4156B6k11K11J1o2Q6p9j00l18M08j8J13k9J48j96q5J7oN1k7N2K10r4j30pJ0j76
$$ 26 -185 26 37 -25 61 -18 -118 -436 -28 -46 67 38 186 -10 -95 -78 -84 -33 -60 -8 202 108 -22 -29 -19 -195
4182a95R2J54k03P2Jl3r9L25l72J76J5J90k13j02J56l17L83m52N03j58j71J50
$$ -195 -103 51 -152 -80 -79 -112 -211 114 -258 -82 -67 123 -90 -192 -36 -353 30 -422 81 -77 -248 -98
4204i8J98j48M3J40K20o61M47j34q4K2l2L11m23K03j61LP9O4m6j56M9K54k98R9
$$ -98 100 -48 -5 135 355 -306 141 7 -77 -55 -87 224 -199 4 -157 -154 -75 -11 -57 -213 -164 90 -208 -109
4228a09j13K77j19k2R1M1J70%l47L73q8j02R1j7l38%L74P3k09L46k99k76L92k24
$$ -109 -222 55 -64 -86 5 46 216 216 -131 242 154 52 143 126 -212 -212 162 235 26 372 73 -203 189 -35
4252c5P1l27K28j45L11n1j43J40j72J63j2l04K12K02N2j44J12q1j97J4K50q2j60
$$ -35 36 -291 -63 -208 103 52 -91 49 -123 40 28 -276 -64 138 190 46 158 77 -120 -106 144 62 -98
4275i8m8J31J06k7J43ok8j57q8K98o4m05K13o9L67m22L7n4J14m1N8O8oj35J89
$$ -98 -146 -15 91 64 207 201 173 16 -72 226 162 -243 -30 -99 268 -154 -117 -171 -57 -98 -40 28 22 -113 76
4300G6p8P2m5j09Q1K43j6l70M05k09p8lk39K18n1K29p0J40m75R0j2J49j11J17
$$ 76 -2 70 25 -84 -3 240 224 -146 259 50 -28 -31 -270 -52 -103 126 56 196 -279 -189 -201 -52 -163 -46
4324d6p8J00K22p8r4k12K87M5l9o6K28l83L8N6k17L12j82j03N3J96pK0R2k33K21
$$ -46 -124 -24 198 120 26 -186 101 146 107 41 269 -114 -76 -20 -237 75 -107 -210 -157 39 32 52 144 -89 132
4349A32R9n4o13L10M8M6L38l34J23j29O6P5N9j21r9K26k04j83M63j74k93L46J31
$$ 132 231 177 -436 -126 -78 -32 306 -28 95 -34 32 107 166 45 -54 172 -32 -215 248 74 -219 127 258
4372B58m88K59K9nRj8R5j45Q2K20j00l61L19k22N0K71m13K95Q8l72L72k19m4K44
$$ 258 -230 29 58 53 62 44 139 -6 76 296 196 -165 154 -68 -18 253 -160 135 223 -149 223 4 -40 204
4396B04m44M59k48k5r7L50j3o6Jk3n7m43O13kk45j48L0K47j65l1k8O0K30l43J37
$$ 204 -240 219 -29 -54 -151 199 186 120 121 98 41 -402 211 209 -36 -184 -154 93 -72 -103 -131 -71 159 -184 -47
4421d7j72J06J65j24k56L36P2l09J85R2J74k57j49K31n3k51J99K44j61k82M90
$$ -47 -219 -113 52 -72 -328 8 80 -229 -44 48 222 -35 -184 47 -6 -257 -58 186 25 -257 233
4442B33k17m5j7J19J5k00j6K9r0J53LN4j62J80j22O9j77J45j78Q7J21j0M5j97
$$ 233 16 -29 -46 73 88 -112 -128 -99 -189 -36 -33 21 -141 39 -83 -14 -191 -46 -224 -137 -16 -26 19 -178
4466a78J57m9L65k44m3J2l4J31P3k70Q7q7j36K29l3J7r2J63k93J50M4j3R7j59
$$ -178 -21 -70 295 51 8 20 -14 117 190 -80 7 -80 -216 13 -20 -3 -95 68 -225 -75 -31 -44 53 -106
4490a06J61n0m8K12j01l56M10J25k03m6J18j60R2j86M1K73J05j05k06O9p1L18
$$ -106 55 5 -43 169 68 -288 122 247 44 -2 116 -44 48 -138 -97 176 281 176 -30 39 -32 286
4512B86m26K70R0J0m15K59r4K82K4m09M6n6K02k20J69J67l71J04q1K32O9r5o6
$$ 286 -140 130 220 230 -185 74 -20 262 286 -123 -77 -133 69 -151 18 185 -186 -82 -163 69 138 43 -23
4535b3r7lM33l54j61M75k14q0m0M03m62K42r6q5m7K9K74q7l14K42%r5J3K67j88
$$ -23 -120 -123 310 -44 -205 270 56 -24 -64 339 -123 119 23 -62 -109 -80 194 107 -207 35 35 -60 -47 220 32
4560C2p4j07Mr8j05L38j80K86l00K41j4J70j65J31m42L9n1J44K55q9r4m1P4K05
$$ 32 -42 -149 -145 -243 -348 -10 -190 96 -204 37 23 193 28 159 -283 -244 -295 -151 104 15 -79 -120 -46 159
4584A59j19rK77l0n31L19r0m7k43L20j54J51J73R5j08k38K46l30L84m5k04K9q7
$$ 159 40 31 308 278 -253 66 -24 -71 -314 6 -148 3 176 271 163 -75 171 -159 225 180 -24 5 -82
4607h2K6j7J28l17nL0M61J21l39j27o7J90q8L01j77r3p2J68j45L3K09j10k19P5
$$ -82 -56 -73 55 -262 -267 -237 224 345 6 -121 -188 2 -86 215 38 -55 -127 41 -104 -71 138 28 -191 -116
4631a16n5j22M40m25J98k47L41j08L9K5k34J73J8Kj80K44J06l05J36j7j51K57
$$ -116 -171 -293 147 -278 -80 -327 14 -94 -55 -30 -264 -91 -73 -71 -251 -7 99 -206 -70 -87 -238 19
4653A9p8L11l24j11N80l53k39Q1K11k49J91j05n2Q3k05NO6J92j2N6j7k34j06K67
$$ 19 -59 252 -72 -183 397 44 -195 -114 97 -152 39 -66 -118 -35 -240 -235 -169 23 11 67 50 -184 -290 -23
4677b3J72j6k53K25n40N39J03k86MK01j01j10r2L38j31j25K87k92J45L36k37j09
$$ -23 149 133 -120 105 -435 104 207 -79 -75 126 25 -85 -177 161 30 -95 192 -100 45 381 144 35
4699C5J32k65J48k62M47r2j11J83k30m21K76J38Q5j81J05q7L76l55l7J65J69m52
$$ 35 167 -98 50 -212 235 143 32 215 -15 -436 -160 -22 63 -118 -13 -100 276 -79 -116 49 218 -234
4721b34L33m4m6J33L56k07m17M19n01k7K54K67l71R1k3J17p7j78J76LJ60k76R3
$$ -234 99 55 9 142 498 291 -126 293 -208 -235 19 286 -85 6 -17 100 23 -155 21 24 184 -92 1
4744AJ78l89K30Q8j51K51j4l28K9M17l50k6lj12K66l83J99J67q9J49j14N1J18
$$ 1 179 -210 20 108 -43 208 194 -134 -105 312 -38 -64 -67 -179 87 -296 -97 70 -19 130 16 67 185
4767A85l24J10L2L2Q2k04J98j71K91j21m6j02R3k11m8K17K46m09L31k25J79q5
$$ 185 -139 -29 3 35 117 -87 111 -60 231 110 64 -38 55 -156 -204 13 259 -150 181 -44 135 50
4789E0K13j28m63K46k03J00N4M46m8n21L12j20l9N7J13k35j9P6L6k58j80N42o4
$$ 50 263 135 -328 -82 -285 -185 -131 315 267 -254 58 -62 -101 -44 69 -166 -185 -109 -73 -331 -511 31 -33
4812c3R4P7P2j63J76o8p6J50l39J15J66l66J33K98O5k35M5O7o1j14j32J36m2J04
$$ -33 61 138 210 47 223 155 79 229 -110 5 171 -195 -62 236 301 66 111 178 117 3 -129 7 -35 69
4836F9j87K43k66K53j69L13l04J6K21m62L41j12K45k28K08k08L10m42P8J53lO7
$$ 69 -118 125 -141 112 -57 256 -48 -32 189 -273 68 -44 201 -27 181 -27 283 -159 -81 72 69 136
4858A36k58P5K53M1k62L2l4J06J78p4j64k45Q4K24K6r4J01qM8j88R7M5J59k70
$$ 136 -122 -47 206 247 -15 17 -17 89 267 193 29 -216 -132 92 118 24 125 117 165 -23 74 119 278 8
4882Hq8k31K26K32k24J70k34J45O5Lj11J1J94k01K36l51K66p3k6K4K0l39N10o7
$$ 8 -80 -311 -85 147 -77 93 -141 4 69 72 -39 -28 166 -35 201 -150 116 43 17 41 61 -278 232 165
4906A65Rjj56K65l84k9J01j57L91l28J52k5J29J04k23k01J95M4r3M4j21k1O9n6
$$ 165 174 173 17 282 -102 -131 -30 -187 204 -124 28 3 132 236 13 -188 7 51 -42 2 -119 -140 -71 -127
4930a27J21o3L56l18k40L25Q7j25m73O30l57J04P5P6m94L59J10p0j0q7L48j77
$$ -127 -6 -69 287 -31 -271 54 141 16 -457 173 -184 -80 -5 71 -423 -64 46 -24 -34 -121 227 50
4952E0o6q7J96Q1m30J66Q0J64Om98K21J58j2K66l22k51O63m41L87m13p0M19l73
$$ 50 -16 -103 93 174 -256 -90 -10 154 160 -338 -117 41 29 295 -27 -278 385 -56 331 -82 -152 267 -106
4975a06N5Q0J88j21k20L39l74J61M36n04M4k0p7J17k9J80j55k80M63l26r8L99
$$ -106 -51 29 217 96 -124 215 -159 2 438 -66 -22 -42 -119 -2 -31 149 -6 -286 177 -149 -247 152
4997A52l6k07J10L7q3j0L6K27j91l1J33l04J27N7k6j15m9J4J66p2J44k56P2K55
$$ 152 116 -91 19 56 -27 -37 -1 226 35 4 137 -167 -40 17 -9 -124 -173 -159 7 -65 79 -177 -105 150
5021A50l92J95J38j83J02j6K47l08K00l42K52J19j55j20j28J02L43k39j83L5J36
$$ 150 -242 -47 91 -92 10 -6 241 -67 133 -209 43 162 7 -113 -241 -139 204 -35 -218 -183 -47
5042d7J22j17P6o3Q3j26L94k90l1J05k81K84l89L21N4j63L17l93K97J7m18L98
$$ -47 75 -42 34 -29 54 -72 322 32 1 106 -175 109 -280 41 95 -68 249 -144 153 170 -248 150
5064A50pj25l0j9m4q8K54R5j54J38j04n6n2J8j71K55k32K96Mk36K6K59l85K27
$$ 150 143 18 -12 -31 -75 -163 91 186 32 170 66 10 -42 -24 -195 60 -172 124 128 -108 -82 177 -208 19
5088A9K82j12m04J89M13l10K4J04l74K01j9j38J42k39L73n0j61M2k14N59o23K53
$$ 19 301 189 -215 -26 387 77 101 205 -169 32 13 -125 17 -222 151 101 -60 -18 -232 327 -296 -43
5110d3J40k34L41k01P0M07m48nK06l65K39j99J39L40k69l1P8O9k64J34k3q6p6
$$ -43 97 -137 204 3 73 480 32 27 233 -132 107 -92 47 387 118 87 165 234 -30 104 81 -5 -81
5133h1j48RK03J10k42K33M2j66j0L49k37l7J62Np2k26L50k2j38l34K13J54n0k21
$$ -81 -229 -220 -17 93 -149 84 126 -40 -50 299 62 25 187 192 120 -106 244 222 84 -250 -37 117 67 -154
5157a54J58J09k75J03k5k01J42K2Q6Qk23L20M5K60k66L6j96M9j00J13l7J24m8
$$ -154 4 113 -162 -59 -84 -285 -143 -121 -35 -27 -250 70 115 375 109 145 -51 -2 -102 11 -26 98 50
5180E0k92L35j73L56k25j52J7M40j69k68O0K91k52J25jP6k51k4p8M7J98J03j33
$$ 50 -242 93 -80 276 51 -101 -84 356 187 -81 -21 270 18 143 142 218 -33 -57 -135 -88 110 213 80
5203H0p3J95k34J7O8j84M12l24l5n3J47m9K0k15K61J60l1L4j86Lk31J39J82k24
$$ 80 7 202 -32 -15 53 -131 281 -43 -78 -131 16 -33 -13 -228 33 193 162 196 10 13 -218 -79 103 -121
5227a21n3L7J48R8Kl98L45j25K00K2l64l8K17J31l34L56k24M0oQk6kj36k35N68
$$ -121 -174 -137 11 109 111 -287 58 -67 133 155 -209 -247 -30 101 -233 123 -101 -61 -67 -59 -85 -87 -223 -458 110
5252A10K8R2m14qL63k35L37k57jo4P2O7M3p5l69L22J05k14j7J82J12J93m30o6
$$ 110 138 230 -184 -192 171 -64 273 16 15 -49 23 90 133 58 -311 11 116 -98 -115 67 179 372 -58 -124
5276a24j2K41k95K3l5L34m6K47j33l87L88j48J40m69J18K83N7j97M37j57l54R3
$$ -124 -136 105 -190 -167 -202 132 86 333 200 -187 201 53 193 -276 -158 125 182 -15 422 265 -89 4
5298Dj09L8Q5q2o1K07j44J3o0K35k0lj50j35K59j33M02k84LO5l04q9J01J13j8
$$ 4 -105 -67 18 -64 -125 82 -62 -49 -109 126 106 103 -47 -182 77 -56 346 62 65 130 -174 -263 -162 -49 -67
5323f7J1O0L06k28k8J68Q4l78J48j71J86p4O0l06M06k64r8N03m94K44J81n81K17
$$ -67 -56 4 310 82 54 222 306 -72 76 -95 91 17 77 -229 177 -87 -185 318 -176 68 249 -332 -115
5346a15K7L09l69K70J11j69N8m2P1j25N8k24o6Q0O7Q4R9l22M43Lj63j27M30m24
$$ -115 -88 221 -148 122 233 64 122 80 151 26 84 -140 -206 -126 -59 25 124 -198 245 248 85 -42 388 -36
5370c6qK43p5j18n2P4j8O1k89M2M44m24K53n03L22J56k48J00M3P0jj22M3J85r6
$$ -36 -44 199 124 6 -46 28 10 71 -218 -176 268 -156 97 -406 -84 72 -176 -76 -33 37 36 -86 -43 142 46
5395D6R7r4m8J96l10N0k2K34j99M6j03L38k23l0J40k24J06K68l05L7J26k73K45
$$ 46 143 49 1 197 -113 -63 -85 149 -50 -4 -107 231 8 -22 118 -106 0 268 -37 0 126 -147 98
5418I8k07J21rj30K72j12J8L7j04J04k01K82r5k57n8K25P4j60R0k73J61L7q9m8
$$ 98 -109 12 3 -127 145 33 51 88 -16 88 -113 169 74 -183 -241 -16 58 -102 -12 -285 -124 -87 -176 -224
5442b24m2K43l04pK83L7Q0l39L76n4p4M9K8L9j23K4j33L57l92N21n23J27K4P7
$$ -224 -266 -23 -327 -334 -51 -14 66 -273 103 49 -25 24 52 91 -32 -8 -141 216 -176 345 -178 -51 -27 50
5466E0Jp0j63J22K70k01j85J49R7j34M0k14J03L66l58J19P1m51J46M08J6q5J38
$$ 50 51 -19 -182 -60 210 9 -176 -27 70 -64 -24 -238 -135 231 -127 -8 63 -388 -242 166 182 97 235
5489B35j86k62J72j3j79K42J43l18N29n39j5L05j31k07K99k42K09j89k99M66j16
$$ 235 49 -213 -41 -54 -233 9 152 -166 363 -176 -191 114 -17 -224 75 -167 42 -147 -446 20 -96
5510i6O5j70P1K13J7l22J04J35J73q7R5j16n5J10p3j75R2J04K42m61K63p1j54
$$ -96 -31 -201 -130 83 100 -222 -118 17 190 103 198 82 27 137 64 -111 -19 85 327 -134 129 58 -96
5533i6j01L27K3j90l2RJ25k62L84k17j80J21k8J10r8R5R9l7L5k26J37k82Q4J48
$$ -96 -197 130 153 -37 -69 -60 65 -197 187 -30 -210 -89 -117 -7 -105 -10 89 52 87 -139 -2 -284 -200 -52
5557e2K04Lk64n9K99j21N46m63k10L22k05P9J01k59J15j95JL58l92M1J4J20J20
$$ -52 152 155 -109 -168 131 10 556 93 -117 205 0 79 180 -79 36 -159 -158 200 -192 -151 -137 -17 103
5580A03r7J50k06k6K2J03J73l72K23k90J10J80p1J74l37Q8j33pJ84RJ20o5Q7j34
$$ 103 6 156 -50 -76 -54 49 222 -150 73 -217 -107 73 2 176 -161 -73 -206 -213 -29 -20 100 35 122 -12
5604a2J36j48j61j37M43j61J65J73k88M1j40j06L29j5N3j16k39M55k33J53N6j39
$$ -12 124 -24 -185 -322 121 -40 125 298 10 51 -89 -195 134 119 172 56 -183 272 39 192 248 109
5626A09K09l59k4L46o4j25j60Q5j16K8PR2j79K21k24K0J34Mj79K51j52K3K57m23
$$ 109 318 -41 -65 281 217 92 -68 17 -99 -71 -64 28 -151 70 -154 -134 0 4 -175 76 -76 -53 204 -219
5650b19l9L1M45j40J00j55K42l38J15j78L19j43Q6k38J99m4L4j11k36K58r1J88
$$ -219 -258 -227 218 78 178 23 265 -73 42 -136 183 40 126 -112 87 43 77 -34 -270 -12 -103 85
5672H5kk04K26k43L49k43K6l2m3J45l04N37m63M20q8J17o74P06k29J52k18o9p6
$$ 85 83 -121 105 -138 211 -32 -6 -38 -81 64 -240 297 -166 254 166 283 -391 315 86 238 20 -49 -125
5695a25J13J10j30j5J20J93k32p7L07k23j9J64m3r8K20l87L07O7j84m70L95K77
$$ -125 -12 98 -32 -47 73 266 34 -43 264 41 22 186 143 45 265 -122 185 252 68 -402 -7 270
5717B70n43N14l20J11J63k26J80o5J65l08k12M77j60R5o1j49J18j02o9R3R2L02
$$ 270 -273 241 -79 32 195 -31 149 84 249 -59 -271 206 46 141 80 -69 49 -53 -122 -29 63 365
5739C65l29j11J47RR1l62Q5M04j49n7j60J14j69L19j01k54J99P7j82J3M7K26k14
$$ 365 36 -75 72 81 172 -190 -105 299 150 93 -67 47 -122 197 96 -158 41 118 -64 -51 -4 222 8
5762Hj11M22l08m7J50N1J43k04l04K18K1j21J24J51n8J02l69J74k09O3J75j9k59
$$ 8 -103 319 11 -36 114 165 308 104 -200 18 39 -82 42 193 135 237 -132 42 -167 -104 71 52 -207
5785b07k6L51j57L49l39j63J84K11k55k1N7J97k2k01N0l8k67K59j76L85o7M5o
$$ -207 -233 118 -39 310 -29 -192 -8 203 -52 -73 -16 181 159 -42 8 -30 -297 -38 -214 171 104 149 143
5808A43j15o4K07Q4k26k05K51k24L56k39q4J35k35J94P8n0J26J77j31l41L26l04
$$ 143 28 -36 171 255 29 -176 75 -149 207 -32 -116 19 -216 -22 56 6 132 309 178 -163 163 -141
5830a41N0k33K17q8N77l11k67J05L43l50l4n6J18J38j41j4J57j70j82J64J97j31
$$ -141 -91 -324 -107 -195 382 71 -196 -91 252 -98 -132 -188 -70 68 -73 -87 70 -100 -282 -118 79 -52
5852e2J99l84m6ON9L11k53k17N03Ql4m6J41l15K40j94M4J90j60j32J64J03j51
$$ -52 147 -237 -283 -277 -218 93 -160 -377 126 134 100 54 195 -120 120 -74 -30 160 0 -132 32 135 -16
5875a6k07Q0K40k20L05j19m6J28k5J27j32Ml6k13K71k41K30k4J07k99K80km12
$$ -16 -223 -143 97 -123 182 63 17 145 120 247 115 119 83 -130 141 -100 130 106 213 -86 194 192 -220
5898b20J42M9k0K5J43l68M29r7l63J10j74K20j7K55j41J46m19J70L26l03q0R7
$$ -220 -78 -29 -49 -24 119 -249 180 83 -280 -170 -344 -124 -141 114 -27 119 -300 -130 196 -107 -187 -90
5920i0o2m6K40J26J8P7j67l4q8m0K20m76L32J43k48J07k83L11P3j16J51o7r4o8
$$ -90 -152 -198 42 168 186 263 96 62 -26 -66 154 -322 10 153 -95 12 -271 40 113 -3 148 81 -13 -81
5944h1p8K00L53m17R0k32J74k2j72K50mj99L56l78J68j09J15p2k04K89j05K07
$$ -81 -159 41 394 -23 67 -165 9 -13 -185 65 61 -138 218 -160 8 -101 14 -58 -262 27 -78 129
5966A29k15n9K70k09K13r2j52m4J67m7P8J88k87l01M80M7o6l1r5l1M6k32j11N47
$$ 129 -86 -145 125 -84 129 37 -115 -159 8 -39 39 227 -60 -361 119 166 100 69 -26 -57 -11 -243 -354 193
5990A93k47j50P5J64J30N5l56L47m65L61K64l56J65k72R1k50J46RP3jK40j60R8
$$ 193 -54 -204 -129 35 165 220 -136 211 -254 107 371 15 180 -92 -1 -251 -105 -96 -23 -24 216 56 154
6013A54k92P1ol37N49lk74j6L6K45k20K69j34p8l1J67j72k37K39Q6n7M2k0j58
$$ 154 -138 -67 -73 -410 139 136 -138 -154 -118 127 -93 176 42 -36 -67 100 -72 -309 -70 16 -41 1 -19 -177
6037a77Q7j39L32j59q6%K33n9J01J54k46o4p7Qm5O7j25J76j25O3Q3N3J78k9m23
$$ -177 -90 -229 103 -56 -142 -142 91 32 133 287 41 -23 -100 -92 -137 -70 -195 -19 -144 -81 2 55 233 204 -219
6062b19J61OK45r9r0R3j5M0k87j1L23j57n5oM0N5j23L9J41j16l9q1l4K76j00m5
$$ -219 -58 -52 193 94 4 97 82 122 -165 -176 147 -10 -65 -71 -31 24 -99 -60 81 -35 -74 -155 -189 87 -13 -58
6088e8k7J82l1J61K5n35K27MQ6j52K63j07K50o0j10j48N5n7p3j93M09m4j71L63
$$ -58 -85 97 66 227 252 -283 -56 -52 34 -118 145 38 288 228 118 -30 25 -32 -105 -298 111 67 -104 259
6112B59Q5j75k55J65j57L06m41L34k89M61k73J84k14l9J03j1j23L9M90l39N9k05
$$ 259 344 169 -86 79 -78 228 -213 121 -168 293 20 204 -10 -49 54 43 -80 -41 449 110 169 -36
6134c6J39l36jM06k45J52n3P2m4n1j08J6N6j13K3j03J14P5n6J5j59K13o4N8K64
$$ -36 103 -233 -234 172 -73 79 26 98 54 3 -105 -89 -33 -146 -123 -226 -112 -37 -93 -78 -237 -24 -88 -30 234
6159B34l23N9L42n69l2K15k0J44j21L70n1j92k1j8q2j9j72k1K28L57r3k27K19
$$ 234 -89 -30 312 -257 -289 -74 -94 50 -71 299 248 56 35 17 -65 -84 -256 -277 -49 308 215 -12 207
6182B07k46l2J76q2j16J70j57J94m26O54k92J87l24J30R8k68K54k49pj84K18J88
$$ 207 -39 -71 105 23 -93 77 -80 114 -312 342 50 237 -87 43 141 -127 127 -122 -129 -313 -95 93
6204I3QK17l28K8lp3R9J25j81o1LJ81j80K43r6K0j22j50k2M41m20J59m8j32K45
$$ 93 101 318 -10 18 15 -58 41 166 -15 -76 -73 108 -72 171 75 95 -27 -177 -199 242 -178 -19 -67 -199 46
6229D6mj96N2R7K92j66K2j31j77K16j3K8q9k02J23J96Q9l09l2q9M53m28J11lN3
$$ 46 42 -154 -102 -5 287 121 143 12 -165 51 38 66 -23 -225 -102 94 183 -126 -158 -247 206 -222 -111 -114 -61
6254f1j4L06N8o63L29J04l0M6p2j02mj14L5P6K65l53L06o2N7j81n9P6L5j59J35
$$ -61 -75 231 289 -374 -45 59 29 75 3 -99 -103 -217 -182 -106 159 -194 112 50 107 -74 -133 -57 -22 -181 -46
6279d6O0O0k78M32j69k83J95j17K64o1Kn3l61N01l70K42M4p9L17p3p1j40K85l44
$$ -46 14 74 -204 228 59 -224 -29 -146 118 57 59 6 -355 146 -224 18 62 -17 300 227 156 16 301 -43
6303d3P9j12J10m1j9P1l14J84P5K3M4J1k07n5N1J90l6J69p2j67J8N5k32J80j16
$$ -43 36 -76 34 -7 -26 45 -269 -85 -10 13 57 68 -139 -194 -143 47 11 180 108 -59 -41 14 -218 -38 -154
6328a54J15R9k18N9J03J83q3p1j89J68L5p9J63J09j66j51K92l02J00l44L64m9
$$ -154 -39 60 -158 -99 4 187 104 33 -156 12 47 -32 131 240 74 -77 215 -87 13 -331 33 -16
6350a6J11J2j20m2j19L52j58j38J10M5n7J87n0k00L06m64J38jl4K8K98k09J77
$$ -16 95 107 -13 -55 -174 178 20 -118 -8 37 -20 167 117 -83 223 -241 -103 -104 -138 -110 188 -21 156
6373A56k65J32Q5J09j71J07j74Q2j82M5K28k35K57k32J25l80J78J52j41nP9J1
$$ 156 -109 23 108 217 46 153 -21 61 -121 -76 152 -83 174 -58 67 -313 -135 17 -124 -129 -50 -39
6395c9pJ8J52l48J77L2k19J05K83l28K95k04J88m8J53J34m25k01K16j57M92r4
$$ -39 -46 -28 124 -224 -47 -15 -234 -129 154 -174 121 -83 105 57 210 344 -81 -282 -66 -223 269 175
$$ [...]
8191A4
##END NTUPLES=NMR FID
##END=
