##TITLE=1H_EC-3189(42)
 CDCl3, 8 sc, 
 18.10.2019
##JCAMPDX= 6.0         $$ Bruker NMR JCAMP-DX V2.0
##DATA TYPE= NMR FID
##DATA CLASS= NTUPLES
##ORIGIN= UXNMR, Bruker Analytische Messtechnik GmbH
##OWNER= root
$$ XWIN-NMR		Version 3.5
$$ Fri Oct 18 14:22:30 2019 Russian Standard Time (UT+4h)  she@DPX200
##.OBSERVE FREQUENCY= 200.1315
##.OBSERVE NUCLEUS= ^1H
##.DELAY= (6, 6)
##.ACQUISITION MODE= SIMULTANEOUS
##.ACQUISITION SCHEME= undefined
##.AVERAGES= 8
##.DIGITISER RES= 18
##SPECTROMETER/DATA SYSTEM= spect
##.PULSE SEQUENCE= zg30
##.SOLVENT NAME= CDCl3
##.SHIFT REFERENCE= (INTERNAL, CDCl3, 0, 15.7039)
##AUDIT TRAIL= $$ (NUMBER, WHEN, WHO, WHERE, WHAT)
$$ ##TITLE= Audit trail, XWIN-NMR		Version 3.5
$$ ##JCAMPDX= 5.01
$$ ##ORIGIN= Bruker BioSpin GmbH
$$ ##OWNER= she
$$ F:/spectra/data/she/nmr/H-F/1/audita.txt
$$ ##AUDIT TRAIL=  $$ (NUMBER, WHEN, WHO, WHERE, WHAT)
(   1,<2019-10-18 14:21:39.70 +0400>,<she>,<DPX200>,
      <created by zg, POWCHK disabled, PULCHK disabled
       configuration hash MD5:
       00 E9 B6 7A A2 85 ED C7 34 08 36 98 17 FE 4E 26
       data hash MD5: 16K
       D0 57 44 7F 16 37 D7 5E 09 1F 3D 69 C8 0F 24 9D>)
$$ ##END=
$$ 
$$ hash MD5
$$ DD C8 95 D3 FB 02 4A EE 4D E8 0B BA F2 8D 16 F9
##$RELAX= 
##$RELAX= 
##$RELAX= 
##$RELAX= 
##$RELAX= 
##$RELAX= 
$$ Bruker specific parameters
$$ --------------------------
##$DU= <F:/spectra>
##$EXPNO= 1
##$NAME= <H-F>
##$PROCNO= 1
##$TYPE= <nmr>
##$USER= <she>
##$AMP= (0..31)
100 100 100 100 100 100 100 100 100 100 100 100 100 100 100 100 100 100 
100 100 100 100 100 100 100 100 100 100 100 100 100 100 
##$AQSEQ= 0
##$AQ_mod= 1
##$AUNM= <au_zg>
##$AUTOPOS= <>
##$BF1= 200.13
##$BF2= 200.13
##$BF3= 200.13
##$BF4= 200.13
##$BF5= 200.13
##$BF6= 200.13
##$BF7= 200.13
##$BF8= 200.13
##$BYTORDA= 1
##$CFDGTYP= 0
##$CFRGTYP= 5
##$CHEMSTR= <none>
##$CNST= (0..31)
1 1 145 1 1 1 1 1 1 1 1 1 1 1 1 1 1 1 1 1 1 1 1 1 1 1 1 1 1 1 1 1 
##$CPDPRG= <>
##$CPDPRG1= <>
##$CPDPRG2= <>
##$CPDPRG3= <>
##$CPDPRG4= <mlev>
##$CPDPRG5= <mlev>
##$CPDPRG6= <mlev>
##$CPDPRG7= <mlev>
##$CPDPRG8= <mlev>
##$CPDPRGB= <>
##$CPDPRGT= <>
##$D= (0..31)
0 1.2 0 0 0 0 0 0 0 0.06 0 0.03 0 0 0 0 0.0002 0 0 0 0 0 0 0 0 0 0 0 0 
0 0 0 
##$DATE= 1571394099
##$DBL= (0..7)
120 120 120 120 120 120 120 120 
##$DBP= (0..7)
150 150 150 150 150 150 150 150 
##$DBP07= 0
##$DBPNAM0= <>
##$DBPNAM1= <>
##$DBPNAM2= <>
##$DBPNAM3= <>
##$DBPNAM4= <>
##$DBPNAM5= <>
##$DBPNAM6= <>
##$DBPNAM7= <>
##$DBPOAL= (0..7)
0.5 0.5 0.5 0.5 0.5 0.5 0.5 0.5 
##$DBPOFFS= (0..7)
0 0 0 0 0 0 0 0 
##$DE= 6
##$DECBNUC= <off>
##$DECIM= 24
##$DECNUC= <off>
##$DECSTAT= 4
##$DIGMOD= 1
##$DIGTYP= 9
##$DL= (0..7)
0 120 120 120 120 120 120 120 
##$DP= (0..7)
150 150 150 150 150 150 150 150 
##$DP07= 0
##$DPNAME0= <>
##$DPNAME1= <>
##$DPNAME2= <>
##$DPNAME3= <>
##$DPNAME4= <>
##$DPNAME5= <>
##$DPNAME6= <>
##$DPNAME7= <>
##$DPOAL= (0..7)
0.5 0.5 0.5 0.5 0.5 0.5 0.5 0.5 
##$DPOFFS= (0..7)
0 0 0 0 0 0 0 0 
##$DQDMODE= 0
##$DR= 18
##$DS= 0
##$DSLIST= <SSSSSSSSSSSSSSS>
$$ [...]
##$SUBNAM2= <"">
##$SUBNAM3= <"">
##$SUBNAM4= <"">
##$SUBNAM5= <"">
##$SUBNAM6= <"">
##$SUBNAM7= <"">
##$SUBNAM8= <"">
##$SUBNAM9= <"">
##$SW= 24.0689530833862
##$SWIBOX= (0..15)
0 0 2 0 0 0 0 0 0 0 0 0 0 0 0 0 
##$SW_h= 4816.95568400771
##$TD= 16384
##$TD0= 1
##$TE= 0
##$TE2= 300
##$TE3= 300
##$TEG= 300
##$TL= (0..7)
0 120 120 120 120 120 120 120 
##$TP= (0..7)
150 150 150 150 150 150 150 150 
##$TP07= 0
##$TPNAME0= <>
##$TPNAME1= <>
##$TPNAME2= <>
##$TPNAME3= <>
##$TPNAME4= <>
##$TPNAME5= <>
##$TPNAME6= <>
##$TPNAME7= <>
##$TPOAL= (0..7)
0.5 0.5 0.5 0.5 0.5 0.5 0.5 0.5 
##$TPOFFS= (0..7)
0 0 0 0 0 0 0 0 
##$TUNHIN= 0
##$TUNHOUT= 0
##$TUNXOUT= 0
##$USERA1= <user>
##$USERA2= <user>
##$USERA3= <user>
##$USERA4= <user>
##$USERA5= <user>
##$V9= 5
##$VALIST= <valist>
##$VCLIST= <CCCCCCCCCCCCCCC>
##$VD= 0
##$VDLIST= <DDDDDDDDDDDDDDD>
##$VPLIST= <PPPPPPPPPPPPPPP>
##$VTLIST= <TTTTTTTTTTTTTTT>
##$WBST= 1024
##$WBSW= 4
##$XGAIN= (0..3)
0 0 0 0 
##$XL= 0
##$YL= 0
##$YMAX_a= 145183
##$YMIN_a= -146653
##$ZGOPTNS= <>
##$ZL1= 120
##$ZL2= 120
##$ZL3= 120
##$ZL4= 120
##$ABSF1= 10
##$ABSF2= 0
##$ABSG= 5
##$ABSL= 3
##$ALPHA= 0
##$AQORDER= 0
##$ASSFAC= 0
##$ASSFACI= 0
##$ASSFACX= 0
##$ASSWID= 0
##$AUNMP= <proc_1d>
##$AZFE= 0.1
##$AZFW= 0.1
##$BCFW= 1
##$BC_mod= 2
##$BYTORDP= 1
##$COROFFS= 0
##$CY= 11.3945322036743
##$DATMOD= 1
##$DC= 2
##$DFILT= <>
##$DTYPP= 0
##$F1P= 20.1720416913024
##$F2P= 0.152960286110954
##$FCOR= 0.5
##$FTSIZE= 0
##$FT_mod= 4
##$GAMMA= 1
##$GB= 0.15
##$INTBC= 1
##$INTSCL= 1
##$ISEN= 128
##$LB= 0.24
##$LEV0= 0
##$LPBIN= 0
##$MAXI= 10000
##$MC2= 0
##$MEAN= 0
##$ME_mod= 0
##$MI= 1.114404
##$NCOEF= 0
##$NC_proc= 0
##$NLEV= 6
##$NOISF1= 3.799351
##$NOISF2= 2.8
##$NSP= 1
##$NTH_PI= 0
##$NZP= 0
##$OFFSET= 15.70392
##$PC= 1
##$PHC0= -9573.218
##$PHC1= 19.20089
##$PH_mod= 1
##$PKNL= yes
##$PPARMOD= 0
##$PSCAL= 0
##$PSIGN= 0
##$REVERSE= no
##$SF= 200.130013532006
##$SI= 16384
##$SIGF1= 3
##$SIGF2= 2
##$SINO= 400
##$SIOLD= 16384
##$SREGLST= <1H.CDCl3>
##$SSB= 0
##$STSI= 0
##$STSR= 0
##$SW_p= 3612.71676300578
##$SYMM= 0
##$S_DEV= 0
##$TDeff= 0
##$TDoff= 0
##$TI= <>
##$TILT= no
##$TM1= 0
##$TM2= 0
##$TOPLEV= 0
##$USERP1= <user>
##$USERP2= <user>
##$USERP3= <user>
##$USERP4= <user>
##$USERP5= <user>
##$WDW= 1
##$XDIM= 8192
##$YMAX_p= 0
##$YMIN_p= 0
$$ End of Bruker specific parameters
$$ ---------------------------------
##NTUPLES= NMR FID
##VAR_NAME=  TIME,          FID/REAL,        FID/IMAG
##SYMBOL=    X,             R,               I
##VAR_TYPE=  INDEPENDENT,   DEPENDENT,       DEPENDENT
##VAR_FORM=  AFFN,          ASDF,            ASDF
##VAR_DIM=   8192,          8192,            8192
##UNITS=     SECONDS,       ARBITRARY UNITS, ARBITRARY UNITS
##FACTOR=    0.0002076,     1,               1
##FIRST=     0,             0,               0
##LAST=      1.7004516,     0,               0
##MIN=       0,             -146653,         0
##MAX=       1.7004516,     145183,          0
$$ Real data points
##PAGE= N=1
##DATA TABLE= (X++(R..R)), XYDATA
$$ plain form
0 0 0 0 0 0 0 0 0 -8 8 -8 8 -16 16 -22 24 -32 39 -44 52 -62 72 -83 97 -112 128 -148 168 -191 215 -244 276
31 276 -308 347 -388 435 -483 538 -597 661 -733 811 -898 995 -1102 1222 -1354 1506 -1675
48 -1675 1872 -2098 2370 -2692 3088 -3584 4233 -5120 6411 -8473 12318 -21982 100709 145183
62 145183 34674 107399 108501 100730 119477 129958 81909 86572 85602 55460 35817 45977 43468
75 43468 72092 78784 22978 -18809 327 3002 12621 44752 27820 -18192 2051 17380 -16734
88 -16734 -13078 24762 20157 21827 40144 11424 -17643 10153 25809 23137 45898 39005 -2847
101 -2847 5146 23973 -655 3370 32258 9005 -8545 13840 -10776 -48855 -15164 5935 -26847
114 -26847 -20380 -3691 -44847 -58401 -19068 -22202 -41547 -15557 -7230 -30856 -27306 -18602 -22123
$$ packed form
0@%%%%%%%qJ6j6J6k4L2l8M6n6P1q3R6j14J34j55J80k09K40k76L16l59M06m59N20
31B76n84O55p35Q23r18J021j135J258j394J544j709J893k097K324k576K860l181
48a675L547l970M468n062N780o672P817r353J1531j4884K0791l4300J22691M4474
62A45183j10509P2725J102p771J8747J0481m8049M663r70l0142j9643J0160k509
75D3468K8624O692n5806m1787J9136K675R619L2131j6932m6012K0243J5329l4114
88a6734L656L7840m605J670J8317k8720k9067K7796J5656k672K2761o893m1852
101b847P993J8827k4628M025K8888k3253j7550K2385k4616l8079L3691K1099l2782
114b6847O467J6689m1156j3554L9333l134j9345K5990Q327k3626L550Q704l521
$$ plain form
127 -22123 -3874 8310 -1624 10749 19060 -7791 970 37781 22957 9588 46731 43389 4316
140 4316 20283 41940 19144 24878 48591 25005 10352 30119 18187 2598 23493 21444 4547
153 4547 23931 21837 -13067 -174 26197 3767 2438 31026 12809 -7939 20558 23663 -694
166 -694 17402 34294 16794 21785 32580 11249 10537 35664 28357 19823 34463 22649 6639
179 6639 25424 24129 688 14979 25682 1771 4181 15283 -13046 -19360 11611 1535 -20144
192 -20144 -707 -3347 -31798 -16174 -240 -24683 -23103 826 -12684 -22512 -8161 -19682 -27290
205 -27290 -192 522 -19391 -4454 -343 -25075 -12715 8868 -13470 -16583 9475 -2799 -22743
218 -22743 -5558 -7488 -24230 -5874 4135 -16499 -15030 -8451 -26795 -21152 -1374 -18420 -24276
$$ packed form
127b2123J8249J2184r934J2373Q311k6851Q761L6811j4824j3369L7143l342l9073
140D316J5967K1657k2796N734K3713k3586j4653J9767j1932j5589K0895k049j6897
153D547J9384k094l4904J2893K6371k2430j329K8588j8217k0748K8497L105k4357
166f94J8096J6892j7500M991J0795k1331p12K5127p307q534J4640j1814j6010
179F639J8785j295k3441J4291J0703k3911K410J1102k8329o314L0971j0076k1679
192b0144J9437k640k8451J5624J5934k4443J580K3929j3510r828J4351j1521p608
205b7290K7098P14j9913J4937M111k4732J2360K1583k2338l113K6058j2274j9944
218b2743J7185j930j6742J8356J0009k0634J469O579j8344N643J9778j7046n856
$$ plain form
231 -24276 -1996 -13166 -33322 -12909 -9705 -30458 -11852 6395 -18335 -22555 -4582 -17196
243 -17196 -20362 5006 -1337 -17669 -71 1642 -18297 -6617 3782 -12471 -2426 16296 -5820
256 -5820 -17154 1376 -4919 -12709 8231 4730 -16798 -3782 3227 -18067 -12063 4317 -11425
269 -11425 -10999 8706 -8626 -27137 -6875 -3144 -15135 -670 2445 -19526 -12380 760 -16035
282 -16035 -14834 4219 -7567 -12652 6532 -5879 -26103 -5254 5288 -12000 -2066 7850 -16313
295 -16313 -15971 4603 -5859 -13957 3439 -1431 -12920 1155 -3194 -22770 -7145 7151 -9664
308 -9664 -6569 4213 -16202 -19943 4501 -2312 -16362 491 908 -16071 -4457 439 -18130
321 -18130 -9305 9472 -4849 -9288 3997 -10639 -17610 6509 5618 -12132 310 6009 -11643
$$ packed form
231b4276K2280j1170k0156K0413L204k0753J8606J8247k4730m220J7973j2614
243a7196l166K5368o343j6332J7598J713j9939J1680J0399j6253J0045J8722k2116
256e820j1334J8530o295p790K0940l501k1528J3016P009k1294O004J6380j5742
269a1425M26J9705j7332j8511K0262L731j1991J4465L115k1971P146J3140j6795
282a6035J201J9053j1786n085J9184j2411k0224K0849J0542j7288R934R916k4163
295a6313L42K0574j0462q098J7396m870j1489J4075m349j9576J5625J4296j6815
308i664L095J0782k0415l741K4444o813j4050J6853M17j6979J1614M896j8569
321a8130Q825J8777j4321m439J3285j4636o971K4119q91j7750J2442N699j7652
$$ plain form
334 -11643 -5380 6906 -8081 -6403 11824 19 -9715 4004 -3243 -14326 5573 10329 -10372
347 -10372 -3440 5801 -12188 -9720 7848 -4550 -11690 5532 -395 -15265 -2575 -2063 -15685
360 -15685 -2097 6938 -11680 -10134 1829 -13366 -14464 6639 -1705 -15961 -240 -134 -16151
373 -16151 -5927 1560 -13528 -5994 7344 -8779 -13686 129 -9194 -14629 5135 988 -16821
386 -16821 -4941 895 -16331 -8908 3977 -11797 -12470 4346 -6433 -17118 -3924 -6529 -15042
399 -15042 1757 2592 -16504 -8961 1247 -13474 -9365 6628 -6373 -12786 4723 -446 -14385
412 -14385 -618 2921 -9337 2567 9883 -7998 -6373 7906 -2438 -3277 12584 3532 -7497
425 -7497 8651 8496 -7180 4287 12844 -1272 3791 14371 -995 -3878 11815 4800 -1660 14096
$$ packed form
334a1643O263J2286j4987J678J8227j1805r734J3719p247j1083J9899M756k0701
347a0372O932R241j7989K468J7568j2398p140J7222n927j4870J2690N12j3622
360a5685J3588R035j8618J546J1963j5195j098K1103q344j4256J5721J06j6017
373a6151J0224P487j5088P534J3338j6123m907J3815r323n435J9764m147j7809
386a6821J1880N836j7226P423J2885j5774o73J6816j0779j0685J3194k605q513
399a5042J6799Q35j9096P543J0208j4721M109J5993j3001o413J7509n169j3939
412a4385J3767L539j2258J1904P316j7881J625J4279j0344q39J5861r052j1029
425g497J6148j55j5676J1467Q557j4116N063J0580j5366k883J5693p015o460J5756
$$ plain form
439 14096 9364 -6380 6254 11769 -3993 3465 16205 1284 -948 13046 3416 -4720 10464
452 10464 8831 -1309 11340 11881 -4542 3068 12620 178 4564 17539 2500 -4117 13331
465 13331 8398 -4657 9173 12629 -1503 6427 13457 -3961 -3393 10564 2558 52 11219 418
479 418 -9845 5246 5227 -8686 1119 6533 -8073 -2611 7078 -9311 -11836 6044 814 -7365
493 -7365 3928 -308 -13366 -61 7072 -6603 -1954 8782 -2632 -3262 8985 -986 -6658 9312
507 9312 9257 -1413 7511 6665 -6273 4423 14171 -337 884 13327 2054 -3761 10886 5432
521 5432 -6192 7987 12501 -2043 2023 8003 -3500 1025 13390 3919 -4 11290 4957 -1117
535 -1117 12789 10748 -875 13083 20126 3485 7069 18861 7547 7132 23660 16027 4848
$$ packed form
439A4096m732j5744J2634N515j5762P458J2740j4921k232J3994r630q136J5184
452A0464j633j0140J2649N41j6423P610R552j2442M386J2975j5039o617J7448
465A3331m933j3055J3830L456j4132P930P030j7418N68J3957q006k506J1167j0801
479D18j0263J5091j9j3913R805N414j4606N462R689j6389k525J7880n230q179
493g365J1293m236j3058J3305P133j3675M649J0736j1414o30J2247r971n672J5970
507I312n5j0670Q924q46j2938J0696R748j4508J221J2443j1273n815J4647n454
521E432j1624J4179M514j4544M066N980j1503M525J2365r471l923J1294o333o074
535a117J3906k041j1623J3958P043j6641L584J1792j1314m15J6528p633j1179
$$ plain form
548 4848 16916 17068 6006 15137 18884 7089 12464 19663 5680 3949 15196 7051 2726 15782
562 15782 8924 -4653 7039 9227 -4613 3318 12284 -1207 -1257 10448 394 -5598 8691 6969
576 6969 -2143 8004 9091 -3403 3167 10691 1307 4523 13580 2885 359 11407 3028 -3691
590 -3691 10376 9211 -4354 4665 8451 -8110 -4952 8093 -2346 -7161 4127 -2494 -11683 -1416
604 -1416 -1366 -11041 -2609 1377 -8419 -3725 1052 -10461 -7116 7500 -827 -6073 7789 3170 -7926
619 -7926 5183 10672 -2090 4142 14423 3611 1705 11057 3421 582 13191 9931 483 7850
633 7850 7081 -3717 4929 9724 -3252 1106 11200 -1047 -5271 6750 162 -6737 7947 8193
647 8193 -5909 971 7554 -3436 888 11450 2691 910 12750 7663 -367 9196 9568 3557
$$ packed form
548D848J2068J52j1062R131L747j1795N375P199j3983j731J1247q145m325J3056
562A5782o858j3577J1692K188j3840P931Q966j3491n0J1705j0054n992J4289j722
576F969r112J0147J087j2494O570P524r384L216R057j0695k526J1048q379o719
590c691J4067j165j3565R019L786j6561L158J3045j0439m815J1288o621r189J0267
604a416N0r675Q432L986r796M694M777j1513L345J4616q327n246J3862m619j1096
619g926J3109N489j2762O232J0281j0812j906R352p636k839J2609l260r448P367
633G850p69j0798Q646M795j2976M358J0094j2247m224J2021o588o899J4684K46
647H193j4102O880O583j0990M324J0562q759j781J1840n087q030R563L72o011
$$ plain form
661 3557 13096 14608 1720 6516 13289 2367 3210 14514 5244 -1015 10879 5854 -7262 1900
675 1900 6631 -3733 -160 5053 -6649 -8039 1174 -4850 -7777 1351 -3257 -9046 1066 -1996
689 -1996 -13076 -1840 6415 -5672 -3098 6625 -4614 -7920 6759 3237 -6454 4244 6048 -4634
703 -4634 525 4649 -5893 -2054 7229 -1460 -4832 1663 -6010 -9506 2384 -1054 -12274 -3469
717 -3469 -158 -12286 -8485 -1368 -11037 -9570 2975 -4618 -12672 -2849 -3234 -9080 1209 3216 -7716
732 -7716 -2589 5476 -2987 -2459 5535 -990 -998 10739 3934 -5757 3924 6099 -3159 4362 8078 -5372
748 -5372 -3568 7685 -1946 -7928 2517 119 -6493 1448 543 -10178 -4785 1741 -5294 -2670 2064
763 2064 -7323 -5568 5006 -2523 -8247 3715 3204 -5007 3969 6045 -6109 -276 10145 1328
$$ packed form
661C557R539J512j2888M796O773j0922Q43J1304r270o259J1894n025j3116R162
675A900M731j0364L573N213j1702j390R213o024k927R128m608n789J0112l062
689a996j1080J1236Q255j2087K574R723j1239l306J4679l522r691J0698J804j0682
703d634N159M124j0542L839R283q689l372O495p673l496J1890l438j1220Q805
717c469L311j2128L801P117r669J467J2545p593q054R823l85n846J0289K007j0932
732g716N127Q065q463N28P994o525qJ1737o805r691R681K175r258P521L716j3450
748e372J804J1253r631n982J0445k398o612P941r05j0721N393O526p035K624M734
763B064r387J755J0574p529n724J1962n11q211Q976K076j2154N833J0421q817
$$ plain form
777 1328 -793 8182 2462 -2520 7117 4169 -4327 3972 6168 -3088 979 4385 -6772 -3798 6618
792 6618 -1757 -7401 2555 -1426 -9311 637 1140 -9243 -2369 4532 -5283 -4922 3288 -3628 -4883
807 -4883 6748 2770 -4660 3619 4380 -3594 3679 7131 -2200 2547 10035 259 -1599 7120 1686
822 1686 -2219 8475 5559 -5390 1871 5754 -4321 -1327 6299 -2662 -4172 5095 -1749 -7064
836 -7064 1936 913 -5023 2909 3100 -6692 -930 5406 -3743 -1618 7398 69 -3423 6569 2954
851 2954 -4800 4718 7083 -1301 3259 7515 -2013 -583 7955 607 -2049 7145 1847 -4651 3900
866 3900 3021 -6099 848 5337 -4867 -2475 3918 -4440 -5301 4770 -517 -6224 2807 1550 -7040
881 -7040 653 4432 -4745 -572 6541 -1857 -3013 5179 -162 -3189 6457 4442 -3253 4111 5325
$$ packed form
777A328k121Q975n720m982R637k948q496Q299K196r256M067L406j1157K974J0416
792F618q375n644R956l981p885R948N03j0383O874O901r815L61Q210o916j255
807d883J1631l978p430Q279P61p974P273L452r331M747P488r776j858Q719n434
822A686l905J0694k916j0949P261L883j0075K994P626q961j510R267o844n315
836g064R000j023n936P932J91r792N762O336r149K125R016p329l492R992l615
851B954p754R518K365q384M560M256r528J430Q538p348k656R194n298o498Q551
866C900q79r120O947M489j0204K392O393q358q61J0071n287n707R031j257q590
881g040P693L779r177M173P113q398j156Q192n341l027R646k015p695P364J214
$$ plain form
896 5325 -3427 2161 7677 -699 -130 8240 636 -3028 5996 2978 -3836 5221 6175 -3572 1097 5939
912 5939 -2518 -91 7227 554 -1300 6956 2717 -3298 5665 5484 -2025 5066 8890 -752 1608
927 1608 9086 2233 1223 10326 4847 -26 8611 6982 -1107 6086 9294 763 4430 10565 939
942 939 -176 9221 3824 -462 8293 6152 -1421 5255 6745 -2326 2603 8372 455 988 8046 339
958 339 -2866 6784 3897 -2479 5899 6293 -3610 1492 6238 -2222 -3 7590 347 -2415 5491 962
974 962 -4528 4123 4233 -3616 2155 5111 -5139 -1996 5069 -1867 -2994 5337 317 -5258 2421
989 2421 1357 -5664 1320 4481 -3939 -836 4285 -4229 -4401 4837 -354 -4272 4079 1850 -6074
1004 -6074 884 3380 -4581 58 5710 -2523 -2301 4857 -1271 -3796 5062 2169 -3326 4096 4176 -4756
$$ packed form
896E325q752N588N516q376N69Q370p604l664R024l018o814R057R54r747M669M842
912E939q457K427P318o673j854Q256m239o015Q963j81p509P091L824r642K360
927A608P478o853j010R103n479m873Q637j629q089P193L208q531L667O135r626
942I39j115R397n397m286Q755k141p573O676J490r071M929N769p917N33P058p707
958C39l205R650k887o376Q378L94r903N102M746q460K219P593p243k762P906m529
974I62n490Q651J10p849N771K956j0250L143P065o936j127Q331n020n575P679
989B421j064p021O984L161q420L103N121q514j72R238n191l918Q351k229p924
1004f074O958K496p961M639N652q233K22P158o128k525Q858k893n495P422Q0q932
$$ plain form
1020 -4756 1001 6691 -1400 -146 7298 510 -1774 6325 2620 -2364 5723 5758 -1717 3780 6465
1035 6465 -1966 1715 8943 1308 -90 7417 2592 -1617 6290 4926 -2172 5082 7488 -1129 1164
1050 1164 6946 -386 26 8071 2149 -2103 6117 4032 -2955 4239 6341 -1541 2343 6996 -1217
1065 -1217 -339 6694 1104 -1285 6982 3361 -2938 3903 3891 -3720 2051 6810 -1510 -951 5257 -1604
1081 -1604 -3487 4732 1162 -4539 2606 2585 -4976 -233 2384 -4979 -1302 5215 -2162 -4310 3134
1096 3134 -1673 -5607 3218 2362 -5517 470 3828 -4594 -1931 3517 -3579 -2262 5762 -124 -5200
1111 -5200 2174 369 -4410 3020 3671 -5086 -807 4300 -3697 -3070 3488 -2235 -4047 4565 219
1126 219 -7130 -286 1230 -5084 692 4058 -5526 -3465 3740 -2448 -4984 2855 -213 -4122 3503
$$ packed form
1020d756N757N690q091J254P444o788k284Q099l705m984Q087L5p475N497K685
1035F465q431L681P228p635j398P507m825m209P907j364p098P254K406q617K293
1050A164N782p332M12Q045n922m252Q220k085o987P194K102p882L884M653q213
1065a217Q78P033n590k389Q267l621o299O841j2p611N771M759q320N59O208o861
1081a604j883Q219l570n701P145k1p561M743K617p363L677O517p377k148P444
1096C134m807l934Q825q56p879N987L358q422K663N448p096J317Q024n886n076
1111e200P374j805m779P430O51q757M279N107p997O27O558n723j812Q612m346
1126B19p349O844J516o314N776L366r584K061P205o188k536P839l068l909P625
$$ plain form
1141 3503 2447 -5959 -704 3739 -2560 -1 5397 -2505 -3744 4495 463 -4325 3083 2384 -4220
1156 -4220 1336 3286 -5144 -2441 3552 -2303 -2382 3150 -2588 -5970 1891 134 -5897 672 1970
1171 1970 -5286 -1007 2916 -5408 -4092 4372 -736 -4131 3383 205 -5614 2034 3409 -3940 853
1186 853 4842 -2514 -1187 4874 -1204 -2741 5410 2194 -3581 3291 2376 -4706 1100 4394 -3384
1201 -3384 -1022 4781 -2419 -4302 2868 -944 -4449 2796 1519 -5185 97 2134 -5107 -1365 3787
1216 3787 -2458 -2122 4289 -1346 -4318 3283 1556 -3941 3286 3722 -4507 -314 4308 -3275 -2378 4994
1232 4994 -345 -3612 2696 -794 -6331 423 1325 -5555 -1266 1712 -6341 -5043 839 -4989 -6138
1247 -6138 1413 -2853 -8039 -1169 -1432 -8240 -2737 1092 -5772 -3699 1155 -5345 -6106 1374 -2529
$$ packed form
1141C503j056q406N255M443o299K559N398p902j239Q239m032m788P408o99o604
1156d220N556J950q430K703N993n855p9N532n738l382P861j757o031O569J298
1171A970p256M279L923q324J316Q464n108l395P514l178n819P648J375p349M793
1186H53L989p356J327O061o078j537Q151l216n775O872r15p082N806L294p778
1201c384K362N803p200j883P170l812l505P245j277o704N282K037p241L742N152
1216C787o245L36O411n635k972P601j727n497P227M36q229M193M622p583Q97P372
1232D994n339l267O308l490n537O754R02o880M289K978q053J298N882n828j149
1247f138P551m266n186O870k63o808N503L829o864K073M854o500p61P480l903
$$ plain form
1262 -2529 -5324 1445 -42 -6526 -804 754 -6342 -2033 3415 -3787 -4092 1995 -3579 -6957 1359
1277 1359 -129 -6033 -152 482 -7129 -3307 1252 -5490 -4036 2596 -2541 -5893 676 -1244 -5857
1292 -5857 1299 2494 -3945 -363 3282 -3802 -1654 4754 -736 -1616 5957 2355 -3159 3201 3412
1307 3412 -2369 3495 6461 -1142 160 5184 -619 -1526 5082 1318 -2409 4209 2092 -4189 880
1322 880 3419 -2572 936 5320 -2684 -3281 3900 -31 -3018 4035 2344 -2971 2569 3828 -3807
1337 -3807 -223 4955 -481 538 5539 -901 -3282 4303 2171 -2965 3408 3162 -3746 555 3290
1352 3290 -4396 -2769 3562 -1141 -2968 2226 -2824 -6822 401 1076 -5694 -1598 967 -5861 -3214
1367 -3214 1182 -5198 -5296 2507 -967 -4919 734 -1121 -6553 814 3188 -4005 -1724 3032 -3055
$$ packed form
1262b529k795O769j487o484N722J558p096M309N448p202l05O087n574l378Q316
1277A359j488n904N881O34p611L822M559o742J454O632n137l352O569j920m613
1292e857P156J195o439L582L645p084K148O408n490q80P573l602n514O360K11
1307C412n781N864K966p603J302N024n803r07O608l764l727O618k117o281N069
1322H80K539n991L508M384q004n97P181l931k987P053j691n315N540J259p635
1337c807L584N178n436J019N001o440k381P585k132n136O373k46o908M301K735
1352C290p686J627O331m703j827N194n050l998P223O75o770M096K565o828K647
1367c214M396o380r8P803l474l952N653j855n432P367K374p193K281M756o087
$$ plain form
1382 -3055 -2830 3671 -1773 -4350 2911 1625 -4150 461 1006 -4787 -258 3568 -3753 -3530 2424 -2344
1398 -2344 -4190 2334 -728 -5703 1151 2117 -4466 -1051 2012 -3894 -1112 4688 -1202 -3255 3147
1413 3147 738 -2698 3624 2871 -2581 3027 4877 -2135 311 5248 -579 -788 5973 1581 -2632
1428 -2632 3840 2973 -2923 2303 4167 -2662 151 4810 -1770 -2364 4175 -289 -2917 3664 1417
1443 1417 -3757 1921 2541 -3168 500 4805 -1943 -1408 4362 -494 -2237 4280 1610 -3271 3294
1458 3294 3708 -2920 1119 4024 -2692 -794 4848 -772 -2650 3273 -261 -3466 2542 1721 -4635
1473 -4635 262 2958 -3897 -1919 2301 -3031 -3332 3183 -1071 -4946 1178 532 -4445 461 2410
1488 2410 -4542 -1452 3057 -2498 -2317 3164 -1268 -3596 3128 1291 -4450 846 2318 -3423 580
$$ packed form
1382c055K25O501n444k577P261j286n775M611N45n793M529L826p321K23N954m768
1398b344j846O524l062m975O854R66o583L415L063n906K782N800n890k053O402
1413C147k409l436O322p53n452N608J850p012K446M937n827k09O761m392m213
1428b632O472q67n896N226J864o829K813M659o580n94O539m464k628O581k247
1443A417n174N678O20n709L668M305o748N35N770m856j743O517k670m881O565
1458C294M14o628M039K905o716J898N642n620j878N923l534l205O008q21o356
1473d635M897K696o855J978M220n332l01O515m254l875O124o46m977M906J949
1488B410o952L090M509n555J81N481m432k328O724j837n741N296J472n741M003
$$ plain form
1503 580 3569 -3412 -2607 3083 -1020 -3358 2730 34 -4167 1776 2110 -4178 -812 2749 -3262 -1109
1519 -1109 3747 -2417 -3944 2874 483 -3473 2388 1381 -3876 1270 3898 -3318 -956 3858 -1057
1534 -1057 -1599 4087 160 -3509 2889 2677 -2755 1859 3276 -2819 81 4587 -1820 -1727 4268 132
1550 132 -2189 3709 1324 -3985 1979 3390 -2304 632 3555 -2296 -1072 4417 -300 -2369 3507
1565 3507 1174 -2386 3036 2674 -3113 853 4403 -1399 -204 4350 -1113 -1744 4625 1351 -2519
1580 -2519 3254 2636 -2578 1746 3422 -2522 1 4512 -741 -1547 3853 47 -2709 3605 2386
1595 2386 -3368 1560 3344 -2982 -84 3841 -1701 -1451 4162 -48 -2465 2990 1319 -3233 1853
1610 1853 2871 -3066 153 3729 -2249 -1999 3465 -857 -2925 3566 741 -3886 1769 1869 -3276
$$ packed form
1503E80K989o981Q05N690m103k338O088k696m201N943L34o288L366L561o011K153
1519a109M856o164j527O818k391l956N861j007n257N146K628p216K362M814m915
1534a057n42N686l927l669O398k12n432M614J417o095K900M506o407R3N995m136
1550A32k321N898k385n309N964J411n694K936K923n851J224N489m717k069N876
1565C507k333l560N422l62n787L966L550n802J195M554n463o31O369l274l870
1580b519N773o18n214M324J676n944K523M511n253q06N400l806k756O314j219
1595B386n754M928J784o326K898L925n542K50N613m210k417N455j671m552N086
1610A853J018n937L219L576n978K50N464m322k068O491k825m627N655J00n145
$$ plain form
1625 -3276 404 3075 -3026 -1406 3309 -1881 -3317 2933 70 -3710 1935 1415 -3909 147 2782
1640 2782 -3315 -1396 3120 -2759 -2748 2832 -545 -3495 2020 926 -4060 930 2620 -3387 -707
1655 -707 3528 -2055 -1955 3070 -947 -3022 2425 1198 -3215 1764 2443 -3134 487 3779 -1823 -843
1671 -843 3999 -37 -1715 3868 1089 -2626 2895 3221 -2163 1284 4028 -1299 193 4645 -100
1686 -100 -1185 4427 1923 -2041 3537 2730 -2136 2105 4369 -1178 599 4741 -103 -501 4796 1266
1702 1266 -1508 4134 2819 -1583 2384 3863 -1528 1246 4744 -133 -349 4469 538 -1494 4110
1717 4110 2175 -2307 2095 2803 -2495 836 3333 -1792 -1033 3967 -754 -2822 2665 511 -3106
1732 -3106 1380 1710 -3339 -258 2749 -2630 -1663 2968 -1735 -2627 2342 -534 -3645 1609 612 -3545
$$ packed form
1625c276L680K671o101J620M715n190j436O250k863l780N645n20n324M056K635
1640B782o097J919M516n879J1N580l377k950N515j094m986M990J690o007K680
1655g07M235n583J00N025m017k075N447j227m413M979O79n577L621L292n602R80
1671h43M842m036j678N583k779l715N521L26n384L447K744n327J492M452m745
1686a00j085N612k504l964N578q07m866M241K264n547J777M142m844l98N297l530
1702A266k774N642j315m402L967J479n391K774L498m877k16M818l931k032N604
1717D110j935m482M402P08n298L331K497n125P59N000m721k068N487k154l617
1732c106M486L30n049L081L007n379R67M631m703q92M969k876l111N254r97m157
$$ plain form
1748 -3545 172 2122 -3321 -1403 2493 -2586 -2805 2883 -724 -3761 1524 -36 -4008 381 1628
1763 1628 -3974 -1498 2074 -2758 -2653 1992 -1434 -3373 2110 498 -3741 380 1523 -3217 -23
1778 -23 3142 -2503 -1753 3548 -96 -2217 2787 778 -2359 2853 2956 -2319 361 3282 -1059 68
1794 68 3864 -349 -1244 4153 1207 -1884 2788 2388 -2103 2106 3910 -1873 -4 4097 -41 -640
1810 -640 4208 622 -1959 3128 2788 -1816 1812 3297 -1375 1371 4514 -1089 -1045 4386 1059 -1135
1826 -1135 3629 1556 -2456 2641 3461 -1879 653 3579 -1189 -581 3846 -500 -2294 2840 1156
1841 1156 -2457 1609 1540 -3182 446 2449 -2636 -1353 2568 -1634 -2544 2320 -1165 -3867 1630 1396
1857 1396 -3642 -129 1631 -3138 -1337 2447 -2254 -2941 1712 -840 -3619 1134 477 -3857 294
$$ packed form
1748c545L717J950n443J918L896n079k19N688l607l037N285j560l972M389J247
1763A628n602K476L572m832J05M645l426j939N483j612m239M121J143m740L194
1778b3L165n645P50N301l644k121N004k009l137N212J03n275K680K921m341J127
1794F8L796m213q95N397k946l091M672m00m491M209J804n783J869M101m138n99
1810f40M848l586k581N087l40m604L628J485m672K746L143n603M4N431l327k194
1826a135M764k073m012N097Q20n340K532K926m768O08M427m346j794N134j684
1841A156l613M066o9m722L628K003n085J283L921m202r10M864l485k702N497k34
1857A396n038L513J760m769J801L784m701o87M653k552k779M753o57m334M151
$$ plain form
1872 294 1700 -3174 -923 1457 -2962 -2548 1885 -1625 -3423 1389 8 -3730 64 868 -3756 -1036
1888 -1036 1844 -2900 -2332 1850 -1266 -2879 1758 -57 -3367 1193 1149 -3385 -40 2203 -2493 -1108
1904 -1108 2995 -1185 -2286 2961 311 -2411 2052 1384 -2732 844 2842 -1779 -707 3152 -664
1919 -664 -1454 2801 389 -2388 2413 1650 -2130 1499 2290 -1967 430 3284 -1474 -916 3462 464
1935 464 -1717 3056 1322 -2158 2348 2740 -1760 685 3289 -1245 -294 3731 -263 -1298 3045 1101
1951 1101 -2186 2218 2157 -2676 1321 3503 -1924 -853 2967 -773 -1957 2766 494 -2525 1677
1966 1677 1806 -2735 267 1859 -2051 -331 2581 -1355 -1707 2146 -604 -2602 1785 642 -3175
1981 -3175 1007 1741 -2528 -616 2000 -1899 -1441 2468 -962 -3011 1536 395 -3136 661 832 -3427
$$ packed form
1872B94J406m874K251K380m419M14M433l510j798M812j381l738L794Q04m624K720
1888a036K880m744N68M182l116j613M637j815l310M560m4m534L345K243m696J385
1904a108M103m180j101N247k650k722M463o68m116L576J998m621J072L859l816
1919f64p90M255k412k777M801p63l780L629P91m257K397K854m758N58M378k998
1935D64k181M773j734l480M506L92m500K445K604m534R51M025l994j035M343j944
1951A101l287M404o1m833L997K182n427J071L820l740j184M723k272l019M202
1966A677J29m541L002J592l910J720K912l936l52L853k750j998M387j143l817
1981c175M182P34m269J912K616l899M58L909l430k049M547j141l531L797J71m259
$$ plain form
1997 -3427 -617 1923 -2759 -2055 1789 -1630 -2537 1546 -582 -3723 520 1062 -3503 -182 1184 -3006
2013 -3006 -1691 1838 -1692 -2902 1299 -358 -2880 939 435 -3257 221 1882 -2398 -995 2151
2028 2151 -2021 -1602 2062 -845 -2865 1487 811 -2912 689 1591 -2621 -209 2952 -1826 -1511 2283
2044 2283 -450 -2270 2201 649 -2347 1447 1888 -1907 176 2313 -1520 -200 3117 -244 -1653
2059 -1653 2687 967 -1759 2260 2325 -1829 926 3153 -1218 -241 3021 -44 -820 3304 811 -1564
2075 -1564 2399 2066 -1747 1564 2618 -1578 383 3290 -600 -979 3265 772 -1370 2730 1556
2090 1556 -2186 1588 2456 -1457 400 2891 -1056 -991 3042 -97 -1503 2509 1118 -1982 1344 1332
2106 1332 -2444 -8 2600 -1501 -1120 2248 -974 -1742 1926 -18 -2897 953 1035 -2917 -502 1586
$$ packed form
1997c427K810K540m682P04L844l419r07M083k128l141M243N42m565L321J366m190
2013c006J315L529l530j210M201j657k522L819n04l692L478J661m280J403L146
2028B151m172M19L664k907k020M352o76l723L601R02m212K412L161m778L15L794
2044B283k733j820M471j552k996L794M41l795K083K137l833J320L317l361j409
2059a653M340j720k726M019O5m154K755K227m371R77L262l065p76M124k493k375
2075a564L963l33l813L311J054m196J961K907l890l79M244k493k142M100j174
2090A556l742L774Q68l913J857K491l947O5M033l139j406M012j391l100L326j2
2106A332l776K436K608m101L81L368l222p68L668j944k879L850Q2l952K415K088
$$ plain form
2122 1586 -2644 -1575 1765 -1708 -2501 1308 -580 -3162 846 -116 -3261 31 1200 -2858 -1127
2137 -1127 1517 -2087 -2377 1846 -594 -3120 843 81 -2836 133 986 -3227 -847 1532 -1980 -1975
2153 -1975 1741 -1106 -2676 1817 49 -2706 864 976 -2580 121 1993 -1826 -1199 2456 -812
2168 -812 -1912 2299 772 -2085 2059 1772 -2040 925 2878 -815 -68 2982 -303 -677 3225 712
2184 712 -1683 2262 2164 -1133 1723 2827 -1121 605 3395 46 -337 3266 712 -1086 2545 1680
2200 1680 -1399 1793 2571 -975 661 3061 -691 -176 3270 319 -1236 2783 1284 -1481 1736
2215 1736 2137 -1616 427 2541 -1164 -880 2633 -526 -1655 2512 714 -2367 1280 1440 -2252 280
2231 280 1483 -2101 -924 2361 -1207 -2110 1495 -341 -2188 1283 351 -3043 51 1206 -2323 -1114
$$ packed form
2122A586m230J069L340l473p93L809j888k582M008r62l145L292J169m058J731
2137a127K644l604k90M223k440k526L963p62k917K969Q53m213K380K379l512N
2153a975L716k847j570M493j768k755L570J12l556K701J872l819O27L655l268
2168h12j100M211j527k857M144k87l812K965J953l693P47L050l285l74L902k513
2184G12k395L945r8l297K856J104l948J726K790l349l83L603k554j798L631q65
2200A680l079L192P78l546J636K400l752N15L446k951j555M019j499k765L217
2215A736M01l753K043K114l705K84L513l159j129M167j798l081L647J60l692K532
2231B80J203l584J177L285l568r03L605j836j847L471r32l394L094J155l529J209
$$ plain form
2247 -1114 1624 -1946 -2310 1764 -928 -2730 668 237 -2514 517 661 -2965 -729 1633 -2356 -2002
2263 -2002 1653 -1113 -2349 1291 69 -2736 529 946 -2451 -506 1571 -2144 -1544 2009 -1183
2278 -1183 -1990 1657 68 -2208 1280 1135 -2258 345 1839 -1373 -598 2386 -816 -1234 2193 392
2294 392 -1699 1812 1449 -1805 806 2191 -1542 -117 2817 -762 -1000 2640 212 -1428 2109 1112
2310 1112 -1827 1507 1908 -1691 446 2491 -712 -603 2568 -241 -1105 2139 1063 -1895 1632 1998
2326 1998 -1764 254 2012 -1292 -760 2768 -699 -1376 2129 218 -2145 1380 1147 -2161 570 1692
2342 1692 -1751 -624 2270 -1106 -1624 2049 -363 -2440 1273 764 -2442 84 1168 -2235 -728
2357 -728 1727 -1581 -1801 1493 -860 -2172 1524 370 -2592 626 1311 -2578 -740 1598 -2095 -1400
$$ packed form
2247a114K738l570l64M074k692j802L398m31k751L031J44l626K236K362l989L54
2263b002L655k766j236L640j222k805L265M17l397J945K077l715O00L553l192
2278a183q07L647j589k276L488j45l393K603J494l212P75K984l202m18L427j801
2294C92k091L511l63l254K611J385l733J425K934l579k38L640k428j640L537r97
2310A112k939L334M01l599K137K045l203J09L171k809q64L244j076k958L527L66
2326A998l762K018J758l304N32L528l467o77L505j911k363L525k33l308K731J122
2342A692l443J127K894l376n18L673k412k077L713n09l206K526J084l403J507
2357g28K455l308k20L294k353j312L696j154k962L218O85l889J838K338l693O95
$$ plain form
2373 -1400 1741 -954 -2411 970 68 -2791 509 876 -2614 -559 1489 -2173 -1585 1562 -1538 -1994
2389 -1994 1324 -396 -2989 465 663 -2631 -179 1244 -2258 -1181 1530 -1360 -1732 1754 -199
2404 -199 -2207 1233 364 -2867 312 1655 -1862 -747 1925 -1399 -1401 1863 -366 -2129 1705 659
2420 659 -2393 617 1138 -2252 -363 2270 -1105 -1723 2074 -673 -1576 1826 399 -2176 1312 1463
2436 1463 -1791 372 1857 -1632 -467 2682 -507 -1450 2122 554 -1702 1718 1414 -1932 865
2451 865 2377 -1206 -434 2169 -449 -963 2457 319 -1526 1635 1107 -1879 904 2024 -1760 -56
2467 -56 2144 -869 -1177 1621 -208 -1642 1746 1215 -2120 713 1620 -1747 -7 2079 -1525 -978
2483 -978 1759 -731 -1658 1596 106 -2510 1043 921 -2491 -451 1435 -2011 -1295 1790 -1256 -2064
$$ packed form
2373a400L141k695j457L381r02k859L300L67l490K055K048l662N88L147l100m56
2389a994L318j720k593L454J98l294K452J423l502J077K711k890l72L486j953
2404a99k008L440q69l231L179J343l517J115K672l324kL264k229j763L834j046
2420F59l052L010N21l390J889K633l375o18L797k747r03L402j427k575L488J51
2436A463l254K163J485l489J165L149l189r43L572j568k256L420l04l346K797
2451H65J512l583P72K603k618n14L420k138j845L161n28k986K783J120l784J704
2467e6K200l013l08K798j829j434L388n31l335K833R07l367J740K086l604N47
2483i78K737k490r27L254j490k616L553j22l412K040J886l446P16L085l046q08
$$ plain form
2499 -2064 1748 -241 -2675 496 615 -2790 -205 965 -2583 -1232 1502 -1453 -2009 973 -567
2514 -567 -2430 531 28 -2750 151 1112 -2498 -857 1369 -1647 -1784 1591 -672 -2348 1133 273
2530 273 -2478 634 896 -1882 34 1703 -1762 -1019 1723 -724 -1818 1645 235 -1983 1290 1263
2546 1263 -1952 -104 1660 -1390 -518 2364 -511 -1300 2129 488 -1298 1668 1501 -1340 670 2560
2562 2560 -909 173 2575 -442 -394 2935 700 -1270 2111 1913 -1170 1484 2118 -858 343 2678
2578 2678 -209 -630 2926 463 -899 2312 887 -1537 1367 1980 -1282 688 2427 -1057 -485 2788
2594 2788 -178 -1337 1844 857 -2252 1242 1345 -2135 106 2188 -1275 -916 1804 -1042 -1685 1416
2610 1416 93 -2126 759 548 -2493 206 1225 -2174 -1217 1364 -1392 -1847 1096 -701 -2494 1040
$$ packed form
2499b064L812j989k434L171J19l405K585J170l548J351K734k955n56K982j540
2514e67j863K961n03k778K901R61l610J641K226l016j37L375k263j676L481q60
2530B73k751L112K62k778J916J669l465P43K742k447j094L463j410k218L273k7
2546A263l215J848J764l050Q72K882k875p89L429j641j786K966j67k841K010J890
2562B560l469J082K402l017M8L329k235j970L381j98l083K654O34k976J201K335
2578B678k887m21L556k463j362L211j425k424K904O13l262J970J739l484N72L273
2594B788k966j159L181r87l109L494J03l480K241K082l463L59K720k846o43L101
2610A416j323k219K885k11l041K699J019l399R57K581k756m55K943j797j793L534
$$ plain form
2626 1040 258 -2938 -353 909 -2545 -1007 1055 -2000 -1748 1118 -769 -2537 912 -45 -2728 90
2642 90 809 -2517 -845 1591 -1926 -1611 1342 -985 -2306 1331 282 -2008 932 1303 -2081 -61
2658 -61 1413 -1852 -847 2099 -768 -1448 1744 28 -1845 1457 1092 -1982 558 2101 -1322 -78
2674 -78 2358 -376 -961 2378 563 -1063 2204 1595 -1139 1441 2260 -1012 521 2726 -102 -304
2690 -304 2468 372 -860 2136 1489 -1111 1495 2204 -968 602 2448 -741 -168 2841 282 -687
2706 -687 2506 1079 -1286 1694 1867 -1051 944 2206 -904 -91 2057 -451 -1231 2045 443 -1609
2722 -1609 1454 963 -1931 541 1673 -1455 -558 1981 -634 -1328 1644 -138 -2008 1120 523 -2234
2738 -2234 187 726 -2163 -619 1192 -1597 -1207 1564 -1219 -2350 872 68 -2401 -9 749 -2298
$$ packed form
2626A040p82l196K585J262l454J538K062l055K52K866j887j768L449r57k683K818
2642I0P19l326J672K436l517L15K953k327j321L637j049k290K940L71l384K020
2658f1J474l265J005K946k867o80L192j716j873L302l65l074K540J543l423J244
2674g8K436k734n85L339j815j626L267o09k734K580Q19l272J533K205k828k02
2690c04K772k096j232K996o47k600K606P09l172J570J846l189N73L009k559r69
2706f87L193j427k365K980J73k918J995J262l110Q13K148k508p80L276j602k052
2722a609L063m91k894K472J132l128Q97K539k615o94K972j782j870L128n97k757
2738b234K421N39k889J544J811k789L90K771k783j131L222q04k469K392P58l047
$$ plain form
2754 -2298 -433 1116 -1552 -1444 1421 -1009 -1944 1191 -367 -2166 508 540 -2369 -417 1127 -1895
2770 -1895 -811 1571 -1236 -2064 1345 17 -2081 807 453 -1859 385 1412 -1948 -719 1597
2785 1597 -1024 -1223 1515 -18 -1615 1214 743 -1687 844 1631 -1280 -140 2078 -910 -1021 2243
2801 2243 221 -1330 1921 912 -1343 1264 1745 -1266 364 2136 -871 -282 2446 207 -885
2816 -885 1907 999 -1224 1419 1539 -1475 887 2091 -914 -47 2328 -193 -818 1954 584 -1427
2832 -1427 1086 1441 -1304 895 2153 -1151 -317 2073 -709 -957 2253 -60 -1540 1677 968 -1703
2848 -1703 770 1649 -1511 253 2050 -1257 -1087 1772 -384 -1698 1162 229 -1909 583 1293 -1870
2864 -1870 -139 1148 -1492 -1175 1459 -694 -1987 966 -242 -2002 595 558 -2320 -214 1187 -1545
$$ packed form
2754b298J865J549k668J08K865k430r35L135j558j799K674L2k909J952J544l022
2770a895J084K382k807q28L409j328k098K888l54k312K244J027l360J229K316
2785A597k621j99K738j533j597K829m71k430K531P87k911J140K218k988j11L264
2801B243k022j551L251j009k255K607M81l011J630J772l007N89K728k239j092
2816h85K792r08k223K643J20l014K362J204l005Q67K375k521o25K772j370k011
2832a427K513L55k745K199J258l304Q34K390k782k48L210k313j480L217p09k671
2848a703K473Q79l160J764J797l307J70K859k156j314K860r33k138K492P10l163
2864a870J731J287k640L17K634k153j293K953j208j760K597l7k878K106J401k732
$$ plain form
2880 -1545 -900 1358 -1296 -1863 1164 -345 -2289 518 439 -2234 -122 768 -1852 -1065 1382 -1188
2896 -1188 -1814 1155 -663 -1847 842 247 -2318 57 813 -1734 -656 1324 -1466 -1271 1538 -597
2912 -597 -1633 1074 163 -2186 753 751 -1860 -236 1680 -1301 -791 1571 -761 -1459 1482 292 -1607
2929 -1607 1077 988 -1618 272 2024 -1248 -610 2139 -593 -968 2069 368 -1657 1616 1110 -1329
2945 -1329 857 1712 -1370 -91 2085 -887 -746 1994 477 -1439 1763 903 -1313 1127 1529 -1077
2961 -1077 234 1891 -561 -869 2223 351 -1053 1783 951 -1513 1202 1474 -1277 293 1855 -1190
2977 -1190 -318 1881 -515 -1675 1476 412 -1658 864 1212 -1588 -208 1221 -1368 -762 1647 -1145
2993 -1145 -1102 1142 -196 -1822 883 454 -2401 148 1090 -2046 -739 1532 -1590 -1858 1346 -536
$$ packed form
2880a545O45K258k654n67L027j509j944K807p9k673K112Q90k620P87K447k570
2896a188o26K969j818j184K689n95k565K375P56k547J078J980k790J95K809k135
2912e97j036K707r11k349K939kk611J624J916k981N10K362k332o98K941j190j899
2929a607K684q9k606J890J752l272O38K749k732l75L037j701k025L273n06k439
2945a329K186Q55l082J279K176k972J41K740j517j916L202q60k216K440M02k606
2961a077J311J657k452l08L092j872j404K836q32k464K715K72k751J570J562l045
2977a190Q72K199k396j160L151j064k070K522L48k800J380J429k589O06K409k792
2993a145M3K244j338j626K705m29k855K549R42l136J307K271l122k68L204j882
$$ plain form
3009 -536 -1663 834 4 -2198 185 1181 -1827 -777 1114 -1454 -1437 900 -937 -1854 950 64 -2174
3026 -2174 249 662 -2029 -360 1190 -1622 -1195 1159 -817 -1690 1267 -43 -2173 470 722 -1750
3042 -1750 96 1283 -1552 -841 1497 -827 -1115 1361 -29 -1645 1225 1015 -1561 362 1369 -1320
3058 -1320 31 1811 -793 -821 2017 -137 -1225 1699 790 -1463 755 1510 -1124 330 1927 -341
3074 -341 -388 1833 -100 -700 1939 747 -964 1108 1741 -953 630 1990 -550 -237 2134 77
3090 77 -871 1658 875 -903 1403 1469 -1357 414 1732 -510 -265 2036 -499 -851 1674 264 -959
3107 -959 1177 829 -1401 580 1409 -1525 -108 1612 -768 -860 1027 12 -1461 942 502 -1848
3123 -1848 397 1014 -1619 -503 1218 -1405 -1334 1217 -718 -1622 1181 76 -2019 267 559 -2233
$$ packed form
3009e36j127K497q30k202K383R96l008J050J891k568J7K337j837r17K804q86k238
3026b174K423M13k691J669J550k812M27K354j976q73K957j310k130K643K52k472
3042a750J846J187k835P11K338k324k88K476j390j616K870k10k576J923J007k689
3058a320J351J780k604k8K838k154j088K924r09k253K218P55k634J454J597k268
3074c41m7K221j933o00K639j192j711K072O33k694J583J360k540L13K371k057
3090G7r48K529p83j778K306O6k826J771J318k242K45K301k535l52K525j410j223
3107i59K136l48k230J981Q29k934J417J720k380r2J887j015j473K403m40k350
3123a848K245O17k633J116J721k623P1K551j935r04K803j105k095K286K92k792
$$ plain form
3139 -2233 -585 648 -1603 -1145 895 -884 -1596 693 -239 -2045 204 208 -1773 -227 929 -1414
3155 -1414 -1128 881 -1138 -1457 1059 -421 -2028 789 640 -1828 70 722 -1451 -261 1574 -939
3171 -939 -1088 1785 -59 -1382 1054 530 -1612 667 1320 -1341 236 1791 -761 -614 1985 47
3187 47 -1025 1476 702 -1061 978 1551 -782 414 1962 -560 -20 1878 113 -470 1949 656
3203 656 -742 1737 1401 -1120 771 1938 -646 273 1938 -52 -695 1919 438 -815 1520 733
3219 733 -1031 1041 1344 -870 -26 1528 -559 -673 1327 -19 -1127 1349 689 -1465 453 1013
3235 1013 -1102 165 1276 -954 -1050 1280 -461 -1453 780 374 -1624 509 740 -1667 -197 816
3251 816 -1351 -742 1226 -1050 -1526 830 -357 -1891 134 413 -1871 -47 658 -1281 -767 806
$$ packed form
3139b233J648J233k251M58K040j779p12K289r32j806K249Mj981J546J156k343
3155a414K86K009k019l19K516j480j607K817j49k468J898O52k173J190J835k513
3171i39j49K873j844j323K436n24k142K279O53k661J577J555k552J47K599j938
3187D7j072K501p74j763K039N73k333J196J548k522N40J898j765n83K419j293
3203F56j398K479l36k521J891J167k584R19J665j990o43K614j481j253K335p87
3219G33j764K072L03k214Q44J554k087j14K000j346j108K476o60k154J918N60
3235A013k115J267J111k230r6K330j741r92K233m06j998K133K31k407J470J013
3251H16k167O09J968k276m76K356j187j534K025K79k284J824P05j939N14J573
$$ plain form
3267 806 -1083 -1627 744 -526 -1910 538 364 -1557 -47 916 -1521 -536 1266 -1106 -747 1148
3283 1148 -330 -1330 926 297 -1286 510 952 -1180 -461 1426 -796 -517 1551 -289 -1343 1118
3299 1118 296 -1386 549 1044 -1054 362 1444 -845 -661 1541 -333 -819 1469 421 -924 1053
3315 1053 1324 -1031 589 1702 -696 -250 1699 -436 -389 1864 243 -822 1195 838 -1124 623
3331 623 1450 -808 -193 1348 -429 -244 1864 -4 -774 1323 671 -1293 908 1056 -920 33 1617
3348 1617 -506 -674 1426 -297 -1212 1207 391 -1314 720 968 -1221 -29 1277 -1031 -771 1388
3364 1388 -676 -1188 1103 139 -1419 505 664 -1702 327 1093 -1318 -771 1404 -740 -1068 977
3380 977 -303 -1527 408 499 -1552 150 750 -1487 -404 918 -960 -1052 1106 -392 -1147 753 479
$$ packed form
3267H06j889n44K371j270j384K448j74j921J510R63k437R85J802k372L59J895
3283A148j478j000K256o29j583J796M42k132P19J887k222K79K068j840j054K461
3299A118q22j682J935M95k098J416J082k289J84K202j874m86K288j048j345J977
3315A053K71k355J620J113k398M46J949k135M7K253j621j065K017l57j962J747
3331F23Q27k258O15J541j777J85K108j868p70K097o52j964K201J48j976R53J584
3348A617k123j68K100j723r15K419q16j705K034K48k189J192J306k308K60K159
3364A388k064n12K291r64j558J924J59k366K029P66k411N47K175k144l28K045
3380I77j280j224J935R1k051J702O00k237J083J322j878r2K158j498p55J900k74
$$ plain form
3397 479 -1595 253 728 -1302 -220 780 -981 -770 1450 -406 -1206 964 303 -1517 486 700
3413 700 -906 240 994 -580 -629 1432 -384 -677 1162 379 -1074 956 978 -1044 879 1227 -722
3430 -722 191 1583 -285 -610 1341 496 -977 1395 882 -699 803 1346 -478 212 1646 -410 -123
3447 -123 1772 533 -886 1413 808 -584 828 1305 -642 232 1613 -535 -404 1426 -337 -595
3463 -595 1456 785 -707 1054 1023 -573 485 1391 -818 -172 1433 -213 -381 1081 34 -1248 939
3480 939 544 -846 375 1345 -801 -134 1230 -576 -956 1188 -68 -830 668 494 -1279 649 637
3497 637 -1211 -416 993 -727 -1121 1245 -275 -989 749 -21 -1438 319 706 -1740 -443 1018
3513 1018 -913 -955 735 -570 -1213 624 143 -1360 355 393 -1527 -47 661 -1243 -619 855 -786
$$ packed form
3397D79k074J848M75k030J082J000j761K11K220j856q00K170o61j820K003K14
3413G00j606J146P54j574m9K061j816k93J839p83j453K030K2k022J923L48j949
3430g22R13J392j868l25J951q45j473K372n13j581J502N43j824O90J434k056K87
3447a23J895j239j419K299o05j392J412M77j947Q74J381k148J31J830j763k58
3463e95K051o71j492J761l1j596J058R06k209O46J605j646j68J462j047j282K187
3480I39l95j390J221R70k146O67J364j806l80K144j256p62J498j74j773J928j2
3497F37j848P95J409j720l94K366j520p14J738p70j417J757L87k446J297J461
3513A018j931m2J690j305o43J837m81j503J715L8j920J480P08j904O24J474j641
$$ plain form
3530 -786 -905 898 -124 -1477 711 521 -1501 -156 810 -847 -391 1417 -482 -730 1166 212 -952
3547 -952 818 638 -1225 337 999 -689 88 1553 -102 -208 1521 222 -710 1359 558 -637 949
3564 949 1229 -556 406 1548 -226 -116 1629 -59 -389 2017 796 -654 996 1324 -426 663
3580 663 1612 -322 239 1477 169 -611 1534 346 -799 997 805 -648 364 1357 -456 250 1458
3597 1458 -132 -696 1180 -7 -685 878 571 -1184 296 785 -881 -52 1258 -533 -335 1280
3613 1280 -623 -934 890 283 -1043 65 290 -1692 -63 639 -861 -1042 859 -432 -1212 762
3629 762 -84 -1194 335 373 -1833 -256 581 -1025 -1016 669 -1079 -1228 680 -233 -1851 437 -274 -1251
3647 -1251 -94 651 -931 -611 826 -675 -950 856 -331 -1190 783 225 -884 236 843 -1007
$$ packed form
3530g86j19J803j022j353K188j90k022J345R66j657M56J808j899k48J896r54j164
3547i52J770j80j863J562O62j688P77J465j655j06J729j299r32K069q01j195J586
3564I49K80j785R62J142j774J10J745j688l30K406j221j450J650L28j750J089
3580F63R49j934N61J238j308p80K145j188j145J796j92j453J012R93j813P06J208
3597A458j590n64J876j187o78J563l07j755J480M89j666Q29J310j791J98J615
3613A280j903l11J824o07j326J108K25j982J629P02j500j81J901j291p80J974
3629G62q46j110J529L8k206J577Q37j606RJ685j748j49J908r13j618K288p11r77
3647a251J157P45j582L20J437j501k75J806j187q59J973n58j109J120O07j850
$$ plain form
3663 -1007 -377 1051 -627 -775 1132 -21 -876 1092 746 -939 552 958 -831 116 1290 -466
3679 -466 53 1627 150 -815 1243 563 -760 1037 981 -580 461 1403 -238 -101 1477 345 -442
3696 -442 1285 635 -315 1158 1164 -552 707 1504 -449 54 1487 27 -136 1252 503 -407 904 814
3714 814 -590 809 1260 -592 -61 1310 -218 -268 788 -52 -1084 894 443 -1119 229 786 -1034
3731 -1034 -98 709 -708 -545 933 -178 -1278 666 -346 -1119 442 398 -1305 347 400 -951 -661
3748 -661 530 -689 -1006 679 -377 -1212 445 78 -1261 -175 237 -1148 -954 571 -575 -1184 753
3765 753 -193 -1099 466 -8 -1268 251 675 -1102 -297 724 -911 -842 809 -481 -1115 546 163
3782 163 -1490 161 752 -1299 -330 896 -948 -620 1196 -308 -677 1111 114 -755 647 1027 -578
$$ packed form
3663a007O30J428j678j48J907j153q55J968l46j685J491M06j789R47J174j756
3679d66N19J574j477r65K058o80j323J797n6j561J041R42j641J37J578j132p87
3696d42J727o50r50J473Oj716J259P97j953N03J433j460j63J388p49r10J311r0
3714H14j404J399M51j852N31J371j528n0J056q40j032J978m51j562J348N57j820
3731a034R36Q07j417J63J478j111j100J944j012p73J561m4j703J652N3j351K90
3748f61J191j219l17J685j056q35J657l67j339J086M12j385J94J525j146o09J937
3765G53r46r06J565m74j260J519M24j777Q05J021j635O9J651j290o34J661l83
3782A63j653J651N91k051R69J226j844L28J816j504l69J788r97q69J402L80j605
$$ plain form
3799 -578 174 847 -569 -139 1266 -309 -391 1185 372 -823 809 601 -830 779 1126 -505 -185
3816 -185 1418 -287 -484 1215 51 -714 1161 823 -553 672 1053 -213 209 1422 -442 -404 1404
3833 1404 408 -450 1149 349 -562 529 812 -810 148 1116 -299 -307 1175 49 -968 907 179 -1061
3851 -1061 568 567 -1090 -236 608 -713 -461 867 -451 -947 841 -29 -1012 434 119 -1418 -117
3868 -117 491 -981 -364 878 -441 -769 437 -397 -1250 714 -5 -1414 167 293 -1402 -461 574
3885 574 -884 -955 724 -441 -991 537 32 -1368 60 346 -1432 -240 432 -848 -459 829 -381
3902 -381 -1148 541 48 -906 726 383 -1112 -188 765 -946 -562 751 -387 -780 807 180 -907
3919 -907 514 519 -885 204 1003 -1008 -454 972 -653 -567 801 -150 -585 849 428 -944 542 834
$$ packed form
3799e78P52O73j416M30J405j575q2J576q13j195J632k08j431J609L47j631L20
3816a85J603j705j97J699j164p65J875l38j376J225L81j266M22J213j864L8J808
3833A404r96q58J599q00r11J091K83j622R58R68j415qJ482j126j017J875p28j240
3851a061J629jj657Q54Q44j321K52J328j318m96J788q70r83J446l15j537J301
3868a17O08j472O17J242j319l28J206q34q53J964p19j409J581J26j695R41J035
3885E74j458p1J679j165n50J528n05j400J428K86j778J192O72j280L89J288j210
3902c81p67J689m93r54J632l43j495R24R53j711L84J313j138l93J587o27j087
3919i07J421Nj404J089P99k011N54J426j625Q6J368r51m35J434m21j372J486K92
$$ plain form
3937 834 -784 211 1047 -668 -522 1204 48 -729 1124 459 -697 531 990 -821 55 1626 -454
3954 -454 84 1370 -91 -596 1207 540 -535 669 934 -695 277 786 -428 -414 1309 -212 -532
3971 -532 907 163 -707 822 403 -877 273 837 -614 -71 1129 -325 -486 908 60 -684 392
3988 392 299 -851 534 692 -843 22 992 -921 -490 1009 -272 -1071 671 102 -989 262 325 -1063
4006 -1063 -132 859 -954 -654 560 -433 -885 233 -340 -1415 180 249 -1221 147 771 -870 -444
4023 -444 790 -517 -958 398 95 -869 150 194 -1162 82 690 -1037 -463 667 -469 -460 933 -113
4041 -113 -752 502 324 -1212 359 499 -635 -167 798 -658 -593 1156 -122 -891 899 320 -831
4058 -831 356 866 -500 235 923 -666 -120 1232 117 -535 1107 508 -323 787 873 -545 432 1229
$$ packed form
3937H34j618R95Q36j715J46J726j156p77J853o65j156J228M59j811Q76J571k080
3954d54N38J286j461n05J803o67j075J204K65j629R72N09j214J4J723j521l20
3971e32J439p44q70J529m19j280J150N64j451N43J200j454j61J394q48p44J076
3988C92r3j150J385J58j535Q65R70j913M31J499j281p99J742n69j091J251O3j388
4006a063R31R91j813L00J214r93m52J118n73j075J595O9j470J368O24j641M26
4023d44J234j307m41J356l03r64J019M4j356J244O08j727N74J130j136RJ393j046
4041a13o39J254j78j536J571J40j134M68R65j456O5J749j278p69J790n79j151
4058h31J187N10j366P35O88j589N46J352j115o52J642n99q31J110Q6j418R77P97
$$ plain form
4076 1229 -647 -70 1019 -197 -243 1066 184 -602 1001 778 -656 579 1375 -335 -99 956 -434
4093 -434 -486 1157 310 -850 1049 360 -774 592 761 -920 184 1020 -312 -551 688 -279 -738
4110 -738 724 250 -693 359 714 -915 103 782 -740 -570 791 -493 -532 727 215 -950 378
4127 378 276 -883 50 528 -794 -474 866 -734 -831 522 111 -814 584 290 -1102 4 662 -746
4145 -746 -228 849 -690 -683 724 -106 -1103 401 133 -1110 301 797 -623 -412 861 -286 -538 1108
4163 1108 -304 -725 611 49 -565 326 878 -667 147 906 -346 -289 975 -129 -598 828 487 -643
4181 -643 718 847 -729 3 891 -595 60 892 -81 -233 1175 434 -506 782 905 -643 774 858
4199 858 -558 253 1077 -71 -287 1005 184 -564 893 598 -815 700 840 -502 393 1282 -218
$$ packed form
4076A229j876N77J089j216m6J309q82p86J603k23j434J235P96j710K36J055j390
4093d34n2J643q47j160J899o89j134J366J69j681J104Q36j332k39J239r67m59
4110g38J462m74r43J052L55j629J018O79j522J70J361j284l9J259n12j165J328
4127C78j02j159R33M78j322L20J340j600r7J353m11r25J398k94j392J106O58j408
4145g46N18J077j539PJ407q30r97J504k68j243J411M96j420K11J273j147k52J646
4163A108j412m21J336n62o14Q91N52j545Q14P59j252N7J264j104m69J426l41j130
4181f43J361J29j576P32Q88j486O55Q32r73j52J408p41r40J288J23j548J417Q4
4199H58j416Q11Q24j148k16J292q21p48J457k95j413J515J40j342Q95Q89j500
$$ plain form
4216 -218 -104 1060 188 -637 814 380 -590 550 1192 -617 222 1080 -633 -397 892 -322 -762 904
4234 904 419 -668 491 853 -820 450 523 -965 -364 1021 -453 -774 883 158 -1015 713 494
4251 494 -953 254 869 -794 -63 716 -457 -541 701 -157 -981 562 167 -1116 123 502 -1094
4268 -1094 -201 953 -670 -489 708 -16 -665 707 -1 -1077 235 475 -1220 -65 1006 -595
4284 -595 -332 798 -187 -744 699 93 -861 367 424 -946 225 735 -572 -5 1220 -442 -738 635
4302 635 104 -819 764 520 -733 591 851 -531 -74 1283 -330 -156 853 -7 -745 778 241
4319 241 -910 390 859 -639 -158 968 -64 -322 1114 49 -344 869 426 -678 610 792 -962
4336 -962 117 899 -445 -124 952 62 -636 984 334 -588 597 740 -781 111 796 -606 -208 1177
$$ packed form
4216b18J14J164q72q25J451m34r70J140O42j809Q39Q58j713K36J289j214m40J666
4234I04m85j087J159L62j673J270P3j488O01J385j474l21J657p25j173J728k19
4251D94j447J207O15j663P31P79j173q4J242q58q24J543l95j283J239L79j596
4268a094Q93J154j623J81J197p24o49J372p08j076J312K40j695J155J071j601
4284e95K63J130r85n57J443o06r54J228N7j370J171N10j307N67J225j662k96J373
4302F35n31r23J583k44j253J324K60j382M57J357j613J74J009q60p38J523n37
4319B41j151J300M69j498M81J126j032k58J436j065l93J213m43j104J288J82j754
4336i62J079P82j344L21J076q90o98J620o50r22J185J43j521Q92O85j402L98J385
$$ plain form
4354 1177 -249 -401 783 15 -441 589 371 -921 578 869 -607 1 1000 -239 -251 730 -285
4371 -285 -612 793 431 -834 397 486 -859 -43 674 -479 -543 814 -324 -894 675 141 -836 515
4389 515 442 -1058 -169 478 -668 -308 617 -437 -813 627 -7 -992 280 100 -777 14 522 -1093
4407 -1093 -687 806 -498 -663 372 -634 -498 461 238 -678 143 428 -1087 -304 736 -613 -857
4424 -857 722 -38 -1029 469 356 -801 393 610 -511 129 912 -465 -378 717 -197 -404 845 360
4442 360 -636 291 826 -754 357 856 -620 -435 667 -80 -441 1018 107 -761 523 673 -501 484
4460 484 818 -629 -204 864 -169 -408 743 99 -329 936 681 -380 508 937 -591 59 1096
4477 1096 -274 -211 859 110 -864 517 434 -734 451 669 -649 54 550 -662 -305 636 -133 -486
$$ packed form
4354A177j426j52J184p68m56J030k18j292J499K91j476O08R99j239j2R81j015
4371b85l27J405l62j265J231Q9j345Q16P17j153o4J357j138n70J569n34r77J351
4389E15p3j500Q89O47j146L60R25j054l76J440o34r85J272j80q77P91N08j615
4407a093M06J493j304j65J035j006J36R59k23r16Q21K85j515P83J040j349k44
4424h57J579p60r91J498j13j157J194K17j121O40P83j377Q7J095r14k07J249m85
4442C60r96R27N35j580J111M99j476J85J102p47l61J459r11q68J284J50j174R85
4460D84L34j447M25J068j033k39J151o44m28J265k55j061Q88M29j528O50J037
4477A096j370O3J070p49r74J381q3j168J185K18j318P03M96j212L57R41p69l53
$$ plain form
4495 -486 656 40 -916 199 335 -646 -248 535 -822 -610 358 -551 -815 737 239 -1072 265 20
4513 20 -790 164 614 -517 -410 688 -368 -801 660 -139 -787 185 103 -987 41 360 -950 -361
4531 -361 484 -863 -726 653 -370 -950 384 176 -851 181 533 -743 26 724 -488 -529 594
4548 594 -432 -745 535 94 -899 479 235 -599 -264 754 -680 -54 955 -247 -653 796 26
4565 26 -623 622 762 -743 411 764 -531 -73 868 -367 -252 557 -170 -651 637 607 -620 344
4583 344 741 -619 -170 958 -407 -377 676 50 -498 518 352 -633 456 527 -626 -140 367 -298
4601 -298 -245 921 -46 -728 608 379 -857 84 561 -736 164 636 -131 -431 673 -585 -524 768
4619 768 85 -444 193 340 -875 24 533 -703 -391 492 -545 -415 561 -114 -853 96 129 -1093 -102
$$ packed form
4495d86J142o16r56J115J36r81L98P83j357K12R68r09k64J552m98j311J337k45
4513B0q10R54M50j131J07J098j056m33J461p99o48R72q2j090J028L19j310N89
4531c61Q45j347J37J379j023n80J334k08j027J032L52j276P69O98j212m1J123
4548E94j026l13J280m41r93J378k44q34L35J018j434O26J009j202m06J449p70
4565B6o49J245J40j505J154L53j295M58R41j235J15Q09p27m81J288l0j227R64
4583C44L97j360M49J128j365L0J053o26n48J016j66r85J089P1j153M86N07o65
4601b98N3J166r67o82J336k29j236R41M77j297R00M72p67l00J104j258O1J292
4619G68o83n29O37J47j215Q99N09j236L12Q83j037J30R76o75p39R49L3j222R91
$$ plain form
4638 -102 891 -768 -243 686 -571 -685 440 -193 -1020 327 -38 -1097 53 394 -809 -242 391 -772
4656 -772 -622 378 -449 -858 414 69 -934 254 516 -791 -112 525 -592 -424 467 -65 -495 632
4674 632 -122 -648 484 545 -724 -177 566 -597 -170 622 -464 -568 664 -89 -553 493 682 -376
4692 -376 207 609 -434 58 602 -395 -160 987 110 -527 610 594 -714 170 550 -615 221 929 -168
4711 -168 -61 1000 156 -496 599 46 -395 314 525 -379 309 527 -593 -174 666 2 -335 863 62
4730 62 -557 429 388 -392 65 577 -705 -157 346 -163 -436 680 118 -351 433 131 -619 -65 553 -539
4750 -539 25 893 -334 -417 756 -156 -755 329 -6 -763 219 457 -805 -138 528 -451 -356 745 -335
4769 -335 -725 541 -71 -708 275 30 -937 -16 564 -625 -320 620 -278 -1040 686 210 -811 131 63
$$ packed form
4638a02R93j659N25R29j257j14J125o33q27J347l65j059J150L41j203N67O33j163
4656g72J50J000q27m09J272l45j003J188K62j307O79O37j117J68Q91n32m30J127
4674F32p54n26J132O1j269N47P43j163M27P92j086j04J232p53m64J046J89j058
4692c76N83M02j043M92N44r97K35J147q77o37J137j6j308Q84L80j165Q36P08j097
4711a68J07J061q44o52J095n53m41P09K11r04O88K18j120M19Q40o64l37J198q01
4730F2o19R86m1p80M57N12j282N48N03n09k73J116n62m69P84l02p50N54O18j092
4750e39N64Q68j227q3J173r12n99J084l35p57R82K38j262O67O66r79R5J101j080
4769c35l90J266o12o37R83k45r67R21N80j189L05R40q98p62J726m76j021R42o8
$$ plain form
4788 63 -602 -161 200 -731 -46 580 -345 -419 557 -113 -635 387 196 -614 445 424 -636 -10 550 -524
4808 -524 -368 657 -112 -406 612 452 -657 446 12 -350 12 633 -187 63 527 -316 -291 714 349
4827 349 -541 436 483 -382 385 710 -544 -171 565 200 -15 609 442 -557 541 518 -119 169 499 -183
4847 -183 376 870 -232 -296 943 206 -268 604 463 -472 401 582 -96 184 636 -115 -119 516 324 -785
4867 -785 111 200 -729 49 197 -510 263 595 -273 -96 462 -141 -272 359 93 -774 123 309 -751 -428
4887 -428 440 -427 -484 565 -139 -660 49 159 -851 388 6 -800 -5 416 -469 -322 448 -313 -542
4906 -542 464 -405 -685 -41 -16 -613 11 293 -655 -166 789 -282 -642 483 -439 -616 609 171 -834
4925 -834 139 216 -793 3 345 -500 -547 351 -346 -254 385 26 -861 424 321 -427 -7 540 -188 -147 501
$$ packed form
4788F3o65M41L61r31O85O26r25p4R76o70n22J022j91q10J059k1j060O26N60j074
4808e24J56J025p69k94J018j60j109J103m34l62L62O21q20K50M64q43K5J005l65
4827C49q90R77M7q65P67L25j254L73P36l65k15O24j67r99J098k3o37K88L30o82
4847a83N59M94j102o4J239p37m74Q72j41r35Q73J81o78K80M52p51mO35j92j109
4867g85Q96Q9r29P78J48p07P73L32q68J77N58o03j31O31k66q67Q97J86j060L23
4887d28Q68q67n7J049p04n21P09J10j010J239l82q06P95M21q85J47P70p61k29
4906e42J006q69k80O44K5n97O24K82r48M89R55j071l60J125r22j77J225m38j005
4925h34R73P7j009P96L42q45m7Q98o97R2O39l59q87J285j03p48M20N47p28M1O48
$$ plain form
4946 501 -259 -174 591 311 -371 740 396 -144 271 1005 1 -117 572 -141 -119 503 47 -377 697 476
4966 476 -490 278 427 -261 34 705 -262 -248 739 -171 -476 871 228 -542 312 210 -460 51 647 -287
4986 -287 -52 472 -19 -417 469 198 -944 426 551 -300 18 561 -268 -301 508 -304 -169 569 62 -485
5006 -485 159 17 -432 -215 365 -626 -433 455 -574 -608 44 -35 -546 -143 -75 -194 -179 235 -693 50 76
5027 76 -469 -435 367 -243 -512 439 280 -683 24 314 -622 -245 414 -288 -296 199 -84 -609 93 -41 -694
5048 -694 58 385 -513 178 47 -712 -147 628 -253 -538 754 -95 -469 474 334 -366 228 445 -368 -305
5068 -305 502 -315 -181 557 46 -254 469 294 -266 433 529 -148 323 469 -287 -120 657 -88 -574 630
5088 630 480 -160 258 663 -194 244 589 -147 -276 600 98 -219 604 123 -319 444 183 -207 208 550
$$ packed form
4946E01p60Q5P65k80o82J111l44n40M15P34j004j18O89p13K2O22m56m24J074k21
4966D76r66P68J49o88K95O71r67J4R87r10l05J347o43p70Q54j02o70N11N96r34
4986b87K35N24m91l98Q86k71j142J370J25q51L18N43q29l3Q09q12J35P38n07n47
5006d85O44j42m49K17N80r91J93Q88j029l4O52p9n11M03O8j19J5M14r28P43K6
5027G6n45L4Q02o10k69R51j59r63P07K90r36L77O59p02qM95k83n25P02j34o53
5048f94P52L27q98O91j31p59N65P75q81k85J292q49l74R43j40p00N94K17q13O3
5068c05Q07q17J34P38n11l00P23j75n60O99R6o77M71J46p56J67P77p45m86J204
5088F30j50o40M18M05q57M38L45p36j29Q76n02l17Q23m81m42P63k61l90M15L42
$$ plain form
5108 550 -349 -196 507 -287 -384 531 247 -358 282 424 -335 263 474 -275 250 511 -61 -223 499 -80
5128 -80 -599 392 149 -706 -62 425 -507 -144 453 -334 -332 520 -220 -482 342 12 -939 94 16 -689 -29
5149 -29 276 -358 -334 438 -18 -504 243 90 -555 381 200 -643 127 394 -577 -294 130 -568 -487 105 -40
5170 -40 -345 66 155 -361 147 488 -497 -175 744 -520 -71 680 -84 -362 398 27 -467 285 605 -392
5190 -392 -44 849 -199 -165 674 196 -524 542 365 -417 230 332 -197 3 435 -303 77 580 157 -144
5210 -144 552 222 -248 315 44 -273 487 180 -518 -249 353 -210 -109 595 206 -172 451 260 -262 96
5230 96 355 -577 -13 492 109 -187 337 29 -92 724 286 -492 162 438 -274 -295 316 -237 -193 453 65
5251 65 -340 525 137 -543 117 261 -621 71 287 -553 -561 640 -376 -362 128 -42 -389 -1 -6 -519 -129
$$ packed form
5108E50q99J53P03p94r7R15k84o05O40J42p59N98K11p49N25K61n72j62P22n79
5128h0n19R91k43q55O44M87r32L63N97p87KQ52p40k62Q24l30r51J033p8p05O60
5149b9L05o34K4P72m56m86P47j53o45R36j81q43P70K67r71K83M24o98Q1N92j45
5170d0l05M11Q9n16N08L41r85L22R19j264M49P51p64k78P60l71m94P52L20r97
5190c92L48Q93j048L4Q39m78p20J066j77p82O47J02n29K00M32p38L80N03m23l01
5210a44O96l30m70N63k71l17P60l07o98K69O02n63J01P04l89l78O23j91n22L58
5230I6K59r32N64N05l83k96N24l08j21Q16m38p78O54K76p12k1O11n53M4O46l88
5251F5m05Q65l88o80O60J44q82O92K16q40qJ201j016J4M90j70l47L88nn13L90
$$ plain form
5272 -129 150 -197 -4 261 -348 -271 336 -12 -758 258 91 -271 223 195 -785 -358 260 -614 -593 493
5292 493 -80 -499 -13 201 -226 67 280 -533 50 305 -331 -509 134 -155 -31 631 -174 -412 275 406
5312 406 -481 147 661 -160 -244 477 118 -511 499 168 -308 459 367 -562 261 404 -402 21 460 -78
5332 -78 -88 576 136 -205 391 369 -236 466 761 -215 -49 519 42 -218 634 220 -32 297 392 -204 87
5353 87 609 -89 -170 296 -292 -170 430 -79 -202 497 348 -433 215 122 -608 -121 278 -240 -52 47 -130
5374 -130 -384 365 125 -378 269 163 -235 108 253 -800 -212 255 -124 -344 308 -251 -338 195 29 -615
5394 -615 -123 457 -413 -177 258 -513 -341 281 -312 -62 -67 39 -716 71 206 -280 -155 328 -515 -635 125
5415 125 -157 -351 449 87 -570 154 95 -197 22 285 -237 -191 523 -269 -69 208 89 -565 -174 114 -735
$$ packed form
5272a29K79l47J93K65o09P7O07l48p46J016j67l62M94k8r80M27O18q74K1J086
5292D93n73m19M86K14m27K93K13q13N83K55o36j78O43k89J24O62q05k38O87J31
5312D06q87O28N14q21q4P21l59o29J010l31m76P67r2r29Q23J43q06M23M39n38
5332g8j0O64m40l41N96k2o05P02K95r76J66N68m77k60Q52m14k52L29R5n96K91
5353H7N22o98q1M66n88J22O00n09j23O99j49p81O48r3p30M87L99n18J88R9j77
5374a30k54P49k40n03O47j06l98L43J45j053N88M67l79k20O52n59q7N33j66o44
5394f15M92N80q70K36M35p71J72O22n93K50nJ06p55P87J35m86J25M83q43j20P60
5415A25k82j94Q00l62o57P24n9k92K19K63n22M6P14p92K00K77j19o54L91K88q49
$$ plain form
5436 -735 -181 397 -99 -162 520 51 94 521 -47 -376 341 200 -216 232 278 -602 -82 416 -446 -257 722
5457 722 -205 -310 581 309 -459 503 270 -622 233 286 -118 -82 579 198 -412 260 32 -539 332 178 -474
5478 -474 80 266 -596 -132 628 291 -162 546 47 -431 -115 337 -326 -184 232 -390 -85 252 -391 -290
5498 -290 476 -138 -431 478 147 -459 -4 404 -581 -214 193 -274 -567 394 -355 -381 349 -125 -479 148
5518 148 37 -591 25 -173 -295 -396 267 -434 -264 125 305 -283 382 192 -347 -324 26 -340 -419 238 -306
5539 -306 -665 207 -155 -406 142 178 -567 -172 202 28 -96 272 -72 -313 517 -32 -428 428 -38 -631
5559 -631 132 450 -440 211 631 -34 -98 359 -36 -289 487 176 -333 347 279 -336 70 375 -153 -376 419
5580 419 39 -221 269 224 -135 269 316 -207 21 507 -573 68 606 -129 -327 284 -46 -154 403 251
$$ packed form
5436g35N54N78m96o3O82m69M3M27n68l29P17j41m16M48M6q80N20M98q62J89R79
5457G22r27j05Q91k72p68R62k33q92Q55N3m04L6O61l81o10O72k28n71Q71j54o52
5478d74N54J86q62M64P60l37m53P08m99m78L16M52o63J42M16o22L05L37o43J01
5498b90P66o14k93R09l31o06M55M08r85L67M07m67k93R61p49k6P30m74l54O27
5518A48j11o28O16j98j22j01O63p01J70L89J80n88O65j90n39K3L50l66p9O57n44
5539c06l59Q72l62k51N48L6p45L95L74j74j24L68l44k41Q30n49l96Q56m66n93
5559f31P63L18q90O51M20o65o4M57l95k53P76l11n09O80o8o15M06L05n28k23P95
5580D19l80k60M90m5l59M04M7n23K28M86j080O41N38p35j98O11l30j08N57j52
$$ plain form
5600 251 -103 35 419 -89 -192 481 -13 -98 446 74 -247 111 278 -359 164 447 -250 -175 446 -159 91
5621 91 398 -306 -709 142 36 -537 93 389 -453 113 246 -392 -303 284 -319 -328 162 229 -432 -40 206 -336
5643 -336 137 457 -678 -267 673 -82 -199 339 226 -465 502 -102 -196 50 271 -492 -328 412 -421 -127
5663 -127 212 -253 -397 144 346 -283 -56 130 -540 -229 166 -338 -445 604 -148 -564 107 103 -484 359
5683 359 84 -250 144 264 -130 40 728 -1 -352 309 334 -231 110 322 -302 137 549 -39 19 446 93
5704 93 -328 346 280 -404 293 132 -476 297 319 -346 31 477 -100 61 470 -99 -146 196 202 -91 194 338
5726 338 -387 16 467 80 29 464 140 -380 287 188 -395 250 276 -296 -37 529 -180 166 294 -125 -91
5747 -91 6 143 -405 54 136 -264 28 153 -296 -207 367 -487 -168 427 -500 -352 105 -49 -432 -63 321
$$ packed form
5600B51l54J38L84n08j03O73m94q5N44l72l21L58J67o37N23K83o97P5O21o05K50
5621I1L07p04m03Q51j06n73O30K96q42N66J33o38Q9N87o03rM90O7o61L92K46n42
5643c36M73L20j135M11R40p55j17N38j13o91R67o04r4K46K21p63J64P40q33K94
5663a27L39m65j44N41K02o29K27J86o70L11L95n04j07J049p52m16O71mn87Q43
5683C59k75l34L94J20l94J70O88p29l51O61K5n65L41K12o24M39M12n88N8M27l53
5704I3m21O74o6o84O97j61o08P73K2o65L77M46n77J61M09n69m7L42Ok93K85J44
5726C38p25M03M51l87n1M35l24n20O67r9n83O45K6n72K59N66p09L46J28m19L4
5747i1R7J37n48M59Q2m00K92J25m49Q9N74q54L19N95r27J48M57j54l83L69L84
$$ plain form
5768 321 57 -437 333 -388 -225 374 -470 -376 -17 24 -239 131 328 -552 61 325 -448 -202 115 -123 -767
5789 -767 49 -122 -624 7 7 -99 -300 344 -370 -96 130 -446 61 160 -55 -209 42 195 -377 -155 261
5810 261 -294 -203 516 -99 -222 113 0 -292 -29 322 -272 206 184 -49 -114 118 -133 -386 580 75 -226
5831 -226 483 95 -425 237 110 -331 37 418 -320 -243 344 -198 6 315 219 -196 32 -43 -195 -254 250
5852 250 -76 36 415 -38 -173 245 261 -408 2 122 -156 37 317 59 97 253 -180 -163 203 -178 -402
5873 -402 312 114 -238 180 232 -382 -3 484 -24 -92 303 -193 -269 173 51 -378 118 353 -377 -99 361
5894 361 -575 -361 396 -45 -194 169 -269 -351 58 14 -393 78 61 -203 -172 243 -300 -312 289 137 -348 -37
5916 -37 62 -164 -44 242 -540 -636 290 -133 -115 177 -290 -207 310 343 -212 154 488 -509 -158 512 -141 -217
$$ packed form
5768C21k64m94P70p21J63N99q44R4L59M1k63L70J97q80O13K64p73K46L17k38o44
5789g67Q16j71n02O31%j06k01O44p14K74K26n76N07R9k15j54K51J53n72K22M16
5810B61n55R1P19o15j23L35j13k92K63L51n94M78k2k33o5K32k51k53R66n05l01
5831b26P09l88n20O62j27m41L68L81p38P7N87n42K04L09r6m15K28p5j52n9N04
5852B50l26J12L79m53j35M18J6o69M10J20k78J93K80k58L8J56m33J7L66l81k24
5873d02P14j98l52M18N2o14L79M87n08o8L95m96p6M42j22m29M96K35p30K78M60
5894C61r36K14P57m41j49L63m38q2M09m4m07M71j7k64L1M15n43j2O01j52m85L11
5916c7R9k26J20K86p82r6R26m23J8K92m67Q3N17L3n55L66L34r97L51O70o53p6
$$ plain form
5938 -217 58 264 -143 302 280 -218 85 173 -442 -25 324 -175 43 340 -61 -175 184 -110 -148 360 263
5959 263 -82 156 233 -61 -202 750 9 -170 722 288 -471 380 -193 -255 243 476 -215 -155 396 49 -307
5980 -307 455 113 -116 253 -45 -144 -147 94 -143 69 401 -114 -27 431 -52 -63 236 182 -423 228 8 -213
6002 -213 -25 316 -218 -144 62 -152 -304 151 85 -499 111 -15 -560 -20 238 -102 11 197 -74 -397 254
6023 254 -80 191 152 -303 -418 115 -20 -306 -233 195 -198 -286 -180 -85 -584 -20 181 -305 -170 241 -286
6044 -286 171 285 153 -259 257 -168 -116 244 105 -195 111 -147 -260 -250 236 78 -416 248 141 -310 202
6065 202 398 -263 191 87 -249 -21 485 -101 -4 218 -35 -9 556 185 -139 232 298 -252 -91 435 -189
6086 -189 -159 569 69 -191 394 -5 -191 380 353 -296 -173 128 -40 -135 326 -69 -90 413 100 -489 326
$$ packed form
5938b17K75K06m07M45k2m98L03Q8o15M17L49m99K18K97m01j14L59k94l8N08r7
5959B63l45K38P7k94j41R52p41j79Q92m34p59Q51n73o2M98K33o91O0N51l47l56
5980c07P62l42k29L69k98r9lK41k37K12L32n15Q7M58m83j1K99n4o05O51k20k21
6002b13J88L41n34P4K06k14j52M55o6n84O10j26n45N40K58l40J13J86k71l23O51
6023B54l34K71l9m55j15N33j35k86P3M28l93q8J06R5m99N64K01m86J35M11n27
6044b86M57J14j32m12N16m25N2L60j39l00L06k58j13J0M86j58m94O64j07m51N12
6065B02J96o61M54j04l36K28N06n86R7K22k53K6N65l71l24L71O6n50J61N26o24
6086a89L0P28n00k60N85l99j86N71k7o49J23L01j68r5M61l95k1N03l13n89Q15
$$ plain form
6107 326 209 -512 248 207 -215 75 187 -77 -312 141 152 56 65 -13 -292 218 210 -282 -247 238 -148 51 155
6130 155 -125 57 -20 128 -226 158 -140 -279 -146 114 -207 -85 158 -29 -248 190 -169 -122 25 22 -107
6151 -107 137 36 61 35 -2 -29 -179 264 41 -53 73 162 -373 -209 -40 -255 12 48 -75 -155 203 -53 -371
6174 -371 78 -199 -92 118 153 19 86 83 -201 -188 323 302 -308 59 103 -145 72 34 -444 -227 -98 -260 138
6197 138 81 20 -171 373 -26 -145 294 258 -254 -94 513 -107 -197 336 194 -255 235 65 -225 -78 162
6218 162 17 251 377 121 89 78 -510 143 235 -48 -473 497 152 -432 168 33 -417 244 308 -212 -143 -28
6240 -28 167 -177 287 -22 -114 -77 49 37 -224 102 -292 108 452 3 -24 101 346 -193 -7 -91 -412 0
6262 0 58 -293 23 285 -78 -171 242 -68 -371 174 -130 -643 -112 101 -329 285 339 -352 -207 112 -148 18
$$ packed form
6107C26j17p21P60m1m22K90J12k64k35M53J1r6Rp8k79N10qm92L5M85l86J99J04
6130A55k80J82p7J48l54L84k98j39J33K60l21J22K43j87k19M38l59M7J47lj29
6151a07K44j01K5k6l7k7j50M43k23r4J26Q9n35J64J69k15K67L6j23q0L58k56l18
6174c71M49k77J07K10L5j34O7lk84J3N11k1o10L67M4k48K17l8m78K17J29j62L98
6197A38n7o1j91N44l99j19M39l6n12J60O07o20r0N33j42m49M90j70k90J47K40
6218A62j45K34J26k56l2j1n88O53R2k83m25R70l45n84O00j35m50O61O4n20O9J15
6240b8J95l44M64l09r2L7J26j2k61L26l94M00L44m49k7J25K45n39J86q4l21M12
6262@N8l51L16K62l63r3M13l10l03N45l04n13N31K13m30O14N4o91J45L19k60J66
$$ plain form
6284 18 40 49 -387 -82 -210 -874 -147 350 -53 110 12 -81 -81 142 91 -163 403 -236 -467 33 63 -345 23
6307 23 217 178 -411 -157 192 -355 181 142 -135 -70 73 -3 -21 303 -72 -94 437 -172 68 448 -81 71
6329 71 205 183 -201 -135 493 -242 37 -72 154 -160 382 44 -201 55 -122 -171 -13 206 -117 -245 167
6350 167 126 27 168 111 -9 264 -150 -193 -210 166 -64 -75 328 -119 -228 157 283 -370 438 401 -155 -19
6372 -19 166 9 -41 287 -390 -322 192 9 -226 -37 75 -132 339 323 -126 -291 198 -33 -107 126 -136 -465
6394 -465 210 -195 -311 63 193 -228 -76 -39 -230 -134 294 -264 -161 75 -45 -489 -199 19 -175 323 29
6415 29 -140 -242 282 -81 -122 12 117 -302 71 23 -231 -148 200 -102 32 356 -447 -181 49 -180 -4
6436 -4 38 184 -185 -117 34 -221 210 116 -227 -51 372 -119 -185 157 342 2 301 210 -122 -43 89 17 -337
$$ packed form
6284A8K2Rm36L05j28o64P27M97m03J63r8r3%K23n1k54N66o39k31N00L0m08L68
6307B3J94l9n89K54L49n47N36l9k77O5J43p6j8L24l75k2N31o09K40L80n29J52
6329G1J34k2l84O6O28p35K79j09K26l14N42l38k45K56j77m9J58K19l23j28M12
6350A67m1r9J41n7j20K73m14m3j7L76k30j1M03m47j09L85J26o53Q08l7n56J36
6372a9J85j57n0L28o77O8N14j83k35J89J12k07M71j6m49j65M89k31p4K33k62l29
6394d65O75m05j16L74J30m21J52L7j91R6M28n58J03K36j20m44K90K18j94M98k94
6415B9j69j02N24l63m1J34J05m19L73m8k54Q3L48l02J34L24q03K66K30k29J76
6436dM2J46l69O8J51k55M31r4l43J76M23m91o6L42J85l40K99r1l32P9J32p2l54
$$ plain form
6459 -337 525 -153 107 267 -102 -91 185 97 -19 49 192 37 96 148 -165 209 308 69 -50 297 209 -121
6481 -121 -44 547 -298 135 417 -117 -225 -59 62 -460 118 171 -277 -24 210 -349 57 232 -161 187 191
6502 191 -14 -382 190 95 -139 -26 -20 26 63 174 -58 -181 109 -297 -142 -178 134 -262 202 -120 -135 21
6524 21 -21 -108 -255 89 -153 -58 12 -73 -260 -126 -6 -425 -94 -88 -75 -215 160 -212 -32 270 79 -332 -10
6547 -10 4 -425 -228 226 97 -189 361 -161 26 273 3 -31 102 335 -395 204 130 79 223 147 -260 -191
6569 -191 79 -1 35 175 173 -152 169 221 -191 -191 378 -366 67 202 -110 22 259 -60 75 -153 109 -222
6591 -222 -238 -206 -130 149 279 279 -241 200 62 -22 422 474 -299 231 191 -24 -15 244 -5 219 54 -88 -424
6614 -424 63 183 -241 161 59 -185 -171 482 -243 -87 88 -174 -9 169 117 -215 20 322 -46 -195 -47
$$ packed form
6459c37Q62o78K60J60l69J1K76q8j16O8J43j55N9N2l13L74R9k39j19L47q8l30
6481a21P7N91q45M33K82n34j08J66J21n22N78N3m48K53K34n59M06J75l93L48M
6502A91k05l68N72r5k34J13OM6L7J11k32j23K90m06J55l6L12l96M64l22j5J56
6524B1m2q7j47L44k42R5P0q5j87J34J20m19L31OJ3j40L75l72J80L02j91m11L22
6547a0J4m29J97M54j29k86N50n22J87K47k70l4J33K33p30N99p4n1J44p6m07O9
6569a91K70q0L6J40kl25L21N2m12%N69p44M33J35l12J32K37l19J35k28K62l31
6591b22j6L2P6K79J30%n20M41j38q4M44N2p73N30m0k15RK59k49K24j65j42l36
6614d24M87J20m24M02j02k44J4O53p25J56J75k62J65J78n2l32K35L02l68j49J48
$$ plain form
6635 -47 -206 125 19 -18 -26 55 -86 -308 222 -196 -499 12 141 -412 -192 167 -54 138 115 -251 -269 307
6657 307 245 -131 -371 -48 -527 -160 237 -171 -174 170 127 -49 237 -33 -168 -198 260 -273 42 -47 -248 -161
6679 -161 40 -57 -159 271 -118 -23 126 250 -284 25 -142 -105 -42 87 10 -413 97 348 -124 -114 54 -149
6701 -149 3 434 -90 -173 64 16 -74 147 367 8 117 14 1 136 113 130 62 381 260 -2 272 197 44
6724 44 321 173 -491 365 208 1 -80 158 -111 -14 156 -43 -153 30 -178 -110 4 11 -472 -275 16 -181
6746 -181 -89 123 -63 -162 -90 -43 32 -47 -6 -171 -36 293 -23 -244 118 -268 -229 -112 170 -140 219 2 16
6769 16 -145 126 -94 80 36 -268 155 -233 -71 36 113 -76 97 -80 204 -337 -50 213 28 -254 -16
6790 -16 -184 -269 138 -9 -23 -139 -54 -157 3 181 -446 -149 -122 -14 -290 -166 -164 -112 -109 57 99 -232 119 -141
$$ packed form
6635d7j59L31j06l7qQ1j41k22N30m18l03N11J29n53K20L59k21J92k3l66j8N76
6657C07o2l76k40L23m79L67L97m08lL44m3j76K86k70j35l0M58n33L15q9k01Q7
6679a61K01r7j02M30l89R5J49J24n34L09j67L7O3J29p7m23N10K51m72J0J68k03
6701a49J52M31n24q3K37m8r0K21K20l59J09j03j3J35k3J7o8L19j21k62K74p5j53
6724D4K77j48o64Q56j57k07q1K38k69R7J70j99j10J83k08O8J14Pm83J97K91j97
6746a81R2K12j86r9P2M7P5p9M1j65J35L29l16k21L62l86L9J17K82l10L59k17J4
6769A6j61K71k20J74m4l04M23l88J62J07P7j89J73j77K84n41K87K63j85k82K38
6790a6j68q5M07j47j4j16Q5j03J60J78o27K97K7J08k76J24KN2LJ66M2l31L51k60
$$ plain form
6814 -141 -59 54 24 -110 463 -164 -390 327 224 -326 -98 173 -136 68 32 40 -163 167 -16 16 185 -42
6836 -42 -120 332 83 -51 333 75 -229 -393 153 74 -129 306 449 5 -200 204 -107 61 249 -168 -249
6857 -249 241 59 -44 142 -98 -44 161 66 66 113 437 86 -37 162 145 109 230 -163 -283 150 121 -215 -37
6880 -37 328 -213 52 40 194 -489 -37 -155 -232 196 -33 101 -135 147 -216 64 -6 -211 -62 25 30 -346
6902 -346 284 101 -258 -135 -66 -284 -34 -30 -223 -284 155 -103 -2 121 -320 -125 81 3 -109 -298 154 -168
6924 -168 -235 131 -37 -153 226 -28 -389 -62 22 -13 -91 71 -228 -290 107 141 -195 127 -176 0 -6 -58 172
6947 172 102 7 -332 342 401 -78 167 17 -269 -398 -146 126 -118 -20 87 -41 -50 73 -178 -201 -97 -163 -242
6970 -242 -41 205 136 191 -3 123 140 -6 -69 34 195 -251 -28 46 -159 -126 99 432 -119 65 109 -211
$$ packed form
6814a41Q2J13l0j34N73o27k26P17j03n50K28K71l09K04l6Qk03L30j83L2J69k27
6836d2p8M52k49j34L84k58l04j64N46p9k03M35J43m44k05M04l11J68J88m17q1
6857b49M90j82j03J86k40N4K05r5%M7L24l51j23J99j7l6J21l93j20M33k9l36J78
6880c7L65n41K65j2J54o83M52j18p7M28k29J34k36K82l63K80p0k05J49Q7Nl76
6902c46O30j83l59J23O9k18K50Mj93o1M39k58J01J23m41J95K06p8j12j89M52l22
6924a68o7L66j68j16L79k54l61L27Q4l5p8J62k99o2L97L4l36L22l03J76on2K30
6947A72p0r5l39O74N9m79K45j50k86j29K52K72k44R8J07j28rJ23k51k3J04o6p9
6970b42K01K46o9N5j94J26J7j46o3J03J61m46K23P4k05L3K25L33n51J84M4l20
$$ plain form
6992 -211 7 42 -14 -102 294 -60 -23 273 -77 -61 55 -61 -185 267 216 98 13 324 185 -386 110 -57
7014 -57 -45 190 7 -437 -277 182 -223 201 38 -283 115 244 -202 -280 88 32 -230 -165 109 -261 -225 -34
7036 -34 -175 -65 298 216 -75 -38 -65 -114 62 49 -17 15 -107 -2 -228 -336 -199 -114 79 465 -124 259 -7
7059 -7 -409 20 314 254 -110 42 32 -75 137 -409 49 -36 -64 -333 17 282 153 15 161 6 -62 229
7081 229 -59 182 137 12 -295 116 208 -122 101 63 -202 -159 32 8 161 55 -102 30 253 296 -14 59
7103 59 405 9 24 208 52 162 182 240 34 89 464 61 173 158 -404 -61 211 92 -163 35 -16 -152
7125 -152 221 195 -397 61 116 -10 185 434 -37 -196 302 -166 -57 264 122 -183 68 -70 40 -167 -12
7146 -12 -299 41 267 -138 -324 78 -11 186 -77 233 -228 199 342 -149 -51 286 -36 -5 28 38 -422 166
$$ packed form
6992b11K18L5n6q8L96l54L7K96l50J6J16j16j24M52n1j18q5L11j39n71M96j67
7014e7J2K35j83m44J60M59m05M24j63l21L98J29m46p8L68n6k62O5K74l70L6J91
7036c4j41J10L63q2k91L7k7m9J76j3o6L2j22J05k26j08J37Q5J93L86n89L83k66
7059gm02M29K94o0l64J52j0j07K12n46M58q5k8k69L50K65j29j38J46j55o8K91
7081B29k88K41m5j25l07M11R2l30K23l8k65M3J91k4J53j06j57J32K23M3l10P3
7103E9L46l96J5J84j56J10K0N8k06N5L75m03J12j5n62L43K72j19k55J98n1j36
7125a52L73k6n92M58N5j26J95K49m71j59M98m68J09L21j42l05K51j38J10k07J55
7146a2k87L40K26m05j86M02q9J97k63L10m61M27J43m91R8L37l22L1L3J0m60N88
$$ plain form
7168 166 220 -272 51 211 -201 113 127 80 -3 -93 -155 -269 67 247 -52 -14 107 -133 203 22 61 -192 116
7191 116 50 -157 59 24 -62 -136 127 -491 -22 222 -26 -63 175 -91 -166 136 288 -57 -92 62 18 55 65
7214 65 208 96 106 60 393 281 -38 -118 229 91 -169 248 -30 11 -141 291 20 -174 -106 -135 -36 321 14
7237 14 -38 -273 -65 106 -17 197 98 -275 304 178 -236 -74 155 -251 -52 148 -254 -20 -163 165 111
7258 111 161 59 143 -193 -113 -60 -248 -178 -161 -156 -246 -45 140 108 9 -74 -54 -112 8 130 -96 -79 -106 94 275
7283 275 -79 178 -199 36 -10 -237 -196 114 239 40 102 -118 -125 -57 -35 -162 158 152 -191 -6 -43 67 -335
7306 -335 -88 151 -242 259 159 7 -180 202 -121 -65 326 -63 -172 177 237 -299 -33 -81 -4 -57 178 269
7328 269 -97 5 111 -12 84 77 -142 -79 185 247 -19 269 -58 108 -282 39 -251 12 116 -40 -50 49
$$ packed form
7168A66N4m92L23J60m12L14J4m7q3r0o2j14L36J80k99L8J21k40L36j81L9k53L08
7191A16o6k07K16l5q6p4K63o18M69K44k48l7K38k66p5L02J52l45l5J54m4L7J0
7214F5J43j12J0m6L33j12l19q0L47j38k60M17k78M1j52M32k71j94O8k9R9L57l07
7237A4n2k35K08J71j23K14r9l73N79j26m14J62K29m06J99K00m02K34j43L28n4
7258A11N0j02Q4l36Q0N3j88P0J7Nr0K01J85l2r9q3K0n8J20J22k26J7k7K00J81
7283B75l54K57l77K35m6k27M1L10J25j99O2k20pO8K2j27L20ol43J85l7J10m02
7306c35K47K39l93N01j00j52j87L82l23N6L91l89j09L49O0n36K66m8P7n3K35R1
7328B69l66J02J06j23R6pk19O3K64O2k66K88l27J66l90L21k90K63J04j56j0R9
$$ plain form
7350 49 30 -63 391 131 -151 290 -122 -17 222 -18 -155 140 287 -208 80 10 -302 -18 77 -162 -161 275
7372 275 118 -187 145 174 -264 -96 34 -263 67 -151 -128 -265 74 33 -175 30 20 -77 29 -115 -67 -206
7394 -206 -14 372 -139 -138 50 -106 244 -241 384 47 151 -64 -3 264 -107 27 -10 -192 -129 87 150 -107
7416 -107 22 -253 -265 241 20 -97 -160 -153 -92 90 92 -292 -216 150 -165 -206 -44 148 -210 10 -39 -55 -42 -84
7440 -84 98 60 197 173 -125 -72 127 -153 123 -80 -41 -424 285 191 140 315 309 -231 79 256 -205 -51 205
7463 205 15 185 -69 101 -108 351 87 202 125 89 -146 -111 82 28 399 -174 -21 -189 -83 112 -65
7484 -65 12 216 -10 89 400 -16 -98 185 157 -55 48 -12 -99 -218 255 -235 -50 35 154 -27 48 -285 -168
7507 -168 -72 -115 166 -90 6 -124 -3 -14 67 10 133 -165 -325 30 -59 -478 -2 -256 -391 43 -100 -175 -18
$$ packed form
7350D9j9r3M54k60k82M41m12J05K39k40j37K95J47m95K88p0l12K84R5k39JM36
7372B75j57l05L32K9m38J68J30k97L30k18K3j37L39m1k08K05j0r7J06j44M8j39
7394b06J92L86n11JJ88j56L50m85O25l37J04k15O1K67l71J34l7j82O3K16O3k57
7416a07J29k75j2N06k21j17o3PO1J82Kl84P6L66l15m1J62J92l58K20m9j6J3m2
7440h4J82l8J37k4k98N3J99k80K76k03L9l83P09r4n1J75on40L10J77m61J54K56
7463B05j90J70k54J70k09M59k64J15p7l6k35L5J93n4L71n73J53j68J06J95j77
7484f5P7K04k26R9L11m16q2K83k8k12J03o0q7j19M73m90J85Q5J19j81P5l33J17
7507a68R6m3K81k56R6j30J21j1Q1n7J23k98j60L55q9m19M76k54j35M34j43p5J57
$$ plain form
7530 -18 210 -242 79 183 14 -355 3 100 335 -52 -86 -41 100 222 -27 171 70 -79 -155 263 39 84
7552 84 20 52 -246 -58 -27 -1 -152 0 228 -66 -11 68 -96 -22 180 -192 -121 172 -103 -108 -331 294 -270 119
7576 119 -194 -117 17 -311 -117 28 444 37 356 -88 -234 -113 -83 -24 -476 -95 16 -122 71 182 -196
7597 -196 -132 -213 0 -256 17 -2 133 -27 270 -130 188 510 115 167 79 92 101 123 98 -189 18 65 -220 -99
7621 -99 221 -93 164 -142 -138 -205 55 195 -101 39 95 -37 44 50 -66 202 208 -50 119 17 21 -122 134 58
7645 58 -82 200 -125 183 150 196 -66 192 -88 29 91 47 79 -11 30 -81 30 -89 -17 -16 -106 41 -270 -154
7669 -154 299 -27 -178 -5 228 -152 -80 306 65 -43 276 -195 -111 -36 -197 -156 15 74 -267 68 -110 -297
7691 -297 -108 -135 43 -94 217 -48 -71 -86 288 85 -9 -211 -208 48 -88 240 -63 365 4 -141 338 -154
$$ packed form
7530a8K28m52L21J04j69l69L58R7K35l87l4M5J41J22k49J98j01j49p6M18k24M5
7552H4o4L2k98J88L1K6j51J52K28k94N5P9j64P4K02l72P1K93k75nk23O25n64L89
7576A19l13P7J34l28J94J45M16m07L19m44j46J21L0N9m52L81J11j38J93J11l78
7597a96O4q1K13k56K73j9J35j60K97m00L18L22l95N2q8J3RK2k5k87K07M7k85J21
7621i9L20l14K57l06Mo7K60J40k96J40N6j32Q1Oj16K68Ok58J69j02Mj43K56p6
7645E8j40K82l25L08l3M6k62K58k80J17O2m4L2r0M1j11J11j19P2Jr0J47l11J16
7669a54M53l26j51J73K33l80P2L86k41j08L19m71Q4P5j61M1J71N9l41L35j78j87
7691b97J89k7J78j37L11k65k3j5L74k03r4k02LK56j36L28l03M28l61j45M79m92
$$ plain form
7713 -154 41 -6 -278 -4 -84 254 76 50 -19 -119 -119 288 -178 -55 122 -214 -159 167 462 -136 47 111 -52
7736 -52 -165 46 -99 238 -54 -54 181 233 213 -239 129 276 -57 110 -106 172 35 -2 -196 -218 216 121 110
7759 110 58 -128 139 161 208 -143 -28 284 -146 166 60 109 31 112 256 100 -152 180 -300 -51 104 -103
7781 -103 -165 -58 61 73 -263 -69 -173 -99 -66 139 141 304 -172 -148 115 -56 -224 -55 -136 -183 348 -48 -260
7804 -260 49 3 -192 -45 -6 -172 -80 99 -13 -132 150 252 0 -58 42 -224 83 304 165 -428 141
7825 141 215 114 -74 163 -276 228 256 82 269 56 40 171 34 -244 -61 -62 -16 -319 -32 -8 -351 -72
7847 -72 230 -28 20 62 133 -140 168 -35 379 -40 117 234 46 80 -19 174 22 93 -155 140 1 -33 31
7870 31 -226 -41 -158 -215 -10 -80 302 203 290 -23 91 -52 -40 281 -107 -23 153 -9 -198 -173 117 109 -52
$$ packed form
7713a54J95m7k72K74q0L38j78k6o9j00%M07m66J23J77l36N5L26K95n98J83O4j63
7736e2j13K11j45L37k92%K35N2k0m52L68J47l33J67k16K78j37l7j94k2M34r5j1
7759A10n2j86K67K2M7l51J15L12m30L12j06M9p8Q1J44j56k52L32m80K49J55k07
7781a03o2J07J19J2l36J94j04P4L3K05KJ63m76K4K63j71j68J69q1m7N31l96k12
7804b60L09m6j95J47L9j66R2J79j12j19K82J02k52n8J00k66L07K21j39n93N69
7825A41P4j01j88K37m39N04K8j74J87k13j6J31j37k78J83jM6l03K87K4l43K79
7847g2L02k58M8M2P1k73L08k03M14m19J57J17j88L4r9J93j52P1k48K95j39l4O4
7870C1k57J85j17n7K05p0L82r9Q7l13J14j43J2L21l88Q4J76j62j89K5K90qj61
$$ plain form
7893 -52 -105 -90 31 -38 -125 -34 144 106 -128 -219 30 -189 -8 123 117 159 -6 -215 45 -110 143 -158 174 -174
7917 -174 -140 -18 -93 -34 63 232 71 393 130 196 158 171 -76 -117 110 68 140 137 155 107 103 114 -362 1 -128 131
7943 131 157 -31 -152 -23 139 -91 -79 -274 73 188 114 58 -63 -100 81 159 -332 15 128 -72 135 -5
7965 -5 -133 -52 120 -132 31 89 -1 3 -76 -134 241 179 -37 16 -101 -40 -42 -55 35 -220 70 -6 187 -24 32 88
7991 88 86 -105 -138 165 -117 -10 59 30 -104 179 -169 -52 176 -120 -120 80 -259 122 259 166 -301 59 -463
8014 -463 -208 272 304 4 -310 -18 -95 51 115 318 15 -125 -47 48 -105 61 -60 -169 -147 -278 60 -328
8036 -328 38 -51 122 121 95 71 135 -123 -117 61 -16 -144 -104 1 195 73 91 194 153 197 -50 128 -348 -97
8060 -97 -168 302 178 26 52 -202 155 -207 155 -79 91 -8 -191 99 -294 100 -80 145 74 134 174 -304
$$ packed form
7893e2n3J5J21o9q7R1J78l8k34r1K49k19J81J31oM2j65k09K60j55K53l01L32l48
7917a74L4J22p5N9R7J69j61L22k63O6l8J3k47m1K27m2P2lJ8m8mJ1m76L63j29K59
7943A31K6j88j21J29J62k30J2j95L47J15p4n6j21l7J81P8m91L47J13k00K07j40
7965ej28Q1J72k52J63N8r0Mp9n8L75o2k16N3j17O1kj3R0k55K90p6J93k11N6N6
7991H8kj91l3L03k82J07O9k9j34K83l48J17K28k96%K00l39L81J37r3m67L60n22
8014d63K55M80L2l00l14K92p7J46O4K03l03j40P8R5j53J66j21j09K2j31L38l88
8036c28L66q9J73jk6k4O4k58OJ78p7j28M0J05J94j22J8J03m1M4k47J78m76K51
8060i7p1M70j24j52K6k54L57l62L62k34J70r9j83K90l93L94j80K25p1O0M0m78
$$ plain form
8082 -304 -235 -106 2 -98 -188 -80 -93 62 19 157 -135 -108 -8 69 -10 -132 -1 -98 -45 42 -101 -121 -93 30
8106 30 -22 -138 236 279 -68 9 -68 218 -159 70 3 70 -14 -161 -135 -16 -90 313 234 115 -51 66 -160 238
8130 238 -136 -11 -94 -320 -128 85 -154 -41 151 74 9 -21 139 -184 -57 -175 117 79 53 17 -306 -58
8152 -58 -8 -191 66 -27 -51 130 -8 27 -34 15 8 16 3 -32 -7 71 30 -6 101 33 -344 -150 129 -155 -367 -86
8178 -86 -125 -70 315 24 -155 9 -144 -87 135 287 -141 -197 276
$$ packed form
8082c04O9J29J08j00r0J08j3J55m3J38k92K7J00P7p9j22J31r7N3Q7j43k0K8J23
8106C0n2j16L74M3l47P7p7K86l77K29o7O7q4j47K6J19p4M03p9j19j66J17k26L98
8130B38l74J25q3k26J92K13k39J13J92p7o5l0J60l23J27j18K92l8k6l6l23K48
8152e8N0j83K57r3k4J81j38L5o1M9pQj3l5K5P8m1l6J07o8l77J94K79k84k12K81
8178h6l9N5L85k91j79J64j53N7K22J52m28n6M73
8191B76
$$ Imaginary data points
##PAGE= N=2
##DATA TABLE= (X++(I..I)), XYDATA
$$ plain form
0 0 0 0 0 0 0 0 0 0 0 0 -1 8 -8 8 -8 8 -16 16 -16 24 -24 29 -32 40 -43 49 -57 64 -73 82 -92 103 -115 129
34 129 -144 160 -178 198 -218 242 -269 298 -330 364 -405 448 -500 556 -623 702 -795 908 -1050
53 -1050 1227 -1464 1800 -2304 3144 -4807 9326 -45884 -146653 -51671 -4124 -27748 -18044 -3571
67 -3571 -45326 -47022 -25896 -42511 -50994 -24076 -16724 -9693 -12002 -64206 -98302 -60550 -38153
80 -38153 -44134 -33218 -53631 -103754 -90543 -62277 -91453 -97075 -57750 -63132 -83936 -73561 -90056
93 -90056 -113335 -76853 -45758 -56639 -48429 -47172 -78947 -66234 -26423 -35505 -36610 -1712 -12587
106 -12587 -36013 -9509 -10184 -38736 -4592 29562 -5075 -14000 8930 -18755 -35889 6228 10894
119 10894 -21504 -8664 1409 -28817 -33289 -16819 -21385 -15852 -6561 -23307 -24711 -14272 -33456
$$ packed form
0@%%%%%%%%%%jRj6J6j6J6k4L2l2M0m8N3o1P2q3R2j06J21j37J55j74J95k18K44
34A29k73L04l38L76m16M60n11N67o28O94p69Q53r48J056j179J325j497J703j958
53a050K277k691L264m104N448p951J4133n5210j00769R4982M7547k3624R704J4473
67c571m1755j696K1126j6615q483K6918P352P031k309n2204l4096L7752K2397
80c8153n981J0916k0413n0123J3211K8266k9176n622L9325n382k0804J0375j6495
93i0056k3279L6482L1095j0881Q210J257l1775J2713L9811r082j105L4898j0875
106a2587k3426K6504o75k8552L4144L4154l4637q925K2930k7685j7134M2117M666
119A0894l2398J2840J0073l0226m472J6470m566N533R291j6746j404J0439j9184
$$ plain form
132 -33456 -31063 6919 -1285 -25300 3486 10998 -26888 -13397 22610 5389 415 26648 11055
145 11055 -9109 14613 16099 -2823 14657 20735 -2445 5370 10626 -21508 -16556 13783 -8026
158 -8026 -25792 -3150 -16176 -45709 -23977 -13334 -42376 -35269 -14896 -35534 -42825 -28115 -42528
171 -42528 -47116 -20003 -21742 -38768 -25408 -26721 -42315 -23718 -13909 -34334 -24904 -5112 -24819
184 -24819 -29854 -10705 -26606 -35637 -4084 -6007 -35302 -21405 -13067 -39822 -31290 -7887 -29899
197 -29899 -38359 -14052 -24606 -43323 -28619 -29265 -40946 -18825 -13582 -38624 -30664 -17187 -36903
210 -36903 -30371 -3528 -19422 -31180 -3860 -7673 -30732 -12949 -1195 -16927 -4052 11526
222 11526 -9607 -13750 1289 -8802 -8237 12846 1227 -12966 6633 3052 -20426 -3979 8994
$$ packed form
132c3456K393L7982q204k4015K8786P512l7886J3491L6007j7221m974K6233j5593
145A1055k0164K3722J486j8922J7480O078k3180P815N256l2134M952L0339k1809
158h026j7766K2642j3026k9533K1732J0643k9042P107K0373k0638p291J4710j4413
171d2528m588K7113j739j7026J3360j313j5594J8597R809k0425R430J9792j9707
184b4819n035J9149j5901r031L1553j923k9295J3897Q338k6755Q532K3403k2012
197b9899q460K4307j0554j8717J4704o46j1681K2121N243k5042P960J3477j9716
210c6903O532K6843j5894j1758K7320l813k3059J7783J1754j5732J2875J5578
222A1526k1133m143J5039j0091N65K1083j1619j4193J9599l581k3478J6447J2973
$$ plain form
235 8994 -12827 -4768 15094 -9115 -22406 210 -3525 -14428 6651 4927 -17830 -5479 4199
248 4199 -15675 -9195 8728 -5295 -5019 13268 -3750 -19288 3059 6681 -6014 9100 11310
261 11310 -11850 -3925 11382 -6780 -6831 14187 2198 -7206 10812 37 -20971 -620 11453
274 11453 -5508 -168 6572 -14059 -12112 6524 -6066 -12047 6993 203 -12946 3039 -825
287 -825 -21492 -3125 14178 -5548 -5548 8224 -9790 -14601 10387 5758 -8948 6807 8590 -7349
301 -7349 2719 6854 -10768 1229 19919 2834 -3811 10693 -2156 -10162 14317 12957 -7006
314 -7006 5445 12198 -6461 -732 11061 -4776 -2400 17649 4394 -8228 5513 173 -10096
327 -10096 10711 14705 -8044 -1452 10858 -5748 -5102 11679 433 -4736 13250 5831 -9667
$$ packed form
235H994k1821Q059J9862k4209j3291K2616l735j0903K1079j724k2757J2351R678
248D199j9874O480J7923j4023K76J8287j7018j5538K2347L622j2695J5114K210
261A1310k3160P925J5307j8162n1K1018j1989r404J8018j0775k1008K0351J2073
274A1453j6961N340O740k0631J947J8636j2590n981J9040o790j3149J5985l864
287h25k0667J8367J7303j9726%J3772j8014m811K4988m629j4706J5755J783j5939
301g349J0068M135j7622J1997J8690j7085o645J4504j2849q006K4479j360j9963
314g006J2451O753j8659N729J1793j5837K376K0049j3255j2622J3741n340j0269
327a0096K0807L994k2749O592J2310j6606O46J6781j1246n169J7986p419j5498
$$ plain form
340 -9667 4290 5677 -7085 8046 16574 -5578 -4931 10951 -2309 -5606 13613 5442 -7631
353 -7631 7141 7342 -10232 -301 7792 -5901 1506 12981 -5491 -10165 6385 -2666 -9512 10157
367 10157 6216 -12791 -569 7145 -9875 -3405 9350 -4138 -3444 11986 -860 -10678 6157
380 6157 4318 -4952 11185 12357 -8260 967 13776 -1387 797 17262 5324 -1943 15511
393 15511 9667 -4952 8666 13460 2207 12608 17447 -1969 1759 17679 5752 2351 19458
406 19458 10336 -2270 14062 14357 -2147 8792 18273 4242 8915 18862 2963 -227 17881
419 17881 11618 3321 17427 13589 -1596 11840 17941 1627 7767 21184 7266 5106 17774
432 17774 6679 -630 16020 13803 2553 14061 13973 -3245 5614 16773 1646 2159 16750 3962
$$ packed form
340i667J3957J387j2762J5131Q528k2152O47J5882j3260l297J9219q171j3073
353g631J4772K01j7574R931Q093j3693P407J1475j8472m674J6550r051o846J9669
367A0157l941j9007J2222P714j7020O470J2755j3488O94J5430j2846r818J6835
380F157j839r270J6137J172k0617R227J2809j5163K184J6465j1938p267J7454
393A5511n844j4619J3618M794j1253J0401M839j9416L728J5920j1927l401J7107
406A9458r122j2606J6332K95j6504J0939R481j4031M673R947j5899l190J8108
419A7881o263q297J4106l838j5185J3436O101j6314O140J3417j3918k160J2668
432A7774j1095p309J6650k217j1250J1508q8j7218Q859J1159j5127N13J4591j2788
$$ plain form
446 3962 -4823 10334 5904 -6241 6898 9412 -4471 2544 7756 -8474 -5290 9376 -1756
459 -1756 -4450 8815 -1963 -13262 4440 5325 -10442 151 9411 -5820 -3240 7745 -5559
472 -5559 -7887 9251 5117 -3635 6542 2318 -9266 4844 10674 -4342 935 11105 -2217
485 -2217 -2863 9773 -1709 -7996 9940 8518 -5469 2692 4420 -9022 982 11819 -2261
498 -2261 -3424 9566 695 -5034 8035 3699 -5120 9772 13293 -969 4587 9999 -651 6225
512 6225 19197 6608 1832 16507 9967 431 15026 15191 1068 11721 19915 3852 2604 12806
526 12806 4305 3088 15093 7254 -3048 7679 5245 -4759 5539 7549 -6653 1334 10219
539 10219 -6369 -8334 6787 -671 -6763 8219 4331 -10853 -39 6423 -5241 353 8632
$$ packed form
446C962q785J5157m430j2145J3139K514j3883P015N212j6230L184J4666j1132
459a756k694J3265j0778j1299J7702Q85j5767J0593R260j5231K580J0985j3304
472e559k328J7138m134q752J0177m224j1584J4110N830j5016N277J0170j3322
485b217o46J2636j1482o287J7936j422j3987Q161J728j3442J0004J0837j4080
498b261j163J2990q871n729J3069m336q819J4892L521j4262N556N412j0650O876
512F225J2972j2589m776J4675o540r536J4595J65j4123J0653Q194j6063j248J0202
526A2806q501j217J2005p839j0302J0727k434j0004J0298K010j4202P987Q885
539A0219j6588j965J5121p458o092J4982l888j5184J0814O462j1664N594Q279
$$ plain form
552 8632 -2055 -1646 8766 -1779 -6581 7199 3584 -5043 5611 3578 -11203 -2048 5264 -8644
566 -8644 -6278 4939 -7358 -13191 -1042 -6872 -16722 -3969 -2320 -14968 -9255 -4268 -16231 -12912
580 -12912 -1766 -9364 -10947 -735 -7617 -13149 -263 -2386 -10867 1936 5861 -7809 -1910 7710
594 7710 -5598 -5150 11033 3977 -5046 5750 4615 -6761 2307 6888 -4241 -210 6473 -4335
608 -4335 -4964 2469 -6476 -7574 6482 17 -10923 434 980 -11354 -1930 7385 -5630 -4572
622 -4572 8341 -402 -5614 5448 3586 -2338 9638 10016 -1572 4589 9459 260 5625 13711
636 13711 2017 1283 13037 3093 -5259 6947 5065 -5393 4657 7314 -9198 -6662 2890 -6995
650 -6995 -8151 3209 -4138 -11816 -1146 -3248 -13869 -5549 -744 -8256 -2889 1361 -10379 -7929
$$ packed form
552H632j0687M09J0412j0545m802J3780l615q627J0654k033j4781R155P312j3908
566h644K366J1217j2297n833J2149n830r850J2753J649j2648N713M987j1963L319
580a2912J1146p598j583J0212o882n532J2886k123q481J2803L925j3670N899R620
594G710j3308M48J6183p056r023J0796j135j1376R068M581j1129M031O683j0808
608d335o29P433q945j098J4056o465j0940J1357N46j2334R424R315j3015J058
622d572J2913q743n212J1062j862n924J1976L78j1588O161M870r199N365Q086
636A3711j1694p34J1754r944q352J2206j882j0458J0050K657j6512K536R552r885
650f995j156J1360p347p678J0670k102j0621Q320M805p512N367M250j1740K450
$$ plain form
664 -7929 3531 -4407 -6836 6070 1049 -8198 3025 4171 -9170 -1360 8338 -2569 -3552 4439
678 4439 -5129 -9370 1560 -1353 -8290 -781 -2326 -11311 -4568 -3586 -14835 -7690 2528 -9871
692 -9871 -13044 -1455 -8864 -14858 -319 67 -11783 -3744 2949 -7589 -5033 4060 -3298 -2022
706 -2022 9336 2502 -4015 4619 3325 -2281 8646 8975 -3702 2321 9528 -2028 -2141 7817 -113
721 -113 -3281 8003 2238 -9331 -173 3185 -5635 508 4475 -7190 -5275 5012 -2110 -5497
735 -5497 3958 1313 -2878 7364 4199 -7049 3033 10396 973 4038 11567 578 -90 12826
749 12826 6747 -1918 8906 10473 761 5757 8211 -2373 1081 9681 2123 -451 5209 -2061
763 -2061 -4616 5654 614 -8015 2383 4802 -6158 -1310 4359 -6325 -4111 8344 1243 -5274
$$ packed form
664g929J1460p938k429J2906n021r247J1223J146j3341P810R698j0907r83P991
678D439r568m241J0930k913o937P509j545q985O743R82j1249P145J0218j2399
692i871l173J1589p409n994J4539L86j1850Q039O693j0538K556R093p358J276
706b022J1358o834o517Q634j294n606J0927L29j2677O023P207j1556j13R958p930
721a13l168J1284n765j1569R158L358q820O143L967j1665J915J0287p122l387
735e497R455k645m191J0242l165j1248J0082P363r423L065P529j0989o68J2916
749A2826o079q665J0824J567r712M996K454j0584L454Q600p558k574N660p270
763b061k555J0270n040q629J0398K419j0960M848N669j0684K214J2455p101o517
$$ plain form
777 -5274 4590 2752 -3916 5116 6602 -2560 3840 10421 803 2386 9223 1124 736 12499 6147
792 6147 -2667 6565 6817 -3026 4179 7980 -2990 -160 8701 -1134 -4890 4336 249 -4310 5308
807 5308 3539 -6658 -12 4297 -4007 170 6836 -1623 -738 8370 1165 -3711 6948 5326 -928
822 -928 8268 8953 -2730 2700 10866 1632 1419 10360 3712 -1160 7823 4940 -3549 4721 6750 -1431
838 -1431 2696 5773 -4610 -1982 6379 -1369 -4230 5520 593 -6712 3048 3061 -6277 1207 6860
853 6860 -2497 -1417 5950 -1639 -2504 7492 3227 -2524 6553 4756 -3372 4092 7453 -1794 2790
868 2790 9364 432 -1293 7401 1590 -2708 7318 4696 -3903 3606 5141 -4456 758 7047 -1996
883 -1996 -1705 6812 -44 -4531 4993 2883 -3102 4930 6255 -3099 2019 7032 -1024 1748 9837
$$ packed form
777e274R864j838o668R032J486r162O400O581r618J583O837q099l88J1763o352
792F147q814R232K52r843P205L801j0970K830Q861r835l756R226m087m559R618
807E308j769j0197O646M309q304M177O666q459Q85R108p205m876J0659j622o254
822i28R196O85j1683N430Q166r234k13Q941o648m872Q983k883q489Q270K029q181
838a431M127L077j0383K628Q361p748k861R750m927p305R760J3r338P484N653
853F860r357J080P367p589q65R996m265n751R077j797q128P464L361r247M584
868B790O574q932j725Q694n811m298J0026k622q599P509J535r597N214O289r043
883a996K91Q517o856m487R524k110n985Q032J325r354N118N013q056K772Q089
$$ plain form
898 9837 2001 -233 8680 4315 -1999 7215 7785 -878 5538 9355 -573 1097 8869 1693 82
913 82 8853 3564 -2210 6159 4406 -3763 3553 6486 -2439 932 7028 -1826 -3025 6185 1401 -3213
929 -3213 5284 2541 -4636 2430 4728 -4461 264 6339 -2006 -1865 5738 -1602 -5226 4756 2473
944 2473 -4724 2608 3158 -5764 -939 3783 -4631 -3023 4309 -2646 -5629 2303 -2417 -7781 1289
959 1289 1568 -7219 -1795 2080 -7381 -5069 2518 -4563 -5982 3059 -2342 -7821 -106 -653 -7599 -368
975 -368 2697 -6259 -2860 2708 -5758 -5622 3795 -1278 -5563 2889 766 -7157 64 2510 -4931 -507
991 -507 4773 -3315 -3424 3941 -2586 -5235 4851 2393 -4714 2454 3264 -5171 -131 5213 -2522 -803
1007 -803 6010 -712 -3609 4790 1017 -3563 4661 4285 -3736 1475 4641 -4298 -599 6980 -542
$$ packed form
898I837p836k234Q913m365o314R214N70q663O416L817r928J670P772p176j611
913H2Q771n289n774Q369j753q169P316K933q925L371O096q854j199R210m784m614
929c213Q497k743p177P066K298r189M725O075q345J41P603p340l624R982k283
944B473p197P332N50q922M825M722q414J608P332o955k983P932m720n364R070
959A289K79q787N424L875r461K312P587p081j419R041n401n479P715n47o946P231
975c68L065q956L399N568q466J36R417n073m285Q452k123p923P221K446p441M424
991e07N280q088j09P365o527k649J0086k458p107P168Q10q435N040N344p735J719
1007h03O813o722k897Q399l773m580Q224l76q021N211L166q939L699P579p522
$$ plain form
1022 -542 -2423 5196 985 -4347 3594 3153 -4072 2539 4979 -3580 -723 4732 -2788 -2429 6111 139
1038 139 -4706 3392 1255 -5494 1651 3391 -5121 -966 4236 -4470 -4620 2966 -2270 -5037 2984
1053 2984 -728 -7347 -339 658 -7409 -2546 2132 -5562 -4972 1830 -5029 -7127 1140 -1827 -7145
1068 -7145 125 -566 -8455 -2445 1139 -6768 -3898 3072 -4578 -6523 1536 -2887 -6968 885 554
1083 554 -7315 -1263 1464 -6518 -3789 1575 -4761 -4148 3338 -2852 -7657 277 -1140 -7171 60
1098 60 1507 -6970 -3641 2228 -5248 -5393 2016 -2859 -4972 2601 -759 -7470 -1058 1261 -4360 356
1114 356 3323 -5178 -3531 4077 -1966 -4447 3531 427 -4007 3120 1961 -6514 -1254 3321 -3312
1129 -3312 -901 3955 -4287 -5622 3060 -983 -6257 1102 717 -5907 118 1350 -7262 -3330 3628
$$ packed form
1022e42j881P619m211n332P941m41p225O611K440q559K857N455p520L59Q540n972
1038A39m845Q098k137o749P145J740q512M155N202q706j50P586n236k767Q021
1053B984l712o619P008R97q067M863M678p694N90O802o859k098Q267k967n318
1068g145P270o91p889O010L584p907K870O970p650j945Q059m423m081P853l31
1083E54p869O052K727p982K729N364o336O13P486o190m805P934j417o031P231
1098F0J447q477L329N869p476j45P409m875k113P573l360o711O412K319n621M716
1114C56K967q501J647P608o043k481P978l104m434P127j159q475N260M575o633
1129c312K411M856q242j335Q682m043n274P359l85o624O025J232q612L932O958
$$ plain form
1144 3628 -2512 -3366 2869 -2717 -6179 2791 1430 -5589 855 3220 -4046 -751 3824 -3756 -2821
1159 -2821 5150 568 -2716 3101 18 -4962 2543 3308 -4060 314 3978 -3826 -2226 3763 -3189
1174 -3189 -4360 4323 581 -5499 597 566 -5898 -18 3513 -4143 -2163 3802 -2599 -4035 3702
1189 3702 -775 -4349 3684 2852 -4834 917 3297 -3643 -262 5838 -1812 -2092 4821 -643 -4806
1204 -4806 3042 1397 -4485 1312 2603 -5597 -2117 2390 -4589 -3790 2454 -2659 -5587 1289 -2161
1219 -2161 -7528 -145 933 -6140 -1529 2051 -6166 -4411 2548 -3225 -4878 3179 177 -5773 955
1234 955 808 -5463 111 3827 -3327 -1500 3194 -3265 -4245 3467 -480 -4310 2583 877 -5938 -436
1250 -436 2055 -5109 -1883 3778 -2853 -4335 2003 -2393 -5353 2687 1261 -4127 1448 2858 -4424
$$ packed form
1144C628o140q54O235n586l462Q970j361p019O444K365p266L295M575p580R35
1159b821P971m582l284N817l083m980P505P65p368M374L664p804J600N989o952
1174c189j171Q683l742o080O096l1o464N880L531p656J980N965o401j436P737
1189C702m477l574Q033q32p686N751K380o940L381O100p650k80O913n464m163
1204d806P848j645n882N797J291q200L480M507o979P99O244n113k928O876l450
1219b161n367P383J078p073M611L580q217J755O959n773j653Q057l002n950O728
1234I55j47o271N574L716p154J827M694o459r80P712l947l830O893j706o815N502
1250d36K491p164L226N661o631j482O338m396k960Q040j426n388N575J410p282
$$ plain form
1265 -4424 -380 4584 -1980 -247 6633 795 -1914 5244 2516 -2218 5618 6649 -768 3040 6506
1280 6506 -807 773 7352 1627 86 7597 3078 -2745 3745 3918 -2133 3305 6161 -1382 -569
1295 -569 5340 -1019 -1556 5577 1955 -2107 5021 3434 -3260 2462 5302 -915 2390 7337 105
1310 105 -1109 5726 2022 -975 6002 3805 -1503 4232 4382 -2735 924 5743 -1124 -254 5079 -1559
1326 -1559 -4667 3135 1372 -4285 1377 1347 -5229 -1307 1719 -4967 -3620 3116 -1680 -3891 1613
1341 1613 -2054 -6091 1710 2386 -4466 -19 3065 -4075 -1860 4130 -2141 -3082 4653 1684 -3232
1356 -3232 2126 398 -4827 2047 4357 -3302 -1227 3121 -3066 -2840 3359 -1583 -4464 3441 1436
1371 1436 -4830 -175 914 -4483 521 5171 -2694 -2553 3748 -461 -2317 4570 1661 -2747 4157
$$ packed form
1265d424M044M964o564J733O880n838k709P158k728m734P836J031p417L808L466
1280F506p313J580O579n725j541P511m519n823O490J73o051N438K856p543Q13
1295e69N909o359n37P133l622m062P128j587o694N722K840o217L305M947p232
1310A05j214O835l704k997O977k197n308N735J50p117L659M819o867Q70N333o638
1326a559l108P802j763n657N662l0o576L922L026o686J347O736m796k211N504
1341A613l667m037P801O76o852M447L084p140K215N990o271r41P735k969m916
1356c232N358j728n225O874K310p659K075M348o187K26O199m942k881P905k005
1371A436o266M655J089n397N004M650p865J41O301m209j856O887k909m408O904
$$ plain form
1386 4157 5216 -1960 1122 5013 -163 1755 7490 1003 -1010 5513 2948 -854 4978 3948 -2121
1401 -2121 3319 5818 -1420 -376 5108 -296 -569 5418 929 -3513 3355 3100 -2553 2266 3805
1416 3805 -2316 662 5441 -1471 -1675 5187 784 -1759 5111 2821 -3006 2938 4730 -2074 1163
1431 1163 5399 -1350 -758 5210 23 -2469 4166 1636 -3132 2413 2736 -4121 -248 2968 -3553
1446 -3553 -1512 3747 -2177 -4311 2209 -660 -4947 1409 1241 -5067 71 2797 -3919 -2099 2924
1461 2924 -2216 -2623 3874 -56 -4027 2140 1621 -3639 1751 3196 -3742 -572 4093 -2351 -2461 3479
1477 3479 -889 -3404 3415 960 -4738 870 2314 -3609 -153 3409 -3548 -2532 3700 -888 -2798
1492 -2798 2822 366 -3685 2200 2945 -3335 392 3876 -1411 -312 4657 -775 -2429 4983 2074
$$ packed form
1386D157J059p176L082L891n176J918N735o487k013O523k565l802N832j030o069
1401b121N440K499p238J044N484n404k73N987m489m442O868k55n653M819J539
1416C805o121K978M779o912k04O862m403k543O870k290n827N944J792o804L237
1431A163M236o749N92N968n187k492O635k530m768N545L23o857L873L216o521
1446c553K041N259n924k134O520k869m287O356j68o308N138K726o716J820N023
1461B924n140m07O497l930l971O167n19n260N390J445o938L170M665o444j10N940
1477C479m368k515O819k455n698N608J444n923L456L562o957J016O232m588j910
1492b798N620k456m051N885P45o280L727L484n287J099M969n432j654P412k909
$$ plain form
1507 2074 -2414 3106 2667 -2643 1957 4524 -2365 -465 4837 -227 -1277 4285 131 -3290 3545
1522 3545 3415 -2828 1558 3248 -2513 539 4459 -1544 -1972 4478 615 -2636 3496 1563 -3263
1537 -3263 2285 4028 -2182 519 4164 -1534 -747 4920 189 -2346 3896 1563 -2324 2764 2653
1552 2653 -3233 1228 4629 -1910 -1275 4071 -972 -2133 3835 938 -3430 2007 1958 -3283 967 2872
1568 2872 -3229 -780 4308 -1422 -2675 3205 -253 -3293 2830 1924 -3918 797 3004 -2886 -745
1583 -745 3342 -1912 -1908 3793 -415 -3585 2456 868 -3912 1642 2454 -4098 -552 3340 -2625 -2320
1599 -2320 2952 -1242 -3186 2732 437 -4248 1132 1631 -3451 -35 2823 -3324 -1643 3233 -1927
1614 -1927 -3453 2957 -432 -3461 1678 1287 -4422 347 2635 -3063 -1112 3158 -2007 -2551 3189
$$ packed form
1507B074m488N520m39n310M600K567o889J900N302n064j050N562m154l421O835
1522C545j30o243M386J690n761L052L920o003m28O450l863l251O132j933m826
1537c263N548J743o210K701L645n698P87N667m731k535O242k333l887N088j11
1552B653n886M461L401o539O35N346n043j161N968k897m368N437m9n241M250J905
1568B872o101K449N088n730j253N880l458l040O123r06n842M715K207n890K141
1583g45M087n254MN701m208l170O041j588m780N554Q12o552L546L892n965L05
1599b320N272m194j944N918k295m685N380M99n082L416K858o147J681M876n160
1614a927j526O410l389l029N139l91n709M769K288n698J951M270n165n44N740
$$ plain form
1629 3189 -425 -3507 2572 1492 -3626 957 2435 -2974 -431 3553 -1606 -1534 3750 -537 -2457
1644 -2457 3234 1698 -2974 1936 3115 -2679 273 3902 -1607 -1031 4019 -197 -2037 3097 1581
1659 1581 -2414 2635 3360 -2261 828 3790 -1750 79 4496 -112 -1511 4149 1777 -2472 3016
1674 3016 2368 -2621 1863 4351 -1971 -297 4148 -589 -1344 4370 698 -2345 2973 2032 -2623 1198
1690 1198 2951 -2571 -132 3550 -1683 -1945 3106 -475 -3051 2673 885 -3702 818 1891 -3683
1705 -3683 -1044 2354 -3083 -2243 2503 -1717 -3894 1538 -374 -4207 944 963 -4377 -1098 1553 -3496
1721 -3496 -2159 2056 -2410 -3790 1767 -961 -4808 525 494 -4398 -346 1564 -3946 -2396 2058
1736 2058 -2477 -3317 1703 -1060 -3756 665 -13 -4096 220 1738 -3431 -1319 2270 -2810 -2264 2749
$$ packed form
1629C189l614l082O079j080n118M583J478n409K543L984n159P2N284m287j920
1644b457N691j536m672M910J179n794K952L629n509N76N050m216j840N134j516
1659A581l995N049P25n621L089K962n540J829M417m608j399N660k372m249N488
1674C016o48m989M484K488o322J674M445m737p55N714l672l043N318r41m655L821
1690A198J753n522K439L682n233k62N051l581k576N724j788m587M520J073n574
1705c683K639L398n437Q40M746m220k177N432j912l833N151J9n340L279K651n049
1721c496J337M215m466j380N557k728l847N333l1m892M052J910n510J550M454
1736B058m535q40N020k763k696M421o78m083M316J518n169K112L589n080N46N013
$$ plain form
1752 2749 -944 -3631 2528 1273 -3562 1095 2371 -2115 596 3516 -1912 -1042 3780 -228 -1864
1767 -1864 3116 1224 -2543 2627 2711 -2654 761 3499 -1200 126 4243 -507 -1702 4001 1425
1782 1425 -2230 2668 2598 -1822 2089 3739 -1979 -522 4096 125 -574 3655 551 -2335 3336 2265
1798 2265 -2160 1518 2767 -1889 549 3803 -1763 -1788 3324 504 -2379 2416 913 -3312 1126
1813 1126 2194 -3138 -1013 2382 -2189 -1621 2078 -2213 -3551 2068 275 -3422 660 509 -3881
$$ packed form
1752B749l693k687O159j255m835M657J276m486K711K920n428Q70M822m008j636
1767a864M980j892l767N170Q4n365L415K738m699J326M117m750j195N703k576
1782A425l655M898p0m420L911J650n718J457M618l971o99M229l104k886N671j071
1798B265m425L678J249m656K438L254n566k5N112k820k883M795j503m225M438
1813A126J068n332K125L395m571N68L699m291j338N619j793l697M082j51m390
$$ [...]
8191e
##END NTUPLES=NMR FID
##END=
