##TITLE=1H_EC-3189(41)
 CDCl3, 8 sc, 
 18.10.2019
##JCAMPDX= 6.0         $$ Bruker NMR JCAMP-DX V2.0
##DATA TYPE= NMR FID
##DATA CLASS= NTUPLES
##ORIGIN= UXNMR, Bruker Analytische Messtechnik GmbH
##OWNER= root
$$ XWIN-NMR		Version 3.5
$$ Fri Oct 18 14:30:02 2019 Russian Standard Time (UT+4h)  she@DPX200
##.OBSERVE FREQUENCY= 200.1315
##.OBSERVE NUCLEUS= ^1H
##.DELAY= (6, 6)
##.ACQUISITION MODE= SIMULTANEOUS
##.ACQUISITION SCHEME= undefined
##.AVERAGES= 8
##.DIGITISER RES= 18
##SPECTROMETER/DATA SYSTEM= spect
##.PULSE SEQUENCE= zg30
##.SOLVENT NAME= CDCl3
##.SHIFT REFERENCE= (INTERNAL, CDCl3, 0, 15.7039)
##AUDIT TRAIL= $$ (NUMBER, WHEN, WHO, WHERE, WHAT)
$$ ##TITLE= Audit trail, XWIN-NMR		Version 3.5
$$ ##JCAMPDX= 5.01
$$ ##ORIGIN= Bruker BioSpin GmbH
$$ ##OWNER= she
$$ F:/spectra/data/she/nmr/H-F/1/audita.txt
$$ ##AUDIT TRAIL=  $$ (NUMBER, WHEN, WHO, WHERE, WHAT)
(   1,<2019-10-18 14:29:06.04 +0400>,<she>,<DPX200>,
      <created by zg, POWCHK disabled, PULCHK disabled
       configuration hash MD5:
       00 E9 B6 7A A2 85 ED C7 34 08 36 98 17 FE 4E 26
       data hash MD5: 16K
       51 FC 0F D2 4C F4 DB BF 60 EF 1F 5C 00 8D 0D AC>)
$$ ##END=
$$ 
$$ hash MD5
$$ 26 8C 92 DB 40 4D F7 C2 C4 D5 5E 4E E7 A1 24 E0
##$RELAX= 
##$RELAX= 
##$RELAX= 
##$RELAX= 
##$RELAX= 
##$RELAX= 
$$ Bruker specific parameters
$$ --------------------------
##$DU= <F:/spectra>
##$EXPNO= 1
##$NAME= <H-F>
##$PROCNO= 1
##$TYPE= <nmr>
##$USER= <she>
##$AMP= (0..31)
100 100 100 100 100 100 100 100 100 100 100 100 100 100 100 100 100 100 
100 100 100 100 100 100 100 100 100 100 100 100 100 100 
##$AQSEQ= 0
##$AQ_mod= 1
##$AUNM= <au_zg>
##$AUTOPOS= <>
##$BF1= 200.13
##$BF2= 200.13
##$BF3= 200.13
##$BF4= 200.13
##$BF5= 200.13
##$BF6= 200.13
##$BF7= 200.13
##$BF8= 200.13
##$BYTORDA= 1
##$CFDGTYP= 0
##$CFRGTYP= 5
##$CHEMSTR= <none>
##$CNST= (0..31)
1 1 145 1 1 1 1 1 1 1 1 1 1 1 1 1 1 1 1 1 1 1 1 1 1 1 1 1 1 1 1 1 
##$CPDPRG= <>
##$CPDPRG1= <>
##$CPDPRG2= <>
##$CPDPRG3= <>
##$CPDPRG4= <mlev>
##$CPDPRG5= <mlev>
##$CPDPRG6= <mlev>
##$CPDPRG7= <mlev>
##$CPDPRG8= <mlev>
##$CPDPRGB= <>
##$CPDPRGT= <>
##$D= (0..31)
0 1.2 0 0 0 0 0 0 0 0.06 0 0.03 0 0 0 0 0.0002 0 0 0 0 0 0 0 0 0 0 0 0 
0 0 0 
##$DATE= 1571394545
##$DBL= (0..7)
120 120 120 120 120 120 120 120 
##$DBP= (0..7)
150 150 150 150 150 150 150 150 
##$DBP07= 0
##$DBPNAM0= <>
##$DBPNAM1= <>
##$DBPNAM2= <>
##$DBPNAM3= <>
##$DBPNAM4= <>
##$DBPNAM5= <>
##$DBPNAM6= <>
##$DBPNAM7= <>
##$DBPOAL= (0..7)
0.5 0.5 0.5 0.5 0.5 0.5 0.5 0.5 
##$DBPOFFS= (0..7)
0 0 0 0 0 0 0 0 
##$DE= 6
##$DECBNUC= <off>
##$DECIM= 24
##$DECNUC= <off>
##$DECSTAT= 4
##$DIGMOD= 1
##$DIGTYP= 9
##$DL= (0..7)
0 120 120 120 120 120 120 120 
##$DP= (0..7)
150 150 150 150 150 150 150 150 
##$DP07= 0
##$DPNAME0= <>
##$DPNAME1= <>
##$DPNAME2= <>
##$DPNAME3= <>
##$DPNAME4= <>
##$DPNAME5= <>
##$DPNAME6= <>
##$DPNAME7= <>
##$DPOAL= (0..7)
0.5 0.5 0.5 0.5 0.5 0.5 0.5 0.5 
##$DPOFFS= (0..7)
0 0 0 0 0 0 0 0 
##$DQDMODE= 0
##$DR= 18
##$DS= 0
##$DSLIST= <SSSSSSSSSSSSSSS>
$$ [...]
##$SUBNAM2= <"">
##$SUBNAM3= <"">
##$SUBNAM4= <"">
##$SUBNAM5= <"">
##$SUBNAM6= <"">
##$SUBNAM7= <"">
##$SUBNAM8= <"">
##$SUBNAM9= <"">
##$SW= 24.0689530833862
##$SWIBOX= (0..15)
0 0 2 0 0 0 0 0 0 0 0 0 0 0 0 0 
##$SW_h= 4816.95568400771
##$TD= 16384
##$TD0= 1
##$TE= 0
##$TE2= 300
##$TE3= 300
##$TEG= 300
##$TL= (0..7)
0 120 120 120 120 120 120 120 
##$TP= (0..7)
150 150 150 150 150 150 150 150 
##$TP07= 0
##$TPNAME0= <>
##$TPNAME1= <>
##$TPNAME2= <>
##$TPNAME3= <>
##$TPNAME4= <>
##$TPNAME5= <>
##$TPNAME6= <>
##$TPNAME7= <>
##$TPOAL= (0..7)
0.5 0.5 0.5 0.5 0.5 0.5 0.5 0.5 
##$TPOFFS= (0..7)
0 0 0 0 0 0 0 0 
##$TUNHIN= 0
##$TUNHOUT= 0
##$TUNXOUT= 0
##$USERA1= <user>
##$USERA2= <user>
##$USERA3= <user>
##$USERA4= <user>
##$USERA5= <user>
##$V9= 5
##$VALIST= <valist>
##$VCLIST= <CCCCCCCCCCCCCCC>
##$VD= 0
##$VDLIST= <DDDDDDDDDDDDDDD>
##$VPLIST= <PPPPPPPPPPPPPPP>
##$VTLIST= <TTTTTTTTTTTTTTT>
##$WBST= 1024
##$WBSW= 4
##$XGAIN= (0..3)
0 0 0 0 
##$XL= 0
##$YL= 0
##$YMAX_a= 370994
##$YMIN_a= -377042
##$ZGOPTNS= <>
##$ZL1= 120
##$ZL2= 120
##$ZL3= 120
##$ZL4= 120
##$ABSF1= 10
##$ABSF2= 0
##$ABSG= 5
##$ABSL= 3
##$ALPHA= 0
##$AQORDER= 0
##$ASSFAC= 0
##$ASSFACI= 0
##$ASSFACX= 0
##$ASSWID= 0
##$AUNMP= <proc_1d>
##$AZFE= 0.1
##$AZFW= 0.1
##$BCFW= 1
##$BC_mod= 2
##$BYTORDP= 1
##$COROFFS= 0
##$CY= 11.3945322036743
##$DATMOD= 1
##$DC= 2
##$DFILT= <>
##$DTYPP= 0
##$F1P= 20.1720416913024
##$F2P= 0.152960286110954
##$FCOR= 0.5
##$FTSIZE= 0
##$FT_mod= 4
##$GAMMA= 1
##$GB= 0.15
##$INTBC= 1
##$INTSCL= 1
##$ISEN= 128
##$LB= 0.24
##$LEV0= 0
##$LPBIN= 0
##$MAXI= 10000
##$MC2= 0
##$MEAN= 0
##$ME_mod= 0
##$MI= 1.114404
##$NCOEF= 0
##$NC_proc= 0
##$NLEV= 6
##$NOISF1= 3.799351
##$NOISF2= 2.8
##$NSP= 1
##$NTH_PI= 0
##$NZP= 0
##$OFFSET= 15.70392
##$PC= 1
##$PHC0= -9573.774
##$PHC1= 19.20089
##$PH_mod= 1
##$PKNL= yes
##$PPARMOD= 0
##$PSCAL= 0
##$PSIGN= 0
##$REVERSE= no
##$SF= 200.130013532006
##$SI= 16384
##$SIGF1= 3
##$SIGF2= 2
##$SINO= 400
##$SIOLD= 16384
##$SREGLST= <1H.CDCl3>
##$SSB= 0
##$STSI= 0
##$STSR= 0
##$SW_p= 3612.71676300578
##$SYMM= 0
##$S_DEV= 0
##$TDeff= 0
##$TDoff= 0
##$TI= <>
##$TILT= no
##$TM1= 0
##$TM2= 0
##$TOPLEV= 0
##$USERP1= <user>
##$USERP2= <user>
##$USERP3= <user>
##$USERP4= <user>
##$USERP5= <user>
##$WDW= 1
##$XDIM= 8192
##$YMAX_p= 0
##$YMIN_p= 0
$$ End of Bruker specific parameters
$$ ---------------------------------
##NTUPLES= NMR FID
##VAR_NAME=  TIME,          FID/REAL,        FID/IMAG
##SYMBOL=    X,             R,               I
##VAR_TYPE=  INDEPENDENT,   DEPENDENT,       DEPENDENT
##VAR_FORM=  AFFN,          ASDF,            ASDF
##VAR_DIM=   8192,          8192,            8192
##UNITS=     SECONDS,       ARBITRARY UNITS, ARBITRARY UNITS
##FACTOR=    0.0002076,     1,               1
##FIRST=     0,             0,               0
##LAST=      1.7004516,     0,               0
##MIN=       0,             -377042,         0
##MAX=       1.7004516,     370994,          0
$$ Real data points
##PAGE= N=1
##DATA TABLE= (X++(R..R)), XYDATA
$$ [...]
2634a531l77K716j653j012K082j844j85K514k034j443M252r67m496L504K806n237
$$ -1531 -1908 808 -845 -1857 225 -1619 -1804 710 -1324 -2767 1485 518 -3978 -474 2332 -2905
2650b905l3N528k205m215M694M71m251J645L045j982j423K410n98p08L92p29Q67
$$ -2905 -2938 2590 385 -3830 864 1335 -2916 -1271 1774 -208 -1631 779 181 -527 -135 -864 3
2667CJ613k431r8L634k573l014M232J254n039K301L992m675j389M952j325l864
$$ 3 1616 -815 -913 2721 148 -2866 1366 2620 -2419 -118 3874 -801 -2190 2762 1437 -2427
2683b427L463J389l114Q38J617j928N13J140j623N34J967k596p14L789k157k651
$$ -2427 1036 2425 -689 149 1766 -162 351 1491 -132 402 2369 -227 -941 2848 691 -1960
2699a960M381o0m221K524L017l994j049M288j519k817K651P22k577J024N91j108
$$ -1960 2421 2361 -1860 664 3681 -313 -1362 2926 1407 -1410 1241 1963 -614 410 1001 -107
2715a07O36M15j626J033J596l292Q01L226l415j732M551r18m164L483K190m705
$$ -107 529 944 -682 351 1947 -1345 -544 2682 -733 -2465 2086 1168 -2996 487 2677 -2028
2731b028L74M221k614k503L299M2k883J984M94j568P09N93j686J246P98k909J505
$$ -2028 -1654 2567 -47 -2550 749 791 -2092 -108 386 -1182 -473 120 -1566 -320 478 -2431 -926
2748i26K340l495p02M238j696l122L148J300m208J127L485l008j329L424j188
$$ -926 1414 -2081 -2783 1455 -241 -3363 -215 1085 -3123 -1996 1489 -1519 -2848 576 -612
2763f12j879K091k30j363J689q3j743K067K82k238J155K216l277m22M105k047
$$ -612 -2491 -400 -630 -1993 -304 -387 -2130 -63 219 -2019 -864 1352 -1925 -2347 1758 -289
2779b89k915M090K52m068K170K388l262O3K928j703r08J936p10r53J902p51j608
$$ -289 -3204 886 1138 -2930 -760 1628 -1634 -1571 1357 -346 -1254 682 -28 -981 921 170 -1438
2796a438K500k50k630K250J878l750L33M131l071k248M743p44l877K769K020l456
$$ -1438 1062 812 -1818 432 2310 -1440 -1107 3024 -47 -2295 2448 1704 -2173 596 2616 -840
2812h40L43K720j788q53J773n83j117K257j652r19K356n70j697J878J027l506
$$ -840 -497 2223 435 -418 1355 772 -345 1912 260 -659 1697 1127 -570 1308 2335 -1171
2828a171J425K393k877j085M128j877k834L203O39l006J458J604k799O81J716
$$ -1171 254 2647 -230 -1315 2813 936 -1898 1305 1944 -1062 396 2000 -799 -118 1598
2843A598j625n45K133j690j248L264r61k652K890N68l989J769K850l544o24L660
$$ 1598 -27 -572 1561 -129 -1377 1887 926 -1726 1164 1732 -2257 -488 2362 -1182 -1806 1854
2859A854j606k702L136O75k862J207J284j711j00J062j545O82J164j265l36J923
$$ 1854 248 -2454 682 1357 -1505 -298 986 -725 -825 237 -1308 -626 538 -727 -1063 860
2875H60j575j469L205p40l038L081J256l782P49L439l092j418L661p96k369K059
$$ 860 -715 -2184 1021 281 -2757 324 1580 -2202 -1453 1986 -1106 -2524 1137 341 -2028 31
2891C1R22l023J648J506k256L84K053k404J09K226j475j703L548m80l085K626
$$ 31 953 -2070 -422 1084 -1172 -788 1265 -1139 -1030 1196 -279 -1982 1566 1086 -1999 627
2907F27J373l667J053K691k419n92K640r44j853J879l36j464J708K95k182K174
$$ 627 2000 -1667 -614 2077 -342 -934 1706 762 -1091 788 452 -1012 696 991 -1191 983
2923I83P30k934J467K130k969lL741k289k353L580m1l661K316K509l587j19L355
$$ 983 1713 -1221 246 2376 -593 -596 3145 856 -1497 2083 2042 -1619 697 3206 -381 -500 2855
2940B855k256j382K482m7j850J231M02j520J021O78k012J094J634k421Q2K369
$$ 2855 599 -783 1699 1652 -198 1033 1435 -85 936 1614 -398 696 2330 -91 -9 2360
2956B360j902j461L157o29k685K091J165k558K49K353j887m47K255j712p78K166
$$ 2360 458 -1003 2154 1525 -1160 931 2096 -462 -213 2140 253 -194 2061 349 -429 1737
2972A737r63j612K632n08k810K457J233l720Q45L355l212j132L801j034l442K829
$$ 1737 774 -838 1794 1286 -1524 933 2166 -1554 -709 2646 -566 -1698 2103 1069 -2373 456
2988D56J423l278J079J824j817o20J561o05r17J716p85j099J948o64j716K363
$$ 456 1879 -1399 -320 1504 -313 -933 628 23 -894 822 37 -1062 886 222 -1494 869
3004H69j81k724K026J939l287J32L448k329k024L009J16k436J751J340k612M76
$$ 869 688 -2036 -10 1929 -1358 -1226 2222 -107 -2131 878 994 -1442 309 1649 -963 -487
3020d87J907j863q7J902j933k47K443j515j875L060k8l125K155J906l565K12L372
$$ -487 1420 -443 -530 1372 -561 -808 1635 120 -1755 1305 1277 -1848 307 2213 -1352 -1140 2232
3037B232j771k232K830L94k681J619J024j653N53Q98j442M28J125k106P44K281
$$ 2232 461 -1771 1059 1453 -1228 391 1415 -238 315 1213 -229 199 1324 -782 -38 2243
3053B243j982j082L113j369k698L206O27l542J223K745k725j129L390j273j861
$$ 2243 261 -821 2292 923 -1775 1431 2058 -1484 -261 2484 -241 -1370 2020 747 -1114
3068a114J913M98k161J301P32j532O57J174k304P56K194k490m02K923j285k647
$$ -1114 799 1297 -864 437 1169 -363 294 1468 -836 -80 2114 -376 -778 2145 860 -1787
3084a787L315N37l421J376K454l257Q1K119p41j793K232n73j260J180O8j454J384
$$ -1787 1528 2065 -1356 20 2474 -783 -702 1417 676 -1117 1115 542 -718 462 530 -924 460
3101D60M43k342J543J115k322j67K955j901j916L471k99l176J915J823k813p9
$$ 460 903 -1439 104 1219 -1103 -1270 1685 -216 -2132 1339 1040 -2136 -221 1602 -1211 -1290
3117a290K685j717j467K390o04j234J627l45j049J604k79j910J604J049l207J129
$$ -1290 1395 -322 -1789 601 -3 -1237 390 45 -1004 600 321 -1589 15 1064 -2143 -1014
3133a014K812k420j681L404p88k695K176J391k530N76J954k097k73J557o98m54
$$ -1014 1798 -622 -2303 1101 313 -2382 -206 1185 -1345 -769 1185 -912 -1185 372 -326 -780
3149g80J109p45o00K013j026j597K079N76l177J855K199l094m36L533j252k543
$$ -780 329 -416 -1016 997 -29 -1626 453 1029 -2148 -293 1906 -1188 -1624 1909 657 -1886
3165a886K750Q03l111J495J478k375J63J629j164q4J766j830j25J904j085j324
$$ -1886 864 1667 -1444 51 1529 -846 -683 946 -218 -302 1464 -366 -491 1413 328 -996
3181i96K557k85k742J748K015l178K9L127j780j910K859K29k628J103J577j814
$$ -996 1561 1276 -1466 282 2297 -881 -852 2275 495 -1415 1444 1673 -955 148 1725 -89
3197h9K10J032j149L11O11p92j63J640j767n52K775q56k684K289J106l348J129
$$ -89 121 1153 4 315 926 134 -29 1611 -156 -708 2067 1211 -1473 816 1922 -1426 -297
3214b97K503k536q42L104j161k220K324M00k430J287R42j875K28J665k260O02
$$ -297 2206 -330 -1172 1932 771 -1449 875 1275 -1155 132 1074 -801 -573 1092 -1168 -566
3230e66J960j867q17K660j153k622L166O89l275J207K082k374q85K822j114j709
$$ -566 1394 -473 -1290 1370 217 -2405 761 1450 -1825 -618 1464 -910 -1795 1027 -87 -1796
3246a796J937Q5j517P12O14j152J092J14j676J239J230k530M26K112j844q66K640
$$ -1796 141 226 -1291 -579 35 -1117 -25 89 -1587 -348 882 -1648 -1222 890 -954 -1820 820
3263H20k79l020K451J514l134K17K821j805r12K155q29j229J391N9j376J422M07
$$ 820 541 -2479 -28 1486 -1648 -1431 1390 -415 -1327 828 -1 -1230 161 220 -1156 266 673
3280F73j748J198J107k639Q77K300j935j075K836o39k581K379R14k621P65K117
$$ 673 -1075 123 1230 -1409 -532 1768 -167 -1242 1594 955 -1626 753 1667 -954 -189 1928
3296A928j682o59J784o45j051J755p68q54J876j124n39J504J40k566J468J640
$$ 1928 246 -413 1371 726 -325 1430 662 -192 1684 560 21 1525 1665 -901 567 2207
3312B207k829L04K909j752j983K722M94k793J294J728k557N6K048j902o6J526
$$ 2207 -622 -318 2591 839 -1144 1578 2072 -721 573 2301 -256 -200 1848 -54 -120 1406
3328A406p12q80J904j045j295J734L79k470J789J184k765M52K231j511j703K263
$$ 1406 694 -186 1718 673 -622 1112 1491 -979 810 1994 -771 -319 1912 401 -1302 961
3344I61J7k202J708P74k098M83J463j423l08J569j307m23J444r56j044K009l04
$$ 961 978 -1224 484 1258 -840 -357 1106 -317 -625 944 -363 -786 658 -298 -1342 667 363
3361C63k115J867Q12k519P28J988k062j088K684q79j615J557Q29k285R67J365
$$ 363 -1752 115 927 -1592 -864 1124 -938 -2026 658 -221 -1836 -279 550 -1735 -768 597
3377E97j689J36J435j547R3J358j589k6J917j094j378K307n6k524J368J792k659
$$ 597 -1092 -956 479 -1068 -975 383 -1206 -1232 685 -409 -1787 520 464 -2060 -692 1100 -1559
3394a559K0K598j232j731K351J56k439J483J272k021O44J038j186K67J158j022
$$ -1559 -1539 1059 -173 -1904 447 603 -1836 -353 919 -1102 -458 580 -606 -339 819 -203
3410b03o79K048j163j121K085j81k165J525J409k291K38J964j372p48J513k96
$$ -203 -882 1166 3 -1118 967 786 -1379 146 1555 -736 -498 1466 94 -654 859 563
3426E63j101J245M79j483Q64L50j430J062R42k070M99J935j971q60K492m05k581
$$ 563 -538 707 1186 -297 567 917 -513 549 1491 -579 -80 1855 -116 -976 1516 1111 -1470
3443a470K233J167k953P90K119k031m78J810o62j623J844L35j804J089L72j268
$$ -1470 763 1930 -1023 -233 1886 -145 -623 1187 525 -1098 746 1081 -723 366 738 -530
3459e30Q15P58j404K71Q86j144j06J658j238j143J847n0j949J459Q78j896M13
$$ -530 285 1043 -361 -90 796 -348 -454 1204 -34 -1177 670 620 -1329 130 1008 -888 -475
3476d75J416j485l58J591r13q97J562l65j573J567J84k128J640J276k328m13K411
$$ -475 941 -544 -902 689 -224 -1121 441 76 -1497 70 254 -1874 -234 1042 -1286 -1699 712
3493G12j059j684K389k70k384J615J461k365L6J794p78r83J248k63o77O37n7o22
$$ 712 -347 -2031 358 88 -2296 -681 780 -1585 -1549 245 -533 -1516 -268 -531 -1208 -571 -628 -1250
3511a250Q23m14q44J267M57j861J031J632k408k75K489j533j296K531j68k261
$$ -1250 -427 -841 -1685 -418 39 -1822 -791 841 -1567 -1842 647 -886 -2182 349 181 -2080
3527b080J343R35j872J86J898j023p15J980j124j015J510L8j908J506P89k009
$$ -2080 -737 198 -1674 -1488 410 -613 -1328 652 -472 -1487 23 61 -1847 -341 448 -1561
3543a561O15J982k010l54K216p69j792J632M97j734O93Q07r59M46N50q60N22P73
$$ -1561 -946 1036 -974 -1328 888 119 -1673 -41 456 -1278 -585 222 -737 -291 259 -601 -79 694
3561F94j380M28J275j301p02J955q31j601J936J304l058P45K436k069j143K621
$$ 694 -686 -258 1017 -284 -986 969 138 -1463 473 1777 -1281 -536 1900 -169 -1312 1309
3577A309p38k244K028Q07k088R24J001j429k13J274p98m13J214l85j225J429K09
$$ 1309 571 -1673 355 1162 -926 -2 999 -430 -643 631 -167 -580 634 249 -976 453 662
3594F62j826J434O89j712N66J381j441o26J412k72j065J349j40j312J412m17j083
$$ 662 -1164 270 959 -753 -187 1194 -247 -873 539 267 -798 551 411 -901 511 94 -989
3611i89J076M05j375P10J521k542k70K366j104j736K284L30k714J230J773k158
$$ -989 87 492 -883 -173 1348 -1194 -1464 902 -202 -1938 346 676 -2038 -808 965 -1193
3627a193l77K197j189j222J907k57j297O81R05j303M69O12j098N44P08j187j9
$$ -1193 -1570 627 -562 -1784 123 -134 -1431 -750 155 -1148 -679 -67 -1165 -621 87 -1100 -1119
3644a119J723j519l95J326l01j438J642L50j684O05J335j587j9J776j150q08J717
$$ -1119 604 -915 -1310 16 -285 -1723 -81 269 -1415 -810 525 -1062 -1081 695 -455 -1263 454
3661D54q82r83J746o9j526Q46J436k218L62J852j248j166K387k34k205J429J266
$$ 454 -428 -1411 335 266 -1260 -414 1022 -1196 -834 1018 -230 -1396 991 757 -1448 -19 1247
3678A247j712K0J424j075p9R76p81l69J061p65k23J018m40q66J322L03j820J071
$$ 1247 -465 -445 979 -96 -175 801 20 -349 712 -53 -276 742 302 -564 758 1061 -759 312
3696C12J099j790K9J955j533p58J766k29j490J127P50j437O8J481j559J81J525
$$ 312 1411 -379 -350 1605 72 -686 1080 851 -639 488 1238 -199 -131 1350 -209 -28 1497
3713A497j105r30J544m76j175J487K34j811R66J275j779J32J550j220q73J720
$$ 1497 392 -538 1006 530 -645 842 1076 -735 231 1506 -273 -141 1409 189 -684 1036
3729A036l77j294R26N64j260J44O62j301P29Q58j331M2J525j328q62K215p50j473
$$ 1036 659 -635 291 855 -405 -261 401 -900 -171 687 -644 -602 923 -405 -1267 948 198 -1275
3747a275J439N14j891O14J748j540r39K157p40j571J867J34j722J018M36j267
$$ -1275 164 678 -1213 -599 1149 -391 -1330 827 87 -1484 383 517 -1205 -187 249 -1018
3763a018N83O96j134j67J495q87o84J685o22j241J387L01j756Q73J060j219p3
$$ -1018 -435 261 -873 -1040 455 -432 -1116 569 -53 -1294 93 394 -1362 -489 571 -648 -721
3780g21R59m67n31J255o47o14J162j87q05R98M70j819P29J302j603m59K485j304
$$ -721 238 -229 -760 495 -152 -766 396 209 -596 402 872 -947 -218 1084 -519 -978 1507 203
3798B03j366K320k26j984J354N63j391J84J278q91k89J028o61o80J056J68r11
$$ 203 -1163 1157 931 -1053 301 864 -527 -343 935 44 -245 783 122 -558 498 666 -245
3815b45J017K6j207R13J021j662P2J849j420p49J820m56j218R09Q46j453L63P45
$$ -245 772 798 -409 504 1525 -137 -65 1784 364 -385 1435 979 -239 670 1516 63 426 1171
3833A171j189Q8R92q61l60J030p89o90J651k55j450J042M20j696P12J108j247
$$ 1171 -18 70 1062 201 -159 871 82 -608 1043 788 -662 380 800 -896 -184 924 -323
3850c23o91K108q35j105J135K02j203R57N42j170J81Q79q33j95J149j213k68J296
$$ -323 -1014 1094 259 -846 289 491 -712 245 787 -383 -202 677 -156 -351 798 -415 -683 613
3868F13n90j168J407J81j421M91J497j480k93J433q66j041J194l6r99Q05M88j274
$$ 613 23 -1145 262 443 -978 -487 1010 -470 -763 670 -196 -1237 -43 -79 -1078 -273 215 -1059
3886a059M77P77r49P2J401j170m27J258q16n89J413j50j453J041J193j744O4J490
$$ -1059 -582 195 -754 -682 719 -451 -878 380 -436 -1025 388 238 -1215 -174 1019 -725 -661 829
3904H29j052p29J565o20o38R61k9j156Q13O72j235P51N17j428M73J077j101o01
$$ 829 -223 -952 613 -7 -645 316 287 -869 -56 616 -619 132 649 -779 -306 771 -330 -931
3922i31J706q39r98J548J56j498M04J642j216m85J501j072n77J462j20j100R25
$$ -931 775 -64 -1062 486 642 -856 -452 1190 -26 -511 990 -82 -659 803 683 -417 508
3939E08K25j302J043M36j540Q67R38j382n5J217q95q88J503J61j651J092O33j507
$$ 508 733 -569 474 910 -630 237 1175 -207 -262 955 60 -828 675 836 -815 277 910 -597
3957e97J44J125n54n70J163n88p26J018l16p16J151j30j125P19R32j461l3J398
$$ -597 -453 672 118 -452 711 123 -603 415 99 -617 534 404 -721 -2 930 -531 -564 834
3975H34p20q93J295N5j419R28N87j403M37J065j120l4O62k98q53J001m42o17J457
$$ 834 114 -779 516 571 -848 80 667 -736 -299 766 -354 -388 274 -24 -877 124 -318 -935 522
3994E22n08j160J210L40j312M3J605j462l12J574l99j098J147R3j053O46P44j079
$$ 522 14 -1146 64 404 -908 -865 740 -722 -1034 540 141 -957 190 283 -770 -124 620 -459
4012d59P3J051j055m4J030o45p28J542p03j238J543L63j504O04R86j514L83J141
$$ -459 -386 665 -390 -434 596 -49 -777 765 62 -1176 367 730 -774 -170 816 -698 -315 826
4030H26q91p04J253j42j345M87J066r61L60P60r72O2J027p75k71R81q07m88J595
$$ 826 -65 -769 484 342 -1003 -516 550 -411 -51 709 -263 -201 826 51 -220 761 -46 -534 1061
4049A061l19j549J375N20j422N03J080j120o67J360o7j004Q68J21j134Q96L27
$$ 1061 742 -807 568 1088 -334 169 1249 129 -538 822 755 -249 619 740 -394 502 829
4066H29q49Q1J099j206R7J355j232m83J407m84j183J130L66j402M76J396j268
$$ 829 -20 61 1160 -46 51 1406 174 -309 1098 614 -569 561 927 -475 1 1397 129
4083A29n79J596p31n35R24m15k53N61J28r42M75Q09j449O23P42j504R9J562r56
$$ 129 -450 1146 415 -120 804 389 136 697 825 -117 358 1167 -282 341 1083 -421 -322 1240 284
4102B84p93J279R0j685O38J118j429K63R48o84n66J044l74o21O79J7q91R87J09
$$ 284 -509 770 860 -825 -187 931 -498 -235 713 29 -537 507 133 -488 191 208 -683 304 413
4121D13j208M75Q94j144N8J421j232j022J891j36j493R33P48j530L33J331j285
$$ 413 -795 -320 574 -570 -512 909 -323 -1345 546 410 -1083 -150 598 -932 -599 732 -553
4138e53r7O32j37l18R77o48l56J005o61p49J176N74j774N40J338j434n57J683
$$ -553 -650 -18 -155 -473 504 -144 -500 505 -156 -905 271 845 -929 -389 949 -485 -1042 641
4156F41k21j439J155N13j161L32R38j211L34N63n02j60J092j151l59J615p93r14
$$ 641 420 -1019 136 649 -512 -180 758 -453 -119 444 -58 -218 874 -277 -636 979 186 -728
4174g28J305O91k049Q68J358j706k60J726n73j061J343K5j429Q06M54n20JN35
$$ -728 577 1268 -781 87 1445 -261 -521 1205 632 -429 914 939 -490 316 770 250 251 786
4192G86p61K47Q12p80o63J240q41l47J364M6j807J003J104j405p1J626r34j536
$$ 786 25 272 1084 304 -359 881 40 -307 1057 1103 -704 299 1403 -2 -73 1553 619 -917
4210i17K080l64j313J321K38j329N80O23q52Q9O19j069K57J060r72n32J108j76
$$ -917 1163 799 -514 807 1045 -284 296 919 67 156 775 -294 -37 1023 51 -481 627 451
4228D51j168J193Q5r70J12Q20r92j02J048n23o98R28j49p45Q97k18j022J379l24
$$ 451 -717 476 561 -409 -297 523 -469 -571 477 -46 -744 184 35 -710 187 -31 -1053 326 2
4247Bj020O39J022j331l27J730j028j019J584K57j581M98J313j355l97J435l01
$$ 2 -1018 -379 643 -688 -1015 715 -313 -1332 252 509 -1072 -574 739 -616 -1013 422 121
4264A21q79R09k01m39L58P4l99L65J59q64M44N07r68nJ149q56j16R42p5j175J089
$$ 121 -758 151 -50 -489 -131 -57 -456 -91 68 -796 -352 155 -813 -818 331 -525 -641 301 226 -949 140
4285A40K70q52K28P68r20K67O50q43j70J224n04r89J422Q0j563Q94R67j466k17
$$ 140 410 -442 -214 554 -366 -99 551 -292 -462 762 258 -731 691 771 -792 102 1069 -397 -614
4304f14J888j204j118J764L7j380N89J112j191K10O68m43m36N16j25j00M49n67
$$ -614 1274 70 -1048 716 753 -627 -38 1074 -117 93 761 318 -118 398 273 173 622 55
4322E5p7J131p36j074J624k98j225Q82P93j448N42P26m94j008J152N6j288J193
$$ 55 -22 1109 373 -701 923 625 -600 282 1075 -373 169 895 401 -607 545 601 -687 506
4340E06K41j401P60M59j166N8J253r57n93J398n18j111J175L81j382P26J062j245
$$ 506 747 -654 106 565 -601 -543 710 -247 -840 558 40 -1071 104 485 -897 -171 891 -354
4358c54n68J282k60r42P98J18o66N66K60o37J57L54p41L08O62j076J75P72q42
$$ -354 -922 360 100 -842 -44 74 -592 -26 234 -403 -246 108 -633 -325 337 -739 -564 208 -634
4377f34n29J457n77j028J345M77j904O32J175r97o83J692o60r19J269k64q39R45
$$ -634 -1163 294 -283 -1311 34 511 -1393 -761 414 -583 -1266 426 -234 -1153 116 -148 -987 -42
4395d2L98j219P68N76j177K52Q55p87m35J178j22j006J179L41j346L20Q97r94
$$ -42 356 -863 -95 481 -696 -444 411 -376 -811 367 245 -761 418 759 -587 -267 630 -364
4413c64nR78n31o30R39l08l36Q71l23o65Q72J6r83M88R21j393M4J276l86j036
$$ -364 -369 609 78 -552 387 79 -257 614 291 -374 498 514 -469 19 940 -453 -409 867 481 -555
4433e55J203R6j167J032M42j015J78P90n26k97Q37o43p04R67l67p20R81M65j212
$$ -555 648 744 -423 609 1051 36 214 1004 478 181 1018 375 -329 638 271 -449 532 997 -215
4452b15M13O30j054J27J272j168o28J451l65j080J057K85j188K51Q31r91O45O39
$$ -215 198 828 -226 -99 1173 5 -623 828 463 -617 440 725 -463 -212 619 -372 273 912
4470I12p67j04K32m45k52J074j76o57O72O7j328L95J307j312m69J556n32q05R03
$$ 912 145 41 273 -172 -424 650 474 -183 489 556 -772 -377 930 -382 -851 705 173 -632 271
4489B71K56j112N02M55q04K11J54k35J48O35j026l35J391n94j158J289R5p86L72
$$ 271 527 -585 -83 372 -432 -221 -67 -302 -154 481 -545 -880 511 -83 -1241 48 143 -643 -271
4508b71N09p72p1J233n53j041J405m8j205Q60Q5p88N27Om85N72J88o72pP91n82
$$ -271 238 -534 -605 628 75 -966 439 391 -814 46 131 -657 -130 -124 -609 -37 151 -521 -528 263 -319
4529c19p22J360N8j511J139N84j296J97J195p97k92O40J89j178J024J25n58j5
$$ -319 -1041 319 377 -1134 5 589 -707 -510 685 -112 -404 236 425 -753 271 396 -162 -177
4547a77M70n14L17N18r94L21J115j230m39J653p35q56Q57M21j189N05J199j510
$$ -177 293 -221 96 614 -380 -59 1056 -174 -613 1040 305 -551 306 727 -462 43 1242 -268
4565b68j36J198n42n41P47l31k78N60r8o07O25L22j219N83Q09q22k80J222r08
$$ -268 -404 794 252 -289 458 127 -151 409 311 -296 329 651 -568 15 824 2 -278 944 36
4584C6p38J401J90j666Q91Q21j035l43J028m46k99P76o17k45P17n02k35O80k97
$$ 36 -702 699 889 -777 114 935 -100 -443 585 139 -160 616 -1 -246 471 -31 -266 414 117
4603A17q17Q91L44j352N28Q52r20p82J909l18j356P65O17p93j79Q05o40QN95o07
$$ 117 -700 191 535 -817 -289 563 -357 -1139 770 452 -904 -139 478 -315 -494 311 -329 -321 274 -333
4623c33j40R08m89o19R59l28q19R11L72j354N29J080j287j97R40l66o46P41L27
$$ -333 -473 435 -54 -673 286 -42 -861 50 422 -932 -403 677 -610 -807 133 -233 -879 -138 189
4642A89p97K62O11r95P84m7m22K32M48p65J22Q49q15m40J068L92j841R54R09j074
$$ 189 -608 -346 265 -730 54 7 -415 -183 265 -500 -378 471 -344 -784 284 676 -1165 -211 698 -376
4662c76j91J233n28r26J011O1q18K63Q54r63L97M68p34N80J21o18MQ65q26l97
$$ -376 -567 666 138 -788 223 284 -534 -271 583 -380 17 485 -249 331 452 -166 -162 703 -123 -520
4682e20J328n29r45J247L35j338O7J374q98o80J009k17l69M61P8n91M86J99q37
$$ -520 808 279 -666 581 916 -422 -355 1019 121 -559 450 233 -136 325 403 -188 298 497 -340
4701c40M12K72n64M94N55r51m09J246m16j320J271L87j307M77R10o84m41N74K67
$$ -340 72 344 -220 274 829 -122 -531 715 299 -1021 250 637 -670 -193 717 33 -408 166 433
4720D33r32N36K91n83M46j46m75P33j9r39N27P47j252nJ170q63o85J375k05j264
$$ 433 -499 37 328 -255 191 45 -430 303 284 -655 -128 619 -633 -638 532 -331 -1016 359 154 -1110
4740a110R56P65q93k86Q71k91k20qJ39j70L17l79J89J90k57n77P67K52q76K40
$$ -1110 -154 611 -282 -568 303 12 -208 -216 -77 -247 70 -309 -120 70 -187 -764 3 255 -621 -381
4760c81Q11o18r61J543O4j063N44M76j004J29N24m26j97L19P8J59K99n02l77O47
$$ -381 430 -188 -1149 394 458 -605 -61 415 -589 -460 64 -362 -559 -240 -162 -3 296 -206 -583 64
4780F4J42r36J040J86j294O47J177j027o03J286nj582J192L93q38l1O38m39k59
$$ 64 206 -730 310 496 -798 -151 1026 -1 -604 682 677 -905 287 680 -158 -189 449 10 -249
4799b49N37k41N4L69l88k56Q46l01q11J035J86j299P91O34j115j68J216n99q17
$$ -249 288 47 101 470 82 -174 672 371 -440 595 781 -518 273 907 -208 -376 840 241 -576
4818e76J042R8r20Q22Rl09J35K9j00k09L96k73l8O59n97n48Q96L5j053P37N46
$$ -576 466 564 -356 466 475 166 301 330 230 21 417 144 106 765 168 -380 516 551 -502 235 781
4839G81j181L81O72m48n19M35J82m12M57j20k06j81K50k54M69Q7o53J32M92p69
$$ 781 -400 -19 653 205 -314 121 303 -109 348 228 22 -159 91 -163 306 393 -260 -128 364 -405
4859d05J82Q54m10j062P09P44j306L59J152j039l10N93K99q55N93m2l58K43L7
$$ -405 -223 631 221 -841 -132 612 -694 -335 817 -222 -532 61 360 -495 98 56 -302 -59 -22
4878b2o48N94N2n19M54M54r57L09R16r75m31J202K11j629Q05Q20q65q9Q60p25
$$ -22 -670 -76 -24 -543 -89 365 -592 -283 633 -342 -773 429 640 -989 -184 636 -229 -318 542 -183
4898a83J09J83l3j68K96J3q33J198k78r08O42L75p97L5J113o12o26J291n98q03
$$ -183 -74 109 76 -92 204 217 -616 582 304 -604 38 413 -384 -349 764 152 -474 817 219 -584
4918e84P12N81j005J09P39q96J1L81k30J84L83l62k65N65j92n08R24J63p87k57
$$ -584 128 709 -296 -187 552 -344 -333 48 -182 2 385 23 -242 323 131 -377 547 710 -77 -334
4938c34J158r74j61Q93m01q86P27R15j229K27L63k02k01M34m75M5L81k62k92O13
$$ -334 824 -150 -311 582 181 -705 22 937 -292 -65 298 96 -105 329 -146 -101 280 18 -274 339
4958C39k94l45Q69j61q94N32N05p30j34P13j93o90Q41k92o11O89K35m99J10J19
$$ 339 45 -300 569 408 -486 46 551 -179 -313 400 207 -483 358 66 -545 144 379 -120 -10 109
4978A09j75R3L24o14J23P87r12k64Q98m02k18L20L62j055L26P75o05n86R24L3
$$ 109 -66 27 351 -263 -140 647 -265 -529 369 -33 -251 69 431 -624 -298 477 -128 -714 210 243
4998B43j167N80M12j55l8L01n00L19J60k68J33M64o98q5O26j97j018J246j4r01
$$ 243 -924 -344 68 -87 -125 176 -324 -5 155 -113 20 484 -214 -299 327 130 -888 358 344 -557
5018e57M09Q21r52j71J237p36p79R38J5o40K61L29o62Q11n31j36N43J39p14J56
$$ -557 -148 673 -279 -450 787 51 -728 210 225 -415 -154 175 -487 324 -207 -343 200 339 -375 -219
5038b19N42m62k87O97R8r02O06O40j076J15O47k94j05K51k23q0J00O4k18N82l47
$$ -219 323 -139 -426 271 369 -533 73 713 -363 -248 399 105 0 251 28 -52 48 112 -106 476 129
5059A29n87P15P2p99L44R09j043n04J490k14j015N61O50r08j12Q49p69j55M25
$$ 129 -458 257 329 -470 -126 783 -260 -764 726 512 -503 58 708 -200 -312 537 -232 -387 38
5078C8K32j87L48k54J23L0l49m94P90n8o79L66R67j001l07J207m99r60R24J28
$$ 38 270 83 431 177 300 330 -19 -513 277 219 -460 -94 873 -128 -435 772 273 -687 237 365
5098C65p75K04M23k70n36M90j12J60K08k23O7Q1m30P2O19k93q72P24O29p95o8
$$ 365 -410 -206 217 -53 -589 -99 -211 -51 157 -66 1 82 -348 -276 343 50 -822 -98 531 -264 -332
5119c32Q54m27o39O42K59p93L56O97q89K61L69o25K88j72r7K54K04n49l09J091
$$ -332 522 95 -544 98 357 -436 -80 617 -272 -11 358 -267 21 -151 -248 6 210 -339 -648 443
5139D43n05j038J056M40j050K21Q49n41p61Q22K86q32M39K37l60J07J75j3k16
$$ 443 -62 -1100 -44 396 -654 -433 416 -125 -886 -64 222 -610 -171 66 -294 -187 -12 -25 -241
5158b41J28k2J91M49q90l9Q33l96p71J176O5j290O95O30n99m73Q69K37j115M87
$$ -241 -113 -135 56 505 -385 -424 409 13 -758 418 483 -807 -112 518 -81 -554 315 552 -563 -76
5178g6N91n05J03k61J92j68J33J27K22J39q85L50Q16j028k72J040J26j216N69
$$ -76 515 10 113 -148 44 -124 9 136 358 497 -388 -38 778 -250 -522 518 644 -572 -3
5197cQ08p63l55P82J1o26L70J92p27N25j14J15j40J90l82K90q6m63R9J113r72
$$ -3 805 42 -313 469 480 -146 224 416 -311 214 100 215 75 265 -117 173 87 -376 -277 836 -136
5218a36l67J091l40q17R07M20j149J15P20k64o19K88M91m49J92LnK1n47L14J62
$$ -136 -503 588 248 -569 338 758 -391 -276 444 180 -439 -151 340 -109 83 86 81 102 -445 -131 31
5239C1K18n59L17K58q58J2J084m70q36P33N63j129M6R86l33m98O66k72l28L06
$$ 31 249 -310 7 265 -593 -581 503 33 -803 -70 493 -636 -590 396 63 -435 231 -41 -369 -63
5259f3k28J59N51p30k32N16L9o86M20N42o24J06O55n80l81P35K30p33j8P01m01
$$ -63 -291 -132 419 -311 -543 -27 12 -674 -254 288 -336 -230 425 -155 -536 199 429 -304 -322 379 -22
5280b2n00L04K96K09m85q6M83j37n74K62P30m95n05P70K38q94K6J041m51p08P04
$$ -22 -522 -218 78 287 -198 -284 199 62 -512 -250 480 -15 -520 250 488 -406 -380 661 210 -498 206
5301B06M06j263P47K77n81J84K77j27k00L64n37J04N67k28m15O26l02m48N61P00
$$ 206 612 -651 96 373 -208 -24 253 126 -74 290 -247 -143 424 196 -219 407 105 -343 218 918
5321I18j428L78Q58j060L19L35J55p57M17L12m56j93L00NJ61p6l83M49k7l90j60
$$ 918 -510 -132 726 -334 -15 320 475 -282 135 447 -9 -202 98 103 264 188 -195 254 227 -163 -323
5342c23Q86o70n46R43M0p59K89O96r31k16J081k40m86L53J44k46j78L37j71j92
$$ -323 563 -107 -653 290 330 -429 -140 556 -375 -591 490 250 -236 117 261 15 -163 174 3 -189
5362a89L9j38K72m7m47L48O09n83j28Q43n27q66R81K31o17m1O07l68k74L22J82
$$ -189 -150 -288 -16 -63 -510 -162 447 -136 -264 579 52 -814 167 398 -219 -260 347 -21 -295 27 209
5383B09k18J15n90J14M19j02j42L70k0p82N26M53p42k10J162n81m28N17M23j093
$$ 209 -9 106 -484 -370 49 -53 -195 175 155 -627 -101 352 -390 -600 562 -19 -447 70 493 -600
5403f00J32R14m43l56O07m26j20M96k62J78K85o15R3K15K98o91L30K35p26K22
$$ -600 -468 446 3 -353 254 -172 -292 204 -58 120 405 -210 -117 98 396 -295 35 270 -456 -234
5423b34Q92n30q3O9K65o86L0R31o65M3N00n13j47L60k17K72K38m19l06N30j5p69
$$ -234 658 128 45 114 379 -307 -277 654 -11 32 532 19 -128 232 15 287 525 106 -200 330 315 -454
5445d54Q61rn55K99J16k8l99N00ol91K83K12m98J63J80n43L74N3k86J92K64n00
$$ -454 407 398 -157 142 258 230 -169 331 325 -66 217 429 -69 94 274 -269 105 158 -128 64 328 -172
5467a72j11O26P0p47M44J58q73O30L91l58n50R04m57p7K54K1m45L53L11m74J61
$$ -172 -283 343 413 -334 110 268 -605 25 416 58 -492 412 -45 -122 132 153 -292 61 372 -102 59
5488E9l23L37j16J73l30J60K77n86L5N10q3p43O51L39p94l1P33m25k88M07mj36
$$ 59 -264 73 -43 130 -200 -40 237 -349 -314 196 113 -630 21 360 -434 -465 268 -157 -445 -38 -42 -178
5510a78P6N0m86M93K96o64K79M53o41j37M69K09n88O82k98m48O08K23o48l3M74
$$ -178 -102 -52 -538 -45 251 -413 -134 319 -322 -459 10 219 -369 313 15 -433 175 398 -250 -283 191
5531A91m29m5L16L0j40q7K91m7j43j39n8J80L85k03l7K91p28J83N74l01l19P73
$$ 191 -238 -283 33 63 -77 -164 127 80 -63 -202 -260 -80 305 102 65 356 -372 -189 385 84 -235 538
5553E38l96n86K28O26k97l42N57j82l00M72k86k28M22M4l14L20J05r31N30L82
$$ 538 142 -444 -216 410 113 -229 328 146 -154 318 32 -196 226 270 -44 276 381 -550 -20 362
5573C62m62k0N61k76n02O34K80p13K18L68o09K90P9k33J97Q2k79J69K69m68j6
$$ 362 -100 -120 441 165 -337 297 577 -136 82 450 -159 131 210 -23 174 256 -23 146 415 -53 -69
5594f9K74M5n56M95N08r09J13N85n83k71P70k75m06L44L54p97K97K09q4l93P17
$$ -69 205 250 -306 189 697 -212 -99 486 -97 -368 402 127 -279 65 419 -378 -81 128 44 -349 368
5615C68m72j35M96k12l91L94j42j31L13j85j06j6M68n56M2O64l70n92L19L07l37
$$ 368 -104 -239 257 45 -346 48 -94 -225 88 -97 -203 -219 249 -307 -265 399 29 -563 -244 63 -274
5636b74K73N9n66M75L20l17r3P3p7l81R72l99n59P61l66k83K41L86l23l55Q09
$$ -274 -1 58 -508 -33 287 -30 -123 -50 -127 -508 464 65 -494 267 -99 -382 -141 245 -78 -433 376
5657C76j85o79O40J83n57K53M02n88Q2J78k56K0N43m82K2L27o12q1P32Qj031O75
$$ 376 191 -488 152 335 -222 31 433 -155 -73 105 -151 -131 412 -70 -48 279 -333 -414 318 326 -705 -30
5679c0L13n56j11Q38m97j38K46J84n26M38k00O9L03l34j07M36l31k40N69j30n81
$$ -30 283 -273 -384 454 -43 -181 65 249 -277 161 -39 30 333 -1 -108 328 -3 -243 326 196 -385
5700c85M31O97m89o88O93L48p36K22K61n61j06N12l5k85M49j39k73K78k94j85
$$ -385 46 743 254 -434 259 607 -129 93 354 -207 -313 199 164 -121 328 189 -84 194 -100 -285
5720b85L13J56l54Q4L99m31j23J030r61k61O18K41q02J03P16o82j74M11L8k36
$$ -285 28 184 -170 -86 313 -118 -241 789 -172 -433 185 426 -376 -273 443 -239 -413 -2 36 -200
5740b00J80L1l81J86R9k47M34k26m41O62Q9p59N27L49n67l10Q69j29o92O41K69
$$ -200 -20 11 -370 -184 -85 -332 102 -124 -565 97 186 -573 -46 303 -264 -574 295 166 -526 115 384
5761C84o18j21N88n2o13M46om4K05l47j44P73o06%L01Ll23J41L40o19J98L61p3
$$ 384 -234 -355 233 181 -432 14 8 -36 169 -178 -322 451 -155 -155 146 149 -174 -33 307 -312 -114 247 174
5784A74n60L56K31k74j91M16k14O6L51m64J91J09l86K33M07m80m04Q19k29m15
$$ 174 -386 -30 201 -73 -264 152 -62 4 355 -109 82 191 -195 38 445 -35 -439 380 151 -264
5804b64L69N87j080K95P30q19J0K85J13l56kL13J11k37m0J36j25K37l43K37K29
$$ -264 105 692 -388 -93 637 -182 -172 113 226 -130 -132 181 292 55 15 151 26 263 -80 157 386
5825C86n42QL63p3m71M29N23q04l1O76k18n20O03k42q5M8J94p47N87J2l07M59
$$ 386 -156 -148 215 142 -329 100 623 -181 -212 464 246 -274 329 87 2 50 244 -503 84 96 -211 248
5847B48k54k48J58N50r26P25p5kp33Q82L8p04K42L55j18n81J78K34k78K88m3r4
$$ 248 -6 -254 -96 454 -472 253 178 176 -557 325 363 -341 -99 256 138 -443 -265 -31 -309 -21 -64 -158
5869a58K15l46O2M56l49n39N59l2k92K30L95j85o20R76k48n29M29K26n88m8N65
$$ -158 57 -289 -227 229 -120 -659 -100 -132 -424 -194 201 16 -604 372 124 -405 24 250 -338 -386 179
5890A79j90p3J61n7m49M33j44k5L20k15l80O56j1m47L36J62n43J27M87p2m15L76
$$ 179 -11 -84 77 20 -429 4 -140 -165 155 -60 -440 216 205 -242 94 256 -287 -160 327 255 -160 216
5912B16J17l14J09L0l6k51n7J89K79k06j10L12j62q9l69P05M3m38j16O11n94K16
$$ 216 333 19 128 158 122 -129 -186 3 282 76 -34 278 116 27 -342 363 406 -32 -148 463 -131 85
5934H5L61n80j13N37k22j29J22J50r4J46K33m26K85j01j60M2L36k66n54O16n2
$$ 85 446 -134 -247 290 68 -61 61 211 117 263 496 70 355 254 94 136 472 206 -348 268 216
5955B16m59J90M90n20q9K35k19j24N15n6p00L85L69k28J3Q4k72M45j33l40K43
$$ 216 -243 -53 437 -83 -172 63 -156 -280 235 179 -521 -136 233 5 18 102 -170 275 142 -198 45
5976D5L87n66j19N33q6l96L38K23m35j78O46l67k65L92m00p2K22O5n9K14r3j94
$$ 45 432 -134 -253 280 194 -202 136 359 -76 -254 392 25 -240 152 -248 -320 -98 -33 -92 122 29 -165
5998a65J12L7k72K71K70p22L82Q9K8l87P1K75j79J26J72m28J40M26q32j3L30Q8
$$ -165 -53 -16 -288 -17 253 -469 -87 2 30 -357 -286 -11 -190 -64 108 -320 -180 246 -586 -599 -269 -181
6020a81j19N27m82L71j22J83j67p1L89o84M0M28j23m11O18K9l86J59J87k86n7
$$ -181 -300 227 -255 116 -6 177 10 -61 328 -356 -316 112 -11 -422 196 225 -161 -2 185 -101 -158
6041a58N80m72J9K06k77J6K41k11oM15k61k45K55k4j91R1L81m77J17K86q0m19
$$ -158 422 -50 -31 175 -102 -86 155 -56 -62 353 92 -153 102 78 -113 -22 359 -118 -1 285 205 -214
6063b14M00R4n28N11k48j40K65P3p8k44K93k51L1J87j45j6Q4J22k21J59K09n08
$$ -214 186 280 -248 263 15 -125 140 213 135 -109 184 -67 -36 151 6 -10 74 196 -25 134 343 -165
6085a65M1L21p3j17j49K97l47K82J57l16Q7J70j84j71K84l06O7L76j36l54N58
$$ -165 -124 197 124 7 -142 155 -192 90 247 -69 18 188 4 -167 117 -189 -122 254 118 -236 322
6106C22k44m56K28J77R2k46N06o26k86P12q4j43J38J5n71K75K96l47J40L11k34
$$ 322 78 -378 -150 27 119 -127 379 -247 -533 179 95 -48 90 105 -466 -191 105 -242 -102 209 -25
6127b5j14K09J13o29N65K3j43M8L65o66k7O59p69K93K69j70j17J09K4p4K41N6
$$ -25 -139 70 183 -446 119 142 -1 47 412 -254 -281 378 -391 -98 171 1 -116 -7 17 -57 184 240
6149B40m49L52j0p4k26K69k71n0O98n43k70M80L5k07j1L83k45m09M29Q4m19M25
$$ 240 -209 143 133 59 -167 102 -169 -219 479 -64 -334 146 181 -26 -37 346 101 -308 121 205 -214 211
6171B11j32l61O49m68m3M96k38k37J73J75J53l01K89j2n08L90l5l82L60L8l47
$$ 211 79 -282 367 -101 -144 352 114 -123 50 225 378 77 366 354 -154 236 201 -181 179 217 -130
6192a30J19K30n17K80L51j37n2m2j23Q3j55R3J20P4l0l14O7N46n51J85RK8k96
$$ -130 -11 219 -298 -18 333 196 144 102 -21 62 -93 0 120 194 164 -150 -83 463 -88 97 106 134 -162
6215a62L03j7n47M43lk33J58M78j95l22J73j80j27J09J88O8J3J51n87J18pk18
$$ -162 141 124 -423 20 17 -216 -58 420 225 -97 76 -104 -231 -122 66 134 147 298 -289 -171 -178 -396
6237c96M97J9q5l64K51L20j33l02L16m02M52k17l52J47K62j48J38K28n58J97L13
$$ -396 101 120 35 -329 -78 242 109 -193 123 -279 173 -44 -396 -249 13 -135 3 231 -327 -130 183
6258A83l29l3K09K47n97J54M31l97j62M47R0m70M15Q6l44j91K31l51L80j88J17
$$ 183 -146 -179 30 277 -320 -166 265 -132 -294 153 243 -227 188 274 -70 -261 -30 -381 -1 -189 -72
6279g2k15N09j97l33N19k27n57P60R1m55J95K24k63j50N57m26rK23j53j22O2K27
$$ -72 -287 222 25 -308 211 -16 -573 187 278 -177 18 242 -21 -171 386 -40 -49 174 21 -101 -39 188
6301A88m28M43k38j67J47L74m04r3M41k84j27N02k07k29L20Q8l90J90o7k4LJ11
$$ 188 -240 203 -35 -202 -55 319 -85 -178 263 -21 -148 354 147 -82 238 326 -64 126 59 35 38 149
6323A49R8k96J95P9M3k71K68m73N53P8l67m4J58k64j09N67k40m18M63q1R3m74
$$ 149 247 -49 146 225 268 -3 265 -208 345 423 56 12 170 -94 -203 364 124 -294 169 88 181 -293
6345b93N02O8l15J77j86o3lK01l19O8j01J51M10j4n85M1J06J44n72O97j65l18
$$ -293 209 277 -38 139 -47 -110 -113 88 -231 -163 -264 -113 297 283 -302 -261 -155 -11 -583 114 -51 -369
6367c69N43j44m65N64j81r4j05L22m41M06o1k78r1M89j55m53O06Oo04N53L21r63
$$ -369 174 30 -435 129 -52 -146 -251 71 -370 36 -25 -303 -394 95 -60 -513 93 99 -505 48 369 -594
6389e94K23L26J30l97L47R0n14M59m1j92k4J02nn2K08r4K30l4k61k69Q84l32m41
$$ -594 -371 -45 85 -312 35 125 -389 70 29 -163 -187 -85 -90 -142 66 -28 202 168 -93 -362 522 190 -251
6412b51M49pl89P4M63m91O3L19pl50%L50l99PK58k65L11lj29N7K44k17k48L75
$$ -251 198 191 -198 -124 339 -152 -89 230 223 -127 -127 223 -176 -169 89 -176 135 132 3 60 304 87 -161 214
6436B14k20l61L23K19n90M61J42l29k43O38o7k79O17k49k20p0K01j95j32R5k94
$$ 214 -6 -367 -44 175 -415 46 188 -141 -384 254 187 -92 525 276 56 -14 187 -8 -140 -45 -339
6457c39L93K21m83K65K87n93j07M35K34k73O3K84k76j59J00K1k7K21k49k84J04
$$ -339 54 275 -208 57 344 -249 -356 79 313 40 103 387 111 -48 52 73 46 267 18 -266 -162
6478a62P4j25L16l9Q9j52r3j75K16L63m27k93M88J3m50L03L2J5n2L90m94QJ49
$$ -162 -88 -213 103 64 153 1 -92 -267 -51 312 -115 -408 80 93 -357 -54 -22 -7 -59 331 -163 -155 -6
6501frm7J37j39l09L36L26l97J94j19J4m7J03l85L36L33j80j48M7J45j86j16J27
$$ -6 -15 -62 75 -64 -373 -37 289 -108 86 -33 -19 -66 37 -348 -12 321 141 -7 40 185 -1 -117 10
6524A0m00L23M5o3J89l17J87K35q1l21R3L88L67q69K32J60k54j26O79m61k27M57
$$ 10 -390 -67 -22 -85 104 -213 -26 209 128 -193 -100 288 655 -214 18 178 -76 -202 477 16 -211 246
6546B46k4k73J76Q4j62j52N11k19L8K65n09l9L13j71k19N75l06l98M53j7n7K02
$$ 246 222 -51 125 209 47 -105 406 187 225 490 -19 -58 255 84 -135 440 134 -264 189 172 115 317
6568C17O1l68K0K6J07q8J08j12m40M86j4k28K01P8m7o0j1j61J07O4J29k79L87
$$ 317 378 10 30 56 163 75 183 71 -369 117 103 -125 76 154 107 47 36 -125 -18 46 175 -104 283
6591B83ln94M54L8l75P2M04m18K15m4L30o79K04N1l14M47l2n0O8N4k37%N45n63
$$ 283 280 -314 140 178 -197 -125 279 -139 76 32 362 -317 -113 -62 -376 71 39 -11 57 111 -126 -126 419 -144
6615a44J62L87l47j50l6Q7N2R4J61k48Q2M4K22k82p6J59m94k3P31n33l3L09m98
$$ -144 18 405 58 -92 -128 -41 11 105 266 18 100 144 366 84 8 167 -327 -350 381 -152 -185 124 -374
6638c74K57J69r6k06K62j4j78l5J28P9K15k79o6k8K38q6j91L74k60P0J30J83j21
$$ -374 -117 52 -44 -250 12 -2 -180 -215 -87 -8 207 -72 -138 -166 72 -14 -205 169 -91 -21 109 292 171
6661A71k9J62m67M57j38l05K6M15l54j9o4K61n9j91J13J61Q6j03pk19L72J27m32
$$ 171 142 304 -163 294 156 -149 -123 292 -62 -81 -145 116 57 -134 -21 140 226 123 116 -103 269 396 -36
6684c6M2K36k21J4r9K65j46K27l38n1M52m95N9M76k94rK18j09l50J47J57k39L4
$$ -36 6 242 21 35 -64 201 55 282 -56 -107 345 -150 -91 385 91 82 300 191 -159 -12 145 -94 -60
6707f0J01J51k26R6k18M23k32r7Q1q5K09m12J18O46o54j47M59j03j30J61j87p6
$$ -60 41 192 -34 62 -156 267 35 -62 19 -66 143 -269 -151 495 -159 -306 153 50 -80 81 -106 -182
6729a82J87n2j48M7L78m73q4M72r8j60K32k51j47J21N08m80o0L35k84O6J37J6
$$ -182 5 -47 -195 -148 230 -243 -327 145 47 -113 119 -132 -279 -158 350 -130 -190 145 -139 -73 64 80
6751H0j38J0L1k1J29k3l42K53K64m97K05K69l55Q8Rn6M1J21J11m75J94Q6k01O0
$$ 80 -58 -48 -17 -38 91 68 -274 -21 243 -254 -49 220 -135 -47 -38 -94 -53 68 179 -296 -102 -16 -217 -157
6775a57M44m07P4K10k32l53N32r8k61L23J42k18j11K97k67j18N41n26l31P61j99
$$ -157 287 -120 -46 164 -68 -421 111 13 -248 75 217 -1 -112 185 -82 -200 341 -185 -516 245 46
6796D6K26OJ4k62j34L59l95K30J63k70J0R0j39m1M78m47P8K69k32j95Q3L97n21
$$ 46 272 278 292 30 -104 255 -140 90 253 -17 -7 83 -56 -97 381 -66 12 281 49 -146 -63 334 -187
6819a87n2K17o2L2k0n2O4O2M09l58p7L28q6k19K50n05J56K62r5o1P4M7k14Q4J00
$$ -187 -239 -22 -84 -52 -72 -124 -60 2 411 53 -24 304 218 -1 249 -256 -100 162 67 6 80 127 -87 -3 97
6844I7J15j95K47k54l86N88k35l5J38j19k79K13J43l47K82kj84P3K26k18J46J82
$$ 97 212 17 264 10 -376 212 -23 -58 80 -39 -318 -105 38 -309 -27 -29 -213 -140 86 -132 14 196
6866A96n7m45L06J1k50Q9M45n29M1J58j75J19%L96n43P3Jo6K77L4k18J63P8k68
$$ 196 139 -306 0 11 -239 -150 295 -234 -193 -35 -210 -91 -91 305 -238 -165 -164 -230 47 81 -137 26 104 -164
6890a64k21L98Q0j64K81o1k19k0Oj3q5O81p51l0N65j13j91n7Rp7J84J43l03J57
$$ -164 -385 13 93 -71 210 149 -70 -90 -84 -97 -182 499 -252 -282 283 170 -21 -78 -69 -146 38 181 -122 35
6914C5J63k56K71j59l12N15l98j8J16J19K3l16K20K64l21L6J69o5L8o5K02l76
$$ 35 198 -58 213 54 -258 257 -141 -159 -43 76 99 -217 3 267 -54 -18 151 86 124 59 261 -115
6936a15N35j54k05m7M61n23K32K93m20J10K6P2m24K97P2l3k8K85l89K66k86J19
$$ -115 420 266 61 14 475 -48 184 477 57 167 193 265 -159 138 210 177 149 434 45 311 25 144
6958A44j53M00m60J96O2k89J08k52L43k77K6N67l47o9J29l61J98M15k23k78J58
$$ 144 -9 391 -69 127 189 -100 8 -244 99 -178 -152 415 68 -1 128 -233 -35 380 157 -121 37
6979C7L08p24J18K24j56K66q8k08K24L7j99j74L28j94j77K63m7K79j13J5j91j47
$$ 37 345 -379 -261 -37 -193 73 -15 -223 1 38 -161 -335 -7 -201 -378 -115 -162 117 4 19 -172 -319
7001c19M96k08j09l7q5M2P8L3j36L51Q4m3P6k3j90jJ16Q2m20J67m4j50J09Q4J57
$$ -319 177 -31 -140 -177 -262 -220 -142 -109 -245 106 190 147 223 200 10 9 125 207 -213 -46 -90 -240 -131 -47 110
7026A10O8K80o43p3N71k72r6J68k40O6j3J35j19l43M84q5j0L66l04j43L28K00
$$ 110 178 458 -185 -258 313 41 -55 113 -127 -61 -74 61 -58 -401 83 -2 -12 354 50 -93 235 435
7048D35m31K2P0j29k89L31j16j02J77M19Pj21j11k19K23j62J4L67k44m7O0K5k93
$$ 435 4 26 96 -33 -322 9 -107 -209 -32 387 394 273 162 -57 166 4 18 385 141 94 154 179 -114
7071a14L18J2j35m4Q6J02m18j23M05p5j90K00k54j6N60j96l21J69K79j48J84p9
$$ -114 204 216 81 37 123 225 -193 -316 89 14 -176 24 -230 -246 314 118 -203 -34 245 97 281 202
7093B02k70j29M64j50j46K19k28l70O19R2l45J08J76l80K1J09J23k90M40j80m85
$$ 202 -68 -197 267 117 -29 190 -38 -408 211 303 -42 66 242 -138 -117 -8 115 -175 265 85 -400
7114d00M59q2J05k4M4j46j2O7o2j53O7L00l94K51R0k51J74K60o14J93M16k94k47
$$ -400 59 -23 82 58 102 -44 -56 11 -51 -204 -137 163 -231 20 110 -141 33 293 -321 -128 288 -6 -253
7137b53j7J06J50J23l52L40no3m4O0J79n11K93J17k17j57L07l20K10J81k59M4
$$ -253 -270 -164 -14 109 -243 97 92 29 -15 45 224 -287 6 123 -94 -251 56 -264 -54 127 -132 -88
7159h8K22j99K72k42J25O2j67J34n0K2J30j52l58L50K92m84J05J23j29J05J04
$$ -88 134 -65 207 -35 90 152 -15 119 69 91 221 69 -289 61 353 -131 -26 97 -32 73 177
7180A77m9j24K50k03k56J00J3rJ72k1k44O85n41n5J53R4j28j00K85Km08p2L74
$$ 177 128 4 254 51 -205 -105 -92 -101 71 50 -194 491 -50 -105 48 142 14 -86 199 201 -207 -279 95
7203I5mk60M70j38p0J91l40k18J51j3l6L07J57m32K10K32m23K65jm68l5N28J09
$$ 95 91 -169 301 163 93 284 -56 -274 -123 -136 -172 135 292 -140 70 302 -121 144 143 -325 -360 168 277
7226B77m45K30J28n41K83J78j31m8L11l34K27q3L1l45L47P8l45M4K04n93M72J38
$$ 277 -168 62 190 -351 -68 110 -21 -69 242 -92 135 52 83 -262 85 163 -182 -138 66 -527 -55 83
7248H3j25K7L40m77N8j60k7J34l48O71j66p8L10n19O4K11Ml14M03j31q9J8r4R3
$$ 83 -42 -15 325 -152 -94 -254 -281 -147 -495 176 10 -68 242 -277 -213 -2 2 -312 91 -40 -129 -111 -205 -112
7272a12j2J03k58j26M62J33l08J19j22M5R0J74l35J23J65l24k42Q15j99k59K76
$$ -112 -124 -21 -279 -405 57 190 -118 1 -121 -76 14 188 -147 -24 141 -183 -425 390 191 -68 208
7293B08q2q5L26k86j61J32J78k88O5K71k85k68J12J78j21K33K3k18J7jm6K39M
$$ 208 126 41 367 81 -80 52 230 -58 7 278 -7 -275 -163 15 -106 127 150 -68 -51 -52 -98 141 145
7316A45K01n68K14K1k33M19k99k7M74j96j48Q8J43k25l4L30j50n00M45n1j69k4
$$ 145 346 -222 -8 13 -220 199 -100 -127 347 151 3 91 234 9 -25 305 155 -345 100 49 -120 -144
7338a44J69k90L71J63k44J91k04n1K9J69l14J02k01J83j21L6L83m56J82K08n2
$$ -144 25 -265 106 269 25 216 12 -39 -10 159 -155 -53 -254 -71 -192 -156 227 -229 -47 161 109
7359A09l38M72j90J49k22K68l71mK14k04N6J63K5j65J06j82l5K99r4K13n16M01
$$ 109 -229 243 53 202 -20 248 -123 -127 87 -117 -61 102 127 -38 68 -114 -149 150 56 269 -247 154
7381A54k21j06L64j55k75K48O0O4j69k14L50j16J35k42J8L51m00J28L0m2j34N35
$$ 154 -67 -173 191 36 -239 9 69 133 -36 -250 100 -16 119 -123 -105 246 -154 -26 4 -38 -172 363
7403C63m45k87O41j46j07j04J61l01L51o6R6j76L13k13m4j45M3k7j04L67l67J36
$$ 363 -82 -369 272 126 19 -85 76 -225 126 60 156 -20 293 80 36 -109 -66 -93 -197 170 -197 -61
7425f1L41l53k27N77m92J60J47L9j89L2r5K03J11Ml17K24J77k84K7L32l07l4k
$$ -61 280 -73 -300 277 -215 -55 92 131 -58 -26 -121 82 193 197 -120 104 281 -3 24 356 49 15 13
7448A3J04l00L40J2j73j6R5N0L2o5k53R9J2M8J24k86L47l03L1K03M6l68K90J1
$$ 13 117 -183 157 169 -4 -20 75 125 157 92 -161 -62 -50 -2 122 -164 183 -120 -89 114 160 -208 82 93
7472I3l12O91o02J59k5K29o43K45M82m97j5K67k7m43M74O5k83J91n7l4k41L24
$$ 93 -219 472 -130 29 4 233 -410 -165 317 -180 -195 72 45 -398 76 141 -142 49 -8 -42 -283 41
7494D1k38r9K36l5K10j42j11P9L68l21r2q9J95j25R1N7j74k75N25J2j73R9j09
$$ 41 -197 -296 -60 -95 115 -27 -138 -59 309 -12 -104 -193 2 -123 -32 25 -149 -424 101 113 -60 39 -70
7517g0k5J62n0qK91r2l60K07k81J60jK74o0m50K82J50j32L15l95k83P2N09J26
$$ -70 -95 67 17 9 300 208 -152 55 -226 -66 -67 207 147 -303 -21 129 -3 312 -83 -366 -294 215 341
7540C41o46M67l09J59K69j05j97K5L38o13J90R8j84K34K98k77j54J17j20qJ43
$$ 341 -305 162 -147 12 281 176 -21 4 342 -271 -81 17 -167 67 365 88 -66 51 -69 -77 66
7561F6J1k03J68J89k60k04N16Ro38N91k66J57j87K7j2j60J52j31J34K99k84k98
$$ 66 77 -126 42 231 -29 -233 283 292 -346 245 -21 136 -51 -24 -36 -196 -44 -175 -41 258 -26 -324
7583c24M59k97k41L95k9k07J05P5j46OM05j24l00J86J17j41L24l05j27K36l6J0
$$ -324 135 -162 -403 -8 -37 -244 -139 -64 -210 -204 201 77 -223 -37 80 -61 263 -42 -169 67 31 41
7605D1j81J05j62l25N40M5r5K28r5m06M6L85l56J68J76j23l6J48j29k46J7J4j31
$$ 41 -140 -35 -197 -522 18 63 -32 196 101 -305 -259 126 -230 -62 114 -9 -45 103 -26 -272 -255 -241 -372
7628c72N73l82m8J59M33k16r9J94j62k67L70m3j05k11J4J1J07j94K50k11L21j28
$$ -372 201 -181 -229 -70 363 147 48 242 80 -187 183 140 35 -176 -162 -151 -44 -238 12 -199 122 -6
7650fL0J13j46K8L20j98l26J08N82l85k23M76k46k33K34m7Q1J23N1k02n7J0o4
$$ -6 24 137 -9 19 339 141 -185 -77 505 120 -103 373 127 -106 128 81 162 285 336 134 77 87 23
7673B3q2M56m47j59J88J53k77N66n39j03N54m32j08K85M9m8J73k11j38p3K93N2
$$ 23 -59 397 -50 -209 -21 132 -145 421 -118 -221 333 -99 -207 78 127 79 252 41 -97 -170 123 175
7695A75l03J9K92K6k28J05lj67M26k38q3J67l6l67J7K36k32K20L05p23L24L7J72
$$ 175 -128 -109 183 209 -19 86 83 -84 342 104 21 188 152 -215 -198 38 -194 26 331 -392 -68 -31 141
7718A41l11J59OJ84j37K9j22J63lj58J32k2q8l7J63m22K15J30k6k60K97J15m68
$$ 141 -170 -11 -5 179 42 71 -51 112 109 -49 83 61 -27 -64 99 -323 -108 22 -4 -264 33 148 -320
7741c20J61L57p95L99L84j06l07K80j43qM1P8j30J22K1n45L97J05r6j77K71J12
$$ -320 -159 198 -597 -198 186 80 -227 53 -90 -98 -57 21 -109 13 34 -511 -114 -9 -105 -282 -11 101
7763A01j88lM7j59R5K38p6M3o4n7l8K9K92m27M25k24k12N6J87q3J96R3m96K05
$$ 101 -87 -90 -43 -202 -107 131 55 98 34 -23 -61 -32 260 -167 258 34 -178 -122 65 -18 178 271 -225 -20
7787b0J67j34o1K75j6n32M50N8k24K60R0k18l36N6K41oK08j71k27K66Ojp7J86
$$ -20 147 13 -48 227 211 -321 129 187 -37 223 313 95 -241 -185 56 50 258 87 -140 126 132 131 54 240
7811B40m16L23K74n75r8L96M0j77M7L5P2L7k2n00M15J47m24J22N1k64J95J09j17
$$ 240 -176 147 421 -154 -252 144 184 7 54 89 161 198 176 -324 91 238 -186 -64 -13 -277 -82 27 -90
7834i0l64M62J90k34N6K00q9j20P5l6l07K66K29m13j13L99J07l38k35K05K19j9
$$ -90 -454 8 198 -36 20 220 131 11 86 50 -257 9 238 -175 -288 111 218 -120 -355 -150 69 50
7856E0j11K2J50J11o3l10K72k10JK71n51L6N73l90J74K57m47k3J92K04l47L33
$$ 50 -61 -39 111 222 159 -151 121 -89 -88 183 -368 -332 241 -149 25 282 -165 -188 4 208 -139 194
7878A94p8l46l2L94n08K00M83k89l31M73j81j97L13K9j66R7J6k83M45Q8n9l63
$$ 194 116 -230 -262 132 -376 -176 307 18 -313 160 -21 -218 95 124 -42 55 71 -212 233 321 262 -101
7900a01K24Q7j70p3j70K90k27L52l38J79J68l58N6K90j96j32L28j30k81O2K91
$$ -101 123 210 40 -33 -203 87 -140 212 -126 53 221 -137 -81 209 13 -119 209 79 -202 -140 151
7921A51n08N0L55q4o0J42k07J27J35mj9K83k22j89K49j66J88l89M01j91j51M84
$$ 151 -357 -307 48 -36 -96 46 -161 -34 101 97 78 361 139 -50 199 33 221 -168 233 42 -109 375
7943C75l92J20lJ54l71LJ08j55J79M8k93L71K3k68m6J05j5k36K33k9q0R9m3M7
$$ 375 -17 103 100 254 -117 -114 -6 -161 18 66 -227 144 167 -101 -147 -42 -57 -293 -60 -89 -169 -70 -113 -66
7967f6j38K54J92j62n1p3O1L56o55M4jK94k75L36J09l98j15K13l2lK0K61m57N2
$$ -66 -204 50 242 80 29 -44 17 373 -282 -238 -239 55 -220 116 225 -173 -288 -75 -107 -110 -90 171 -286 -234
7991b34K89m6j50K16j28Mj06j5j8K74J83l31j17K96q5N2M6p8p1L59m09j72J91
$$ -234 55 9 -141 75 -53 -49 -155 -170 -188 86 269 -62 -179 117 32 84 130 52 -19 340 -69 -241 -50
8014e0J2j01O0K32j26R1k46O6m04O56l51J91q5R0J16l7Ol25J43Q0J04j47K74m07
$$ -50 -38 -139 -79 153 27 118 -128 -62 -466 190 -161 30 -55 35 151 114 120 -205 -62 18 122 -25 249 -158
8038a58q5K73r7Q4K69k71j15J15K11l95N9R4k7O1j4K33j75p8K76k12Q3r4J63k81
$$ -158 -243 30 -67 17 286 15 -100 15 226 -169 -110 -16 -43 18 4 237 62 -16 260 48 131 37 200 -81
8062h1L79l63j39L34P8m19m0N35l94l6J32j11J59N7k49l1K77RK16j47j19j74J18
$$ -81 298 -65 -204 130 208 -211 -251 284 -110 -146 -14 -125 34 91 -158 -189 88 97 313 166 47 -127 -9
8085ij5m1K53j9j51k74L56k31k5L45j19j50j35K42p1j76L25j36l96L59R0q3K22
$$ -9 -24 -65 188 169 18 -256 100 -131 -156 189 70 -80 -215 27 -44 -220 105 -31 -427 -68 22 -61 161
8108A61j00m03L69M3K9K16k55k78K24J56k19m6J72k03j05N34k15o1o7J85l92K52
$$ 161 61 -342 27 70 99 315 60 -218 6 162 -57 -103 69 -134 -239 295 80 19 -48 137 -255 -3
8130cLJ04p8J59k82j1L85r0n13O73n64j5J2L27l40N9L31l65K22O2j00l57M16M
$$ -3 0 104 26 185 -97 -108 277 187 -326 347 -217 -232 -220 107 -233 -174 157 -208 14 76 -24 -381 35 39
8154C9l24L79n6j21K47j87j01J4L72k97P7J47k05K52n5m5J9j69R9k73l8J64mL9
$$ 39 -285 94 38 -83 164 -23 -124 -110 262 -35 42 189 -16 236 181 136 155 -14 85 -188 -226 -62 -66 -27
8178b7L0O4j85J84Pj30k09J13k0J68nK6k23
$$ -27 3 67 -118 66 73 -57 -266 -153 -173 -5 -10 16 -207
8191b07
$$ Imaginary data points
##PAGE= N=2
##DATA TABLE= (X++(I..I)), XYDATA
0@%%%%%%%Qj6J6j6J6k4L2l2M0n2O0p2Q3r4J12j30J49j71J95k21K48k80L19l59
$$ 0 0 0 0 0 0 0 0 8 -8 8 -8 8 -16 16 -16 24 -28 32 -40 43 -51 61 -69 80 -91 104 -117 131 -149 170 -189
31a89M00m47N00n60O24o88P62q48R38j037J149j273J410j561J733j932K157k415
$$ -189 211 -236 264 -296 328 -360 402 -446 492 -545 604 -669 741 -820 913 -1019 1138 -1277
49a277K719l082L524m072M775n716P035r011J2268j8529L4501j38500k61677N27645
$$ -1277 1442 -1640 1884 -2188 2587 -3129 3906 -5105 7163 -11366 23135 -115365 -377042 150603
63A50603Q3737n05685J02541M63533k45729l51354L08760K06394l42779o7323
$$ 150603 234340 -271345 -168804 294729 49000 -302354 6406 212800 -129979 -197302
73a97302L31508k3099k85508Q5925K05170j42553j58099J63315J09944j61000
$$ -197302 134206 111107 -174401 -88476 116694 -25859 -183958 -20643 89301 -71699
83g1699o7347J45926J6879j43358j597J23553q00r3448J94Q2181M574r6451j2862
$$ -71699 -139046 6880 23759 -119599 -121196 2357 1557 -91891 -91697 -9516 -4942 -101393 -114255
96a14255J33349J6957j56746K7866J84696r7457j83759J89041J52449k56822n6117
$$ -114255 19094 36051 -120695 -92829 91867 -5590 -189349 -308 152141 -104681 -160798
107a60798L08974o4884l12176J89211K60293k88340j52484L54461K4149l71795
$$ -160798 148176 83292 -228884 -39673 220620 -67720 -220204 134257 158406 -213389
117b13389R2684L27463j95267k49830K67922J60673l01420p3440K95483j7880
$$ -213389 -120705 206758 11491 -238339 29583 190256 -111164 -184604 110879 92999
127I2999k72061R8347K42941j50691j86135J94180J17224k19096m0226K28681
$$ 92999 -179062 -80715 162226 11535 -174600 19580 136804 -82292 -122518 106163
137A06163j7482j92705P7842J48078j09445r6101J12772N7939q6106k9588N9896
$$ 106163 88681 -104024 -26182 121896 12451 -83650 29122 87061 955 -28633 31263
148C1263L0237m5173n5891M4218P7177p1362q7108J13174O7386j61468k7476J80402
$$ 31263 61500 16327 -39564 4654 81831 10469 -76639 36535 103921 -57547 -85023 95379
160I5379m0543j78465J07103J43278j61311q7609J88073J9838j89811M2149J71412
$$ 95379 54836 -123629 -16526 126752 -34559 -122168 65905 85743 -104068 -61919 109493
171A09493q9573j37063J27232J01197j49509n9109J65623J5831j69623L1351J63493
$$ 109493 19920 -117143 10089 111286 -38223 -97332 68291 84122 -85501 -54150 109343
182A09343q0233j37876J24872R3071j58561l9631J62830k3703j46593P2119J05105
$$ 109343 29110 -108766 16106 109177 -49384 -89015 73815 50112 -96481 -24362 80743
193H0743j04382o1409J04678J4889r2436Q401O8609j4714m9943P037M3911J624
$$ 80743 -23639 -85048 19630 34519 -57917 -49516 19093 4379 -45564 -38527 5384 7008
205G008n3136j335P0317q762p9129L7381Q0782o5398o3004Q8697L6972r4975k777
$$ 7008 -46128 -47463 22854 14092 -65037 -27656 53126 -12272 -75276 13421 50393 -44582 -47359
218d7359R2666k2403p8442L7926O2354m6942n1457N2478M3845o2052l7092P3588
$$ -47359 45307 22904 -55538 -17612 44742 -2200 -53657 -1179 42666 -19386 -56478 17110
230A7110K0178q9190K490R5438l5733q7791O8357O3481r1225k7087R6683j0964
$$ 17110 37288 -51902 -49412 46026 10293 -77498 -9141 54340 -36885 -63972 32711 21747
242B1747q1073M2822N6006n4377k3584N3122K212l6731R671K3536o577j4792K561
$$ 21747 -59326 -16504 39502 -14875 -38459 14663 16875 -19856 -10185 13351 6774 -8018 -5457
255e457J8812J603k7527M605L4377j9477l4400L7040K1861m9550k258M7847k0101
$$ -5457 13355 14958 -12569 -7964 26413 6936 -27464 9576 31437 -18113 -20371 27476 7375
268G375l9356L3311K0964l5690m278K6623n693j6486M169R611L934j0082r015
$$ 7375 -31981 1330 22294 -13396 -17674 8949 3256 -13230 -9061 550 4484 -5598 -14613
281a4613K1123P056l2664M695M0365k1915l4356M1961J7357n1644M498M7902k3992
$$ -14613 6510 13566 -19098 -14403 25962 4047 -30309 11652 29009 -22635 -18137 29765 5773
294E773l2644L5527J1802l3563K511J9077r896n797N446k158M386j787j5309R242
$$ 5773 -26871 8656 20458 -13105 -10594 8483 -1413 -7210 -1764 -3922 464 -1323 -16632 -7390
308g390J4505k0047l669K6251j1892k2789K3076P567k7437J1080K1977k0523o440
$$ -7390 7115 -12932 -16601 9650 -2242 -25031 -1955 5612 -21825 -10745 11232 -9291 -15731
321a5731K1808j1482j3733K0612N81j5697J4373N494k0054O236J2386j4840L71
$$ -15731 6077 -5405 -19138 1474 2055 -13642 731 6225 -13829 -7593 4793 -10047 -9676
334i676J6863j0691o580J3504r629j0185J8971k009j6429J7489P724k6841N028
$$ -9676 7187 -3504 -10084 3420 -6209 -16394 2577 568 -15861 1628 9352 -17489 -12461
347a2461K1745j7877q829K5881l946j8627J3261L930j6259R420R917j2606O138
$$ -12461 9284 -8593 -17422 8459 4513 -14114 -853 3077 -13182 -3762 6155 -6451 -313
360c13J0014j6960r78J8232j2567q810K2917k123k0085J3818P317j9768N524J6701
$$ -313 9701 -7259 -8237 9995 -2572 -11382 11535 9412 -10673 3145 10462 -9306 -3782 12919
374A2919j2722j854J4325j1864o716J6694p117j0965K0297J653k2654J1832J4003
$$ 12919 197 -1657 12668 804 -5912 10782 3665 -7300 12997 14650 -8004 3828 17831
387A7831k2404j148K3878r896j3330J6347m42j5018R406M082j0459Q712M700j4370
$$ 17831 -4573 -5721 18157 8261 -5069 11278 10836 -4182 5224 9306 -1153 7559 12259 -2111
401b111O220J0139j7585P76K0198j2785j1210K0910k826k0861J5886J0693k1524
$$ -2111 4109 14248 -3337 -2561 17637 4852 -6358 14552 11726 -9135 6751 17444 -4080
414d080M383J9541j6966q049K0257n786j5254J4982M930j5871N255P631j0388
$$ -4080 303 19844 2878 -5171 15086 9300 -5954 9028 13958 -1913 3342 10973 585
427E85J533N922q286K864O161j3975J878J6766j5974j1402K5787k528k9626J7215
$$ 585 2118 8040 -246 2618 8779 -5196 -3318 13448 -2526 -13928 11859 9331 -20295 -3080
441c080K0899k8292p003L0629o888k3475J3807J2242j3437k911Q395J724j62p515
$$ -3080 17819 -10473 -17476 13153 6265 -17210 -3403 8839 -4598 -7509 886 2610 2448 -5067
455e067k504J5988l243k2797J6886K2231l0820j2180L8644p432l8495K4600K7447
$$ -5067 -7571 8417 5174 -17623 -737 21494 -9326 -21506 17138 9706 -28789 -4189 23258
468B3258l4769j2588L4913m773k9508J2928J8646j3458r618R184P429o078j2585
$$ 23258 -11511 -24099 10814 6041 -23467 -10539 8107 -5351 -14969 -5785 1644 -4434 -17019
481a7019P165J8674j3077j7867K5861J1694l5639K679L8760j8734l0207L5136
$$ -17019 -9854 8820 -4257 -22124 3737 15431 -20208 -17529 21231 2497 -27710 7426
493G426J6367m1038P15L6578j4744k6146K2320J5239k0606r252J3629P328j1716
$$ 7426 23793 -17245 -16530 20048 5304 -20842 1478 16717 -3889 -13141 488 7816 -3900
506c900j1775J4861J6503k5152j6175L5920M190m5531J3580M6861l2144l6252
$$ -3900 -15675 -814 15689 -9463 -25638 10282 14472 -31059 -17479 29382 -2762 -39014
518c9014M7174J8495n3683J581N1808j5549l9727K5607K9163k7271k2086K7301
$$ -39014 8160 26655 -27028 -25447 26361 10812 -28915 -3308 25855 -1416 -23502 3799
530C799K0013k6817j8482L2974J5731m3926p879N1631q472n4257K8112M5891m7457
$$ 3799 23812 -3005 -21487 11487 27218 -16708 -24587 27044 18572 -35685 -7573 38318 -9139
543i139l1323N5498Q204n5950J1269M6158k4540l3645K7367K1164k5429j4779
$$ -9139 -40462 15036 23240 -32710 -21441 24717 177 -33468 -6101 15063 -10366 -25145
555b5145K3336J6024k3283j7273L0347J6065l9992n698N1315r119n2178L0353
$$ -25145 -1809 14215 -9068 -26341 4006 20071 -19921 -25619 25696 16577 -35601 -5248
567e248M4393m8070k7077N9105O943n8812J2892N0227k7937l9467L4121K8193
$$ -5248 39145 -8925 -36002 23103 30046 -28766 -15874 34353 6416 -33051 1070 29263
579B9263l6438k0610L6955J5744m3327j0782M9148J313n5035J5188N7537l5719
$$ 29263 -7175 -27785 9170 24914 -18413 -29195 19953 21266 -33769 -18581 38956 3237
591C237m9575N4794L3425o5656p992O9879j3681n9434L1859M4819l8990k7134
$$ 3237 -46338 8456 41881 -23775 -31767 38112 24431 -35003 -3144 41675 2685 -24449
603b4449M1618J7954l6497j1977L3842J0679l6260r106M3486L260n1139R323N3628
$$ -24449 17169 35123 -1374 -13351 20491 31170 -5090 -14196 29290 32550 -18589 -9266 44362
616D4362k9848n0076M6641L6056n9514j5889O2625n323n9345K0511M9212l0402
$$ 44362 14514 -35562 11079 47135 -12379 -28268 34357 29034 -30311 -9800 39412 9010
628I010l6612L6779K8541l9800k2751M3410J7536m9110n319N8181r180o0944K9394
$$ 9010 -27602 9177 37718 -2082 -24833 18577 36113 -12997 -18316 39865 30685 -30259 -865
641h65N4376n0245l8713O7048J5579p2162R525O2888l3350m9285M4489K9814m7502
$$ -865 53511 3266 -35447 31601 47180 -24982 -15457 47431 14081 -35204 9285 39099 -8403
654h403j4086M1311J233l8344L09L3103j635l3231M258L7054j3897m2222K4981
$$ -8403 -22489 18822 20055 -18289 -17980 15123 13488 -19743 -15485 21569 7672 -34550 -9569
667i569L9571l8024k7154N1013J2343n6344L182N1765j7004m1789K8952L4384
$$ -9569 30002 -8022 -35176 15837 28180 -28164 -24982 26783 9779 -32010 -3058 31326
679C1326l2641k7943L2237K1349l6982j7195M5163J2767n4124k358N7144j9958
$$ 31326 -1315 -29258 2979 24328 -12654 -29849 15314 28081 -26043 -28401 28743 8785
691H785n8489M1402M9554n8138k9242O7833M16o9807K2538N8911l7317l6917M7324
$$ 8785 -49704 -8302 41252 -16886 -46128 21705 22121 -47686 -25148 33763 -3554 -40471 6853
704F853J7886m7307n230M0380j145k9968Q000L0082r487l0860J2649L0117j8910
$$ 6853 24739 -22568 -27798 12582 11437 -18531 -10531 19551 10064 -20796 -8147 21970 3060
717C060k5188L2130J9718l9870r199L9299n817l5648J9135K8803k3714j9236K1146
$$ 3060 -22128 10002 29720 -10150 -19349 19950 14133 -21515 -2380 26423 2709 -16527 4619
730D619R946k0373q454K1041J2331k2316j3038K8508P377l9025M950M7608j8143
$$ 4619 14565 -5808 -14262 6779 19110 -3206 -16244 12264 19641 -19384 -14434 33174 15031
743A5031m3298L7681L0923n3498j1605N9831p267n1144K7654L8909m0205k5542
$$ 15031 -28267 9414 40337 -13161 -24766 35065 27798 -23346 4308 43217 3012 -22530
755b2530M2487J0824l7051P18L2861o301l2148O680K8536j2100k7090K0605K5531
$$ -22530 19957 30781 -6270 -5552 27309 21008 -11140 -4460 24076 11976 -15114 5491 31022
768C1022l0153k0448L4640O092l7139Q892L4817j8810k4452K3835J0165k3528
$$ 31022 869 -19579 15061 21153 -15986 -7094 27723 8913 -15539 8296 18461 -5067
780e067m88J8715r98q962j261N703M899r561q393J7600P518k4510Q56K8367j6060
$$ -5067 -5555 13160 12162 3200 1939 7642 12541 2980 -5413 12187 19705 -4805 -3949 24418 8358
795H358k6667K7671J5575l4824j092L4210j4260k8521K1630J6606k4817o228K1966
$$ 8358 -18309 9362 24937 -9887 -10979 23231 8971 -19550 2080 18686 -6131 -12359 9607
808I607j53j8839J569J6267k301j6833M781J9937r817k1016J8605J7260k6212
$$ 9607 9454 -9385 -7816 8451 6150 -10683 -5902 14035 4218 -16798 1807 19067 -7145
821g145p580L2158m643l0878J7214K1513k4861r518K6305j942k0586P933J0949
$$ -7145 -14725 17433 12790 -18088 -874 20639 -4222 -13740 12565 10623 -9963 -2030 8919
834H919r928m471N160J642Q74n367m081R806N96j5723O854J6462j5152j0454K0984
$$ 8919 -1009 -5480 -320 1322 2196 -3171 -7252 2554 3150 -12573 -5719 10743 -4409 -14863 6121
849F121Q17k1500Q390J7041j3764p424J5490J70j0897K753N294j553j216j207
$$ 6121 6938 -14562 -6172 10869 -2895 -10319 5171 5341 -5556 -2803 2491 938 -278 -1485
863a485K968M390p372m415J2285j073j4977R812J1895j7596m132J9650p169j6441
$$ -1485 1483 5873 -1499 -5914 6371 5298 -9679 133 12028 -5568 -9700 9950 2781 -13660
877a3660J5517P196j7985K417J4669j0021o893J1288k48p596N172J726m167L344
$$ -13660 1857 9053 -8932 -6515 8154 -1867 -8760 2528 2280 -5316 -144 1582 -2585 759
891G59n25l015O830n43r037P925O136j2998N51J4159p740r575J3216J260j4638
$$ 759 234 -2781 4049 3506 -5531 2394 8530 -4468 -3917 10242 2502 -7073 6143 7403 -7235
906g235N993R180r852j410Q352m554l758N319l168k140O897l997n441R117o33
$$ -7235 -1242 7938 -1914 -3324 5028 474 -3284 2035 -1133 -3273 3624 -373 -5814 3303 2670
921B670j1321P777P258j2213R11J2688q331p227J1314k86r978P598M064q785K326
$$ 2670 -8651 -874 6384 -5829 -4918 7770 -561 -7788 3526 3240 -6738 860 4924 -3861 -1535
936a535N939q217Q70P596o554k437Q674m388p228R020M5q952O900M285j0260J456
$$ -1535 4404 -3813 -2943 4653 -1901 -4338 4336 -52 -7280 1740 1785 -7167 -267 4018 -6242 -4786
952d786Q256q442j855J0496m701p180R276j97j0334P248N302q828K337P279p858
$$ -4786 3470 -4972 -6827 3669 -1032 -8212 1064 867 -9467 -2219 3083 -5745 -3408 3871 -3987
967c987k041Q158m598l550R412k177p631P411J209j0192N418P883r313j6R811
$$ -3987 -6028 2130 -2468 -6018 3394 1217 -6414 997 2206 -7986 -2568 5315 -3998 -4014 5797
982E797p299n998R517j195o636P878K115q604L654L768q650K989Q849p219k112
$$ 5797 -1502 -7500 2017 822 -5814 2064 4179 -4425 -771 2997 -5653 -2664 6185 -1034 -3146
997c146J0078n410r100R929K741r701N920O670q756j295P065n442j870P925k327
$$ -3146 6932 1522 -7578 2351 5092 -4609 1311 7981 -775 -2070 4995 -447 -2317 5608 3281
1012C281l900P088l197p246P794K320q539N759P647j0812j715J0468o423n964
$$ 3281 -619 6469 3272 -3974 3820 6140 -2399 3360 11007 195 -1520 8948 2525 -3439
1026c439J1414N58r318N756K956r298K542P103o511M11O637n993l370O924l830
$$ -3439 7975 8533 -785 4971 7927 -1371 1171 8274 1763 2174 8811 2818 -552 6372 2542
1041B542n199R558k03r267O609L744j2013K819J1205r100m554J2386l159j1166
$$ 2542 -2657 6901 6698 -2569 4040 7784 -4229 -1410 9795 695 -3859 8527 5368 -5798
1055e798P817N367r925K370P744n780k946M675l096j139M466l336r59O161n344
$$ -5798 2019 7386 -2539 -169 7575 1795 -1151 3524 428 -711 3755 419 -540 5621 277
1070B77n982R443L25j1395P132Q618j2814k623J1515m926q420R491J706q302L211
$$ 277 -5705 3738 4063 -7332 -200 8418 -4396 -7019 4496 -430 -8850 641 2347 -5955 -2744
1085b744K830n536K519K824n724M066M536r347L37J0733p719p337J4346J352j5471
$$ -2744 86 -5450 -2931 -107 -5831 -1765 2771 -6576 -6239 4494 -3225 -10562 3784 5136 -10335
1100a0335O938J1200j3377l748J5152l260j1163P975M120q881N98N587j784j609
$$ -10335 -3397 7803 -5574 -9322 5830 2570 -8593 -618 3502 -5379 -4781 806 -978 -2587
1114b587L90n23K129j501m958O213M355j0021R61J1478q090q472J3112K679j3716
$$ -2587 -2197 -2720 -591 -2092 -7050 -837 3518 -6503 -5542 5936 -2154 -10626 2486 5165 -8551
1129h551O436J0954j1901l314J1810l198p208Q349J817o586L958J091o321O006
$$ -8551 -2115 8839 -3062 -6376 5434 2236 -4972 3377 5194 -1392 2566 3657 -2664 3342
1143C342K968r415M307R657j1905n251J4916l392j3871J1614Q963j5579k077J3972
$$ 3342 6310 -3105 1202 10859 -1046 -6297 8619 5227 -8644 2970 11933 -3646 -5723 8249
1157H249m937j0078P939O194o257l452M392K705l481m241N406O776q564m587J2925
$$ 8249 3312 -6766 1173 7367 1110 -2342 2050 4755 1274 -2967 2439 9215 651 -3936 8989
1172H989q32j5184Q552J3166j4579n360J7469l358j6600J0466R068j4269M00J2432
$$ 8989 8157 -7027 1525 14691 112 -5248 12221 8863 -7737 2729 11797 -2472 -2072 10360
1186A0360p568o340Q054j916n847O083n62n301O094L63r092M842O936j0807j09
$$ 10360 2792 -3548 4506 2590 -3257 2826 2264 -3037 3057 3420 -5672 -830 6106 -4701 -4810
1201d810J2833o018j0253J0920L888j1526K126R861m745n975N153K823l691k759
$$ -4810 8023 2005 -8248 2672 6560 -4966 -2840 7021 2276 -3699 1454 4277 586 -2173
1215b173K386N675l689p835P329O053j3422k095J7245n618j6391J3267R650k0201
$$ -2173 213 5888 2199 -5636 1693 7746 -5676 -7771 9474 3856 -12535 732 10382 -9819
1229i819j308K0091q062j4256J4837N417j5909K142J0969o984l161Q168j796l323
$$ -9819 -11127 8964 902 -13354 1483 6900 -9009 -6867 4102 -2882 -6043 2125 329 -2994
1243b994M171l212j920O768k171n505Q681J695j1168K960R023q496m155J0857
$$ -2994 1177 -2035 -3955 2813 642 -4863 3818 5513 -5655 -2695 6328 -2168 -6323 4534
1257D534l20q771L133L520m210j697K032J614R72m289j084O415l047r014R097
$$ 4534 4214 -4557 -1424 2096 -2114 -3811 -1779 -165 807 -3482 -4566 1849 -1198 -10212 -1115
1272a115P851j3765j066J6051q062j3576J5766O622j7655L814J6050j1814r460
$$ -1115 6736 -7029 -8095 7956 -106 -13682 2084 8706 -8949 -5135 10915 -899 -10359
1285a0359J4848P00j1754O583O979q026j698M978l504l54L433l297J318L943o599
$$ -10359 4489 5189 -6565 18 6997 -1029 -2727 2251 -1253 -1607 1826 -1471 -153 3790 -2809
1300b809k900P972k920o963Q167L876r816N02O784m777l728N998J242k053Q25
$$ -2809 -5709 2263 -657 -7620 547 4423 -5393 -4891 1893 -2884 -6612 -614 628 -1425 -600
1315f00j713P71K110m862K89R708l810q895R662M247j5600K777J5284r093r698
$$ -600 -2313 -1542 568 -4294 -4005 5703 1893 -7002 2660 6907 -8693 -5916 9368 275 -9423
1330i423J4965J167j6679N537J0953j0633l356J1024k496p861N533O69n023K873
$$ -9423 5542 6709 -9970 -4433 6520 -4113 -7469 3555 1059 -6802 -1269 -600 -5623 -2750
1344b750J422k726L743k84n471L499L522o796J334Q654n390m457P381k15p325
$$ -2750 -1328 -4054 -311 -595 -6066 -2567 955 -5841 -4507 4147 -1243 -5700 1681 1466 -5859
1359e859M833M448n456J109L336l781j21K525l640J634M629o304r20Q306n889
$$ -5859 -1026 3422 -2034 -925 2411 -1370 -1491 1034 -2606 -972 3657 -2647 -3567 4739 -1150
1374a150p334J0492K404j2576N254J0769j1485n305J3560k597j0662Q703N836
$$ -1150 -8484 2008 4412 -8164 -2910 7859 -3626 -8931 4629 2032 -8630 73 5909
1387E909r958Q17P338m493k417N194j305j150L347k445j459M833k929m024O969
$$ 5909 -4049 -3232 4106 -387 -2804 2390 1085 -65 3282 837 -622 4211 1282 -2742 4227
1402D227Q29p860M069N549q084j226P840l560m644O044J02n517L647M15m251L683
$$ 4227 5056 -2804 1265 6814 -1270 -2496 5344 1784 -2860 3184 3286 -2231 1416 1831 -2420 1263
1418A263J594n492L455L986q026M34Q922o325n170J0823m07j0686O447O614j0231
$$ 1263 2857 -2635 820 4806 -3220 -2786 6136 -189 -5359 5464 5057 -5629 818 7432 -2799
1433b799l64J0280n217n949Q047j78p067L989K633n333J895K512m058J334K195
$$ -2799 -3163 7117 1900 -4049 3998 3820 -3247 742 3375 -1958 -63 2449 -1609 -275 1920
1448A920n056P22N156n570j842P661l226o594O937J861q196L289O469p238j117
$$ 1920 -3136 -2414 2742 -2828 -4670 2991 -235 -6829 108 1969 -6227 -2938 3531 -3707 -4824
1463d824P059l619l785O096r68m314N204k86n454M161K721p361K984O586p449
$$ -4824 2235 -1384 -5169 927 -41 -4355 849 563 -4891 -730 1991 -5370 -2386 4200 -3249
1478c249k141Q726l748o980P341K770q538L011N641o490r96N844l020k539M958
$$ -3249 -5390 3336 -412 -7392 -51 2719 -5819 -2808 2833 -3657 -4653 1191 -1829 -4368 590
1493E90j639l202M472r37l967M936J115n908M003M033p201O31P539n300l583Q288
$$ 590 -1049 -4251 221 -716 -4683 253 1368 -4540 -537 3496 -3705 -3074 4465 -835 -4418 3870
1509C870j153p270O093K958p465K407N297n984n78N916l616k800N405j484m355
$$ 3870 2717 -4553 1540 4498 -2967 -560 4737 -1247 -1825 4091 475 -2325 3080 1596 -2759
1524b759N783J55o175M240L292p268J791O557n617k641P680k826n519O270J782
$$ -2759 3024 3179 -2996 1244 4536 -2732 -941 5616 -1 -2642 5038 2212 -3307 2963 4745
1539D745o777K839M119n768O27M997m506j082N720l590k881N816j340n796N623
$$ 4745 -2032 807 4926 -842 -215 4782 276 -806 4914 1324 -1557 4259 2919 -2877 2746
1554B746K035p388K642N451o709j251O800l644m133N879l3n492M395J242n549
$$ 2746 4781 -2607 35 5486 -1223 -2474 4326 682 -3451 2428 2395 -3097 1298 2540 -3009
1569c009K335L699n273P20M927m953j950O167k611m614O026O34o668L960L943
$$ -3009 -674 3025 -2248 -1528 3399 -1554 -3504 2663 52 -4562 1464 2098 -4570 -610 3333
1584C333o986Q54O281n237k533O881k379n066N289R60n887L352L000n753J911
$$ 3333 -3653 -2799 3482 -1755 -4288 2593 214 -4852 437 1397 -4490 -1138 1862 -3891 -1980
1599a980M576n313j282O085l265l549O013p01n486M974K324o709K103M868n231
$$ -1980 2596 -2717 -3999 2086 -1179 -4728 1285 584 -4902 72 2396 -4313 -2210 2658 -2573
1614b573o91N626k938l441N859j602l993M445J109n456L999K866o221J122O271
$$ -2573 -3264 2362 -576 -4017 1842 240 -3753 692 1801 -3655 344 3210 -3011 -1889 4382
1629D382n737k264Q076k690n723N799J647o961L296M389n254J8M981l550k220
$$ 4382 -1355 -3619 4457 1767 -3956 1843 3490 -3471 -175 4214 -1040 -1022 3959 409 -1811
1644a811N061j913l458N362q82m663M217J682o345K711M949n386j233O418l219
$$ -1811 3250 1337 -2121 3241 2359 -2304 1913 3595 -2750 -39 4910 -476 -1709 4709 1490
1659A490m386N770j41n082L753K214m861J733K836n080Q90M682m187j095N535
$$ 1490 -2896 2874 2733 -2349 1404 3618 -1243 490 3326 -1754 -864 3818 -369 -1464 4071
1674D071l088m750O158M19o802M247N117q077J06P160n246l971P343l55o248M028
$$ 4071 983 -3767 2391 2810 -3992 255 5372 -2705 -2599 4561 -685 -4656 2687 2332 -3916 112
1690A12K572n753J212L293l864Q19L255l843l39M180l951k283O273j234n706N397
$$ 112 2684 -3069 -1857 1436 -2428 -1609 1646 -2197 -2536 1644 -2307 -4590 1683 449 -5257 140
1706A40J932p131J697O031n084k193O166j658m348L880K92l365K883M72l359L266
$$ 140 2072 -5059 -3362 2669 -2415 -4608 1558 -100 -4448 -568 -276 -3641 -758 -286 -3645 -379
1722c79J166n452K826M903p010q39Q262m085o825Q180K392q973K736P183o329
$$ -379 787 -4665 -1839 3064 -3946 -4785 3477 -608 -7433 747 3139 -5834 -3098 4085 -2244
1737b244l144P177j188m857L834J645l051J170Q32k094K505j0l045K869K596n693
$$ -2244 -5388 1789 601 -4256 -422 1223 -1828 -658 174 -1920 585 575 -2470 399 2995 -2698
1753b698J042O245n079l384P860j002o794M618L882o371J39N689l290k282M095
$$ -2698 -1656 4589 -490 -3874 3986 2984 -3810 808 4690 -1681 -1542 4147 857 -1425 2670
1768B670j515j856L105j690j637M761j574n199N574K970r032K305Q709o906m955
$$ 2670 1155 -701 2404 714 -923 3838 2264 -2935 2639 5609 -3423 -1118 7591 685 -4270
1783d270R816l64r485M973O124o881j762O492j554m217J904J464n72N0j452J327
$$ -4270 5546 5182 -4303 670 6794 -87 -1849 4643 3089 -1128 776 2240 1668 1718 266 1593
1799A593K191m283j609O438j447p398O049M718q988r54R267m209o614P166K303
$$ 1593 3784 -499 -2108 4330 2883 -4515 1534 6252 -2736 -3690 5577 1368 -5246 1920 4223
1814D223p149J697M926m628r64K879j592J92K092l196k06M542l887l357P409l21
$$ 4223 -2926 -1229 3697 -931 -1895 984 -608 -416 1676 -1520 -1726 2816 -1071 -4428 2981 2660
1830B660q288M729O016q516k011R091k634o996N339L503o053m93M699j399k157
$$ 2660 -5628 -899 5117 -3399 -5410 3681 1047 -5949 -610 2893 -3160 -3653 1046 -353 -2510
1845b510M99J061J400k074l209M995K146p209J112Q141n340p046R680K298j0808
$$ -2510 -2011 -950 450 -1624 -4833 162 2308 -4901 -3789 4352 -988 -8034 1646 3944 -6864
1860f864L312R509p573n335R097M14q216M009M809m781o43K532j204J54N29k323
$$ -6864 -3552 5957 -1616 -6951 2146 2560 -5656 -1647 3162 -1619 -2262 270 -934 -780 -251 -2574
1876b574K487K777n464K19O326l659n643P378K557q010J861O797m610m846N924
$$ -2574 -87 2690 -2774 -2555 3771 112 -5531 1847 4404 -3606 -1745 5052 442 -4404 1520
1891A520J288m356J221K583r38j022j132P62L419k834l020O346P58q469L048Q145
$$ 1520 2808 -1548 -327 2256 1318 296 -836 -74 3345 511 -2509 3837 4595 -3874 -826 7319
1907G319p726n139J1191j56j0992N226P757q603k782Q949j278o349L405L012m142
$$ 7319 -407 -5546 5645 5489 -5503 -277 7480 -1123 -3905 5044 3766 -2583 822 3834 -308
1922c08l27J916K42O12j518j530L624o34n220L662M835o157k205P229k090p230
$$ -308 -635 1281 1523 2135 617 -913 2711 2077 -3143 519 5354 -803 -3008 4221 2131 -5099
1938e099N389M240n951j76N269k960l271K675k35m27J248j501N12K986m213l478
$$ -5099 290 4530 -1421 -1597 3672 712 -2559 116 -119 -546 702 -799 -287 2699 -1514 -4992
1954d992P030j74p252N056O295r087l022R915k873p900O857N351q304q50O489
$$ -4992 2038 1864 -5388 -332 5963 -3124 -6146 3769 896 -7004 -147 5204 -3100 -3950 2539
1969B539l051m212L643K226j877k65j54N97N63l224K24N623k508m739N575K182
$$ 2539 -512 -4724 -1081 1145 -732 -997 -1151 -554 9 -3215 -2991 2632 124 -4615 960 3142
1985C142q153J464P523m740m282P195O64p214K833L934m163n8L416j606q61J695
$$ 3142 -5011 -3547 3976 -764 -5046 2149 2813 -4401 -1568 2366 -1797 -1855 1561 -45 -906 789
2001G89k549N77L767l391j312N679k312n627N690K878p761J921P620n160n027
$$ 789 -1760 -1183 2584 -807 -2119 3560 1248 -4379 1311 4189 -3572 -1651 5969 809 -4218
2016d218O907O18o128K721L898k927j872K563l67n88J62j252K406J096m179J102
$$ -4218 2689 3307 -2821 -100 3798 871 -1001 1562 1195 607 769 -483 1923 3019 -1160 -58
2032e8M389m549l277P156K49p372L854N746p094j679P091k045n069M399J666m376
$$ -58 4331 -218 -3495 3661 3910 -3462 392 6138 -956 -2635 4456 2411 -2658 1741 3407 -969
2048i69R98K042k108M70J152k495J350K013l692M95M393l916k977N924j44o189
$$ -969 29 2071 -37 433 1585 -910 440 2453 -1239 -744 3649 -267 -3244 2680 2536 -3653
2064c653L859L833o077m25N702k632m089M041N47k918J418J189k101R54O2j999
$$ -3653 206 4039 -2038 -2463 3239 607 -3482 559 1106 -1812 -394 795 -1306 -352 -290 -2289
2080b289K631P78m126J923L411n030j400O845j993n854N230K807o768Q99N684
$$ -2289 342 1120 -3006 -1083 2328 -2702 -4102 2743 750 -5104 126 2933 -3835 -2936 2748
2095B748m001k565M764o01l369K670K09j796J620L23k391K498M68l699K354L187
$$ 2748 -1253 -3818 946 345 -3024 -354 -145 -1941 -321 2 -2389 109 577 -3122 -768 2419
2111B419m801l44N760l158l911M820J486n567K201L818m011q46L870j567k070
$$ 2419 -2382 -2726 3034 -124 -4035 785 2271 -3296 -1095 2723 -1288 -2134 1736 169 -1901
2126a901K952p32j470K367n08k207L166k5m122L084K661m923O63M998l785l137
$$ -1901 1051 319 -1151 1216 708 -1499 1667 1642 -2480 604 3265 -1658 -995 4003 218 -2919
2142b919N424k70m792L819K464m856N27L855l043j163L311j332j172K470j537
$$ -2919 2505 2235 -2557 1262 3726 -1130 -603 3252 209 -954 2357 1025 -147 2323 786
2157G86j686L066m59l488L683J389m691J492M158m300k106N771j428m659M280
$$ 786 -900 2166 1707 -1781 1902 3291 -1400 92 4250 -50 -2156 3615 2187 -2472 1808
2172A808J592m750J244L027l007n07K940j806r63K536k060j500L878j455l232
$$ 1808 3400 -1350 -106 2921 -86 -593 2347 541 -422 2114 54 -1446 2432 977 -2255
2187b255L962P39n113J813M113n362l92N290k358l338L766O04m145K033J960k765
$$ -2255 1707 2446 -2667 -854 3259 -2103 -2495 2795 437 -2901 865 1469 -2676 -643 1317 -1448
2203a448K70K082k619K13K462k375r20M101k581k424L877L3m612L023L145m893
$$ -1448 -1178 904 -1715 -1502 960 -1415 -2335 1766 -815 -3239 638 671 -3941 -918 2227 -2666
2219b666K25M347l102k613M231l82l480L012J045l305J150J737k585P37K714k945
$$ -2666 -2441 1906 -1196 -3809 422 40 -3440 -428 617 -2688 -1538 199 -2386 -1649 1065 -1880
2235a880l3L284k620k246M263l98l981L824J703m835J439L449l480j390M320q29
$$ -1880 -1913 1371 -1249 -3495 768 370 -3611 213 1916 -2919 -1480 1969 -1511 -2901 1419 590
2251E90k729K522L18k636K247N99k395J808J545l806J438L307m170o25N093j805
$$ 590 -2139 383 701 -1935 312 911 -1484 324 1869 -1937 -499 2808 -1362 -1987 3106 1301
2267A301m381M923J079n553K096L938l833n58L892k045k604L274k65k081K263
$$ 1301 -3080 1843 2922 -2631 -535 3403 -430 -988 2904 859 -1745 1529 1264 -817 1446
2282A446K8k029J837O60l199J547K985m116L3M425k414l083L609O04l858J978
$$ 1446 1474 -555 1282 1942 -1257 290 3275 -841 -808 3617 1203 -1880 1729 2333 -1525 453
2298D53K800l784lK702k124m79K145j772n00K729j752k320L853r85m169M179J768
$$ 453 3253 -531 -534 2168 44 -435 1710 -62 -562 2167 415 -1905 1948 963 -3206 973 2741
2315B741n331J133M917m117l076N832p95m668K997K813m672k59M150k490j262
$$ 2741 -2590 -1457 3460 -657 -3733 2099 1304 -3364 -367 2446 -2226 -2485 1665 -825 -2087
2330b087K336n52r82J567j095j354K740j059k716L482P24m100J635L478m171j115
$$ -2087 249 -303 -1285 282 -813 -2167 573 -486 -3202 280 1004 -3096 -1461 2017 -2154 -3269
2346c269M639j593l447L653R27l287J493J169k092Q55J035k442J244K255l624
$$ -3269 1370 -223 -3670 -17 910 -2377 -884 285 -1807 -952 83 -2359 -1115 1140 -2484
2361b484K48M479l118l710N890P62o333L092M947n776j554O296j749m563L976
$$ -2484 -2236 2243 -875 -4585 1305 2067 -4266 -1174 3773 -2003 -3557 2739 990 -3573 403
2376D03K203l930l2K960j518n44P14l20N53J46j607J059K272l378o01M687j604
$$ 403 2606 -1324 -1356 1604 86 -458 256 -64 489 635 -972 87 2359 -1019 -1620 3067 1463
2393A463m222M021J783n162J624M059l428j765M178j051k879K820l1j734J934
$$ 1463 -2759 1262 3045 -2117 -493 3566 138 -1627 2551 1500 -1379 1441 1410 -324 1610
2408A610q9k247K488J209m758J919M515m757j980O267j643n736M260L575o195
$$ 1610 1521 -726 1762 2971 -1787 132 4647 -110 -2090 4177 2534 -3202 1058 4633 -1562
2423a562p9N956k845l712L189J878l572p3K132k51q74p06N48J611j966k416M567
$$ -1562 -1641 4315 1470 -2242 947 2825 -747 -820 1312 1061 187 -519 29 1640 -326 -2742 1825
2440A825K81n049K135M738m826k827O240k05o336L556L972n660l60M482k267k153
$$ 1825 2106 -2943 -808 3930 -896 -3723 2517 2312 -4024 -468 3504 -2156 -2516 1966 -301 -2454
2456b454L062n41j853K250j100j831K753K03l959K903K634n198K67N344l001m132
$$ -2454 608 67 -1786 464 -636 -2467 286 489 -3470 -567 2067 -3131 -2864 2480 -521 -4653
2472d653N268J212n209J174M081k889k194L390L89j719n5N30J378r54k208K218
$$ -4653 615 1827 -3382 -2208 1873 -1016 -3210 180 569 -1150 -1205 -675 703 -251 -2459 -241
2488b41K681m097j545N906j283o091M804M456p169p97P577k744n975N036K866
$$ -241 2440 -1657 -3202 2704 1421 -4670 134 4590 -2579 -3376 4201 1457 -4518 518 3384
2503C384n796M61M933k832k016K935m78j203J526n24p76K112j348j824L579K69
$$ 3384 -2412 -1951 2982 150 -1866 1069 591 -612 914 390 -386 1726 378 -1446 2133 2402
2519B402m233K291L637m584j156M990j408l511K390K159k722m22K043n30l77l73
$$ 2402 -1831 460 4097 -487 -1643 3347 1939 -1572 818 2977 255 -167 1876 1346 969 596
2535E96l80K215m92l091K449K513n018p09O513k655n911O031L076p642M60P201
$$ 596 216 2431 1939 -1152 1297 3810 -1208 -1917 4596 1941 -3970 2061 5137 -2505 -2045 5156
2551E156l958m695O009Q86n487J355L788l008j170K730n4j288J6o21J150O95k675
$$ 5156 1198 -3497 2512 3398 -2089 -734 3054 46 -1124 1606 1552 264 280 -341 809 1504 -1171
2568a171M18L485k631k899M046N80m850J857L793l542j528L769q88l058K217P61
$$ -1171 -753 2732 101 -2798 1248 1828 -3022 -1165 2628 -914 -2442 1327 439 -2619 -402 359
2584C59j914J532n69j320K170n78l183L599J822n174R82N397l842m170O160P79
$$ 359 -1555 -23 -592 -1912 258 -320 -3503 96 1918 -3256 -2274 3123 -719 -4889 1271 2050
2600B050o766L128M778m738k745N319o45m035K667J907k120k79N30k46L00o11
$$ 2050 -4716 -1588 3190 -1548 -4293 1026 381 -3654 -987 920 -1200 -1479 -949 -1195 -895 -1506
2616a506k83K215K23l618K067K583l920j164N757j597m071L501K143m742N88M011
$$ -1506 -1789 426 649 -2969 -902 1681 -2239 -3403 2354 757 -3314 187 2330 -2412 -1824 2187
2632B187k548j580L489r77j500J342m42q49K359j020j894K968K88m306J898M255
$$ 2187 -361 -1941 1548 571 -929 413 -29 -878 1481 461 -1433 1535 1823 -2483 -585 3670
2648C670m334j565N522j534m917L785K566m940O48L722j843j811K272k22j301
$$ 3670 -664 -2229 3293 1759 -3158 627 3193 -1747 -1099 2623 780 -1031 1241 1019 -282
2663b82P08k8J37J584j643j319L345j420k851L193K242n222O34N110l827k750
$$ -282 426 398 535 2119 476 -843 2502 1082 -1769 1424 3666 -1556 -922 4188 361 -2389
2679b389M722L71m646K207K794l750r2K419j204r92J798j406n09J854j456r61
$$ -2389 2333 2704 -1942 265 3059 -691 -783 1636 432 -560 1238 -168 -677 1177 -279 -1240
2695a240K833q04l458K999J726m385N27M640l338k555M445J63m398K506J781k941
$$ -1240 1593 789 -2669 330 2056 -2329 -1802 2838 -500 -3055 1390 1553 -2845 -339 1442 -1499
2711a499q7K473j700J1R23j286J36J640k278j93L158k024k465L808M18m608K177
$$ -1499 -1586 887 -813 -802 121 -1165 -1029 611 -1667 -1860 1298 -726 -3191 617 1035 -3573 -1396
2728a396L301l854j554N136j641k995K830J000l267J162J716j584j13J425j495
$$ -1396 1905 -1949 -3503 1633 -8 -3003 -173 827 -2440 -1278 438 -1146 -1259 166 -1329
2743a329P64J454k658J32K997j782k290M090m13l814K601K782m101k83M322k081
$$ -1329 -565 889 -1769 -1637 1360 -422 -2712 1378 965 -2849 -248 2534 -1567 -1850 2472 391
2759C91k447L431m04k325J810J014j978R33Q05j720O61J503k222J76K853k310
$$ 391 -2056 1375 971 -1354 456 1470 -508 425 1230 -490 171 1674 -548 -372 2481 171
2775A71j496L850p67l645L279J864m069N36L687k878j463L310o66k314K332L19
$$ 171 -1325 2525 1758 -1887 1392 3256 -813 -277 3410 532 -931 2379 1713 -601 1731 2050
2791B050k093J849k85j864J631Q66k731J081K389l221p04M011j719l111L849O08
$$ 2050 -43 1806 1521 -343 1288 2154 -577 504 2893 -328 -1032 2979 1260 -1851 1998 2606
2807B606l846J227L145l398r24L624j455j947K365k67j727J366Q1j423J553J15
$$ 2606 -1240 -13 3132 -266 -1190 2434 979 -968 1397 1130 -597 769 850 -573 980 1095
2823A095k086J523J651l119p1L318k882j570L927p57l450K518J566l177O51K679
$$ 1095 -991 532 2183 -936 -1007 2311 -571 -2141 1786 1029 -2421 97 1663 -1514 -863 1816
2839A816k498p67K434j222j144K142o71j911K512L08l476K657J560l843N39L866
$$ 1816 -682 -1449 985 -237 -1381 761 90 -1821 691 999 -2477 180 1740 -2103 -1564 2302
2855B302k729k130L823k58l662L034J405l269O05K174j646p15K018j308m61J706
$$ 2302 -427 -2557 1266 1008 -2654 380 1785 -1484 -879 1295 -351 -1066 952 -356 -817 889
2871H89p09j132K184q99k002K869L66l449K282J966l161p13M102k348j903L096
$$ 889 180 -952 1232 333 -1669 1200 1566 -1883 399 2365 -796 -1509 2593 245 -1658 1438
2887A438N22l407J814K075l358R06K020j975p8K588k129j151K886r11k182K728
$$ 1438 1960 -1447 367 2442 -916 -10 2010 35 -43 2545 416 -735 2151 1240 -942 1786
2903A786O59l358J903J882l231k11L512j778k122K951l21k162J657Q21k172J295
$$ 1786 2445 -913 990 2872 -359 -570 2942 1164 -958 1993 1672 -490 1167 1988 -184 1111
2919A111O76j580N75J270k441M05K418k320q20L027p74l587L202J479m056R38
$$ 1111 1787 207 782 2052 -389 16 2434 114 -706 2321 1547 -2040 1162 2641 -1415 -477
2935d77L661l020j683L549q45k676K256J046k622R12J390k077M27J548k062M05
$$ -477 3184 164 -1519 2030 1185 -1491 765 1811 -811 101 1491 -586 -159 1389 -673 -268
2951b68K046j991j198L227j694k178L056K97k878J178K144k931m87K597j308j077
$$ -268 1778 -213 -1411 1816 122 -2056 1000 1297 -1581 -403 1741 -1190 -1677 920 -388 -1465
2967a465K369r48j688K082J51k369K292N07k847J675J909l114l61L852k295k299
$$ -1465 904 -44 -1732 350 501 -1868 424 931 -1916 -241 1668 -1446 -1807 2045 -250 -2549
2983b549L747j4l735K185K475l218n69L002j395j685K260r4j608J341J71j385
$$ -2549 1198 1184 -2551 -366 2109 -1109 -1678 1324 -71 -1756 504 410 -1198 143 314 -1071
2999a071J649O9k162J863J081k955P58K682k718p44L217q50k760K696J104l077
$$ -1071 578 647 -1515 348 1429 -1526 -768 1914 -804 -1548 1669 819 -1941 755 1859 -1218
3015a218J002J982k196l45K336j433p64J811q09j056K269n80k548K483J135l554
$$ -1218 -216 1766 -430 -775 1561 128 -636 1175 366 -690 1579 999 -1549 934 2069 -1485
3031a485J176K386k771q84L600q26l199K878J336l452P20K281k000m35J902j343
$$ -1485 -309 2077 -694 -1578 2022 1196 -2003 875 2211 -1241 -521 1760 -240 -675 1227 -116
3047a16k14J358j255n21K313j269j614K656m1l239J796K338l628L20L413k141
$$ -116 -330 1028 -227 -748 1565 296 -1318 1338 1297 -1942 -146 2192 -1436 -1116 2297 156
3063A56k180L300m33k605J632J425k210O30J121j763L30J578j549o98K259j279
$$ 156 -2024 1276 843 -1762 -130 1295 -915 -285 836 -927 -597 981 -568 -1266 993 -286
3079b86j647K931j57l066K349J264l233P07K752k185j124K703o06k199J492Q69
$$ -286 -1933 998 841 -2225 124 1388 -1845 -1138 1614 -571 -1695 1008 402 -1797 -305 564
3095E64j713N76R63j460O16R06k058M40K499k396p17L097j010k994L443M01l639
$$ 564 -1149 -573 390 -1070 -454 452 -1606 -1166 1333 -1063 -1780 1317 307 -2687 756 1157 -2482
3112b482J713K449k688r96L378j485j596J783M82j819J474o0j374J277O12k047
$$ -2482 -769 1680 -1008 -2004 1374 -111 -1707 76 558 -1261 213 153 -1221 56 668 -1379
3128a379J209J678k482k08L097j957j837L139J31l226J526K710l147k05K399j193
$$ -1379 -170 1508 -974 -1182 1915 -42 -1879 1260 1391 -1835 -309 2401 -746 -951 1448 255
3144B55j291J857l07j039J514k13j166J116j85j174P95J603k930R48K399k302
$$ 255 -1036 821 514 -525 989 776 -390 726 541 -633 162 1765 -1165 -217 2182 -120
3160a20j304L642r92k856K702J385l076L33K072j810m81J832o28j005J586p34
$$ -120 -1424 2218 1226 -1630 1072 2457 -619 -286 1786 -24 -505 1327 699 -306 1280 546
3176E46j138J832l91j783J908M70k861J217K753l314o99L430j099k521K287R18
$$ 546 -592 1240 849 -934 974 1444 -1417 -200 2553 -761 -1460 1970 871 -1650 637 1555
3192A555k723M54K445j930n07J431q02o57J009n75l13J535r21j464K320k86l081
$$ 1555 -1168 -714 1731 -199 -706 725 -77 -734 275 -300 -613 922 1 -1463 857 571 -2510
3209b510K100J952k761l2L106k119j867K750p6k701J894J494k227K17J472k110
$$ -2510 -410 1542 -1219 -1251 1855 -264 -2131 619 543 -2158 -264 1230 -997 -780 692 -1418
3225a418R7J919j363l43J995j484j209K098O3k628K098J600l050J21K930k104
$$ -1418 -1321 598 -765 -1108 887 -597 -1806 292 355 -2273 -175 1425 -1625 -1504 1426 -678
3241f78j589K968p4k145J587O24j581O16J064j358O1J142j275N00J307j707l43
$$ -678 -2267 701 627 -1518 69 693 -888 -272 792 -566 -505 637 -638 -138 1169 -538 -881
3258h81K364r23j970K606J049l641J219K586k977n43L093j290j503J708M78k369
$$ -881 1483 560 -1410 1196 2245 -1396 -177 2409 -568 -1111 1982 692 -811 897 1375 -994
3274i94J360R72j193K92R88j695Q49J289k134o0K318j183j716K411L18k851J423
$$ -994 366 1338 145 437 1425 -270 579 1868 -266 -326 1992 809 -907 1504 1822 -1029 394
3291C94J981k464k04K441j680j279J797j72j189J247p6j256J032K70j463J364
$$ 394 2375 -89 -293 2148 468 -811 986 814 -375 872 796 -460 572 842 -621 743
3307G43Q78k574P08J886j909j205L157q94k956K431J340l070P75K111j748j119
$$ 743 1621 -953 -245 1641 -268 -1473 1684 790 -2166 265 1605 -1465 -690 1421 -327 -1446
3323a446K097o42j212J463j65j241J027J88j706J215Q85k344J069J670j954n73
$$ -1446 651 9 -1203 260 95 -1146 -119 69 -1637 -422 463 -1881 -812 858 -1096 -1669
3339a669K362r53k434K528O62k429P59J856k042k22K083j426o54J557j82j033
$$ -1669 693 -260 -2694 -166 496 -1933 -1174 682 -1360 -1582 501 -925 -1579 -22 -204 -1237
3355a237Q71K2j430J563M72k277J106J791k231j29K643j524j749K328jk254J659
$$ -1237 -366 -344 -1774 -211 261 -2016 -910 881 -1350 -1479 1164 -360 -2109 219 218 -2036 -377
3372c77J662k323q9J962j425l48J706j075p08J733o29j230J704K8j878K042M14
$$ -377 1285 -1038 -1127 835 -590 -938 768 -307 -1015 718 89 -1141 563 591 -1287 755 1169
3389A169k574Q01K539k187r11K440n72k193K084R01k536R39J604j454m13J683
$$ 1169 -1405 -604 1935 -252 -1163 1277 705 -1488 596 1497 -1039 -100 1504 50 -363 1320
3405A320r42q30J553r25p28J815n22j681J839K90j992J110J313j860p17K473j374
$$ 1320 378 -452 1101 176 -552 1263 741 -940 899 1189 -803 307 1620 -240 -957 1516 142
3422A42j206J721j6j428J154P09j810N29P70j134J64J344j362n78K209j355j270
$$ 142 -1064 657 641 -787 367 1076 -734 -205 565 -569 -405 939 -423 -1001 1208 -147 -1417
3439a417K233J07k751J802J402k821K25K481j500j609K373j14k519K049L37j282
$$ -1417 816 923 -1828 -26 1376 -1445 -1220 1261 -239 -1848 525 411 -2108 -59 278 -1004
3455a004L83P69j215J31Q68q54j89J296j009o21J730n27j565J702R9j992J114
$$ -1004 -621 148 -1067 -936 -68 -922 -1111 185 -824 -1445 285 -242 -1807 -105 -6 -1998 -884
3472h84J676k155j98J932j077j263J977p5j736J674J42j379P62R34j985M65J947
$$ -884 792 -1363 -1561 371 -706 -1969 8 -67 -1803 -129 13 -1366 -604 330 -1655 -1190 757
3489G57j956p12K712q90k357K183R62k485O33K154j719q93K066l99j841J466L94
$$ 757 -1199 -1911 801 -89 -2446 -263 699 -1786 -1153 1001 -718 -1611 455 56 -1785 -319 75
3506G5q82L42N66o08L57lp10J022N13j706N62J678j548j136K188J24j995J831
$$ 75 -807 -465 101 -507 -150 -153 -863 159 672 -1034 -472 1206 -342 -1478 710 834 -1161 670
3524F70P58k162N70J504j536m83J887p53j201J824j27k022J475P60j729N74J447
$$ 670 1428 -734 -164 1340 -196 -679 1208 455 -746 1078 951 -1071 404 1164 -565 9 1456
3541A456j915J7K220j149j393J920K23k284R90J607j957K51J260r07l66R13o32
$$ 1456 -459 -442 1778 629 -764 1156 1379 -905 85 1692 -265 -14 1246 339 -27 886 254
3558B54j24P61o27n3P61n66j169J729M8k171J796J083k495J4K667j531j654K620
$$ 254 130 891 264 211 972 406 -763 966 1014 -1157 639 1722 -773 -759 1908 377 -1277 1343
3576A343J1k647J396J662k317J90J369p28j022J722o84j099J502l13j437J318
$$ 1343 1354 -1293 103 1765 -552 -362 1007 279 -743 979 295 -804 698 385 -1052 266
3592B66J17j277Q65J106j467m90J551q16q87J418l04q59Q07L92j367J048J68j028
$$ 266 383 -894 -29 1077 -390 -880 671 -145 -1032 386 82 -777 30 422 -945 103 271 -757
3610g57M98P19j466K72J713j400j046K162R9k609J878J161k702O83K145j760j101
$$ -757 -259 460 -1006 -734 979 -421 -1467 695 794 -1815 63 1224 -1478 -795 1350 -410 -1511
3627a511K461l49j960J361O40j600P10R06q82j8Q85r63n5J217r31m35J926j148
$$ -1511 950 601 -1359 2 642 -958 -248 658 -224 -242 643 -320 -375 842 -89 -524 1402 254
3645B54j200J377M36j604J201P80j739M28J481j083o58J394p24n97J322J19j536
$$ 254 -946 431 867 -737 464 1244 -495 -67 1414 331 -327 1067 343 -254 1068 1187 -349
3662c49J070R81k199P29J614j741l67K111j281j516J864O96j945K98J744j486
$$ -349 721 1702 -497 232 1846 105 -262 1849 568 -948 916 1612 -333 -35 1709 223
3678B23j89J559r78o46J258m15p58M98J25p31J082m8j086Q59O64j569Q2J524j411
$$ 223 34 1593 615 -31 1227 812 54 552 677 -54 1028 980 -106 753 1417 -152 -70 1454 43
3697D3m80J672o82j456J530K75j663N20J514j927K16J361j014n90J676p94j232
$$ 43 -437 1235 553 -903 627 902 -761 -241 1273 -654 -438 923 -91 -681 995 201 -1031
3714a031J635j65j376J005J047k005J74J945j643q30J765k24j330R74M97j381
$$ -1031 604 439 -937 68 1115 -890 -716 1229 -414 -1244 521 297 -1033 -59 438 -943
3730i43L90P93r88M2Q34q44J5J174j008k17J347q24j164J679l11j541J076J366
$$ -943 -553 240 -748 -706 128 -716 -701 473 -535 -752 595 -229 -1393 286 -25 -1566 -490 876
3748H76k027q6K208q77j272J907m00j426J081O73j081O1J045j250L55J206j049
$$ 876 -1151 -1237 971 94 -1178 729 329 -1097 -16 657 -424 -363 682 -568 -213 993 -56
3765e6o09J710o50r07J294j20j421J302P64j821L71J305j453k28J356m86j002
$$ -56 -665 1045 395 -512 782 662 -759 543 1307 -514 -143 1162 -291 -519 837 351 -651
3782f51J010N10j283J047M19j154M07Q68j455R0J687j204o93J652j49j992J752
$$ -651 359 869 -414 633 1052 -102 305 1173 -282 -192 1495 291 -402 1250 1101 -891 861
3799H61Q71k179O11J362j222o02J580o73j003J263k26p76O16P2j128J000N22j331
$$ 861 1732 -447 164 1526 304 -298 1282 609 -394 869 643 -133 483 555 -573 427 949 -382
3817c82J59Q66q88o46J774p21j321J496L37j503Q21R47j451k29J395p85n86J362
$$ -382 -223 643 -245 -891 883 162 -1159 337 674 -829 -8 939 -512 -741 654 -131 -717 645
3835F45q30n64R09m0j176J341L90j718P01J122j538k73J820p95j361J543K8j718
$$ 645 -185 -749 160 120 -1056 285 675 -1043 -342 780 -758 -1031 789 -6 -1367 176 204 -1514
3853a514J188O32j490K58J312j244j79J379n55j009J535n82p77J442k41j495R87
$$ -1514 -326 306 -1184 -926 386 -858 -1037 342 -213 -1222 313 -269 -1046 396 155 -1340 -353
3870c53Q64j647N06J610j246j085K161n34j238J468J83j285L19J062j191j1J183
$$ -353 511 -1136 -630 980 -266 -1351 810 276 -962 506 689 -596 -277 785 -406 -417 766
3887G66r32j93R02o99j003J769n96j220J427N03j314M51J220j656l1J700j011
$$ 766 -166 -359 543 -156 -1159 610 14 -1206 221 724 -590 -139 1081 -575 -606 1094 83
3904H3p86J515l11j156J003P11j460N64O39p27j98J065j033m41J243j65j424J715
$$ 83 -703 812 501 -655 348 1059 -401 163 802 75 -123 942 -91 -532 711 546 -878 837
3922H37l2j556R53J258j786j22J652j204n63J218j7j372J072K12j006L86P60j126
$$ 837 805 -751 202 1460 -326 -448 1204 0 -563 655 638 -734 338 550 -456 -70 690 -436
3940d36N46Q21j462L22R80n88j168J710l08j544J687J96j235R1J188j137m80J297
$$ -436 110 931 -531 -209 771 183 -985 725 417 -1127 560 756 -479 -388 800 -337 -817 480
3958D80k48o73Q46P7j435J008J3r40R99J94j092K50J241j151q36J689l11j416
$$ 480 232 -441 405 482 -953 55 68 -872 127 321 -771 -521 720 -431 -1267 422 111 -1305
3976a305J859P0j786R09J067j537OJ518o03j075J075l29l89Q79p0j063Q91K65
$$ -1305 554 624 -1162 -253 814 -723 -717 801 198 -877 198 -131 -520 359 289 -774 117 382
3994C82r52M84R29j489K82J463j231q08J557k20j323J079N69j365K60J329j139
$$ 382 -570 -86 843 -646 -364 1099 -132 -940 617 397 -926 153 722 -643 -383 946 -193
4011a93k31J117m83r12J431j85q53J028k5j278R57P89j540N10J296j175q85J929
$$ -193 -424 693 210 -702 729 544 -309 719 694 -584 373 1162 -378 132 1428 253 -632 1297
4029A297n84j407J287M07j419P81N56r14k70J270r85l17R13l99m31J126m30j146
$$ 1297 713 -694 593 1000 -419 362 918 4 -266 1004 19 -298 615 216 -215 911 481 -665
4047f65J316M27j713P88J197j584j57J382o15j037J450L6j445P46P41j240J18
$$ -665 651 1078 -635 153 1350 -234 -391 991 376 -661 789 825 -620 126 867 -373 -255
4064b55J162j421M03J007r65k90J071n81j073J434q8j282N02J159j537j03J718
$$ -255 907 -514 -111 896 -69 -359 712 131 -942 492 404 -878 -376 783 -754 -857 861
4081H61j244p40J575k59j334J308K50j033L86N36j012J36J020j241J88J325r29
$$ 861 -383 -1123 452 193 -1141 167 417 -616 -230 306 -706 -570 450 -791 -603 722 -207
4098b07q92J577j16j626J254N05j789K95J697j125m26J180k72j103J039R8j201
$$ -207 -1099 478 362 -1264 -10 495 -1294 -999 698 -427 -853 327 55 -1048 -9 89 -1112
4115a112P97L99q52N46O45j086KQ85q18m49J629o21j216J591L24j475M69J076
$$ -1112 -315 84 -768 -222 423 -663 -661 224 -594 -1043 586 -35 -1251 340 664 -811 -342 734
4133G34j478K39R13m42m34N24j10k67P32m0j304J408K51j551Q71Q30j553K85J454
$$ 734 -744 -505 408 -34 -468 56 -54 -321 411 371 -933 475 726 -825 46 876 -677 -392 1062
4152A062r01j100J570K43j334P13R43j521J72J161j137L17Q08o12q84J077l54
$$ 1062 161 -939 631 874 -460 253 1196 -325 -153 1008 -129 188 996 384 -500 577 223
4169B23p95J297O0j268M96R10j195J89J458j201q68J580j90j486R80O24j347N00
$$ 223 -572 725 785 -483 13 923 -272 -83 1375 174 -694 886 696 -790 190 814 -533 -33
4187c3P02m23j54M90q59l8J014r19n71J296l07j234J297O58j958N08J480j582
$$ -33 669 246 92 582 -277 -315 699 -220 -791 505 198 -1036 261 919 -1039 -531 949 -633
4205f33l01J922q88j399J505m8j338P95O81q93K66K26m26o7N28n28o41J732o73
$$ -633 -934 988 100 -1299 206 158 -1180 -385 296 -597 -331 -105 -531 -598 -70 -598 -1239 493 -180
4224a80j063J156M07j466O64Q86j371M3J074m92n13R03j74r15R19j65n80O68l01
$$ -180 -1243 -87 320 -1146 -482 404 -967 -924 150 -342 -855 48 -126 -1041 -122 -287 -867 -199 -500
4243e00o45Q05P57j394M93P94q11p27J501j57j651J382N48j061j54J796j116j029
$$ -500 -1145 -340 417 -977 -484 310 -501 -1228 273 116 -1535 -153 395 -666 -820 976 -140 -1169
4261a169J703n07q43J062R2r30O45M11o82K32M92j077M51J157j143n08J424m16
$$ -1169 534 27 -816 246 338 -592 53 464 -218 14 506 -571 -120 1037 -106 -614 810 394
4279C94q26P34M40j438R56N27j120k6J026p54n20J377n46q31J288k63j015J228
$$ 394 -432 302 742 -696 260 787 -333 -359 667 -87 -607 770 224 -607 681 418 -597 631
4297F31L24j577O56R68j016j23J191m66j693J753M52j422J43J248j268k92Q53
$$ 631 955 -622 34 1002 -14 -137 1054 588 -1105 648 1100 -322 -179 1069 -199 -491 362
4314C62m16k35K90l6l78L68k12q3K41L46j111Q95K4r20M03Q90q39m70J362n29
$$ 362 -54 -289 1 -35 -413 -45 -257 -340 -99 247 -864 31 55 -865 -462 428 -411 -881 481 -48
4334d8j182J173M42j409Q33L88q27m2J210j084r5J070p66n49J039j84j147J097
$$ -48 -1230 -57 385 -1024 -191 197 -630 -672 538 -546 -641 429 -337 -886 153 -31 -1178 -81
4352h1M33j629K35J543j025p52J350K8j297R35N31p75K4M80n18L30L13l39J9N85
$$ -81 352 -1277 -1042 501 -524 -1276 74 102 -1195 -260 271 -504 -480 0 -518 -188 125 -214 -195 390
4372C90r93J43J203q75n15J357k76j379R96R89j555j90J569p69q04J208k53j218
$$ 390 -603 -460 743 -132 -647 710 434 -945 51 1040 -515 -705 864 95 -709 499 246 -972
4390i72J055N15q94N25L45m94k44J153j154l79J259k36r46J064J49j061M96Q81
$$ -972 83 598 -296 229 574 80 -164 989 -165 -544 715 479 -467 597 746 -315 181 1062
4408A062j267K43R67k92r57J027n6n91M14Q9q82P13M27r75N92N14j512M77J034
$$ 1062 -205 38 1005 713 -244 783 727 136 550 639 -243 470 897 -78 514 1028 -484 -7 1027
4427A027j029m09J177p08j021J517L04j620M27J336j415k12J183l28o40J083q9
$$ 1027 -2 -411 766 58 -963 554 858 -762 -335 1001 -414 -626 557 229 -411 672 583
4444E83j141O40K00q82P03L27p62O3J116j150o22J732q23j101J102L77j285N66
$$ 583 -558 82 282 -600 103 430 -332 -269 847 -303 -925 807 -16 -1117 -15 362 -923 -357
4462c57Q45j168j00J193o73l75P59m23n95R00k59p66J257k62r66O00Q71j421K11
$$ -357 488 -680 -780 413 -260 -635 124 -299 -894 6 -253 -1019 238 -24 -990 -390 481 -940 -729
4481g29J234q39p38J333J71j257P79M44q93M9R76r73j40Q93p42j4O56l83l54P78
$$ -729 505 -334 -1072 261 432 -825 -46 398 -495 -446 530 -443 -583 310 -432 -446 210 -173 -527 251
4501B51j62r86O98Q05j372L59J422r81n65J134l91j026J171J34o44j46O38m44
$$ 251 89 -897 -199 606 -766 -407 1015 34 -531 603 212 -814 357 491 -153 -299 339 -105
4519a05l9L18k98j8P42p87j43J265o73j065J620j60j390O56J077j325k92J758
$$ -105 -144 174 -124 -142 600 -187 -330 935 262 -803 817 657 -733 -77 1000 -325 -617 1141
4537A141r10r07J060L94j151O55J63n71j3P87o09P9K69j48n76J053o60k51Q92
$$ 1141 231 -676 384 778 -373 282 445 -126 -139 648 39 118 387 239 -337 716 56 -195 697
4556F97j5j166Q18N12j198k37J543r31m91J014j50r56P26L86p49M05J2n27J84
$$ 697 682 -484 334 846 -352 -589 954 23 -468 546 396 -560 166 552 -197 208 220 -307 -123
4575a23L55o15j45J273r90n28J338L9j431J011K92j182J70J170n68j096J341j8
$$ -123 232 -383 -528 745 -245 -773 565 604 -827 184 476 -706 -536 634 66 -1030 311 293
4593B93o60K77j9l67N39R4q56Q57np72L79O46q92r4J321q57q75J144N85j707Q34
$$ 293 -367 -90 -109 -476 63 157 -699 158 153 -619 -240 406 -486 -580 741 -116 -991 153 738 -969 -135
4614a35O66q80k78J013m94q48J189l79k99M35J04m40N51j81q45Q89M60j429N17
$$ -135 531 -349 -627 386 -108 -956 233 -146 -445 -10 94 -346 205 24 -821 68 528 -901 -384
4633c84J216j135m42J180Pj152R29M41j043K74P61l64o20P42n25o2O60m44m48
$$ -384 832 -303 -745 435 442 -710 219 660 -383 -109 652 288 -332 410 -115 -177 483 39 -409
4652d09Q84l10p13J447j27j226J24J214r08m93J475l94j217P91Q51q98k02J098
$$ -409 475 165 -548 899 772 -454 -330 884 -24 -517 958 564 -653 138 989 91 -111 987
4670I87r93Q0K14m29J28N28p79L6R96p67n47R69J52j097N58P96j079m13J381n42
$$ 987 -6 74 288 -141 -13 515 -264 -228 768 1 -546 423 575 -522 36 832 -247 -660 721 179
$$ [...]
8191F2
##END NTUPLES=NMR FID
##END=
