##TITLE=1H_EC-3189(35)
 CDCl3, 8 sc, 
 18.10.2019
##JCAMPDX= 6.0         $$ Bruker NMR JCAMP-DX V2.0
##DATA TYPE= NMR FID
##DATA CLASS= NTUPLES
##ORIGIN= UXNMR, Bruker Analytische Messtechnik GmbH
##OWNER= root
$$ XWIN-NMR		Version 3.5
$$ Fri Oct 18 14:37:19 2019 Russian Standard Time (UT+4h)  she@DPX200
##.OBSERVE FREQUENCY= 200.1315
##.OBSERVE NUCLEUS= ^1H
##.DELAY= (6, 6)
##.ACQUISITION MODE= SIMULTANEOUS
##.ACQUISITION SCHEME= undefined
##.AVERAGES= 8
##.DIGITISER RES= 18
##SPECTROMETER/DATA SYSTEM= spect
##.PULSE SEQUENCE= zg30
##.SOLVENT NAME= CDCl3
##.SHIFT REFERENCE= (INTERNAL, CDCl3, 0, 15.7039)
##AUDIT TRAIL= $$ (NUMBER, WHEN, WHO, WHERE, WHAT)
$$ ##TITLE= Audit trail, XWIN-NMR		Version 3.5
$$ ##JCAMPDX= 5.01
$$ ##ORIGIN= Bruker BioSpin GmbH
$$ ##OWNER= she
$$ F:/spectra/data/she/nmr/H-F/1/audita.txt
$$ ##AUDIT TRAIL=  $$ (NUMBER, WHEN, WHO, WHERE, WHAT)
(   1,<2019-10-18 14:35:44.98 +0400>,<she>,<DPX200>,
      <created by zg, POWCHK disabled, PULCHK disabled
       configuration hash MD5:
       00 E9 B6 7A A2 85 ED C7 34 08 36 98 17 FE 4E 26
       data hash MD5: 16K
       55 B0 70 66 8B 5A CD 80 A0 C6 6B E7 38 82 C3 37>)
$$ ##END=
$$ 
$$ hash MD5
$$ A1 65 FF E5 51 66 6E 42 09 E2 A3 A1 56 FD E2 FC
##$RELAX= 
##$RELAX= 
##$RELAX= 
##$RELAX= 
##$RELAX= 
##$RELAX= 
$$ Bruker specific parameters
$$ --------------------------
##$DU= <F:/spectra>
##$EXPNO= 1
##$NAME= <H-F>
##$PROCNO= 1
##$TYPE= <nmr>
##$USER= <she>
##$AMP= (0..31)
100 100 100 100 100 100 100 100 100 100 100 100 100 100 100 100 100 100 
100 100 100 100 100 100 100 100 100 100 100 100 100 100 
##$AQSEQ= 0
##$AQ_mod= 1
##$AUNM= <au_zg>
##$AUTOPOS= <>
##$BF1= 200.13
##$BF2= 200.13
##$BF3= 200.13
##$BF4= 200.13
##$BF5= 200.13
##$BF6= 200.13
##$BF7= 200.13
##$BF8= 200.13
##$BYTORDA= 1
##$CFDGTYP= 0
##$CFRGTYP= 5
##$CHEMSTR= <none>
##$CNST= (0..31)
1 1 145 1 1 1 1 1 1 1 1 1 1 1 1 1 1 1 1 1 1 1 1 1 1 1 1 1 1 1 1 1 
##$CPDPRG= <>
##$CPDPRG1= <>
##$CPDPRG2= <>
##$CPDPRG3= <>
##$CPDPRG4= <mlev>
##$CPDPRG5= <mlev>
##$CPDPRG6= <mlev>
##$CPDPRG7= <mlev>
##$CPDPRG8= <mlev>
##$CPDPRGB= <>
##$CPDPRGT= <>
##$D= (0..31)
0 1.2 0 0 0 0 0 0 0 0.06 0 0.03 0 0 0 0 0.0002 0 0 0 0 0 0 0 0 0 0 0 0 
0 0 0 
##$DATE= 1571394944
##$DBL= (0..7)
120 120 120 120 120 120 120 120 
##$DBP= (0..7)
150 150 150 150 150 150 150 150 
##$DBP07= 0
##$DBPNAM0= <>
##$DBPNAM1= <>
##$DBPNAM2= <>
##$DBPNAM3= <>
##$DBPNAM4= <>
##$DBPNAM5= <>
##$DBPNAM6= <>
##$DBPNAM7= <>
##$DBPOAL= (0..7)
0.5 0.5 0.5 0.5 0.5 0.5 0.5 0.5 
##$DBPOFFS= (0..7)
0 0 0 0 0 0 0 0 
##$DE= 6
##$DECBNUC= <off>
##$DECIM= 24
##$DECNUC= <off>
##$DECSTAT= 4
##$DIGMOD= 1
##$DIGTYP= 9
##$DL= (0..7)
0 120 120 120 120 120 120 120 
##$DP= (0..7)
150 150 150 150 150 150 150 150 
##$DP07= 0
##$DPNAME0= <>
##$DPNAME1= <>
##$DPNAME2= <>
##$DPNAME3= <>
##$DPNAME4= <>
##$DPNAME5= <>
##$DPNAME6= <>
##$DPNAME7= <>
##$DPOAL= (0..7)
0.5 0.5 0.5 0.5 0.5 0.5 0.5 0.5 
##$DPOFFS= (0..7)
0 0 0 0 0 0 0 0 
##$DQDMODE= 0
##$DR= 18
##$DS= 0
##$DSLIST= <SSSSSSSSSSSSSSS>
$$ [...]
##$SUBNAM2= <"">
##$SUBNAM3= <"">
##$SUBNAM4= <"">
##$SUBNAM5= <"">
##$SUBNAM6= <"">
##$SUBNAM7= <"">
##$SUBNAM8= <"">
##$SUBNAM9= <"">
##$SW= 24.0689530833862
##$SWIBOX= (0..15)
0 0 2 0 0 0 0 0 0 0 0 0 0 0 0 0 
##$SW_h= 4816.95568400771
##$TD= 16384
##$TD0= 1
##$TE= 0
##$TE2= 300
##$TE3= 300
##$TEG= 300
##$TL= (0..7)
0 120 120 120 120 120 120 120 
##$TP= (0..7)
150 150 150 150 150 150 150 150 
##$TP07= 0
##$TPNAME0= <>
##$TPNAME1= <>
##$TPNAME2= <>
##$TPNAME3= <>
##$TPNAME4= <>
##$TPNAME5= <>
##$TPNAME6= <>
##$TPNAME7= <>
##$TPOAL= (0..7)
0.5 0.5 0.5 0.5 0.5 0.5 0.5 0.5 
##$TPOFFS= (0..7)
0 0 0 0 0 0 0 0 
##$TUNHIN= 0
##$TUNHOUT= 0
##$TUNXOUT= 0
##$USERA1= <user>
##$USERA2= <user>
##$USERA3= <user>
##$USERA4= <user>
##$USERA5= <user>
##$V9= 5
##$VALIST= <valist>
##$VCLIST= <CCCCCCCCCCCCCCC>
##$VD= 0
##$VDLIST= <DDDDDDDDDDDDDDD>
##$VPLIST= <PPPPPPPPPPPPPPP>
##$VTLIST= <TTTTTTTTTTTTTTT>
##$WBST= 1024
##$WBSW= 4
##$XGAIN= (0..3)
0 0 0 0 
##$XL= 0
##$YL= 0
##$YMAX_a= 290838
##$YMIN_a= -236968
##$ZGOPTNS= <>
##$ZL1= 120
##$ZL2= 120
##$ZL3= 120
##$ZL4= 120
##$ABSF1= 10
##$ABSF2= 0
##$ABSG= 5
##$ABSL= 3
##$ALPHA= 0
##$AQORDER= 0
##$ASSFAC= 0
##$ASSFACI= 0
##$ASSFACX= 0
##$ASSWID= 0
##$AUNMP= <proc_1d>
##$AZFE= 0.1
##$AZFW= 0.1
##$BCFW= 1
##$BC_mod= 2
##$BYTORDP= 1
##$COROFFS= 0
##$CY= 11.3945322036743
##$DATMOD= 1
##$DC= 2
##$DFILT= <>
##$DTYPP= 0
##$F1P= 20.1720416913024
##$F2P= 0.152960286110954
##$FCOR= 0.5
##$FTSIZE= 0
##$FT_mod= 4
##$GAMMA= 1
##$GB= 0.15
##$INTBC= 1
##$INTSCL= 1
##$ISEN= 128
##$LB= 0.24
##$LEV0= 0
##$LPBIN= 0
##$MAXI= 10000
##$MC2= 0
##$MEAN= 0
##$ME_mod= 0
##$MI= 1.114404
##$NCOEF= 0
##$NC_proc= 0
##$NLEV= 6
##$NOISF1= 3.799351
##$NOISF2= 2.8
##$NSP= 1
##$NTH_PI= 0
##$NZP= 0
##$OFFSET= 15.70392
##$PC= 1
##$PHC0= -9572.39
##$PHC1= 19.60089
##$PH_mod= 1
##$PKNL= yes
##$PPARMOD= 0
##$PSCAL= 0
##$PSIGN= 0
##$REVERSE= no
##$SF= 200.130013532006
##$SI= 16384
##$SIGF1= 3
##$SIGF2= 2
##$SINO= 400
##$SIOLD= 16384
##$SREGLST= <1H.CDCl3>
##$SSB= 0
##$STSI= 0
##$STSR= 0
##$SW_p= 3612.71676300578
##$SYMM= 0
##$S_DEV= 0
##$TDeff= 0
##$TDoff= 0
##$TI= <>
##$TILT= no
##$TM1= 0
##$TM2= 0
##$TOPLEV= 0
##$USERP1= <user>
##$USERP2= <user>
##$USERP3= <user>
##$USERP4= <user>
##$USERP5= <user>
##$WDW= 1
##$XDIM= 8192
##$YMAX_p= 0
##$YMIN_p= 0
$$ End of Bruker specific parameters
$$ ---------------------------------
##NTUPLES= NMR FID
##VAR_NAME=  TIME,          FID/REAL,        FID/IMAG
##SYMBOL=    X,             R,               I
##VAR_TYPE=  INDEPENDENT,   DEPENDENT,       DEPENDENT
##VAR_FORM=  AFFN,          ASDF,            ASDF
##VAR_DIM=   8192,          8192,            8192
##UNITS=     SECONDS,       ARBITRARY UNITS, ARBITRARY UNITS
##FACTOR=    0.0002076,     1,               1
##FIRST=     0,             0,               0
##LAST=      1.7004516,     0,               0
##MIN=       0,             -236968,         0
##MAX=       1.7004516,     290838,          0
$$ Real data points
##PAGE= N=1
##DATA TABLE= (X++(R..R)), XYDATA
0 0 0 0 0 0 0 0 8 -8 8 -16 16 -24 24 -32 40 -48 56 -72 80 -96 112 -132 152 -176 203 -233 266 -301 342
29 342 -386 435 -490 548 -613 685 -763 849 -943 1045 -1159 1285 -1422 1574 -1745 1932
45 1932 -2145 2383 -2652 2964 -3327 3752 -4266 4893 -5687 6719 -8135 10202 -13523 19753
59 19753 -35620 165421 290838 101519 147054 174575 232991 244226 220800 159392 171450 144548
71 144548 89929 68315 90931 94255 135197 135350 38317 -48724 -21813 16880 43816 66331 37829
84 37829 -22660 -17057 -7794 -37880 -23063 38313 46285 30592 18457 -24544 -44436 11963 48024
97 48024 37357 44811 34714 -13483 -15310 12241 -494 1856 39052 26841 -14155 -26312 -47579
110 -47579 -60305 -13983 13992 -21275 -40621 -48236 -81573 -73999 -26768 -31713 -51459 -28553 -32626
123 -32626 -66182 -56032 -37504 -40775 -11105 18338 -6532 -22262 -10749 -20515 -7775 45380
135 45380 49996 20518 29830 31178 7187 28521 61306 47236 45439 61993 35699 17028 39500
148 39500 36762 21495 48092 54517 20679 14424 15330 -7548 6276 37742 16842 -6285 7089
161 7089 -4719 -24041 -2306 4385 -16419 -2282 12368 -13508 -19245 -6506 -19972 -13339 21992
174 21992 9823 -17883 -1345 3367 -16849 -2511 11464 -6442 1409 19460 -7373 -25683
186 -25683 -9209 -12419 -15955 7228 -3455 -37878 -29316 -19939 -43035 -38529 -20638 -37785 -41219
199 -41219 -23284 -47002 -73450 -52044 -38508 -43771 -27408 -31638 -64829 -57408 -31693 -42340 -40024
212 -40024 -14928 -24113 -34307 -15307 -24331 -44290 -17472 5314 -7147 -1571 1995 -26660 -26233
225 -26233 3456 -469 -7488 10446 -1305 -23727 -10063 -9264 -30582 -11884 10435 -12134 -24248
238 -24248 -17161 -35355 -39302 -9018 -8379 -25210 -14603 -19206 -41962 -27547 -12063 -26549 -15693
251 -15693 8427 -10743 -28941 -14950 -18033 -19221 12059 16069 -11310 -8425 2 -16054 -6741
264 -6741 13261 216 -1769 16412 -788 -24883 -9073 -1006 -7128 11512 13027 -21292 -25018
277 -25018 -5097 -13036 -12799 5465 -5676 -17774 -1423 -8723 -31097 -12431 6433 -3818 2775
290 2775 7486 -19755 -21913 8243 7404 -1272 14315 10443 -6566 7237 11747 -5810 7961 29051
304 29051 15171 9464 17198 -1440 -5860 25629 27299 6498 14479 16214 -2063 7122 19632
317 19632 3276 6672 26853 12501 -2416 8636 2120 -5231 19717 24947 8 1263 8744
330 8744 -5924 829 19990 5880 -2115 16348 8947 -8744 1961 5588 -3163 13339 20412
343 20412 -5621 -9279 5486 -3806 -2741 16895 5963 -11391 2672 3377 -13610 -3096 6733
356 6733 -7043 -481 10386 -11163 -19922 -1695 -3383 -7852 8381 858 -20861 -8619 1300
369 1300 -13583 -7127 6842 -7095 -9839 4948 -7898 -19221 -365 3586 -5405 6861 4688
382 4688 -18188 -8979 10294 75 -1343 12197 -29 -7024 10871 5937 -9338 7781 18032
395 18032 4966 9022 13017 -5047 347 23410 16150 6799 18174 10446 10 18040 20585
408 20585 2721 12917 26818 12286 7687 15581 4199 4996 26806 20496 3168 11451 11202 -951
422 -951 12225 20720 3128 4972 19004 5441 -2556 10782 6346 533 18450 16917 -3328 2419
436 2419 10691 -154 7907 20675 5698 457 14633 5634 -4177 11997 13650 256 10528
449 10528 14500 -5083 -3211 8972 -808 -174 13271 -287 -13023 381 -1439 -13106 -108
462 -108 4476 -13067 -9092 713 -14623 -15606 674 -5969 -12013 2158 -3609 -19175 -6723 1776
476 1776 -8022 860 7980 -8757 -8349 7929 -626 -6453 9714 6492 -5247 5591 5335 -11190
490 -11190 -2586 9967 -1436 -2646 4203 -11837 -16851 373 -3215 -15641 -6231 -6710 -21144 -14103
504 -14103 -8076 -23466 -18999 -3165 -12697 -20708 -11859 -19575 -24683 -5666 -3147 -17401 -10874 -4529
518 -4529 -16850 -11464 800 -10139 -10682 6452 -748 -13735 -5130 -4486 -11234 2421 6269 -12064
532 -12064 -12027 -2490 -13360 -14357 -1276 -10756 -18350 -4770 -9253 -26025 -17450 -10014 -18623 -10668 -3533
547 -3533 -19781 -22398 -7187 -11254 -14468 -442 -2432 -11579 544 3452 -10125 -884 13341 5023
561 5023 6216 16609 4712 -1000 15096 15828 6877 16281 16169 2204 8370 14185 675 2357
575 2357 15577 5836 -2141 5722 -3114 -12325 1760 4824 -8580 -4466 -393 -13136 -10622 340
589 340 -8547 -9979 4263 -1152 -11132 -1731 -1199 -9241 4526 12605 -1941 -1467 8474 698 -634
604 -634 12068 6392 -154 11110 8191 -6515 284 5325 -3790 1900 8579 -7797 -13914 -2436
618 -2436 -8247 -14490 -3042 -5467 -17852 -9614 -7321 -21690 -16632 -4882 -11838 -11098 -2058 -13172
632 -13172 -19135 -2904 -1163 -8563 2647 5817 -6817 -378 8428 -1777 527 15423 10633 4896
646 4896 12391 5363 -3384 11063 16349 4360 7570 11620 -1283 -810 8185 -1012 -4282 9814
660 9814 4840 -8424 -3224 -3137 -11770 -1342 6577 -6120 -6633 1636 -6563 -8825 3869 1118 -3779
675 -3779 9176 9220 -5503 75 8811 3297 9233 17964 6036 2429 13630 8732 1203 13060
689 13060 14017 4724 10802 10975 -4409 -907 10219 2632 -386 7241 -2682 -11497 -722 -1530 -12109
704 -12109 -4212 691 -10599 -8644 -5177 -16385 -13442 1830 -4269 -12319 -3890 -6512 -14226 -3712
718 -3712 -157 -10265 -3405 5654 -5980 -9242 -1089 -6637 -7144 6493 1275 -12233 -6156 -3835
732 -3835 -12646 -6670 -2203 -14392 -13278 -4096 -15603 -24358 -15152 -16009 -20564 -12485 -16410 -31272 -25095
747 -25095 -17133 -25647 -24632 -16663 -24523 -26710 -16724 -22767 -31254 -19113 -13837 -20154 -14797 -14151 -25718
762 -25718 -20039 -6576 -13654 -16625 -6714 -10792 -15917 -6939 -9245 -18493 -7572 -4 -10853 -11265
776 -11265 -6603 -15394 -13775 -1547 -7807 -15504 -6919 -7718 -16392 -9414 -7447 -16213 -8602 523 -10640
791 -10640 -14353 -5562 -8788 -9477 2503 -548 -10237 -697 3510 -5232 -689 7401 929 3876 12875
806 12875 3528 -2400 9053 9846 3972 11799 11589 228 5613 11592 1309 1448 10287 3877 -260
821 -260 6888 -90 -8805 1856 4667 -5585 -2509 583 -9948 -8295 178 -8019 -10651 86
835 86 -3634 -11175 -4768 -5784 -13212 -3890 2188 -8279 -7561 -560 -8143 -8932 1319 -3372 -9295 323
851 323 -494 -11229 -5899 -2226 -10123 -5652 1003 -9470 -12956 -4161 -9504 -14720 -5240 -7128 -15709
866 -15709 -8732 -7099 -17799 -14082 -5730 -12799 -12671 -4244 -11359 -16597 -6243 -6537 -12664 -3996 -1195
881 -1195 -10138 -5405 1535 -7264 -5272 5777 438 -3497 5386 2550 -4369 4504 7769 -16 4329
896 4329 9287 -157 677 8737 2186 -247 9574 6283 -1932 4708 5435 -2735 4151 10138 611 868
912 868 8035 914 -692 8612 5730 326 9434 8622 -840 5175 10278 2994 6369 14040 5422 2542
928 2542 11108 7153 2406 11479 11486 2793 8416 10176 155 3247 11169 3643 2408 9904 2918 -3380
944 -3380 5339 4739 -2523 4475 6805 -3140 -1367 4800 -2994 -2526 6091 1002 -3819 4150 869 -7032
960 -7032 1612 5379 -2483 1301 5821 -3343 -3026 5985 397 -2754 6567 4214 -3252 2694 3440 -4241
976 -4241 1918 8385 -97 -281 5815 -993 -3550 6408 3834 -2345 5065 5535 -3427 751 5384 -1808
992 -1808 816 8658 1074 -2609 5202 1361 -3800 5407 6042 -2366 2400 5296 -2711 -622 6742
1007 6742 -225 -1827 6956 2200 -4553 2259 2359 -3401 3484 6354 -3861 -1603 5057 -1965 -2486
1022 -2486 5857 896 -3803 4391 2906 -4752 1286 4666 -2395 1201 6423 -2536 -3721 5177 1192
1037 1192 -2797 4902 2509 -4639 2308 4028 -4893 -219 6337 -1413 -1584 5615 -819 -4325 4764
1052 4764 3570 -2124 4647 5069 -3299 1810 8300 653 1287 9629 3555 833 8457 5648 -84
1067 -84 8454 10142 2622 6435 9444 1445 3706 11660 5505 2472 9842 5761 -235 7059 6532 -1235
1083 -1235 5125 8898 -406 -311 4930 -1034 -1990 6068 1812 -3933 2817 1235 -6836 -303 3872 -4198
1099 -4198 -2008 3816 -3385 -5389 1906 -2179 -5959 2847 1757 -6473 -1935 -28 -7635 -3600 2664
1114 2664 -5402 -7201 20 -5126 -9773 -1984 -3797 -10008 -3137 -1030 -11057 -9209 -4228 -9634 -7819
1129 -7819 -461 -7636 -12110 -3297 -4784 -11195 -4165 -2285 -8930 -3700 1164 -7223 -7741 427 -2391
1144 -2391 -3437 4132 135 -6574 1604 4034 -2662 1597 5450 -1352 784 7057 -233 -3306 5258
1159 5258 4434 -334 5217 3373 -4613 1204 6680 -783 -212 5209 -989 -2024 4817 126 -5118
1174 -5118 3278 4907 -2059 1253 2989 -4693 -659 7058 711 -1674 4861 1216 -2606 4917 3487
1189 3487 -2989 4082 7155 -1231 -311 4393 -1834 -413 7819 1993 -3568 2807 1435 -4575 1518
1204 1518 3116 -4360 -677 3639 -4259 -5286 1457 -2545 -4116 3531 -127 -6738 -634 1760 -4775
1219 -4775 -393 4244 -2235 -1681 4898 -1114 -3490 5204 3975 -642 5419 5402 -2314 2270 7259 1042
1235 1042 2839 8573 2234 -649 6308 3155 -1578 5784 6197 -1446 1940 4268 -3487 -1170 5383
1250 5383 -611 -2530 4228 -507 -6103 1155 1328 -4543 821 3554 -4487 -2964 2293 -3239 -3510
1265 -3510 4792 755 -4086 2504 980 -5206 969 4460 -2347 243 5164 -2512 -3535 3658 -392
1280 -392 -3422 3889 1561 -5316 -543 836 -6022 -1922 3485 -4068 -4355 1575 -3773 -7208 541
1295 541 -376 -5433 692 1294 -6073 -2193 2922 -2996 -1417 5526 317 -2303 4805 2425 -1995 5486
1311 5486 7127 542 4457 7718 751 1942 8656 4040 2144 8739 5431 -526 5533 5874 -620
1326 -620 4256 7548 254 855 5488 -432 -2009 4796 1948 -2382 3769 2468 -4662 322 3839
1341 3839 -2652 -1 4976 -1346 -2607 3864 430 -3146 3822 3292 -2325 2252 3704 -3561 -583
1356 -583 4531 -936 -1888 3626 -1502 -5292 1390 64 -6438 -1056 824 -6490 -4312 -774 -7574
1371 -7574 -7375 -313 -4834 -8420 -2818 -5476 -10126 -3249 -1498 -8584 -5456 -934 -6368 -6056 -613
1386 -613 -5201 -6406 1901 -99 -6076 -1111 132 -4845 608 4320 -2920 -2441 3702 -742 -2456
1401 -2456 3218 416 -3596 3692 3392 -4694 -1329 2545 -2000 248 4819 -2243 -4119 3681 1182
1416 1182 -3287 2209 2512 -2253 3200 5258 -2454 -598 6254 2167 1986 7144 2342 -1151 6303
1431 6303 6627 794 4862 7326 1665 4791 8417 1106 741 8179 5435 1136 6086 3626 -1814
1446 -1814 4190 6039 -1134 1146 5132 -958 -907 4257 -892 -3369 4047 2302 -3441 990 1502 -4070
1462 -4070 55 4861 -1741 -2040 3807 -790 -2759 3394 1270 -2936 3001 3473 -2996 271 3023
1477 3023 -2790 -1009 4595 -439 -3208 2458 35 -4732 1529 1774 -4304 -737 2189 -4267 -3219
1492 -3219 1689 -3110 -3938 2140 -1035 -5366 138 -71 -5088 -172 2544 -3748 -2035 3037 -2262
1507 -2262 -2739 3291 87 -3523 2748 1920 -3342 1112 3294 -2473 171 4703 -1562 -2209 3460 324
1523 324 -2240 3237 1740 -3750 1292 3384 -3130 -1190 2611 -1952 -1376 3880 -1162 -4345 2078
1538 2078 1482 -3252 1259 2051 -3552 34 3983 -2187 -1789 3879 67 -1609 3779 977 -3302 2688
1554 2688 4078 -1746 1131 3796 -1337 -61 5063 -25 -1900 4464 2549 -1813 3294 3097 -2146
1569 -2146 2102 4957 -983 362 5041 -297 -950 5015 1818 -1684 3443 3373 -1922 2184 4431 -1397
1585 -1397 832 4998 -143 -1289 4376 1073 -1851 3805 2656 -2214 1990 3809 -2003 194 3984
1600 3984 -1117 -1862 3975 151 -3442 1922 1022 -3707 725 2127 -4149 -1719 2181 -2900 -3278 1605
1616 1605 -2021 -4819 705 -1104 -5574 -842 -22 -5463 -2712 541 -5268 -4552 295 -3695 -5834
1631 -5834 -184 -2151 -5980 -1442 -1018 -6092 -2639 670 -4949 -3970 520 -3269 -5096 738 -1646
1646 -1646 -5281 -106 312 -4772 -646 1667 -3724 -2333 2687 -1768 -2891 2658 112 -2970 2169
1661 2169 2074 -3196 716 3418 -1835 257 4157 -115 -1003 4463 1247 -1690 3694 3252 -1870 2244
1677 2244 4370 -1378 701 4891 326 -140 4851 1549 -1193 4302 3180 -1550 2863 4000 -1181
1692 -1181 1543 4603 -819 -629 4405 1034 -1379 3867 1666 -2613 2272 2973 -2286 265 3265
1707 3265 -1641 -932 3062 -1245 -2877 2564 733 -3607 650 890 -3770 -573 2297 -3592 -2460
1722 -2460 1806 -1998 -3700 1080 -1159 -4557 528 865 -4062 -1348 1265 -3528 -1902 1786 -2582
1737 -2582 -3869 1756 -553 -3737 1011 349 -4054 -236 2129 -3970 -2288 1528 -2516 -3012 1803
1752 1803 -1408 -4384 626 181 -3881 -772 761 -4038 -1999 2033 -3307 -3931 1294 -1084 -3617
1767 -3617 1191 -568 -4676 -200 1568 -3587 -1469 1793 -2816 -2196 2255 -1435 -3376 1880 830
1782 830 -3392 786 1352 -3711 -226 2845 -2442 -1726 2629 -920 -2537 1977 440 -3147 1280 2006
1798 2006 -2993 224 2581 -2075 -990 3244 -614 -2089 3092 853 -2178 2239 2419 -1811 1799
1813 1799 3763 -1038 188 4557 490 -432 4280 2060 -616 3835 3037 -1317 2620 4832 69
1828 69 1045 4456 244 -342 4096 1377 -1324 3343 2460 -1671 1687 2768 -1891 111 3706 -737
1844 -737 -1589 2600 -212 -2310 2666 1044 -3337 800 1909 -2698 -900 2062 -2298 -1971 2192 -1191
1860 -1191 -3683 1043 -130 -3374 313 716 -4114 -1584 1154 -3260 -3126 622 -2289 -3758 809
1875 809 -1366 -5041 -1073 -108 -4179 -1927 -10 -4240 -3207 1023 -2575 -4075 229 -1219 -4096
1890 -4096 245 -14 -4656 -1053 1871 -2476 -1793 1700 -1551 -2562 2558 351 -2849 1615 1857 -2332
1906 -2332 630 2497 -1629 43 3507 -431 -1139 3281 810 -1564 2742 1945 -1935 1645 3361
1921 3361 -1010 618 4026 -186 -46 4554 1129 -1187 3102 2635 -667 2543 3634 -224 1443
1936 1443 4078 60 193 4145 1067 -562 3665 2262 -1090 2545 3203 -1122 1327 3626 -941
1951 -941 -316 3482 -26 -1733 2709 863 -2083 1540 1709 -2604 89 2273 -1938 -1162 2276 -1395
1967 -1395 -2350 1496 -249 -3132 801 806 -2967 -490 1388 -2415 -1357 2013 -1654 -2550 1340 -445
1983 -445 -3218 796 330 -3605 -342 903 -2977 -1576 1269 -2296 -2427 1749 -1260 -3395 989 92
1999 92 -3588 59 1062 -2982 -1371 1802 -2311 -2517 1587 -981 -2692 1360 -42 -3129 591 1416
2015 1416 -2472 -417 2193 -1615 -1457 1991 -686 -2137 2209 1003 -2295 1180 1590 -2146 153
2030 153 2471 -1110 -892 3002 -228 -1615 2412 561 -2318 1924 2071 -2088 249 2787 -1221 -536
2046 -536 3236 -497 -1539 2537 969 -1772 1998 1850 -1749 1070 2777 -1153 -281 2927 -239 -559
2062 -559 3282 798 -1429 2410 2004 -1058 1292 2415 -1286 229 3496 -420 -845 2906 802 -1367
2078 -1367 2605 1533 -1972 1489 2401 -1299 564 2810 -867 -881 3309 313 -1871 2214 1577 -1687
2094 -1687 1344 1866 -1939 489 2575 -1191 -902 2341 -7 -1626 1788 604 -2229 890 1675 -2405
2110 -2405 -404 1376 -1914 -1245 1935 -1198 -2773 826 -187 -3090 -112 79 -3363 -920 821
2125 821 -3217 -2273 1057 -2135 -3084 551 -1108 -3896 -96 -329 -3602 -1093 418 -2948 -2137 797
2141 797 -2329 -3057 682 -655 -3309 37 128 -3414 -317 1213 -2926 -1474 1777 -1674 -1964 1698
2157 1698 -567 -2284 1533 994 -2350 524 1601 -1730 -233 2677 -565 -820 2916 578 -966
2172 -966 2399 1693 -1170 2126 2923 -761 993 3420 61 221 3409 1195 -262 3407 2030 -626
2188 -626 2477 3082 -432 1505 3639 100 313 3543 526 -402 3041 1684 -1089 2241 2320 -1174
2204 -1174 914 2827 -1021 -473 2374 -511 -1515 2173 989 -1997 1028 986 -2018 22 1480 -2020
2220 -2020 -852 1606 -1410 -2173 1430 -540 -2936 426 468 -2918 -491 761 -2513 -1485 850 -2013
2236 -2013 -2427 898 -1329 -3214 356 -362 -3185 -404 725 -2833 -1449 1237 -2096 -2195 1098 -1084
2252 -1084 -2841 430 -372 -2965 0 955 -2789 -881 1103 -2146 -1664 1517 -972 -1982 1208 179
2268 179 -2431 689 1330 -2425 -142 1715 -1453 -683 2038 -592 -1848 1796 542 -2127 1152 1357
2284 1357 -1751 325 2086 -1502 -580 2654 111 -1324 2189 943 -1447 1645 1713 -1218 1020 2297
2300 2297 -937 -57 2763 -154 -780 2474 850 -1410 2039 1675 -1090 1479 2788 -783 412 2719
2316 2719 -126 -548 2918 900 -870 2234 1623 -1194 1367 2441 -729 54 2589 -112 -848 2610
2332 2610 450 -867 2444 1447 -1277 1523 2464 -1022 392 2591 -292 -503 2672 190 -1255 1641
2348 1641 867 -1739 1124 1502 -1978 -396 1744 -1430 -1362 1494 -805 -1996 1175 -257 -2803 221
2364 221 703 -2804 -694 586 -2428 -1913 1058 -1790 -2725 406 -1166 -3334 -194 -30 -3100 -1013
2380 -1013 403 -2270 -1842 414 -2049 -2752 409 -744 -3002 38 -494 -3001 -701 334 -2870 -1634
2396 -1634 1192 -1807 -2386 983 -848 -2545 596 187 -2539 67 1288 -2055 -175 1654 -1336
2411 -1336 -1211 1674 -162 -1874 1891 764 -1561 1122 2086 -1126 316 2415 -386 -175 2809 703
2427 703 -782 2373 1363 -1227 1988 2715 -927 897 2716 -332 56 2735 437 -532 2431 976
2443 976 -1078 1719 1782 -1159 688 2316 -754 -21 2562 26 -969 1944 797 -1389 1402 1343 -1598
2460 -1598 568 1819 -1230 -270 1980 -763 -1689 1749 -66 -1858 1144 757 -2203 300 1261 -2095
2476 -2095 -1186 1301 -1187 -1820 1039 -504 -2609 478 106 -2931 -596 486 -2510 -1251 957 -1991
2492 -1991 -2284 923 -1081 -2730 540 -662 -2834 -284 656 -2618 -1203 858 -1894 -1171 818 -1302
2508 -1302 -2361 1217 159 -2576 -100 498 -2331 -394 1365 -2006 -1393 1322 -713 -1929 843
2523 843 -191 -2086 1081 1011 -2225 -169 1362 -1554 -509 1695 -299 -1471 1501 735 -1748 905
2539 905 1560 -1405 683 2446 -1182 -252 2308 4 -516 2244 767 -1381 2028 1753 -1155 939
2555 939 2386 -853 350 2588 -389 -371 2766 1114 -481 2016 1547 -1177 1072 2187 -904 467
2571 467 2724 -265 -405 2323 309 -940 2045 1325 -929 1301 1804 -761 537 2077 -424 -201
2587 -201 2586 110 -1454 1839 942 -1440 994 1494 -1227 423 2073 -1188 -764 1806 -329 -1378
2603 -1378 1398 72 -1960 635 1141 -1968 48 1231 -1653 -1135 1366 -1358 -1880 926 -124 -2364
2619 -2364 296 475 -2433 -435 1134 -2065 -1299 993 -1516 -2017 763 -802 -2562 626 383 -2267
2635 -2267 -373 673 -2133 -1040 1250 -1622 -2079 1035 -771 -2163 778 296 -2440 -472 1146
2650 1146 -2211 -963 1225 -1418 -1548 1165 -647 -1994 1023 245 -1992 682 1574 -1629 -45 2179
2666 2179 -665 -657 2051 99 -714 2270 875 -1163 1550 2028 -883 765 2923 -14 -14 2574 542
2683 542 -227 2682 1288 -954 1962 1819 -691 1327 2613 -468 308 2560 236 -542 2609 893
2699 893 -993 2148 1932 -773 791 2193 -752 180 2716 -163 -549 2198 396 -1246 1562 1211
2715 1211 -1370 627 1546 -1117 -405 1581 -968 -1457 1586 -270 -1949 366 51 -2316 -216 417
2731 417 -2211 -1238 904 -1967 -2165 636 -896 -2690 1 -750 -2641 -327 284 -2848 -1068 575
2747 575 -2029 -1556 594 -1094 -2328 471 -340 -2473 -28 150 -2472 -794 792 -1919 -1708 712
2763 712 -1314 -2067 1088 -141 -2228 187 491 -1825 -536 1297 -1384 -894 963 -870 -1565 1423
2779 1423 -129 -1612 890 840 -1873 339 1685 -1153 -476 1690 -291 -974 1586 420 -1327 1228
2795 1228 1252 -1527 456 1752 -984 49 2130 -136 -746 1683 338 -1181 1555 1082 -1417 945
2811 945 1340 -1099 -97 1660 -772 -775 1760 191 -1210 1224 557 -1494 810 1433 -1277 -65 2072
2828 2072 -850 -447 1826 -3 -1101 1545 820 -1504 1101 1169 -1399 107 1602 -948 -546 1618
2844 1618 -401 -1493 1498 307 -1990 831 899 -1816 -80 1288 -1431 -904 1484 -1007 -1537 1219
2860 1219 -265 -1933 582 526 -2169 -305 844 -2004 -1210 774 -1344 -1630 579 -558 -2371 129
2876 129 -45 -2626 -144 420 -2224 -1406 735 -1664 -2024 763 -961 -2461 324 21 -2554 -210
2892 -210 172 -2269 -944 813 -2148 -1813 970 -1056 -1946 631 -111 -1904 11 595 -1690 -654
2908 -654 1014 -1398 -1111 1221 -689 -1617 1002 251 -1649 684 1280 -1074 251 1455 -585 -277
2924 -277 2089 -281 -974 1803 717 -934 1392 1889 -847 1411 2229 -319 336 2193 318 -150
2940 -150 2406 904 -458 1764 1917 -538 1119 2529 -80 489 2260 195 0 2366 888 -707
2956 -707 1573 1645 -994 977 1649 -950 475 2243 -174 -646 1619 226 -979 1080 590 -1562
2972 -1562 371 795 -1303 -500 1384 -1288 -998 989 -547 -1868 703 142 -2038 -86 619 -1659
2988 -1659 -1021 802 -1875 -1531 814 -1181 -2429 138 -669 -2645 -270 76 -2474 -990 387 -2032
3004 -2032 -1618 629 -1328 -2027 672 -608 -2421 -129 367 -2151 -655 593 -1676 -1484 1079 -921
3020 -921 -1523 981 -88 -1576 837 319 -1366 91 1032 -1495 -752 1567 -846 -1362 1294 287
3036 287 -1324 1284 992 -965 500 1401 -1026 271 2051 -225 -84 2016 606 -648 1732 1349
3052 1349 -333 1126 2070 -420 676 2481 142 -29 2432 676 -506 2064 1433 -850 1200 1874
3068 1874 -361 544 2291 -63 34 2333 599 -729 1852 1238 -1035 1009 1394 -715 532 1868
3084 1868 -685 -45 1991 135 -749 1515 636 -1315 900 1197 -1514 -14 1413 -812 -295 1520
3100 1520 -487 -1166 1336 204 -1611 815 507 -1721 139 943 -988 -714 1179 -1009 -1411 986
3116 986 -366 -2049 532 204 -1756 -324 860 -1406 -1011 1003 -1050 -1584 740 -387 -1749 471
3132 471 229 -1843 82 690 -1566 -617 1102 -1028 -1142 1201 -477 -1795 749 317 -1815 143
3148 143 794 -1484 -135 1187 -966 -1029 1244 -592 -1187 1142 527 -1634 323 1008 -1312 -52 1266
3165 1266 -914 -455 1706 -62 -1050 1733 704 -1291 982 1316 -694 638 1507 -107 89 1889
3181 1889 -180 -434 1670 856 -967 1295 1198 -573 753 1804 -588 -29 2021 195 -424 1932
3197 1932 695 -571 1477 1239 -821 957 1732 -515 250 2058 -124 -384 1855 473 -446 1259
3213 1259 866 -700 732 1200 -681 272 1656 -283 -358 1415 -72 -1023 844 501 -1450 484 526
3230 526 -1424 -133 981 -1107 -1108 1075 -771 -1733 782 84 -1402 -2 128 -1739 -409 960 -1228
3247 -1228 -1066 699 -614 -1303 619 -466 -1981 189 344 -1585 -372 694 -1556 -1149 706 -793
3263 -793 -1390 918 -250 -1723 104 273 -1549 -218 816 -1874 -734 1039 -605 -1389 585 -305
3279 -305 -1385 385 175 -1564 25 983 -1156 -282 1233 -396 -1046 1119 -35 -1149 914 951 -1173
3296 -1173 397 1015 -691 282 1347 -490 -396 1483 -32 -632 1520 824 -700 850 1366 -841 106
3313 106 1519 -791 -305 1692 106 -647 1291 853 -896 824 1154 -860 61 1334 -315 -393 1857
3330 1857 37 -469 1416 604 -952 1002 1038 -762 147 1385 -473 -395 1515 -230 -715 1232 747
3347 747 -1078 609 770 -1071 322 1176 -937 -615 1010 -303 -998 1031 -327 -1385 400 120
3363 120 -1550 -232 630 -1313 -522 842 -916 -1371 832 -588 -1408 138 -167 -1754 -418 648
3379 648 -1384 -673 502 -879 -970 510 -688 -1528 254 -200 -1924 177 149 -1444 -889 697 -1061
3396 -1061 -1221 752 -751 -1460 697 -4 -1303 -86 462 -1235 -151 897 -867 -787 956 -505
3412 -505 -953 850 219 -1115 855 830 -913 -71 1295 -462 -410 1354 -159 -563 1391 270 -749
3429 -749 1087 809 -673 604 1330 -397 83 1637 243 -222 1433 625 -462 1259 1061 -540 884
3446 884 1291 -54 421 1603 80 -277 1342 757 -454 1302 1060 -296 1137 1475 -496 409 1553
3463 1553 -376 -265 1565 255 -486 1205 846 -646 700 904 -1089 263 1454 -263 -493 1267
3479 1267 249 -526 868 185 -1254 731 581 -1144 -189 990 -564 -673 1002 -354 -824 717
3495 717 363 -1367 419 509 -1362 -426 513 -909 -609 620 -789 -1065 420 187 -1442 347 29
3512 29 -1250 -311 503 -805 -740 501 -618 -1038 678 -408 -1244 575 253 -985 77 729 -907
3529 -907 -111 805 -761 -881 717 -75 -1010 482 316 -962 293 751 -761 -31 1033 -298 -662
3546 -662 1189 321 -719 1324 908 -799 703 1160 -462 313 1432 -130 -47 1558 384 -150 1357
3563 1357 936 -343 895 1402 -201 484 1673 -70 140 1594 438 -348 1672 697 -444 1279
3579 1279 1176 -446 835 1824 -222 421 1683 419 -42 1406 887 -395 977 1176 -635 510
3595 510 1543 -295 -130 1365 299 -622 1039 321 -637 866 601 -925 169 1017 -720 -148 872
3612 872 -413 -542 742 -71 -1085 409 302 -930 98 692 -1065 -583 553 -849 -758 668 -530
3629 -530 -1358 308 114 -1260 154 185 -1219 -587 517 -846 -1130 490 -748 -1193 139 -240 -1201
3646 -1201 181 344 -1353 -223 748 -1062 -1199 617 -551 -1215 404 -238 -958 85 755 -1092 -144
3663 -144 983 -695 -214 1167 -40 -499 815 366 -890 441 699 -862 179 1114 -349 -135 1303
3680 1303 -127 -351 1356 457 -409 1225 806 -588 802 1477 -409 179 1473 288 2 1306 645
3697 645 -486 1128 1395 -512 889 1476 -336 376 1359 -27 -79 1225 330 -517 1211 960 -511
3714 -511 845 1142 -205 278 1480 -217 -130 1329 53 -681 572 374 -900 -56 765 -1003 -373
3731 -373 552 -753 -681 427 -493 -1165 455 207 -1087 -222 15 -1355 -385 681 -769 -1030 447 -464
3749 -464 -1299 408 -667 -1270 16 -130 -1321 -899 184 -1333 -1121 497 -983 -1191 180 -413 -1474
3766 -1474 146 -39 -1238 -24 87 -1089 -726 347 -715 -1247 273 -163 -1031 234 167 -1090 289
3783 289 557 -875 -319 731 -720 -596 989 76 -662 492 403 -797 536 763 -476 271 855 -303
3801 -303 -203 1011 339 -493 614 446 -580 720 945 -195 -47 1254 -40 -21 1141 -52 -275
3818 -275 1060 387 -248 834 1024 -588 511 1092 -375 74 1301 333 -336 1173 246 -722 678
3835 678 782 -539 366 1073 -580 -230 836 -222 -434 820 33 -615 594 410 -739 -46 976
3852 976 -510 -492 809 -329 -446 577 -72 -872 147 335 -1162 -339 364 -934 -325 643 -732 -514
3870 -514 520 -123 -1047 439 183 -1094 -22 425 -891 -533 248 -796 -635 536 -682 -1053 328
3887 328 -12 -1224 -15 167 -1080 -488 288 -1122 -561 565 -953 -995 429 -196 -1252 -202 99
3904 99 -998 -83 704 -795 -584 457 -227 -1035 629 169 -760 439 281 -847 80 694 -563 -134
3922 -134 784 -244 -383 919 143 -549 779 471 -680 104 924 -604 -116 886 -156 -482 503 441
3940 441 -614 905 493 -274 477 983 -253 250 1375 -220 -60 1239 248 -345 1057 967 -539 537
3958 537 1023 -566 522 1099 -274 -62 1321 -6 -603 655 600 -290 567 621 -174 228 687 -350
3976 -350 -320 1094 -194 -653 697 200 -724 320 455 -756 -43 736 -563 -289 811 -423 -494 439
3994 439 157 -1165 496 308 -983 -225 578 -868 -654 435 -473 -954 282 96 -963 436 139
4011 139 -1285 -94 248 -821 -388 579 -854 -805 417 -311 -1015 44 278 -921 32 514 -1051 -236
4029 -236 708 -871 -811 605 -466 -1048 765 131 -728 16 309 -477 -67 580 -589 -305 771 15
4047 15 -603 764 100 -587 467 775 -638 402 1049 -461 -279 1051 -233 -342 510 433 -244 657
4065 657 792 -546 324 1008 -91 132 1213 33 -133 947 288 -741 627 622 -563 326 676 -462
4083 -462 -16 1384 331 -247 795 368 -655 535 528 -757 306 816 -536 -282 844 -227 -221 1183
4101 1183 -47 -819 696 332 -706 565 617 -532 -132 487 -515 -719 741 23 -783 220 118
4118 118 -777 232 328 -896 -238 474 -718 -369 503 -564 -1046 40 -65 -1302 29 225 -1171 -462
4136 -462 466 -970 -395 249 -515 -712 256 -210 -1082 217 -137 -985 -13 415 -648 -204 725 -699 -763
4155 -763 299 -216 -967 352 224 -665 305 81 -982 -368 748 -621 -697 740 6 -726 698 -33
4173 -33 -760 180 605 -582 -6 932 -524 -371 704 -250 -602 463 644 -604 418 873 -522 40
4191 40 872 -183 -297 655 -163 -261 636 187 -457 347 954 -394 63 903 -285 -60 1106 -18 -933
4210 -933 604 333 -467 717 761 -446 183 698 -293 -317 823 -217 -527 867 242 -771 126 415
4228 415 -835 -173 717 -692 -476 609 -205 -507 512 27 -754 412 -47 -542 65 402 -682 -415
4246 -415 608 -249 -738 381 -305 -845 100 -21 -906 -139 247 -988 -753 720 -603 -387 438 -114
4264 -114 -1012 154 8 -929 -70 216 -878 -292 313 -943 -895 -45 -558 -896 312 -194 -1054 -32 168
4283 168 -1202 -356 263 -738 -527 490 -397 -489 434 -42 -660 383 540 -668 122 322 -473 -229 683
4302 683 -10 -381 540 85 -814 511 716 -866 167 643 -570 -376 591 -551 -531 625 57 -587
4320 -587 702 729 -469 501 896 -69 46 1015 -263 -465 829 279 -883 810 473 -855 636 1064
4338 1064 -409 55 1182 -45 -163 819 13 -337 766 444 -463 377 716 -575 -221 559 -186 -474
4356 -474 759 -90 -901 504 51 -734 78 326 -766 0 361 -669 -303 322 -120 -561 264 69 -726
4375 -726 3 146 -897 -387 283 -524 -601 439 -359 -684 254 -411 -1000 56 -95 -1021 -285 156 -980
4394 -980 -288 506 -471 -865 -194 -272 -626 -195 -169 -698 -124 435 -1113 -278 533 -480 -532 584 -175 -610
4414 -610 456 316 -665 282 815 -356 184 710 -171 -470 552 15 -689 462 331 -648 304 1036 -306
4433 -306 128 734 -269 -322 392 105 -358 779 433 -297 538 462 -689 290 1373 -196 -288 1072 -97
4452 -97 -181 666 792 -438 862 747 -403 339 494 -162 61 785 -67 -196 883 254 -375 290 522
4471 522 -706 155 465 -356 129 954 -104 -452 515 94 -646 370 56 -388 317 580 -586 -557 636
4490 636 -343 -574 245 -120 -678 -24 232 -786 84 172 -704 -309 427 -625 -665 331 -317 -556 202 296
4510 296 -961 -126 215 -949 -402 632 -415 -1010 424 -251 -822 26 -79 -824 -43 372 -820 -306
4528 -306 429 -511 -452 434 -137 -508 611 -52 -564 564 429 -422 169 312 -479 -197 492 8 -415 758
4548 758 -59 -557 132 166 -205 26 782 -367 26 507 -244 -190 721 68 -428 346 654 -326 282 640
4568 640 -373 101 759 -278 12 848 -20 -97 864 501 -453 347 486 -48 153 829 48 -209 607 70
4588 70 -61 728 466 -241 251 698 -200 -31 623 -585 -358 261 -13 -394 399 116 -582 294 363 -759
4608 -759 -44 265 -399 -137 610 -252 -308 328 62 -627 356 349 -690 -252 237 -664 -375 367 -401 -477 354
4629 354 -280 -647 101 19 -351 -449 27 -387 -384 511 -221 -281 324 -321 -997 312 281 -442 86 351 -582 -313
4651 -313 434 -446 -423 204 -128 -605 51 232 -601 47 448 -459 45 379 -241 -326 392 -327 -250 378 -256
4672 -256 -367 68 270 -702 -145 524 -215 -61 790 -242 -470 263 12 -690 429 319 -383 191 441
4691 441 -161 -193 600 -191 -301 687 142 -566 346 592 -127 163 580 -269 -89 895 130 -319 452 475 -149
4712 -149 295 464 -390 284 726 -253 -239 498 42 -531 628 116 -475 602 299 -144 164 443 -517 -64
4732 -64 912 -554 -388 624 -317 -394 407 37 -776 44 416 -812 -347 518 -484 -616 227 -371 -460 34
4752 34 -118 -671 102 474 -702 -155 375 -694 -182 525 -327 -672 447 -110 -677 180 175 -804 194 321
4772 321 -587 -273 242 105 -385 376 -89 -614 236 117 -494 149 239 -308 -118 411 -477 -451 352 -141 -341
4793 -341 241 410 -231 2 501 -326 -56 763 -276 -265 494 181 -294 341 300 -520 279 444 -56 111
4813 111 509 -56 -362 473 260 -101 579 319 -187 517 424 -190 312 762 2 -153 698 57 -49 615
4833 615 507 -403 516 320 -147 264 612 59 87 763 22 -185 477 227 -338 97 373 -376 -118 288
4853 288 -251 -137 341 -105 -397 699 30 -380 429 347 -375 -75 44 -233 37 715 -363 -507 84 -46
4873 -46 -419 194 397 -215 -190 305 -633 -134 260 -305 -499 442 28 -519 216 213 -348 -284 400 -413 -252 325
4895 325 -440 -207 282 -383 -649 152 -23 -786 83 185 -326 -290 378 -367 -348 155 -17 -385 277 61 -529
4916 -529 339 491 -566 -195 570 -300 -61 776 119 -364 737 172 -258 355 335 -183 168 723 -222 -397
4936 -397 438 153 -444 485 311 -604 182 173 -367 252 324 -102 -41 401 -24 -233 499 196 -322 96 554
4957 554 -259 240 633 -399 -65 458 107 -19 497 197 -171 427 287 -209 367 194 -232 -245 342 -250
4977 -250 -167 619 -106 -308 242 17 -300 217 307 -361 -129 516 -74 -184 421 -247 -641 107 135 -372 -99
4998 -99 150 -518 -109 130 -169 -236 285 -54 -460 455 -28 -560 79 147 -818 225 376 -440 -420 227 -353
5019 -353 -575 71 -66 -776 53 34 -794 -199 224 -612 -260 427 -166 -524 193 98 -308 128 66 -254 -97
5040 -97 483 -571 -245 470 -99 -298 449 176 72 290 352 -291 97 598 -224 -108 249 -275 -274 474 -174
5061 -174 -457 344 65 -222 172 510 -109 -316 378 -168 -394 659 -99 -208 754 226 84 358 487 -113
5081 -113 218 350 -129 -177 376 99 -248 520 143 31 408 356 -189 -262 481 -338 28 711 37 -358 460
5102 460 54 -429 332 36 -340 -258 287 -514 -145 460 -413 -238 339 -152 -315 135 -50 -572 -114 437
5122 437 -155 -178 147 -285 -543 346 -88 -296 335 -170 -592 26 222 -427 -380 201 -243 -361 157 -382 -613
5143 -613 311 -63 -428 -156 -158 -356 -415 316 -466 -414 111 -223 -556 149 145 -291 7 489 -295 103 203 -155
5165 -155 -241 376 -172 -273 548 318 -312 65 426 -121 -3 391 -81 -25 402 -253 -343 396 159 -232 369
5186 369 260 -308 -17 663 95 -85 531 132 -185 467 75 -202 578 358 -311 -101 509 247 163 545
5206 545 -178 -151 299 174 -387 401 445 -188 147 243 -261 -22 351 -160 -194 423 47 -362 298 157 -9
5227 -9 -42 233 -357 -256 242 -140 -69 322 -227 -680 275 402 -458 64 147 -208 -75 222 -296 -249 342 -388
5249 -388 -580 263 -191 -219 217 203 -385 -23 272 -348 -484 258 -264 -414 339 -43 -499 -116 -35 -317 -92
5270 -92 278 -379 -329 406 -4 -269 -54 -159 -263 129 -110 -459 -83 -221 -542 -555 397 -77 -377 248 67
5291 67 -153 370 -175 -196 -199 246 -467 55 262 -140 -158 97 160 -384 498 281 -29 129 276 -278 51 355
5313 355 76 -304 770 -53 35 372 105 -476 296 483 -38 18 639 12 -189 511 -20 74 334 433 22
5334 22 540 284 -181 227 436 -265 57 329 -76 -58 346 199 -246 338 82 -274 129 276 50 45 294
5355 294 -11 -201 119 3 -232 338 339 92 242 118 -556 -139 238 -385 -281 258 -2 -250 56 -150 -264
5376 -264 15 364 -396 33 271 -417 -403 262 -344 -375 302 -147 -222 101 88 -401 -253 285 -270 -160 29
5397 29 11 -574 289 108 -227 -114 122 -220 -360 144 -488 -339 318 -22 -470 352 -232 -490 242 180 -145
5418 -145 -63 244 -522 -161 268 -78 -245 294 118 -201 159 579 -7 283 369 -424 -245 523 135 -369 450
5439 450 144 -308 443 191 -191 305 254 -122 19 385 15 -324 404 12 36 644 154 -300 299 334 -139
5460 -139 121 497 -259 41 299 295 -239 480 232 -287 222 387 -120 186 436 -70 -179 236 102 -178 441
5481 441 -137 -480 114 393 -422 -60 -88 -156 -164 328 -299 -292 356 -27 -706 -7 150 -527 38 220 -202 -116
5503 -116 265 -578 -10 103 -216 -468 -31 28 -548 -152 257 -504 -49 73 -130 -289 239 -97 -267 67
5523 67 79 -460 12 507 -571 -270 312 27 -628 121 -32 -211 65 36 -45 64 330 61 58 381 -56 -337
5545 -337 63 -166 -280 280 -67 -155 291 125 -186 -24 230 -1 -211 390 105 -75 352 123 -252 238
5565 238 387 18 -203 118 -152 -237 412 347 -126 282 164 -136 447 286 -319 -44 253 -244 -8 582 18
5586 18 -222 442 303 -400 75 355 34 105 141 -375 -121 182 12 -495 312 23 -434 53 89 -258 243
5607 243 271 -45 60 408 -222 -142 421 270 -460 103 76 -287 -173 -22 -122 -37 424 -242 -5 533 7
5628 7 -460 -199 -260 -357 -173 27 -388 -105 31 80 21 -5 -37 -502 380 -213 -190 -52 252 -597 -426 295 -194
5651 -194 -342 153 -229 -660 198 -109 -308 332 153 -414 -67 302 -122 -347 535 -200 -263 195 26 -176
5671 -176 11 148 -402 331 28 -294 96 428 110 -218 222 255 -239 304 295 -102 13 227 -199 113 213
5692 213 -64 -132 426 122 -240 482 361 -293 139 503 -42 202 399 -34 -56 438 -16 -102 458 -22 -409
5713 -409 252 51 26 233 232 53 -82 276 -127 -267 -68 -256 -309 268 69 97 452 288 -176 -91 293 -18
5735 -18 -461 85 358 -365 -69 354 -425 -351 118 -244 -266 177 -8 -387 262 40 -225 20 -27 -373 225
5756 225 275 -302 -84 70 13 -428 14 -238 -274 119 -110 -173 305 -55 -225 -158 168 -224 -383 326 36 -138
5778 -138 210 205 -237 146 433 -346 -194 270 -384 -230 485 -6 -293 89 -36 -155 384 203 -314 -43 523
5799 523 -250 -170 584 -21 -192 -236 86 -218 300 32 -547 5 -112 -70 -77 276 -265 83 366 82 -151 344
5821 344 274 -49 -11 394 52 141 468 56 30 299 223 -91 258 203 -43 145 269 -65 -121 305 252 -97 83
5844 83 184 278 357 -169 -36 134 159 -143 -396 270 -59 -144 392 254 -55 298 -74 -139 -256 342 62 39
5866 39 59 -79 -72 379 167 -511 631 50 -434 -128 304 -114 -90 408 91 -203 -44 114 -246 287 -17
5887 -17 -251 105 38 -469 22 323 -345 -214 209 -200 -119 42 -130 -282 268 -26 -439 9 367 -10 -208
5908 -208 581 -196 -187 11 157 -448 -11 146 -260 6 27 -234 -47 232 -242 49 391 -114 -193 237 -15
5929 -15 -60 163 101 -420 109 334 -104 49 -67 141 3 78 78 -184 69 357 -405 40 315 98 -38 151
5951 151 123 -193 282 241 -117 306 315 -113 83 303 58 -192 17 -70 -167 269 199 -132 188 234 -432 221 131
5974 131 151 -214 245 -154 34 497 80 -320 218 346 -453 134 299 7 -235 62 132 -179 475 -173 -327
5995 -327 15 42 -97 32 209 -81 -137 360 97 -232 0 11 93 56 -12 -319 -56 -155 -292 -131 -37 -35 -172
6018 -172 245 -187 -214 -119 78 -292 -203 226 -247 -5 50 50 -47 338 -168 -301 484 189 -94 -8 31 -215 -65
6041 -65 -40 -418 -82 432 -297 -269 196 -237 54 116 239 -44 -229 226 -338 54 443 21 -125 230 -85
6062 -85 -105 244 7 -16 14 338 -276 260 354 94 -32 227 -28 -313 353 113 334 226 419 75 70 83 -240
6085 -240 -32 471 -347 -62 529 5 -366 68 102 -196 116 150 -173 20 415 62 59 205 274 -255 34 353
6107 353 -397 -199 299 23 -106 116 113 -226 71 -182 -381 50 98 -207 85 26 -297 -109 16 -7 -306 277
6129 277 62 -254 12 234 -291 44 83 -329 -326 17 -310 -273 -418 -319 -463 -54 -57 -146 -50 439 -56 -432 89
6152 89 -143 52 190 56 -253 135 290 -237 -76 200 19 -188 78 -324 -80 64 -177 -156 114 -95 -93
6173 -93 -68 -57 -167 -121 512 -4 -238 218 -10 -39 75 -243 -284 75 303 33 318 178 -105 17 -2 246
6195 246 -144 249 433 -115 226 88 -221 94 420 -216 -177 149 -106 -154 -56 82 83 270 211 -72 118 170
6217 170 -125 114 514 -87 -130 545 135 85 244 6 -231 326 7 69 -44 98 107 -501 192 107 -286 85
6239 85 228 68 85 148 25 -135 3 -71 -223 -64 33 -130 -53 -248 -99 14 -74 -205 -240 89 -161 -270 83
6262 83 -84 -560 -332 -28 -77 39 177 -144 2 250 127 -282 -55 -359 -258 -95 20 -256 -180 -28 -118
6283 -118 -8 237 -39 -377 327 -39 -683 413 -12 34 -3 -26 -135 -48 61 -85 72 7 -394 -203 141
6304 141 90 -191 308 295 -498 342 228 161 212 -29 104 -137 209 331 -121 111 -4 182 -170 143 123 56
6326 56 263 -122 217 204 -180 -175 363 -164 -25 396 380 46 -82 309 -93 -75 138 -55 -337 110 127 -213
6348 -213 -84 98 64 76 139 -8 9 5 -69 -68 212 -10 -165 79 -73 -185 -122 55 -259 122 170 -149 -281 14
6372 14 85 -178 151 99 -418 110 -66 -239 -618 122 7 -319 225 -259 -157 72 -53 -122 -245 37 10 -145
6394 -145 113 -163 -120 26 -204 -361 -211 58 -243 70 144 -292 -62 -221 -15 113 18 -98 -307 -166 213
6415 213 -199 -78 -61 -85 -124 72 195 63 191 80 -259 167 -15 -165 0 345 -219 109 -189 171 187
6436 187 89 106 -138 -43 -41 116 84 -11 -252 235 -232 -166 187 262 63 -57 86 244 -22 -2 540 -221 -91
6459 -91 60 38 207 -9 -3 -26 -34 -16 32 166 7 -248 21 293 -170 260 379 120 -207 439 232 -278 26
6482 26 441 -255 -297 113 -297 111 82 -17 45 55 7 -155 363 11 -218 354 230 -161 226 64 45 -392 150
6505 150 -6 -316 159 -100 73 -81 -26 -143 140 -48 77 -302 53 -46 -520 149 -297 -183 -114 130 -115
6526 -115 -388 -22 -6 -297 188 11 -375 170 117 -455 139 88 -337 -297 61 42 -46 196 40 -254 151 33
6548 33 -83 50 177 -321 20 -6 -123 206 246 -51 -110 217 -56 -56 55 -93 -200 -13 122 -116 -17 90
6570 90 36 295 207 226 -124 242 48 -36 339 149 -46 231 -9 -358 27 243 204 -215 524 30 32 30 -19 -15
6594 -15 332 238 -173 -151 97 78 -109 257 64 -121 175 -13 -328 55 54 -253 111 74 -290 -133 -128 326 -342
6617 -342 108 -125 -384 270 221 -264 -218 152 36 -336 -41 -140 -207 -40 -35 -20 -45 40 -144 -135 -178 65 -263 -57
6641 -57 -252 146 -122 76 4 193 247 -25 107 -108 -187 -178 -103 -118 -352 54 8 191 192 183 -115 -86 -89 -146 -65 3
6667 3 -49 -39 -59 -134 -135 49 -227 -235 220 390 10 63 176 -120 -231 188 88 433 79 -176 -87 321 39 -104
6691 -104 -125 -5 178 -202 -55 65 1 129 201 82 163 -88 -63 -46 297 95 131 163 232 -211 16 -239 60
6714 60 141 416 40 -181 148 -212 14 197 -97 -5 9 34 29 -72 97 -358 -321 235 -42 92 274 119 -26
6737 -26 152 138 -97 174 -10 -150 81 275 123 148 -3 91 -108 121 -235 -239 -10 -257 -297 -257 224 -145 -86
6760 -86 235 -270 -96 -219 67 -74 79 -153 -240 -183 60 -60 -204 -172 76 -220 -35 140 -65 309 237 -135
6782 -135 -255 252 -118 -208 161 -144 -110 505 68 -43 -84 69 -147 140 78 -173 -100 -121 147 -248 -15 120
6804 120 -16 321 -95 -144 -47 -35 -33 -1 220 -170 -170 289 114 161 36 220 -294 240 196 -162 -37 12 -26 30
6828 30 -79 -143 -22 161 50 245 -152 206 -37 151 135 -122 -61 90 29 -139 -248 217 132 83 -364 -5
6850 -5 147 19 -142 -35 242 -61 -123 64 -66 -75 -4 -28 -97 52 152 -363 153 292 -137 -126 -18 -86 -137 -100
6874 -100 179 -135 172 148 -156 -216 -102 45 -212 -102 33 -89 -170 360 4 207 9 -21 -289 -64 -398
6895 -398 -89 183 -12 182 105 -86 -58 47 132 -155 -59 251 -358 -278 87 -133 -233 134 -461 -206 38 159
6917 159 -121 401 -56 -360 -142 61 -70 -67 225 -76 32 250 295 -292 103 -125 -42 25 271 178 129 307
6939 307 -54 51 197 -19 176 66 132 -171 64 425 65 120 -137 6 -146 114 308 293 192 198 129 -123
6961 -123 234 -82 106 187 88 -229 -101 211 -206 149 -120 -37 -151 123 -47 -66 -36 -35 -132 292 -60 6 226
6984 226 -12 -188 -94 -9 6 -13 13 -418 -254 188 -115 -190 163 415 -286 -77 -53 -28 -19 163 -138 -208 66 152
7008 152 94 -7 164 -209 -91 25 -261 -163 -41 3 -150 -48 -175 -389 89 195 -296 -2 61 -274 -157
7029 -157 92 199 -351 -26 -186 -181 4 -75 -144 149 130 -206 -336 209 -45 26 325 108 -187 -247 164 -200
7051 -200 -222 264 -254 5 -15 54 -35 196 -108 135 191 293 126 389 226 145 171 242 -108 66 259 174 55
7074 55 18 314 29 51 110 -229 -163 383 125 179 164 -262 -10 266 258 36 -157 132 -60 27 166 67 199 322
7098 322 9 153 -107 -80 130 -33 -6 -41 76 93 -140 16 136 -216 -439 164 297 272 242 -184 -100 7
7120 7 -154 58 -13 121 67 -328 -21 222 -121 204 272 47 87 3 -41 -152 -281 -138 -82 -26 -52 -49 -1 162 -14
7145 -14 111 -62 -157 78 414 -209 -184 -281 28 100 298 108 -38 -134 93 -6 -112 378 74 -214 2 137
7167 137 -12 128 -21 -53 132 -26 -63 169 -2 -68 149 430 -155 -382 -28 -22 -191 -66 212 14 200 214
7189 214 11 34 126 36 4 56 70 -238 -6 229 6 124 277 -178 -19 182 66 -181 -195 152 15 -24 56
7212 56 -71 219 194 -157 17 180 5 -197 -69 321 71 33 158 18 36 109 -100 295 189 -189 -220 -144
7234 -144 222 -32 207 -18 38 162 406 -108 27 103 114 -344 95 -149 -144 -150 -146 -46 -241 265 -294 -32 286
7257 286 -328 -93 -57 -200 -91 66 11 -79 306 196 -79 -204 122 -164 -249 66 -361 -77 128 -404 17
7278 17 -93 -49 -29 -144 -413 -227 -167 267 106 -246 228 -121 -119 307 -104 -241 -29 117 -92 -1 49 23 -53
7301 -53 78 200 35 -29 110 -56 113 -216 -65 28 198 51 -402 -103 87 -58 187 134 24 -268 -131
7322 -131 -36 147 133 79 208 78 -43 -20 151 152 70 448 219 186 355 85 13 188 200 13 25 97 -61 -89
7346 -89 47 237 18 299 54 -164 -185 -42 250 -17 296 -396 97 202 132 6 290 6 -58 -80 390 12
7368 12 -215 26 -14 40 25 -8 -74 191 40 36 -129 104 -207 -217 -158 112 104 328 -291 -327 -48 125 -171 98
7392 98 -147 -35 -326 136 -83 -94 -69 -157 15 -125 -216 93 -66 246 27 -34 -142 7 8 -413 -69 -154 16
7415 16 153 -55 313 185 10 -71 224 -209 55 15 -88 -247 -220 -8 119 6 -17 39 -58 -36 -70 -43 46 -45
7439 -45 -41 220 109 237 -22 141 -95 60 229 347 -147 58 232 -71 76 -101 68 81 175 -25 3 91
7461 91 35 194 534 -35 157 68 62 236 -92 -13 -196 19 188 96 17 183 -45 -84 15 292 34 173 -199
7484 -199 40 264 61 -179 -499 199 -107 -198 171 98 -20 -7 22 -148 -95 -84 -4 9 -183 25 149 -138 -229
7507 -229 91 -164 -24 -183 -30 245 64 182 33 74 -211 250 -178 -170 -72 -159 191 -243 -40 82 -121 -179
7529 -179 -44 -47 -194 -223 15 0 -40 -144 -189 -237 -141 -262 -131 6 243 76 102 -73 127 352 -162 -176 221
7552 221 -205 -277 -58 -90 148 -83 270 -48 4 -218 -351 53 110 158 61 -273 107 -228 -249 265 149 350
7574 350 77 -340 136 45 35 173 -115 33 -28 -55 -35 -40 110 -55 176 33 211 -72 13 262 107 204 332
7597 332 -19 -274 5 38 200 101 132 -12 63 14 -378 157 23 131 267 264 -76 254 91 -311 -262 -18 -20
7620 -20 -142 25 89 -46 339 -123 97 -177 -131 115 -172 47 -178 -35 -263 69 275 -13 -139 -219 161
7641 161 103 175 195 4 -178 -148 28 -30 -218 -58 -35 98 -97 102 -243 -263 -85 -118 -231 -96 96 95 -215
7664 -215 48 -46 -54 -7 -82 -83 -267 119 56 -185 -46 -227 -157 13 -98 68 -138 19 142 -87 -43 -136 67 330
7688 330 79 -52 -89 -207 -346 244 246 -87 -323 118 127 -9 208 -147 198 130 -6 -229 433 125 30 100 -80
7711 -80 -62 -12 281 -116 136 92 117 79 250 112 189 7 24 2 -19 -73 26 48 117 53 50 30 -224 115 -33 -296
7737 -296 132 124 -85 -167 -78 247 45 -10 -140 25 -23 -16 308 -171 -122 70 95 -131 120 -104 30 285 12
7760 12 -27 276 -253 -315 -95 -107 -288 1 66 -125 -295 -93 -60 6 -122 23 58 181 -67 -50 -79 50 234
7783 234 -23 -106 -134 -227 -21 -111 -199 -57 -99 -59 64 21 -183 -45 322 -64 -85 102 92 -50 32 -164 -75 -6
7807 -6 52 60 88 -160 -83 52 -151 14 -15 -275 -48 229 -347 89 183 -206 -8 -36 147 39 119 109 -24 158
7831 158 59 107 -168 -115 31 -145 -150 24 237 338 158 194 57 -167 27 -11 -204 -137 158 1 8 192 101 50
7855 50 130 -8 -188 142 -229 -101 -136 -147 213 332 -85 8 -305 -169 268 -87 -260 -51 -65 -8 -56 97 -161
7878 -161 47 -108 -323 285 -36 -228 420 238 70 252 -15 -35 -140 17 -31 106 -220 -188 -182 80 -331 72
7900 72 -5 -31 -252 131 -27 -161 -129 -190 -254 -42 -239 72 -191 -43 321 -128 -233 -57 242 -16 197 -194
7922 -194 11 -16 -15 -404 -189 102 -48 -95 -82 -111 -74 -71 -111 86 17 -116 257 -98 40 83 -50 -22 -17 -194 22
7947 22 42 59 -36 111 -81 234 100 52 248 71 39 -75 112 -10 236 2 208 25 28 29 122 -118 118 -64
7971 -64 122 236 -81 161 84 -129 45 -50 59 12 281 85 -194 116 -208 -271 111 -55 113 -82 -31 -233
7993 -233 98 96 -368 -42 -61 -151 200 -89 106 87 100 -17 -34 -67 142 -27 -84 52 -119 -109 -190 74 -66 -73
8017 -73 9 158 169 10 -205 61 261 171 -107 -177 325 25 -158 64 -4 182 183 -172 -172 -36 232 -97 174
8040 174 -45 -176 -167 37 66 -77 -97 -410 -321 -123 -124 194 147 -98 -219 -2 -345 225 -122 61 4 -91 -97 -127
8064 -127 24 178 -36 7 -45 -104 126 -111 -190 -5 27 -32 230 -158 199 -166 -3 -196 -99 109 -75 -54 452
8087 452 -53 18 245 6 21 185 -139 230 48 74 -121 -184 20 264 153 24 -338 -185 225 70 177
8108 177 9 192 56 207 252 3 112 49 9 -51 259 38 -134 6 -40 157 -125 -65 -73 13 -314 21 242
8131 242 -20 -157 -70 99 29 -4 -131 -143 1 178 -9 66 -24 120 116 -207 -251 -69 145 -42 -205 99 22
8154 22 49 -119 -16 -319 1 -208 -158 -7 -77 -88 95 -252 -40 84 66 -255 -6 -120 0 124 -181 112
8176 112 -179 141 133 -250 -208 109 195 108 -158 -30 -242 -264 160 76 -139
8191a39
$$ Imaginary data points
##PAGE= N=2
##DATA TABLE= (X++(I..I)), XYDATA
0 0 0 0 0 0 0 0 0 0 0 8 -8 8 -8 8 -16 16 -19 24 -26 32 -40 42 -50 58 -67 77 -86 99 -112 127 -143 160 -178
33 -178 200 -223 248 -277 304 -339 375 -415 461 -510 563 -625 696 -772 860 -965 1084 -1226
51 -1226 1398 -1612 1885 -2247 2754 -3513 4775 -7258 14020 -69584 -236968 -140566 -40743 -1938
65 -1938 -9252 -44858 -97368 -80706 -69397 -99777 -94144 -45159 -34430 -31250 -49375 -135805 -193486
78 -193486 -129558 -63641 -65043 -81900 -124072 -185062 -177915 -144981 -161618 -155212 -105271 -113485 -159498
91 -159498 -173579 -186801 -183921 -118622 -77230 -104648 -115731 -111785 -136345 -121751 -66639 -57626 -59071
104 -59071 -24329 -27994 -66933 -61525 -42743 -33808 11176 37519 -6948 -36106 -23653 -30720 -20560
117 -20560 25197 17489 -21513 -13379 -12027 -46533 -40352 -12496 -19952 -15482 -2299 -36594 -65126
130 -65126 -46614 -40753 -36257 183 -3167 -48512 -47497 -29707 -43252 -26360 9116 -5924 -22759
143 -22759 -6392 -18546 -35284 -6166 6634 -10834 5905 16131 -18964 -28219 -10624 -19613
155 -19613 -13366 14308 -8051 -43455 -30390 -29374 -50816 -35256 -24077 -50772 -51038 -37721 -64780
168 -64780 -79376 -60091 -65092 -68407 -42854 -54470 -89774 -75140 -57008 -73387 -64175 -42091 -55903
181 -55903 -56545 -35050 -50841 -65881 -37337 -23758 -29526 -11405 -13304 -42480 -30248 -3993 -18090
194 -18090 -16965 6563 -5208 -17679 -784 -13229 -37002 -12305 9235 -6448 -7366 -9713 -39663
207 -39663 -35336 -3471 -12316 -23858 -5262 -13358 -33049 -18544 -16105 -34146 -11421 14792 -4338
220 -4338 -12838 -3449 -19407 -16952 19165 21063 4179 17632 15391 -5889 9785 24842 9159
233 9159 20333 43649 19736 -763 13062 9064 3468 29767 30628 2652 4009 6881 -12848
246 -12848 -3900 16917 1373 -2876 15628 -3413 -27371 -9557 152 -5522 13794 16787 -15391
259 -15391 -15823 4119 -3268 123 22712 13158 1412 18402 10289 -10720 9680 29488 19449
272 19449 25186 28021 -1706 -4987 24718 23967 14645 27980 19829 1403 14392 15721 -4697 9932
286 9932 31677 15551 6739 12623 -6677 -9914 22067 23449 2787 11001 12506 -6195 3586 16235
300 16235 1184 7367 28649 13383 -1914 9245 2973 -2065 26021 29705 1233 3392 14002
313 14002 -486 4430 21009 7843 1921 20064 8581 -11394 965 5320 -3870 12558 17983
326 17983 -10438 -14411 1618 -7376 -7215 10993 -974 -16613 -547 -1498 -21279 -10792 1765
339 1765 -8541 -2038 5840 -17893 -24217 -1849 -3361 -9556 6239 -380 -20800 -7807 2135 -13217
353 -13217 -6833 8471 -3578 -5983 6584 -8484 -18122 4512 9014 -2010 7946 5605 -14921
366 -14921 -4170 13818 545 108 15882 4690 -4739 10710 5703 -7225 10962 19833 5055
379 5055 9052 12051 -6623 -387 23269 13387 2563 14594 7893 -3600 12668 14192 -2970
392 -2970 8669 21545 5108 723 9404 -2514 -1200 20857 14311 -3522 5352 5744 -6297 8130
406 8130 15188 -3409 507 16896 2460 -7710 4472 898 -2643 14878 10308 -11955 -5478
419 -5478 3285 -8049 -1113 9765 -7682 -12913 2266 -7294 -20037 -5827 -4618 -15649 -4527
432 -4527 -3917 -25727 -22458 -7005 -15728 -15735 -3610 -16182 -26345 -10305 -11875 -24017 -9096 -2379
446 -2379 -17370 -12320 -3104 -18294 -18399 264 -4757 -10380 1828 -5574 -19653 -5257 1638 -11376
460 -11376 -3559 4662 -12857 -14182 -748 -11044 -17931 -994 -4820 -17757 -7941 -9060 -25518
473 -25518 -15972 -2997 -14418 -15129 -6282 -20232 -24089 -5472 -8947 -19562 -5839 -3059 -17609
486 -17609 -9451 -2124 -15045 -8579 8195 -1463 -8227 1054 -5991 -11841 6716 7893 -7997 -1907
500 -1907 3699 -10138 -7297 3384 -9342 -10670 4488 -4500 -18867 -10474 -10754 -18297 -4668 -686
514 -686 -19491 -18026 -7128 -16639 -15955 -1671 -8928 -14753 1093 -1237 -16234 -5898 3934 -1733
528 -1733 6836 14305 -1714 -2992 13529 9334 5298 18923 15119 4037 15947 16873 479 7008
542 7008 19434 10099 8666 15518 773 -5936 9645 8081 -2745 6178 5693 -8308 -1750 4237
556 4237 -9262 -5631 9869 734 -6207 3861 -2468 -9698 6961 12016 -397 5351 10491 -1738
570 -1738 2676 14472 5028 3467 17999 11163 -961 7726 7083 -3412 8393 13960 -2474 -4300
584 -4300 3358 -8029 -10307 1201 -6207 -13884 -3655 -7398 -22146 -15175 -9453 -18654 -11308 -2990
598 -2990 -18459 -22259 -8379 -11546 -15755 -2767 -3692 -12665 -2479 983 -11386 -4489 8347 1229
612 1229 2599 11849 534 -6089 9413 10151 297 10056 11129 -2700 1531 8191 -4419 -3809 9243
627 9243 1609 -5945 1022 -6865 -15773 -1092 2812 -10349 -5612 -379 -13196 -11407 547 -6624
641 -6624 -9393 5766 2362 -8065 -407 101 -6402 6352 15209 2261 1509 10378 2001 411 13028
656 13028 8139 1929 13534 11175 -4838 -274 6013 -2124 2132 9617 -4297 -10918 -2046 -7763
670 -7763 -14300 -3774 -5057 -15864 -8194 -6748 -22484 -19232 -6450 -11870 -12815 -5204 -14502 -20752
684 -20752 -7938 -7495 -15516 -4999 311 -10305 -7627 -2044 -12781 -9791 5500 65 -7920 -352
698 -352 -4382 -14187 -3036 666 -10950 -7178 -475 -12579 -15735 -9040 -16699 -17983 -4504 -10682
712 -10682 -24809 -18405 -16130 -25075 -18122 -11744 -23461 -21375 -11208 -21425 -27336 -15847 -15553 -18811
726 -18811 -7711 -9592 -22985 -15849 -6506 -12889 -9393 -832 -9879 -11299 465 -6096 -15045 -2853
740 -2853 1720 -5047 -952 -1281 -13512 -8770 3249 -4744 -8266 -43 -5461 -11778 -2601 -5097 -14709
755 -14709 -4673 3271 -6717 -6763 -2599 -11210 -7221 6758 1710 -5849 4024 4393 -2689 6009 9224
770 9224 1294 9713 20074 8879 5595 14923 11355 10892 22761 19005 8262 15863 19293 9651
784 9651 14247 19187 10223 12521 20915 9835 1441 11669 11287 5275 12509 10247 -2426 3225 9714
799 9714 -519 -303 8945 2534 -613 7620 986 -7186 4354 8399 25 4222 7051 -2873 590
814 590 10047 2313 -389 9348 6364 -1106 5654 3491 -5210 4077 9660 -1920 -2698 3397 -4879
829 -4879 -6458 2958 -3084 -9421 -548 -2019 -12848 -8029 -4468 -12156 -6693 400 -10388 -13196 -3833
844 -3833 -7884 -11183 -239 -1902 -9542 -1135 1994 -7925 -3146 5942 -109 1254 9826 2393 -2444
859 -2444 8954 8267 1828 10107 11955 2656 7012 12469 3288 3783 14554 8402 3600 11353 7240
874 7240 -515 8568 11363 2311 7305 11904 2033 3345 11483 4801 2930 13426 10297 2722 10056
889 10056 11076 3130 10693 16999 8004 8901 15867 8845 7186 16274 12894 6924 15904 14886 4718
904 4718 9953 13957 5810 9061 15521 5999 2167 10161 5515 -290 8370 7236 -1034 4454 5902
919 5902 -4207 -1445 6408 -691 -2041 5378 -1176 -7280 2444 2086 -5005 1984 4559 -5088 -1869
934 -1869 3918 -4000 -3647 6614 1262 -3891 3796 671 -6641 1562 5125 -3509 192 4933 -4448
949 -4448 -4964 3465 -1751 -4743 4281 773 -6621 176 689 -8021 -1053 5322 -3541 -3857 2867 -4103
965 -4103 -6130 3981 1291 -5011 3193 3546 -5833 -1042 3956 -3416 28 7654 -106 -3697 3811
980 3811 94 -4690 4975 5264 -3591 1895 4856 -4098 -2051 5572 -716 -1761 6316 874 -5661
995 -5661 2253 2303 -4612 2171 5259 -4123 -2730 3543 -3758 -3827 4839 -172 -4853 2975 940 -7111
1011 -7111 -994 2717 -4243 -437 3879 -5174 -5876 3448 -1436 -5266 3000 608 -6406 684 2784
1026 2784 -5957 -1083 5154 -1783 -1403 5384 -1798 -4344 5657 4377 -2469 4194 5102 -3201 1790
1041 1790 7038 -1167 297 7961 1594 -1725 5628 2542 -3147 4799 6263 -2303 1714 4804 -3721
1056 -3721 -1493 6593 -522 -3646 4017 512 -5447 1437 1584 -5437 601 4602 -4535 -3461 2497
1071 2497 -4087 -4265 4706 -254 -6076 767 478 -6971 -1347 1484 -6231 -2908 2610 -5480 -8631
1086 -8631 -770 -4217 -8223 -571 -2581 -10663 -5774 -3700 -11772 -7536 -1223 -9195 -10343 -3036 -8439
1101 -8439 -12579 -4408 -5691 -11007 -3742 -2420 -11217 -7708 -1660 -7740 -5651 2167 -3958 -7651 597
1116 597 -563 -6365 975 3098 -3673 1770 5787 -2981 -2961 5455 1464 171 7246 2236 -4191 3666
1132 3666 5500 -2186 2577 6467 -534 1043 7262 -465 -2979 5971 4741 138 6155 4544 -3226
1147 -3226 3369 8836 1454 3096 8897 2656 1547 8899 4215 -362 8327 9643 2347 5826 6985
1162 6985 -568 3683 10795 3364 658 7127 2892 -1195 5648 3334 -3569 3187 6490 -2667 -1887
1177 -1887 1958 -3884 -2445 5347 -316 -6329 623 -284 -5666 548 2032 -4996 -353 5025 -3352
1192 -3352 -4570 3215 -363 -1647 6022 2628 -4334 2122 4556 -1865 2272 6901 -344 662 7151
1207 7151 417 -2697 5670 4176 -812 5306 4381 -4151 412 5671 -1049 -115 5454 -928 -3322
1222 -3322 3617 273 -4685 3185 4103 -3109 737 2938 -4332 -1516 5866 258 -1471 5272 883
1237 883 -3690 3397 3644 -2309 3721 6198 -1641 -379 4739 -1433 -1472 6199 1667 -3085 3004 787
1253 787 -5950 20 3498 -3848 -1823 2760 -4910 -5987 973 -2767 -5694 1692 -523 -7692 -1829
1268 -1829 74 -6408 -1717 3860 -3045 -3181 3298 -2010 -4581 3837 3024 -1877 4545 4851 -1864 1708
1284 1708 6420 730 2421 8505 2883 -386 6042 3902 -1388 5636 6822 -409 2789 5655 -1842
1299 -1842 -706 5813 1075 -1108 5425 1546 -3816 2289 2733 -2972 2346 5699 -1889 -560 4863
1314 4863 -1164 -1383 5975 3209 -1216 4614 3836 -2796 2466 5734 -645 1691 6659 -89 -2196
1329 -2196 3945 102 -3459 3425 2104 -4671 59 487 -6776 -3774 1510 -4865 -5704 -104 -4993
1344 -4993 -8903 -2263 -3330 -8832 -2534 -1501 -8287 -5331 -845 -7337 -6037 1423 -2439 -5787 537
1359 537 -1224 -6051 539 2460 -3995 -69 4271 -2413 -1956 3739 -990 -2684 4884 2371 -3782
1374 -3782 1465 1828 -3701 1425 4829 -2595 -2054 4174 -651 -3103 3190 813 -2729 4397 4011 -3459
1390 -3459 378 5039 77 3019 7552 1309 -137 7557 4975 1064 7131 7049 2014 7201 9700
1405 9700 1053 2976 9512 5329 4598 9040 3731 226 7749 6925 78 4193 6312 56 2625
1420 2625 6057 -1321 -1665 5640 2664 -1732 3126 422 -4616 2231 4374 -2933 -752 3607 -1883
1435 -1883 -1229 3907 -1112 -3434 4966 3580 -3234 1240 1997 -3252 980 4936 -1771 -2161 3522 -1288
1451 -1288 -3725 2383 -468 -4778 1346 1986 -5337 -2619 227 -5248 -3593 2136 -3860 -6283 -52
1466 -52 -2295 -6600 -541 -247 -5718 -1447 1223 -5101 -3438 2224 -2604 -3316 3309 -84 -4278 1389
1482 1389 1590 -3419 1531 3952 -2357 -454 4053 -1144 -2117 3934 849 -2729 3551 1883 -3807
1497 -3807 888 2765 -2910 -126 4363 -2173 -2926 2970 -528 -3102 2332 1200 -3830 1375 2959
1512 2959 -3225 -528 3772 -1542 -1163 4797 -224 -3255 3407 2441 -2213 2710 3008 -2781 1192 5073
1528 5073 -1404 -964 4360 569 -1320 4020 751 -3850 2583 3784 -2541 476 2980 -2519 -900
1543 -900 4277 -1163 -3284 2900 1260 -2748 2137 1709 -3356 1533 3963 -2269 -1042 3471 -880
1558 -880 -1659 4274 495 -2828 3222 2986 -2626 1067 3295 -2103 -97 4068 -1603 -2686 3140 -165
1574 -165 -3592 2419 1180 -4123 366 1780 -4091 -1521 2218 -3466 -3352 2114 -1903 -5324 676
1589 676 -603 -5337 -442 356 -5327 -2704 891 -4582 -4206 900 -3104 -5544 394 -1508 -6482 -1394
1605 -1394 -136 -5682 -2571 447 -5535 -4385 1094 -3226 -5237 538 -1495 -5431 -162 38 -5575
1620 -5575 -1756 1630 -4128 -2948 2156 -2541 -3776 1992 -303 -4163 1152 1332 -3347 322 3197
1635 3197 -2571 -703 3985 -483 -1417 3614 1383 -1739 3487 3047 -2082 2099 4395 -897 1052
1650 1052 5079 264 -60 5188 2331 -881 4367 3839 -1035 3520 4979 -635 1287 5504 473
1665 473 117 5044 1662 -1001 4152 2846 -1952 2390 3933 -1650 606 4343 -1744 -932 3712 -199
1681 -199 -2610 2512 663 -3672 1043 1733 -3894 -1233 2395 -2893 -2559 1674 -2493 -4209 1530 -399
1697 -399 -4588 -261 252 -4804 -1253 1333 -4057 -3176 1432 -2559 -3679 862 -1588 -4659 205 635
1713 635 -4785 -1836 990 -3627 -2137 1852 -2945 -3946 1496 -944 -4406 414 -326 -4096 -437
1728 -437 1681 -3727 -2214 1898 -2161 -2719 2366 -1116 -3821 1521 921 -3258 -20 1532 -2843 -390
1744 -390 3046 -1566 -2418 2735 158 -2216 2349 901 -3302 1658 2880 -2137 3 2931 -1751
1759 -1751 -1033 3546 -500 -2677 2608 1647 -2426 1446 1872 -3108 478 3678 -1558 -907 3136 -768
1775 -768 -1668 3231 835 -2417 2554 3006 -1854 1120 3614 -1351 163 4727 216 -969 3892 1910
1791 1910 -1082 3176 3035 -1084 2095 4346 -617 143 4616 394 -473 4247 1501 -1399 2864 2463
1807 2463 -1998 1553 3518 -1583 116 3630 -986 -1458 3311 577 -2624 2144 1571 -2743 996
1822 996 2365 -2239 -284 3280 -1324 -2037 2302 -476 -2679 1967 940 -3324 402 1528 -3349
1837 -3349 -1413 1465 -2732 -2542 1803 -2289 -4109 63 -842 -4590 -174 -177 -4928 -2296 812 -3842
1853 -3842 -3474 402 -2734 -4138 512 -1698 -5003 -249 320 -3915 -963 858 -3596 -2157 2526
1868 2526 -1531 -2902 1780 -174 -2622 1760 1303 -3290 435 3131 -1453 -631 2553 -1021 -1558 3747
1884 3747 1146 -2011 2607 2529 -1361 1465 3390 -1128 629 4329 249 -364 3445 1435 -806 3773
1900 3773 2945 -828 2508 4335 -323 1530 4436 274 832 4854 1849 -593 3720 2774 -759 3105
1916 3105 3570 -788 1074 3866 -401 -477 3592 608 -1272 3041 1043 -2487 1571 2182 -1984 195
1932 195 2605 -2032 -1197 2546 -1171 -2658 1710 17 -3181 500 719 -3453 -783 1485 -2608 -1947
1948 -1947 1288 -1952 -3083 1274 -804 -3731 253 241 -3446 -1158 899 -3308 -1820 1284 -2025
1963 -2025 -3157 838 -1373 -3705 219 -202 -3675 -516 1145 -3214 -1738 1177 -2319 -2739 1742
1978 1742 -1159 -3391 832 283 -3185 203 1960 -2519 -706 2191 -1402 -1392 2490 -174 -1905 2536
1994 2536 853 -2401 1016 2368 -1942 325 2868 -1044 -861 2943 -343 -1504 2525 1586 -1662
2009 -1662 1862 2290 -1862 554 3197 -705 -620 3073 -348 -1401 2705 1401 -1871 2175 2379 -1331
2025 -1331 1063 3065 -1426 -67 3456 286 -1103 2726 1170 -1244 2112 1867 -1840 1277 2811
2040 2811 -1274 -642 2685 -572 -1159 2899 540 -1798 1808 1550 -2003 1110 2129 -1469 -71 2901
2056 2901 -1231 -1613 2534 -10 -1953 1919 1132 -2469 785 1829 -2011 -321 2474 -1090 -1469 2399
2072 2399 -434 -2613 1758 514 -2467 536 1538 -2736 -356 2155 -1932 -1884 1929 -663 -2513
2087 -2513 1270 -320 -3144 236 917 -3057 -939 1066 -2602 -1931 1535 -1780 -3382 981 -520
2102 -520 -3344 -4 241 -3568 -757 988 -3065 -2473 989 -1923 -2826 846 -849 -3731 276 357
2118 357 -3084 -735 964 -2484 -1263 1327 -1732 -2609 1527 -457 -2366 1095 460 -2578 465 2062
2134 2062 -1582 -547 2300 -803 -760 2701 285 -1452 2276 1758 -1446 1391 2628 -800 774 3423
2150 3423 -12 -93 3315 1109 -333 2923 2256 -352 2515 3474 -406 1190 3486 58 526 3862
2166 3862 891 -533 3216 1854 -1117 2283 2447 -743 1165 3042 -877 -322 3064 534 -1347
2181 -1347 2496 985 -1707 1613 1507 -2054 224 2022 -1874 -1008 1980 -1168 -2409 1286 -516
2196 -516 -2683 678 520 -2888 -450 928 -2746 -1745 1072 -2186 -3097 490 -1228 -3490 8 -379
2212 -379 -3330 -915 196 -3029 -1681 510 -2092 -2658 731 -1499 -3218 539 -291 -3509 -202 721
2228 721 -2919 -1379 1067 -1759 -1991 1558 -490 -2130 1375 376 -2174 469 1373 -2127 -321 2134
2244 2134 -991 -1101 2542 -56 -1437 1957 863 -2080 1339 1750 -1500 464 2485 -851 -125 2909
2260 2909 24 -973 2369 1033 -1387 1952 2142 -1079 961 2476 -447 -215 2919 139 -1065 2577
2276 2577 1142 -1440 1807 2019 -1071 963 2651 -1186 -81 2904 -164 -688 2726 574 -1292
2291 -1292 2067 1702 -1311 959 2537 -1178 217 2639 -670 -1053 2498 636 -1796 1742 1360 -1528
2307 -1528 1000 1854 -1437 99 2145 -789 -1152 2435 136 -1386 1638 1006 -1927 685 1189 -2261
2323 -2261 -245 1678 -1381 -1430 1345 -1055 -2482 1105 -216 -2518 169 713 -2677 -1045 812 -2053
2339 -2053 -2184 951 -1580 -2698 605 -936 -3198 -51 -10 -3352 -955 370 -2759 -2042 570 -1942
2355 -1942 -2593 400 -1117 -3318 106 -55 -3025 -541 1007 -2379 -1918 651 -2127 -2480 659 -591
2371 -591 -2645 332 218 -2875 -227 740 -2089 -969 1341 -1231 -1430 1457 -392 -1709 1719 909
2387 909 -1903 875 1870 -1168 226 2820 -426 -379 2874 526 -886 2202 1730 -992 2084 2506
2403 2506 -527 756 2932 -41 13 3058 281 -412 2594 1565 -1004 1932 2170 -949 800 2420
2419 2420 -700 -238 2940 58 -932 2199 823 -1344 1600 1845 -1483 454 2480 -721 -279 1878
2435 1878 -789 -1317 2064 433 -2325 1041 904 -2097 -86 1643 -1814 -909 1498 -1390 -1957 910
2451 910 -659 -2602 563 109 -2721 -734 476 -2885 -1351 807 -2047 -2025 1213 -1032 -2984 269
2467 269 -45 -2824 -437 490 -2287 -785 890 -1558 -2110 1471 -586 -2389 701 -132 -2448 354
2483 354 1066 -2302 -738 1405 -1415 -1227 1543 -880 -1638 1449 425 -2224 674 1167 -1908 -139
2499 -139 1953 -1281 -833 2117 -483 -988 2015 527 -1248 1823 1709 -1176 830 2321 -760 -63
2515 -63 2590 -191 -529 2583 1183 -1468 1730 1849 -873 1790 2825 -686 227 2822 -69 -721
2531 -721 2552 944 -1015 2209 1841 -934 1320 2042 -755 370 2463 -319 -619 2679 743 -982
2547 -982 1652 1420 -1361 1097 2461 -1245 148 2476 -209 -340 2053 172 -1307 1805 1054 -1257
2563 -1257 793 1578 -1137 -69 1927 -1157 -915 1838 -469 -1846 1250 67 -2069 618 847 -2058
2579 -2058 -524 1236 -1660 -1097 1024 -861 -2015 998 -254 -2423 362 276 -2521 -520 1176 -1816
2595 -1816 -1218 1313 -1313 -2217 975 -483 -2363 5 214 -2292 -169 791 -2137 -1454 1344 -1429
2611 -1429 -1937 1104 -875 -2354 367 419 -2420 -339 1004 -2058 -912 1200 -1469 -1924 1354 -388
2627 -388 -2046 820 220 -1938 275 1361 -1328 -464 1913 -826 -614 2125 -192 -1154 1838 1084
2643 1084 -1250 1249 1660 -1065 434 2217 -494 -287 2512 268 -719 2209 1298 -853 1548 2078
2659 2078 -712 884 2400 -543 129 2866 286 -625 2482 1035 -818 1787 1817 -922 869 2565
2675 2565 -533 153 2411 65 -557 2110 679 -1487 1244 1335 -1446 85 1623 -1312 -722 1558
2691 1558 -926 -1498 1441 -172 -1781 603 367 -2404 -190 631 -2099 -1161 719 -2014 -2325 565
2707 565 -995 -2790 163 -495 -2818 -692 75 -2476 -1362 792 -1934 -2459 263 -1254 -2872 173
2723 173 -507 -2427 -573 339 -2361 -1025 546 -2249 -1695 872 -1156 -2466 503 -221 -2453 408
2739 408 606 -2205 -599 1169 -1496 -901 1281 -603 -1305 1357 0 -1993 884 1229 -1420 427
2755 427 1950 -898 -498 2652 -314 -612 2147 696 -843 1283 1614 -722 1100 1995 -590 213
2771 213 2062 -175 -365 2093 546 -1043 1752 1340 -984 1133 1901 -969 428 2340 -144 -254
2787 -254 1958 566 -830 1463 917 -1075 1060 1765 -836 318 1982 -580 -267 2008 196 -1164
2803 -1164 1733 605 -1362 1020 1438 -1376 -145 1787 -826 -437 2051 -454 -1210 1376 343 -1586
2819 -1586 823 952 -960 174 1549 -1464 -819 1424 -588 -1598 1363 -20 -1739 615 654 -2069
2835 -2069 -29 1405 -1473 -818 1350 -912 -1452 1155 20 -1914 792 454 -1953 164 944 -1623
2851 -1623 -883 1269 -1282 -1517 1109 -414 -2219 483 374 -2256 13 1143 -1912 -408 1428 -1131
2867 -1131 -1368 1048 -388 -1601 682 409 -1873 533 1255 -1389 -361 1512 -972 -930 1930 -140
2883 -140 -1156 1204 987 -1254 1000 1690 -1102 556 2084 -424 -168 1972 436 -399 2013 1286
2899 1286 -699 1846 1934 -740 1343 2515 -63 589 2569 788 -229 2625 1068 -693 1749 2046
2915 2046 -319 1501 2501 64 463 2703 722 -104 2573 996 -451 1783 1715 -442 1451 2286
2931 2286 -371 604 2299 83 -63 2270 384 -699 1635 1254 -1163 701 1306 -689 18 1592
2947 1592 -684 -1014 1644 -268 -1627 1102 884 -1850 243 878 -1651 -734 1137 -1454 -1349 916
2963 916 -874 -2040 410 -325 -2102 -71 208 -2181 -725 368 -1857 -1477 845 -974 -2089 610
2979 610 -559 -2438 -103 265 -2281 -536 821 -1674 -974 1026 -983 -1351 1262 -22 -1827 330
2995 330 868 -1613 -137 1464 -1010 -799 1609 -533 -885 1737 664 -993 1146 1208 -865 746
3011 746 1776 -347 258 2028 126 -80 2076 984 -397 1988 1745 -590 1299 2319 -145 479
3027 479 2627 480 122 2338 1124 -304 2155 1592 -347 1786 2187 -574 891 2303 119 141
3043 141 2532 642 -589 2193 1255 -663 1282 1498 -682 483 1835 -378 -282 2033 38 -917
3059 -917 1447 573 -1139 886 998 -1436 52 1544 -975 -445 1460 -389 -1214 941 457 -1396
3075 -1396 669 513 -1485 -106 892 -1521 -999 950 -1080 -1624 572 -346 -2021 299 376 -1996 -279
3092 -279 692 -1452 -1001 807 -1213 -1839 764 -265 -1641 259 62 -1598 176 689 -1638 -1018 774
3109 774 -876 -1349 1088 -424 -1603 423 372 -1772 106 854 -1310 -355 1280 -1191 -894 982 -282
3126 -282 -1344 958 257 -1436 460 686 -1526 -293 1802 -822 -64 1305 -72 -925 1445 779
3142 779 -956 1104 1412 -1041 544 1468 -770 -477 1849 273 -670 1560 565 -740 1055 1162 -988
3159 -988 722 1865 -333 59 1598 -186 -594 1198 366 -911 1385 907 -760 876 1642 -784
3175 -784 173 1628 -516 -347 1689 409 -852 1329 1050 -822 501 1394 -976 229 1641 -604
3191 -604 -438 1358 -120 -882 1199 424 -1262 382 895 -1324 -155 1012 -1010 -1352 693 -700
3207 -700 -1323 603 -186 -1697 97 225 -1338 -824 876 -1458 -1109 733 -1150 -1584 683 -144 -1742
3224 -1742 92 163 -1937 -621 569 -1576 -1302 618 -1251 -1405 657 -350 -1813 -204 287 -1797
3240 -1797 -479 446 -1657 -721 1022 -1027 -1422 671 -260 -1634 277 177 -1435 226 846 -1376
3256 -1376 -855 1198 -475 -1110 944 222 -1228 854 642 -1401 285 1162 -806 74 1584 170
3272 170 -386 1657 405 -429 1163 896 -912 819 1324 -557 67 1604 -31 -359 1812 -77 -763
3289 -763 1440 844 -353 745 1006 -375 283 1504 -471 -172 1738 497 -422 914 731 -447 864
3306 864 1007 -385 215 1482 -688 44 1329 -210 -724 812 348 -1094 1015 700 -973 156 977
3323 977 -964 -633 917 -744 -954 952 -191 -1394 342 536 -1345 37 682 -1103 -685 937
3339 937 -887 -1302 663 -365 -1617 407 201 -1521 124 534 -1504 -582 360 -974 -985 438 -414
3356 -414 -1638 441 141 -1527 -117 474 -1550 -484 927 -1110 -918 638 -337 -1422 586 59
3372 59 -1375 201 518 -1113 -385 760 -683 -620 1204 -287 -632 1270 415 -1029 368 679 -870
3389 -870 344 995 -357 -197 952 -401 -269 1086 408 -583 1020 1049 -562 289 1345 -314 -51
3406 -51 1843 311 -182 1468 732 -685 1165 1253 -431 893 1592 -294 102 1782 330 -149 1535
3423 1535 496 -405 1323 1234 -685 643 1687 -519 262 1592 -90 -285 1374 374 -640 1115
3439 1115 617 -1107 505 848 -838 110 1281 -511 -519 1331 -57 -1043 911 311 -1069 203 779
3456 779 -1267 -351 845 -734 -754 949 -401 -1109 422 82 -1347 128 355 -1266 -271 561 -1221
3473 -1221 -949 677 -951 -1245 500 -158 -1531 -104 326 -1698 -360 403 -1325 -844 561 -916
3489 -916 -1081 800 -342 -1223 221 219 -1299 -198 590 -866 -516 538 -439 -839 850 86 -1093 622
3507 622 693 -1019 77 560 -1106 -391 1294 -410 -607 1229 222 -477 874 418 -772 551 932
3524 932 -680 252 1374 -113 -418 1263 422 -129 1016 862 -622 781 1085 -333 471 1443 -13
3541 -13 -28 1603 166 -244 1332 711 -561 971 1017 -370 411 1197 -428 -170 1463 74 -520 1143
3559 1143 590 -823 1036 916 -758 454 888 -524 -485 907 -169 -809 848 -10 -802 641 234
3576 234 -1063 212 550 -874 -580 497 -625 -1033 557 -310 -1483 235 148 -1638 -379 342 -1155
3593 -1155 -430 360 -1068 -1234 452 -749 -1605 -25 -301 -1324 -53 120 -1275 -795 544 -974 -1602
3610 -1602 188 -901 -1460 250 -3 -1758 -260 -95 -1484 -792 378 -1162 -1250 502 -576 -1541 -28
3627 -28 -199 -1371 159 504 -1351 -303 541 -994 -266 699 -598 -518 849 -12 -1008 681 950 -880
3645 -880 364 849 -568 -300 1052 -169 -388 997 278 -486 751 806 -286 499 904 -509 40 1405
3663 1405 247 -132 1204 660 -574 888 929 -579 813 1076 -174 307 1597 117 -67 1079 331
3680 331 -412 939 919 -304 421 1085 -145 -123 1322 -426 -456 899 -141 -622 837 426 -946 214
3698 214 360 -1244 -437 617 -508 -854 702 -875 -1131 492 -8 -1755 -274 -4 -1535 -602 381
3715 381 -919 -914 435 -746 -1487 208 -581 -1329 -33 39 -1822 -511 126 -1571 -1052 486 -848 -1265
3733 -1265 81 -425 -1409 -297 -475 -1596 -803 151 -1199 -1060 516 -892 -1151 361 -141 -1438 286
3750 286 191 -1243 37 594 -971 -525 817 -591 -257 758 128 -822 642 571 -603 397 704 -576
3768 -576 298 1134 -9 -396 1383 217 -349 855 613 -458 716 1148 -524 364 1137 -133 -168 1385
3786 1385 277 -595 1247 603 -486 818 1092 -259 49 1185 -96 43 1176 225 -120 1131 436
3803 436 -492 961 821 -709 211 1015 -209 -168 1061 -204 -610 945 254 -796 234 421 -775
3820 -775 -27 516 -833 -537 862 -400 -1115 517 -323 -1009 262 226 -1089 81 422 -931 -367 836
3838 836 -700 -625 180 -139 -1118 356 -226 -1223 23 459 -873 -341 558 -886 -817 846 -425 -1267
3856 -1267 356 27 -944 -215 503 -987 -654 301 -856 -846 338 -252 -971 625 -311 -1004 102 581
3874 581 -1023 -277 579 -778 -550 849 -279 -570 753 152 -833 591 570 -865 276 649 -229 -210
3892 -210 842 -13 -225 998 244 -594 1111 615 -484 480 1120 -244 -177 1325 162 -118 1311 251
3910 251 -766 869 584 -531 420 1148 -278 335 1222 -85 -197 968 633 -412 801 635 -354
3927 -354 446 682 -557 -54 1303 51 -142 1024 105 -595 779 341 -291 555 739 -580 187 1067
3945 1067 -238 -560 1010 -158 -584 529 307 -758 500 370 -797 24 902 -635 -286 762 -291
3962 -291 -619 516 109 -1072 362 291 -919 -135 390 -568 -443 600 -580 -1217 521 -90 -1177 126
3980 126 5 -1444 101 1 -900 -553 345 -652 -792 521 -146 -864 200 162 -988 -74 607 -812
3998 -812 -228 822 -466 -839 338 -208 -990 672 243 -1001 278 575 -1021 -3 724 -609 -581
4015 -581 739 0 -646 707 63 -629 131 534 -581 -114 1017 -14 -55 772 -16 -364 908 291
4033 291 -618 662 990 -564 -91 1128 -252 -99 871 33 -145 1032 493 -311 811 711 -232 612
4051 612 1023 -203 -9 1047 -45 -247 804 398 -575 1041 239 -569 290 887 -375 -597 931 -218
4069 -218 -39 610 259 -575 645 144 -744 70 518 -613 -361 619 -659 -661 426 -345 -663 537 -125
4088 -125 -693 159 364 -1068 -284 267 -657 -636 335 -488 -1409 293 189 -1303 -107 -5 -1103 -242 460
4107 460 -641 -830 377 -175 -862 446 -238 -972 43 -166 -870 -320 517 -1037 -702 465 -581 -727
4125 -727 547 54 -978 220 126 -1236 -205 499 -632 -613 872 -494 -518 404 -33 -689 356 102
4143 102 -797 255 680 -630 99 1100 -593 -348 643 9 -417 572 534 -845 467 809 -598 -134
4161 -134 912 -55 -399 1153 34 -185 892 400 -603 499 616 -292 104 1000 -294 -375 779 114
4179 114 -414 1078 379 -370 345 574 -526 -387 920 -205 -358 671 134 -403 779 22 -566 312
4197 312 544 -633 120 596 -578 -393 817 -254 -820 892 55 -892 496 331 -845 -215 303 -638
4215 -638 -471 518 -742 -656 848 -42 -754 205 111 -873 -280 449 -884 -615 611 -635 -740 165 -386
4234 -386 -1008 242 89 -1352 53 313 -823 -200 301 -663 -715 470 -411 -1108 197 -120 -872 -28
4252 -28 266 -979 -140 425 -768 -529 262 -202 -732 325 361 -753 152 482 -939 -175 549 -214 6
4271 6 660 -313 -807 693 -47 -714 170 621 -548 172 626 -312 -355 900 26 -258 581 265 -286 575
4291 575 521 -232 607 971 -460 -67 743 -157 -424 807 209 -387 832 619 -663 624 951 -274
4309 -274 209 936 203 -509 723 66 -439 531 704 -464 195 899 -582 -114 904 -541 -374 832
4327 832 -197 -455 621 197 -461 305 442 -798 -284 515 -547 -621 444 -432 -692 -31 33 -733 484
4346 484 300 -1004 -81 559 -811 -450 513 -653 -914 327 -222 -989 406 -182 -1011 -105 486 -857
4364 -857 -372 324 -601 -850 574 -477 -767 129 442 -788 -38 392 -550 -356 705 -408 -824 456
4382 456 58 -449 344 486 -653 122 604 -409 -127 738 -159 -192 775 76 -265 680 346 -143 472 922
4402 922 -433 38 765 -70 -225 645 229 -380 656 309 -409 654 664 -381 324 793 -112 106 1116
4421 1116 77 -13 820 740 -156 930 661 -171 386 1025 -92 -79 589 -107 -453 602 242 -573 260
4440 260 546 -555 167 645 -368 -28 431 -245 -460 538 278 -416 291 434 -843 -207 295 -562 -386
4459 -386 631 -372 -554 464 63 -710 133 297 -914 -99 563 -688 -428 375 -706 -741 253 110
4477 110 -601 147 126 -576 69 19 -621 -461 248 -541 -773 528 -539 -836 232 158 -903 153 316
4496 316 -722 -336 429 -721 -671 568 -255 -515 305 192 -714 188 248 -443 270 713 -402 -355 724
4515 724 -112 -429 525 306 -403 383 -275 -662 403 597 -427 -162 445 -357 -193 825 247 -666 440
4534 440 260 -259 21 441 -226 -141 681 -43 140 585 130 -176 475 418 -329 275 663 -280 18 566 -181
4555 -181 -163 667 287 -337 759 334 -670 271 547 -371 17 659 -141 -124 640 -69 -337 552 161 -843
4575 -843 462 115 -683 -135 458 -254 -472 421 -193 -464 157 324 -622 148 433 -603 -75 297 -704
4594 -704 -359 370 -335 -825 304 -162 -831 377 -63 -789 -448 498 -658 34 256 -362 -677 480 -380
4613 -380 -751 275 101 -890 33 475 -540 -52 209 -402 -619 640 -375 -521 4 197 -588 141 350
4632 350 -488 30 743 -246 -549 606 -355 -203 301 231 -445 93 388 -471 -144 413 -272 -266 744 -202
4652 -202 -420 725 329 -320 500 698 -464 175 707 -251 -10 666 45 -476 599 543 -298 762 773
4671 773 -284 461 648 -237 129 717 273 -384 633 246 -223 548 307 -485 585 678 -298 -10 706
4690 706 53 -125 328 -64 -515 346 270 -438 293 463 -337 20 446 -269 -257 678 252 -441 422 297 -485
4711 -485 26 619 -528 -163 573 -434 -336 464 -39 -807 34 -89 -662 -76 86 -783 -401 -47 -424 -736
4731 -736 530 -411 -582 224 -280 -790 -265 -63 -520 45 283 -472 -434 290 -306 -514 43 -26 -329 333
4751 333 253 -661 -254 324 -276 -235 347 -313 -354 680 -220 -612 510 551 -561 -153 504 -210 -180 328 -100
4772 -100 -281 756 183 -454 303 521 -280 177 502 -221 -223 445 -98 -272 538 357 -396 618 231 -410
4792 -410 415 467 -11 -124 686 89 -280 613 372 -178 527 548 -333 530 545 -299 191 402 43 -122 398
4813 398 -59 -165 638 42 -403 512 580 -282 -84 733 -359 -64 471 -319 -324 332 2 -418 21 196 -534
4834 -534 157 445 -593 -257 512 -245 -540 249 194 -535 -137 -17 -531 176 118 -366 -15 529 -433 -449 284
4855 284 -252 -933 41 55 -774 -83 105 -474 -193 309 -225 -410 102 -495 -645 -5 155 -447 86 316
4875 316 -678 -283 350 -325 -249 147 -38 -430 263 267 -509 193 22 -433 -154 355 -276 -202 415 70 -154
4896 -154 646 173 -529 174 583 -208 -51 355 26 -336 621 102 -311 613 337 -175 260 391 -106 -128
4916 -128 501 -115 158 597 214 -90 364 143 -420 474 330 -219 107 430 -84 4 521 -98 -215 580
4936 580 357 -318 619 160 -262 81 556 -445 -197 504 -366 -179 188 188 -230 60 180 -354 -10 -42 -112
4957 -112 -111 241 -466 -423 324 -277 -490 194 -13 -722 -157 177 -563 -149 228 -306 -294 387 -94 -377 92
4978 92 -64 -704 -167 134 -706 -94 109 -370 -579 417 -72 -451 -129 -158 -884 188 171 -413 -152 296 -313
4999 -313 -16 308 -298 -628 301 -150 -581 302 284 -523 281 152 -206 -161 458 -154 -365 628 93 -38 268
5020 268 296 -373 115 152 -402 -202 301 -471 -474 627 -138 -454 272 18 -413 42 438 -474 61 192 14
5041 14 277 560 342 -238 643 387 -324 157 501 -204 280 492 15 26 563 198 -193 331 372 -319 487
5062 487 563 -419 -47 543 -298 15 153 -395 -118 75 -75 -560 169 393 -489 -260 65 -505 -214 497
5082 497 -136 -441 491 -303 -838 27 54 -641 410 112 -264 -125 117 -355 -479 285 -163 -666 169 -262
5102 -262 -524 169 18 -358 -330 103 -82 -444 62 -278 -486 149 -304 -534 -55 120 -396 -198 280 -253
5122 -253 -406 102 -220 -289 327 100 -312 42 231 -547 -137 149 217 39 396 81 -470 98 53 -487 192
5143 192 21 12 -13 300 -180 -311 366 -202 -137 263 306 -344 442 491 -491 263 366 -52 -73 433 206 80
5165 80 687 264 -259 244 469 -269 313 491 -11 56 597 66 -259 467 388 -306 419 137 -488 15 432
5186 432 293 194 624 100 -293 393 178 -362 337 8 -181 209 42 -302 57 268 -200 -401 422 193
5206 193 -273 375 121 -464 75 245 -595 231 16 -188 -617 160 -210 -424 307 27 -317 -44 -227 -408
5226 -408 17 167 -522 -417 165 -247 -374 157 -201 -589 62 321 -349 -155 205 -581 -44 7 -86 -432 200
5247 200 -177 -349 21 290 -308 -30 77 -420 85 52 -317 -434 87 -225 -355 98 48 -309 -4 264 -429
5268 -429 96 316 -258 -111 344 35 -258 511 41 -282 -40 109 55 16 542 -61 -156 458 44 -38 290
5289 290 602 -496 554 531 63 140 490 -112 -124 533 58 -161 454 96 -370 352 255 35 193 247 -62
5310 -62 -44 580 13 9 403 121 -298 52 328 -414 391 343 162 134 128 -127 -333 219 164 -32 -46 38 -511 -133
5334 -133 452 -359 31 429 -71 -247 264 -205 -264 -56 -141 -641 -195 -19 -191 -184 -137 -24 -400 -139 272 -617
5356 -617 -82 -151 -449 63 363 -392 -116 217 -134 -367 36 39 -371 115 -56 -434 221 55 -379 -206 165
5377 165 -158 -238 416 189 -503 264 -101 -355 489 59 -305 -271 152 -264 -238 399 -141 -227 322 -119 -307
5398 -307 295 158 -113 232 332 62 38 445 205 -93 451 269 -408 117 448 -99 140 576 -123 54
5418 54 456 -139 -288 597 157 -332 657 441 -187 420 492 -77 13 421 184 -110 301 211 292 345 303 -233
5440 -233 179 706 -170 -76 425 -243 -228 204 5 -244 124 219 -105 35 374 -143 9 209 81 -152 -6
5461 -6 -291 -316 37 -16 -347 -64 116 -390 -197 278 -552 -402 184 -302 -44 -11 -16 -321 -25 151 -394 -142
5483 -142 261 -349 -357 9 -119 -427 72 -149 -2 44 36 -267 -196 486 -533 52 306 -265 -280 392 96 -287
5505 -287 108 42 -303 155 162 -247 -284 361 -185 -428 126 151 -261 339 135 -350 116 204 -175 -98 173 -271
5527 -271 -182 274 253 -215 180 129 -387 175 556 -482 -65 558 -196 -160 248 -185 -161 189 -102 -536 180
5548 180 324 -461 120 232 -44 -286 279 23 -202 342 279 -55 -60 441 -105 -152 146 -273 -217 350 310 -167
5570 -167 450 227 -363 262 41 -546 240 404 -188 -108 250 -206 -379 72 165 -136 142 65 -275 -280 371 -175
5592 -175 -5 120 -372 -223 -48 85 -281 170 -86 -288 43 102 -412 146 182 -240 -535 -57 -56 -210 172
5613 172 141 -218 152 219 -305 -277 163 -88 -341 345 15 -193 -120 159 -216 16 124 -92 -153 271 -276 -197
5635 -197 127 -180 23 394 8 -494 43 217 -436 281 176 -476 -9 287 -255 -274 302 -31 -283 338
5655 338 235 -330 129 414 -210 -55 408 -298 -141 273 257 -39 605 21 -356 196 74 -68 8 120 -183
5676 -183 -198 176 136 -415 108 260 -334 433 287 -290 230 313 57 -132 332 -66 -190 321 118 -363 170
5697 170 260 -296 250 565 -445 -63 72 -94 -107 257 62 -173 114 58 -389 -75 256 -228 -196 91 -210
5718 -210 -275 -95 -136 -230 -213 -183 -652 -216 290 -422 -374 112 -77 -428 150 -254 -349 171 -260 -1 -107 131
5740 131 -293 -243 -55 27 64 93 -160 -275 -72 -86 -261 -58 174 -76 -250 209 -171 -98 319 -9 -433 264
5762 264 131 -97 -73 217 -25 114 354 -43 -2 355 61 -433 365 289 -376 -128 553 -79 79 442 -131
5783 -131 -179 45 -103 -121 430 -89 -317 264 0 -344 -81 302 -244 96 376 -344 -151 255 -32 -99 278
5804 278 277 -398 129 180 -298 -51 334 -59 -375 175 13 -99 216 101 -351 227 169 -329 -46 162 -232
5825 -232 -329 326 87 -252 270 134 -304 -9 108 -87 -126 -29 -170 -236 420 -317 -273 -4 83 -381 -164 303
5847 303 -344 131 126 -205 -90 391 -116 -509 35 -29 -501 -225 277 -239 -231 64 -234 -370 121 -330 -42 211
5869 211 151 -150 -160 176 -460 -20 93 -126 -86 125 -122 -269 92 21 -170 -191 -122 -255 -289 335 104 -133
5891 -133 230 -357 -461 330 -87 -173 -51 -58 -158 185 214 -117 101 58 -57 -197 29 100 -128 -82 39 -81
5913 -81 255 304 -160 -126 173 221 -8 362 491 -66 521 190 -142 193 108 -362 0 336 -320 216 109 -18
5935 -18 -300 304 97 -361 196 211 122 137 203 -279 -191 363 109 6 46 460 -227 -24 433 -112 5 100 -172
5958 -172 -325 373 212 -205 -5 -236 33 260 195 -285 -250 243 -257 -130 249 -13 -404 102 -106 -152 168
5979 168 35 -323 -62 -141 -191 -374 504 37 -149 156 -362 -207 -87 -48 -162 -84 55 -275 -173 101 252
6000 252 -226 137 341 -227 355 33 -131 100 46 -352 -128 -21 156 80 329 -149 -482 194 -71 -249 67
6021 67 285 -408 -182 534 -136 -218 221 -236 14 189 -114 -66 177 95 -32 71 244 122 -282 462 383 -112
6043 -112 590 195 -21 200 515 63 -128 366 -52 7 39 165 75 269 239 90 101 -145 -107 1 417 -149
6065 -149 71 493 34 -81 426 -153 -299 -37 -98 -35 197 266 126 -72 106 -159 -247 -4 53 -265 240 19
6087 19 -403 55 236 -384 -53 223 -1 -252 167 -196 -21 282 -250 -203 12 155 -451 -258 156 -169 -226
6108 -226 174 75 -185 253 -140 -399 77 -60 -197 30 -11 -190 -60 367 -22 -168 333 -173 -51 16 -152
6129 -152 -75 -27 124 -241 -190 170 137 -179 410 -4 -140 147 244 -21 -136 243 -273 236 -38 -145 -87 -11
6151 -11 53 -194 316 189 53 217 601 -52 154 221 -113 55 -37 233 241 381 222 -73 328 279 -49 188
6173 188 192 189 -112 209 66 -52 221 200 -245 390 10 69 -231 327 -317 42 259 -84 22 284 14 83
6195 83 247 439 131 156 120 -202 -138 273 513 -115 274 -112 -253 -64 54 -195 -219 40 -140 -230 382 -285
6217 -285 -376 382 -83 -196 -155 -42 -516 -76 -106 -329 64 336 -150 -524 154 -186 -299 170 126 6 -248
6238 -248 -80 -166 -33 -37 -147 -176 -38 -318 -6 193 -26 -197 202 134 -165 201 53 -459 -117 233 189 -286
6260 -286 77 66 -390 83 368 -216 -54 126 -462 -168 195 -100 -233 186 -82 100 469 122 120 395 67
6281 67 68 -111 470 -172 -275 135 174 40 -114 370 12 53 528 -9 -40 46 97 -49 331 234 -24 418 286
6304 286 -193 -129 328 -115 -129 159 96 286 491 -111 -159 78 -4 -291 -102 157 -113 -71 538 -208 -59 153
6326 153 -135 -491 -26 149 -108 41 128 -250 -255 229 3 -11 7 -31 -24 134 -49 -171 -153 -140 -246 -26 44 85
6350 85 -383 125 85 -243 334 -61 -244 162 76 -98 117 221 -151 108 72 -196 -203 252 141 -127 -247 57
6372 57 -230 -97 21 -165 -36 -24 -56 -115 119 -167 -181 267 -32 252 94 53 -301 -7 68 -116 -152 202 240
6395 240 -176 -146 193 -201 16 181 -76 101 275 32 25 39 -86 -253 154 -128 -229 350 190 -224 111
6416 111 279 70 47 130 220 14 194 -149 -162 185 78 -116 -60 138 113 -229 109 -186 139 315 221 -130
6438 -130 156 -1 282 272 79 -36 -83 322 22 45 266 197 61 175 -26 18 -67 118 -254 -175 277 -202
6460 -202 -288 14 -228 -124 -112 64 -367 163 108 177 -132 8 -175 -118 -63 -298 -215 236 -65 -435 -53 132
6482 132 -199 -297 276 -42 -213 15 -63 -257 87 -31 -261 -139 56 -202 -82 156 -53 -230 283 -90 -193
6503 -193 51 -52 -419 -23 11 -305 290 132 47 18 207 23 -367 167 259 132 -50 126 33 -160 375 -256
6525 -256 -72 205 -40 -121 20 439 -60 25 -45 -156 -44 147 -117 -211 417 -72 71 -142 -70 -81 339 -23
6547 -23 -115 -44 310 -31 64 279 -144 31 349 127 -144 -58 89 54 -8 80 39 27 256 -236 -429 -74 145
6570 145 89 144 238 -274 72 -34 -161 9 -172 38 -253 39 -259 169 18 -135 -83 147 335 -410 -143
6591 -143 278 43 -3 18 1 46 -135 170 -492 -218 -288 -28 141 225 -118 364 78 -337 -402 -145 5 -395
6613 -395 67 111 -201 -117 -213 -175 204 314 -75 -146 187 -408 -242 29 138 -406 -95 -119 -41 -60 203 -103 106
6636 106 48 -59 -278 91 -12 24 51 212 -146 -106 482 -266 6 -14 97 -212 289 70 270 -115 -54 -14
6658 -14 -41 203 81 175 143 15 -280 90 -94 -379 252 210 -150 -259 66 -196 164 167 64 275 378 235
6680 235 270 236 310 -79 194 25 -2 -157 -17 214 -297 111 234 349 144 244 -97 16 119 -173 -32
6701 -32 -53 -84 -22 -49 333 -76 45 45 -233 10 -153 -154 -222 307 232 -31 184 38 -34 123 91 -634 -317 68
6725 68 15 -261 51 -308 -265 188 20 -162 171 13 201 -188 58 -268 -42 18 -55 139 -104 0 -29 214
6747 214 20 -71 257 28 -95 -55 121 -165 -5 256 -33 -102 347 19 -221 88 197 -49 -121 231 118
6768 118 -208 298 -299 -280 -26 -139 -79 -50 -33 -341 91 140 -44 219 113 196 -98 -26 181 -129 177 40
6790 40 130 -74 179 -69 93 166 -52 7 -36 188 41 -240 123 42 -51 -118 -50 74 302 -60 -7 119 89 -45
6814 -45 -24 531 -219 -34 -37 -109 12 58 -22 111 -106 -192 246 -55 3 -259 300 -12 -162 191 -157 -64 -338
6837 -338 224 134 -105 227 -74 -21 58 -281 -61 -22 445 19 111 -50 -98 -94 -14 -131 -191 146 89 -287 2 -3
6861 -3 -128 -36 224 -91 -84 26 128 -157 59 69 -271 -274 -39 -125 -72 127 -96 -40 289 360 -156 112 -59 -243
6885 -243 -9 20 -97 69 264 197 90 217 130 -224 59 -73 -34 258 245 -52 203 586 -259 107 65 440
6907 440 177 104 -22 -249 195 284 -31 29 150 -139 161 274 -222 -119 145 305 -186 139 158 -101 -243
6928 -243 81 -39 175 50 -29 78 212 20 -122 61 174 29 -61 -54 -108 144 307 16 -180 257 174 102
6950 102 -50 442 33 -108 -62 -90 -231 320 208 -81 380 -88 178 60 317 10 64 -107 -101 -161 -120 -153 -140
6973 -140 -197 -223 -4 -119 -150 -127 -20 -5 -70 -284 -23 -112 -309 67 172 -315 32 -372 -15 306 -123 -189 91
6996 91 270 -221 9 113 -384 -264 97 54 -115 -56 15 -204 -257 -235 -26 -88 78 -222 -281 223 -154 -114 48
7019 48 78 111 -193 -88 -131 128 -118 -288 12 143 -205 -57 -58 -17 -216 279 79 -100 202 145 -70 -51 56
7042 56 -118 -135 319 -85 -135 136 -16 -15 -141 92 214 223 544 179 114 -106 -131 -116 508 -73 -164 92 -8 52
7066 52 -6 195 -86 -192 77 -298 13 211 -178 -213 -115 143 -42 -22 5 -46 44 87 35 -297 -95 327 -235
7089 -235 -66 -118 -191 -77 178 -262 233 25 -334 -233 -82 -193 9 91 -243 -244 -439 -68 31 182 183 -323 13
7112 13 -255 38 -99 -192 264 -83 -61 263 -84 53 218 6 -212 269 139 -312 5 -368 -427 -100 -139 54
7134 54 -69 61 110 -57 -120 -112 22 118 191 -22 -47 -124 -291 105 142 203 87 51 -101 8 66 -35 213 -22
7158 -22 177 -277 -65 211 -100 -270 -8 66 401 32 -71 -222 196 380 243 -43 289 55 -201 262 122
7179 122 -51 218 49 -169 4 -149 -80 -36 397 -71 -324 202 106 -264 199 -351 -54 34 -176 -254 289 220
7201 220 -73 62 257 -259 -39 88 142 -239 -104 224 19 -14 -305 -92 -21 17 -96 -1 -20 -354 44 61
7223 61 2 -12 -109 83 -74 41 30 -152 1 52 78 -59 298 -15 -134 -203 129 -126 -43 -86 -170 -144 -44 -7
7247 -7 -227 -74 -94 -181 135 -18 -130 -258 64 -207 103 -34 0 -68 306 82 17 63 15 18 -185 34 352 -230
7271 -230 288 -23 -185 162 257 25 -54 -47 -102 -99 353 69 61 146 63 94 308 166 40 94 349 -118 -91 198 148
7296 148 -245 249 4 29 172 -69 87 24 -63 -91 -92 385 -190 -138 15 30 -84 208 132 -336 -11 -93 -71 305
7320 305 370 35 -182 185 148 211 439 46 -88 -95 -46 -102 -281 80 36 -132 4 110 -34 21 -83 -56 122
7343 122 -153 16 -58 172 101 -365 109 -54 -299 -120 83 -379 127 105 -341 -47 -56 -420 -168 229 -258 -95
7365 -95 -163 -250 -25 114 -37 -76 98 -80 -109 -118 -100 29 46 -91 -161 -94 -40 -8 44 2 -96 -100 164 113 57 214 178
7392 178 -103 20 279 100 -24 -116 -52 96 34 246 -22 -41 -14 -175 -148 -85 128 25 -131 239 -55 3 -109
7415 -109 -185 23 126 104 -59 265 -82 -223 217 -9 -182 -107 86 106 -111 29 -37 -269 154 57 -316 214
7437 214 204 -123 394 179 -40 -152 54 -22 213 -104 36 -95 -99 -3 -224 -97 -63 59 -33 -18 15 133 -124
7460 -124 -54 -218 144 -90 -42 -163 -50 -259 -36 183 -86 -288 57 -271 -194 -261 33 -87 175 380 -389
7481 -389 -200 -22 -244 72 213 -347 70 201 -156 20 -50 187 -81 47 305 -79 -197 79 45 47 -122
7502 -122 104 -31 37 76 -125 70 -12 -237 -141 -155 -360 -33 -76 -126 -8 193 33 -191 -228 360 -169 -189 48
7525 48 19 -144 -207 -27 -224 -171 -53 74 103 62 59 -116 -42 -225 -65 426 -19 116 148 118 120 -156 193 41
7549 41 -42 128 -35 -158 217 -50 139 289 12 -17 -8 -158 172 -41 -107 -161 166 154 -18 -111 7 22 136
7572 136 81 -3 -191 183 185 109 -60 229 35 239 -158 38 -53 -55 53 -72 -100 35 -186 430 8 46 113 -394
7596 -394 -151 5 46 31 -98 -25 76 -224 -17 218 85 41 16 133 -38 56 -420 -111 -157 -165 -70 -24 -119 -108
7620 -108 84 -4 23 167 91 -186 175 110 81 -225 -129 119 2 -233 -185 -304 162 16 15 244 -142 156 -71
7643 -71 -35 9 -294 132 225 132 -59 397 -105 -2 22 -253 -152 114 15 30 166 131 -192 50 -5 -96 -114 163
7667 163 153 -176 -5 232 -124 171 50 34 -96 95 304 -40 305 -82 113 3 124 -168 134 -30 113
7688 113 51 -56 325 40 69 105 243 -39 8 220 -158 189 -37 -33 59 149 -23 -22 85 -76 -64 72 -83 -48
7712 -48 203 -36 91 373 91 -14 -167 -44 -22 -88 53 164 60 31 187 -35 30 -230 -179 -166 197 -16
7734 -16 -88 -189 150 -181 103 141 102 72 19 15 -222 -156 -63 -173 -243 1 -108 -139 -262 -104 113 -77 -222 -352
7758 -352 -83 49 -65 -208 94 231 -46 258 103 101 -43 12 179 -4 -216 -147 -6 136 -27 -228 52
7779 52 188 -108 107 104 10 153 307 15 26 -216 355 541 -16 24 -186 86 -205 151 37 166 78 340
7801 340 -141 157 73 367 193 185 6 -121 27 16 45 10 -98 183 -49 96 -148 -73 20 89 17 45 97 -39
7825 -39 124 269 -83 20 -106 168 22 -46 -224 1 -1 110 86 -151 -202 -155 -24 219 9 -36 -79 140 -174
7848 -174 -259 377 94 6 -14 47 -50 -42 130 -72 121 -317 75 84 -35 -214 47 -4 -4 -102 77 -20 -338 -23 49
7873 49 84 134 -230 58 -461 -244 84 -18 260 -202 -98 167 268 -152 73 -70 -206 -153 -112 -97 -101 -121 52
7896 52 258 -166 173 37 -9 -29 15 37 31 -174 33 -40 -24 -75 91 149 394 193 -178 -149 79 -61 -192 -120
7920 -120 126 207 37 163 -170 -99 257 31 -73 296 -130 123 19 -21 -160 119 24 14 88 -165 -211 9
7942 9 129 314 -41 198 262 -187 -99 16 -46 -88 16 21 -34 103 153 219 145 144 -377 101 177 23 -77 -9 175
7967 175 56 102 139 2 -42 397 262 105 -22 -53 -51 96 -18 -28 -80 -1 200 -87 41 74 155 -58 -290 204
7991 204 -200 245 -193 -133 -49 43 -407 -238 191 168 55 -168 -93 182 0 -104 122 -251 -205 -148 45 163
8013 163 108 -61 246 -76 -43 124 -30 -161 -243 -11 76 -258 16 243 11 -38 -25 128 -205 -267 92 -250
8035 -250 97 397 -257 -516 -19 -76 244 17 66 -116 -143 -110 -56 -10 144 376 7 -123 128 -175 40 192
8057 192 60 224 -188 -161 -119 194 98 167 -157 180 -74 -197 43 61 14 41 16 -1 -28 -26 383 48 179 -190
8081 -190 140 19 -71 -124 195 20 6 -238 134 430 32 217 97 -111 -159 -93 59 -210 38 104 -100 21
8103 21 -169 67 75 -8 -225 -209 176 -167 -54 -34 -72 342 -55 -120 210 217 -139 50 -44 272 129 -193 49 -45
8127 -45 137 -92 -70 266 -293 33 27 0 -105 175 181 192 -127 158 -190 -16 -93 -196 245 -5 -18 198 14
8150 14 -24 90 216 88 51 -74 -59 61 26 197 184 118 170 -129 -121 222 6 103 -49 292 -195 159 67 69 -114
8175 -114 -148 358 -101 -170 -132 186 17 -177 146 35 236 224 128 171 -83 -66
8191f6
##END NTUPLES=NMR FID
##END=
