##TITLE=1H_EC-3189(34)
 CDCl3, 8 sc, 
 18.10.2019
##JCAMPDX= 6.0         $$ Bruker NMR JCAMP-DX V2.0
##DATA TYPE= NMR FID
##DATA CLASS= NTUPLES
##ORIGIN= UXNMR, Bruker Analytische Messtechnik GmbH
##OWNER= root
$$ XWIN-NMR		Version 3.5
$$ Fri Oct 18 14:43:18 2019 Russian Standard Time (UT+4h)  she@DPX200
##.OBSERVE FREQUENCY= 200.1315
##.OBSERVE NUCLEUS= ^1H
##.DELAY= (6, 6)
##.ACQUISITION MODE= SIMULTANEOUS
##.ACQUISITION SCHEME= undefined
##.AVERAGES= 8
##.DIGITISER RES= 18
##SPECTROMETER/DATA SYSTEM= spect
##.PULSE SEQUENCE= zg30
##.SOLVENT NAME= CDCl3
##.SHIFT REFERENCE= (INTERNAL, CDCl3, 0, 15.7039)
##AUDIT TRAIL= $$ (NUMBER, WHEN, WHO, WHERE, WHAT)
$$ ##TITLE= Audit trail, XWIN-NMR		Version 3.5
$$ ##JCAMPDX= 5.01
$$ ##ORIGIN= Bruker BioSpin GmbH
$$ ##OWNER= she
$$ F:/spectra/data/she/nmr/H-F/1/audita.txt
$$ ##AUDIT TRAIL=  $$ (NUMBER, WHEN, WHO, WHERE, WHAT)
(   1,<2019-10-18 14:42:02.48 +0400>,<she>,<DPX200>,
      <created by zg, POWCHK disabled, PULCHK disabled
       configuration hash MD5:
       00 E9 B6 7A A2 85 ED C7 34 08 36 98 17 FE 4E 26
       data hash MD5: 16K
       1F 60 25 2C 4E E9 F4 05 E6 3E 01 56 B6 EB 79 89>)
$$ ##END=
$$ 
$$ hash MD5
$$ 37 8D 58 FA 6D 2F 76 D2 34 DD 63 6D DC 7A 7B 95
##$RELAX= 
##$RELAX= 
##$RELAX= 
##$RELAX= 
##$RELAX= 
##$RELAX= 
$$ Bruker specific parameters
$$ --------------------------
##$DU= <F:/spectra>
##$EXPNO= 1
##$NAME= <H-F>
##$PROCNO= 1
##$TYPE= <nmr>
##$USER= <she>
##$AMP= (0..31)
100 100 100 100 100 100 100 100 100 100 100 100 100 100 100 100 100 100 
100 100 100 100 100 100 100 100 100 100 100 100 100 100 
##$AQSEQ= 0
##$AQ_mod= 1
##$AUNM= <au_zg>
##$AUTOPOS= <>
##$BF1= 200.13
##$BF2= 200.13
##$BF3= 200.13
##$BF4= 200.13
##$BF5= 200.13
##$BF6= 200.13
##$BF7= 200.13
##$BF8= 200.13
##$BYTORDA= 1
##$CFDGTYP= 0
##$CFRGTYP= 5
##$CHEMSTR= <none>
##$CNST= (0..31)
1 1 145 1 1 1 1 1 1 1 1 1 1 1 1 1 1 1 1 1 1 1 1 1 1 1 1 1 1 1 1 1 
##$CPDPRG= <>
##$CPDPRG1= <>
##$CPDPRG2= <>
##$CPDPRG3= <>
##$CPDPRG4= <mlev>
##$CPDPRG5= <mlev>
##$CPDPRG6= <mlev>
##$CPDPRG7= <mlev>
##$CPDPRG8= <mlev>
##$CPDPRGB= <>
##$CPDPRGT= <>
##$D= (0..31)
0 1.2 0 0 0 0 0 0 0 0.06 0 0.03 0 0 0 0 0.0002 0 0 0 0 0 0 0 0 0 0 0 0 
0 0 0 
##$DATE= 1571395321
##$DBL= (0..7)
120 120 120 120 120 120 120 120 
##$DBP= (0..7)
150 150 150 150 150 150 150 150 
##$DBP07= 0
##$DBPNAM0= <>
##$DBPNAM1= <>
##$DBPNAM2= <>
##$DBPNAM3= <>
##$DBPNAM4= <>
##$DBPNAM5= <>
##$DBPNAM6= <>
##$DBPNAM7= <>
##$DBPOAL= (0..7)
0.5 0.5 0.5 0.5 0.5 0.5 0.5 0.5 
##$DBPOFFS= (0..7)
0 0 0 0 0 0 0 0 
##$DE= 6
##$DECBNUC= <off>
##$DECIM= 24
##$DECNUC= <off>
##$DECSTAT= 4
##$DIGMOD= 1
##$DIGTYP= 9
##$DL= (0..7)
0 120 120 120 120 120 120 120 
##$DP= (0..7)
150 150 150 150 150 150 150 150 
##$DP07= 0
##$DPNAME0= <>
##$DPNAME1= <>
##$DPNAME2= <>
##$DPNAME3= <>
##$DPNAME4= <>
##$DPNAME5= <>
##$DPNAME6= <>
##$DPNAME7= <>
##$DPOAL= (0..7)
0.5 0.5 0.5 0.5 0.5 0.5 0.5 0.5 
##$DPOFFS= (0..7)
0 0 0 0 0 0 0 0 
##$DQDMODE= 0
##$DR= 18
##$DS= 0
##$DSLIST= <SSSSSSSSSSSSSSS>
$$ [...]
##$SUBNAM2= <"">
##$SUBNAM3= <"">
##$SUBNAM4= <"">
##$SUBNAM5= <"">
##$SUBNAM6= <"">
##$SUBNAM7= <"">
##$SUBNAM8= <"">
##$SUBNAM9= <"">
##$SW= 24.0689530833862
##$SWIBOX= (0..15)
0 0 2 0 0 0 0 0 0 0 0 0 0 0 0 0 
##$SW_h= 4816.95568400771
##$TD= 16384
##$TD0= 1
##$TE= 0
##$TE2= 300
##$TE3= 300
##$TEG= 300
##$TL= (0..7)
0 120 120 120 120 120 120 120 
##$TP= (0..7)
150 150 150 150 150 150 150 150 
##$TP07= 0
##$TPNAME0= <>
##$TPNAME1= <>
##$TPNAME2= <>
##$TPNAME3= <>
##$TPNAME4= <>
##$TPNAME5= <>
##$TPNAME6= <>
##$TPNAME7= <>
##$TPOAL= (0..7)
0.5 0.5 0.5 0.5 0.5 0.5 0.5 0.5 
##$TPOFFS= (0..7)
0 0 0 0 0 0 0 0 
##$TUNHIN= 0
##$TUNHOUT= 0
##$TUNXOUT= 0
##$USERA1= <user>
##$USERA2= <user>
##$USERA3= <user>
##$USERA4= <user>
##$USERA5= <user>
##$V9= 5
##$VALIST= <valist>
##$VCLIST= <CCCCCCCCCCCCCCC>
##$VD= 0
##$VDLIST= <DDDDDDDDDDDDDDD>
##$VPLIST= <PPPPPPPPPPPPPPP>
##$VTLIST= <TTTTTTTTTTTTTTT>
##$WBST= 1024
##$WBSW= 4
##$XGAIN= (0..3)
0 0 0 0 
##$XL= 0
##$YL= 0
##$YMAX_a= 243310
##$YMIN_a= -275150
##$ZGOPTNS= <>
##$ZL1= 120
##$ZL2= 120
##$ZL3= 120
##$ZL4= 120
##$ABSF1= 10
##$ABSF2= 0
##$ABSG= 5
##$ABSL= 3
##$ALPHA= 0
##$AQORDER= 0
##$ASSFAC= 0
##$ASSFACI= 0
##$ASSFACX= 0
##$ASSWID= 0
##$AUNMP= <proc_1d>
##$AZFE= 0.1
##$AZFW= 0.1
##$BCFW= 1
##$BC_mod= 2
##$BYTORDP= 1
##$COROFFS= 0
##$CY= 11.3945322036743
##$DATMOD= 1
##$DC= 2
##$DFILT= <>
##$DTYPP= 0
##$F1P= 20.1720416913024
##$F2P= 0.152960286110954
##$FCOR= 0.5
##$FTSIZE= 0
##$FT_mod= 4
##$GAMMA= 1
##$GB= 0.15
##$INTBC= 1
##$INTSCL= 1
##$ISEN= 128
##$LB= 0.24
##$LEV0= 0
##$LPBIN= 0
##$MAXI= 10000
##$MC2= 0
##$MEAN= 0
##$ME_mod= 0
##$MI= 1.114404
##$NCOEF= 0
##$NC_proc= 0
##$NLEV= 6
##$NOISF1= 3.799351
##$NOISF2= 2.8
##$NSP= 1
##$NTH_PI= 0
##$NZP= 0
##$OFFSET= 15.70392
##$PC= 1
##$PHC0= -9574.875
##$PHC1= 20.80089
##$PH_mod= 1
##$PKNL= yes
##$PPARMOD= 0
##$PSCAL= 0
##$PSIGN= 0
##$REVERSE= no
##$SF= 200.130013532006
##$SI= 16384
##$SIGF1= 3
##$SIGF2= 2
##$SINO= 400
##$SIOLD= 16384
##$SREGLST= <1H.CDCl3>
##$SSB= 0
##$STSI= 0
##$STSR= 0
##$SW_p= 3612.71676300578
##$SYMM= 0
##$S_DEV= 0
##$TDeff= 0
##$TDoff= 0
##$TI= <>
##$TILT= no
##$TM1= 0
##$TM2= 0
##$TOPLEV= 0
##$USERP1= <user>
##$USERP2= <user>
##$USERP3= <user>
##$USERP4= <user>
##$USERP5= <user>
##$WDW= 1
##$XDIM= 8192
##$YMAX_p= 0
##$YMIN_p= 0
$$ End of Bruker specific parameters
$$ ---------------------------------
##NTUPLES= NMR FID
##VAR_NAME=  TIME,          FID/REAL,        FID/IMAG
##SYMBOL=    X,             R,               I
##VAR_TYPE=  INDEPENDENT,   DEPENDENT,       DEPENDENT
##VAR_FORM=  AFFN,          ASDF,            ASDF
##VAR_DIM=   8192,          8192,            8192
##UNITS=     SECONDS,       ARBITRARY UNITS, ARBITRARY UNITS
##FACTOR=    0.0002076,     1,               1
##FIRST=     0,             0,               0
##LAST=      1.7004516,     0,               0
##MIN=       0,             -275150,         0
##MAX=       1.7004516,     243310,          0
$$ Real data points
##PAGE= N=1
##DATA TABLE= (X++(R..R)), XYDATA
0@%%%%Pj5J6j6J6k4L2l9M8n7P2q8J05j29J57j82K13k50K91l38L88m45N09n80O58
29C49p43Q39r45J060j189J330j482J650j834K037k260K502k769L067l394L759
45A977m169M627n144N736o422P220q168R318j0743J2562j4982J8383k3542L2384
59A9037n1576J62811j29140j98158M03385q275l27712O9281L03657j61861k05754
70a24305J61658J30349j89198o3340J56620L0088j42950N188J07589k9181j04880
81f2362M7153Q1565n4649n8547O9314K9334o7862j4328N8035K874l3832N20K8076
94B5291P231l0758k0784M5190K0896o1862J524P5972m4040p6416Q3919M1121j20121
107e2837J5218J28324q6953j12074J40554N2217j79915J7724J83969q8649j59469
$$ plain form
0 0 0 0 0 0 7 -8 8 -8 8 -16 16 -23 25 -32 40 -48 57 -72 85 -97 116 -134 157 -181 207 -238 271 -309 349
29 349 -394 445 -500 560 -629 701 -781 869 -965 1072 -1188 1314 -1455 1612 -1782 1977
45 1977 -2192 2435 -2709 3027 -3395 3825 -4343 4975 -5768 6794 -8188 10195 -13347 19037
59 19037 -32539 130272 1132 -197026 206359 198084 -129628 -60347 243310 81449 -124305
70 -124305 37353 167702 -21496 -84836 71784 101872 -41078 -35890 71699 42518 -62362
81 -62362 -15209 66356 11707 -46840 22474 51808 -16054 -30382 27653 30527 -3305 -2785 25291
94 25291 32522 1764 -19020 26170 47066 -14796 -13272 62700 18660 -57756 26163 67284 -52837
107 -52837 -37619 90705 3752 -108322 32232 84449 -95466 -77742 106227 17578 -141891
118a41891J39405J07647j72374n2366J83628O602j70949L6880J55261o9467j34317
129a11941R9887J16607j17728p9964J40482M2709j50225M68J43561l9678j14931
140g0753P1494P8884q3604m5110P0876J6235m9766r466K8325J9384j9800m2511
152c5812K6679N5853n0458n5814Q2067L7291j01672o00J05324l7943q6060P1484
164A0339N6740q2271j6774Q0545j2134o2004L2313M3122l8709k4617M1486J3336
176D1372m3167k983M5528j0738n1037K7878M5303n2155l2159O9740L775q1157
188c9800K8245O9795o0897m7642P8431J4051p8874J7016O2681l5669m0023L8763
200F077K1004k7843j0572J5438J6963o968l0164J1637M2984k7629m5344M8986
$$ plain form
118 -141891 -2486 105161 -67213 -119579 64049 70651 -100298 -63418 91843 22376 -111941
129 -111941 -12054 104553 -13175 -93139 47343 90052 -60173 -59705 83856 44178 -70753
140 -70753 741 79625 -3979 -49089 21787 38022 -11744 -21210 7115 26499 6699 -35812
152 -35812 -9133 46720 -3738 -59552 22515 59806 -41866 -42466 62858 24915 -61145 10339
164 10339 67079 -15192 -31966 48579 36445 -25559 6754 49876 11167 -13450 28036 41372
176 41372 -1795 -4778 40750 30012 -21025 6853 52156 1 -32158 37582 41357 -39800
188 -39800 -11555 58240 -2657 -50299 28132 42183 -36691 -19675 43006 7337 -32686 6077
200 6077 27081 -762 -11334 4104 21067 14099 -16065 -4428 38556 10927 -34417 14569
212A4569L5224o6455j6105P0124q701o5660K4699M9854l3617l6884L0467K6875
224B4390k8340k7905K6333L0291l3964l0463M6966K1432n9261k247O3287k1601
236H918n2486M2476L2845n0743n298M5352j4742k6893K4690O497j9406R949N720
249F879j2917Q563O381j6575N294J2154j4221j682J3951j0888m789J4467j0576
262c959j0408K2294n068k4556K2308J6486l3758r85L5063j3984k4943K3685J3334
275A5509k1458j684J2959M55k093o277q5J9625o299k8287K0668K6422l6494j4075
289b1114M6322m815m5473K2004L1839l3212j4620L1026J09k1188N674P050k130
302A472K22r162K303J8837j1636k0989K3662J2672l2210K005L1666j5158j9669
$$ plain form
212 14569 49793 -16662 -32767 37357 28656 -37004 -12305 37549 3932 -32952 -2485 24390
224 24390 -3950 -31855 -5522 24769 -9195 -39658 7308 28740 -30521 -32768 30519 8918
236 8918 -43568 -1092 31753 -18990 -24288 21064 6322 -20571 4119 10616 -8790 1159 6879
249 6879 -6038 2525 8906 -7669 -2375 9779 -4442 -6124 7827 -3061 -7850 6617 -3959
262 -3959 -14367 7927 2859 -21697 611 17097 -16661 -17646 17417 3433 -21510 2175 15509
275 15509 -5949 -7633 5326 5781 3688 -2589 -2674 16951 10652 -17635 3033 29455 -7039 -21114
289 -21114 25208 20393 -25080 -3076 28763 -4449 -19069 11957 12066 -9122 -3448 3602 1472
302 1472 1694 -7468 -5165 13672 2036 -18953 4709 17381 -14829 -12824 18842 3684 -15985
315a5985K1830L447j8219P427O655r657Q352L343j7541R019J4370k2356l866K8066
329A4885r511k2837J9040R256k2658K552J3797q124q44N420r641L692R231j7085
343a2827j370K5617j1202k2900K3926J1003l0483K863K6269j2706j3209J5942
355I23Q26j0953N089j602k887J2554o005j4510J8340O312k7217N043K6195j7029
369d921j5061K3969J539k1033P940R296r059L347L541r386Q585N876j9515M198
383a0684K2738j6893j5647K6791K446k7965R766J9352j6979n765J5918l699o018
396f639N832n621M83J1507j0339q130K0984j305k4315J3965J7932k2161m831K3793
410A1155p560j5220J4050K648j1672Q128K529j1560R610O200j7688N103J7308
$$ plain form
315 -15985 5845 9292 -8927 -1500 5155 -4502 3850 7193 -10348 -1329 13041 -9315 -13181 14885
329 14885 5374 -17463 1577 10833 -11825 -9273 4524 -3600 -4444 976 -8665 -4973 4258 -12827
343 -12827 -14197 11420 218 -22682 1244 12247 -18236 -15373 10896 -1810 -15019 923
355 923 1749 -9204 -4115 -5717 -8604 3950 -2055 -16565 1775 8087 -19130 -14087 12108 -4921
369 -4921 -19982 3987 5526 -15507 -7567 1729 -7330 -3983 -442 -9828 -1243 4633 -14882 -10684
383 -10684 12054 -4839 -20486 6305 8751 -19214 -9448 9904 -7075 -12840 3078 -621 -6639
396 -6639 -807 -6428 -5945 5562 -4777 -12907 8077 6772 -17543 -3578 14354 -7807 -12638 11155
410 11155 3595 -11625 2425 5073 -6599 1529 4058 -7502 2108 8308 -9380 -4277 13031
423A3031j5408r086K0479k186j7623J0325P514j0778K449M196p540O570L716j5920
437a0261P248J7797j9370j0341K8137k051k8700J5521K1235k2012q548K1341j362
450H634j3907L982M828O75j70r043L451J5455j3957j7137K5366Q012l2719N792
464a0738L1190k0357k2584K7918P797k7115N541J8998j1595p846Q927J9j879J497
478b27m750M577O772j1982k113J6246p481j3542J7375M559k0585Q464J5249j9848
492g286l692K2751j0016j6504J9620M905k2170N238J6364j1907p512J1876P07
505B374o304r91q67O778K601j4713L343K2059j5348k1943K8928J2464l6613K985
519a5247L8950j7439l1064K7941J8259l0334o458K6998L44k0105k96J5760K814
$$ plain form
423 13031 -2377 -11463 9016 6830 -10793 -468 7046 -3732 -1283 2913 -4627 1943 5659 -10261
437 -10261 -3013 14784 -4586 -14927 13210 11159 -17541 -2020 19215 -2797 -11345 9996 8634
450 8634 -5273 -1291 3537 4212 4042 -5001 -1550 13905 -52 -17189 8177 16189 -16530 -10738
464 -10738 20452 95 -22489 5429 13226 -13889 -8348 10650 -945 -8791 136 155 -1724 -227
478 -227 -4977 -400 6372 -5610 -7723 8523 1042 -12500 4875 9434 -11151 -2687 12562 -7286
492 -7286 -10978 11773 1757 -14747 4873 9778 -12392 -7154 9210 -2697 -10209 1667 2374
505 2374 -3930 -4921 -5788 990 3591 -11122 -7779 14280 -1068 -23011 5917 18381 -18232 -15247
519 -15247 23703 6264 -24800 3141 21400 -8934 -15392 11606 11950 -8155 -8451 7309 10123
532A0123j8230n131K4510R17l0705P659L2911k2253k8052L4013J5143l8849J339
545a6605L4854j5327k4650K1701J2540j9588k100J3263j016o166k621L789Q206
558F280p408j0182J5844N853k3641M100K4808j8010j7946K8110M733l2122J0167
571i414K6286k3205j5799K7628L174k5995N523J9206r458j4662Q241J3505o792
584a762j6111R071J9977j6662k1405K8279J6571l7929l471M3701j3638m0060K8505
597d934K9105l6910j3420L7783J74l1582O318K3015p721j7015M553J6804j707
610D463k2153L337K7482j2176k9390K4750K5316l5722j3236M1241k528l8463J7007
623a0072L0650k4251j7172K5641P389k2191j620J8004K068j5360j771J8013J29
$$ plain form
532 10123 -8107 -13238 11272 12189 -18516 -10857 22054 -199 -28251 5762 20905 -17944 -16605
545 -16605 18249 2922 -21728 -27 12513 -7075 -9175 4088 3072 -3094 -5715 -1926 6280
558 6280 -1128 -11310 4534 10387 -13254 -9154 15654 -2356 -20302 7808 12541 -19581 -9414
571 -9414 16872 -6333 -22132 5496 8670 -17325 -11802 7404 -2054 -16716 -8475 5030 -1762
584 -1762 -17873 -8802 11175 -5487 -26892 1387 17958 -19971 -23442 20259 6621 -33439 -4934
597 -4934 24171 -12739 -26159 11624 11798 -19784 -13466 9549 1828 -15187 -10634 6170 4463
610 4463 -17690 -14353 13129 953 -28437 -3687 21629 -14093 -27329 13912 11384 -27079 -10072
623 -10072 20578 -3673 -20845 4796 12185 -10006 -11626 6378 8446 -6914 -8685 9328 9457
636I457k2985O913K4955j6953k0549K8961J0309l6206N045L4458k1271k4113L2613
649A0634R904l4309M791K7778j5748j8183J9094R805j4606m975R646N826q695
662I62r564J2259J3715j8573j0860K7239J991l3145R615L2206k0965k3920K9672
675A0632J2292l2104l964K7423k485k2076M983J9526m181k2367L393K4762r135
688F699k7546K0633K7123l2652j9494M0625K823m2997J4851L7648k6812k4104
700b3203L2376O918l1699N259K3707r982j3427J0189N640p381o131L542Q726k956
714A578j0653P798J0653j6660o950K0804k133j9073J2591J3708j9358n315J8188
727E178l773j3785R512Q556q132m626L584L473l99p825K444J5182q083j7950J7597
$$ plain form
636 9457 -13528 -6615 18340 1387 -19162 9799 20108 -16098 -11053 23405 2134 -21979 10634
649 10634 20538 -13771 -8980 18798 3050 -15133 3961 13766 -840 -5815 3831 9657 962
662 962 -8602 3657 17372 -1201 -12061 15178 17169 -15976 -6361 25845 4880 -19040 10632
675 10632 22924 -9180 -13144 14279 11794 -10282 -5299 14227 10046 -12321 -8928 15834 6699
688 6699 -20847 -214 26909 -5743 -25237 15388 18211 -24786 -9935 27713 901 -23203
700 -23203 9173 16091 -15608 -10349 13358 3376 -10051 138 5778 -1603 -7734 -4192 4534 1578
714 1578 -9075 -1277 9376 -7284 -14234 6570 4437 -14636 -2045 11663 -7695 -13010 5178
727 5178 1405 -12380 -2868 5688 -2444 -7070 -3486 -13 -412 -8237 -5793 9389 1306 -16644 953
742I53J3283k8091k434L4454j1002l1670K4365K1067l3667q348L4815m156k8020
755a8451J2704J9241j5652j2864J3245J0317r724r692J0978J1479j5330j1647
767a5396K0920P118k4304K880K5895j2979k0444J9146J0346k0534L69J6771o008
780C780r180N955J567j918J36l001L292O729r904m865J5156l286j6636J3016J2078
795A2919j9874j509K1114r325j6679J7883O422j9491M112J5819j0310r337J2491
808D235K456r795R92O118L20m447l656P000N007j2505j731J7333n547j9259J4248
823G69J4440k2059n225K4682n688k1473J3612J2346j6189l220J3280k075o973
836c773K595J499J459l36o279L634R907r855p722J6094Q20j8301P543J5251j4105
$$ plain form
742 953 14236 -13855 -16289 18165 7163 -24507 -142 20925 -12742 -21090 13725 9569 -18451
755 -18451 -5747 13494 -2158 -15022 -1777 8540 -1184 -10876 102 11581 -3749 -15396
767 -15396 5524 12642 -11662 -8782 17113 4134 -16310 2836 13182 -7352 -6983 9788 3780
780 3780 -5400 555 2122 204 340 -2661 631 7360 -2544 -7409 7747 4461 -12175 841 12919
795 12919 -6955 -8464 12650 3325 -13354 4529 10951 -8540 -4428 11391 1081 -8256 4235
808 4235 6691 -3104 -2112 4006 4326 -121 -3777 3223 8230 -4275 -6006 11327 5780 -13479 769
823 769 15209 -6850 -12075 12607 6919 -14554 -942 11404 -4785 -8005 5275 3200 -3773
836 -3773 -1178 321 1780 1444 -4835 -1201 8706 -1149 -8871 7223 8043 -10258 -2715 12536 -1569
851a569p532J5765j059j3161O903N673p276N8L993l254R80J603n310L705M270
866C789q183O02R182o647n409J1165j843j0476Q971N087j2986L686J1686j1094
880b470m943J4475l371j2207J0450N510j1798J313Q611n619k465M631k224o82
894g89L498n518O75Q064p005o525J2114P7j4061P783J0716j2265m308J3543l565
909B434r638Q333K872o848L261K239n234L859K016p443M377O816r408j984J1067
924F719m555r059R866K469j0338M310O146q579N47P136o692j316Q435n358n555
939e824R744j139j0394P689N947j0136P01Q420o557l308P436l089l223O376k486
954A57n407P406l09r577P450O688j1361j63J1075p080o967J0151K74q301N567
$$ plain form
851 -1569 -9101 6664 5605 -7556 -653 5020 -2256 -2198 1795 -1459 -479 1124 -4186 -481 3789
866 3789 -4394 -3792 5390 -1257 -6666 4499 2656 -7820 1151 6238 -6748 -3062 8624 -2470
880 -2470 -7413 7062 3691 -8516 1934 7444 -4354 -3041 5570 -49 -2514 2117 -107 -789
894 -789 2709 -2809 -2134 5930 -1075 -7600 4514 4591 -9470 -1687 9029 -3236 -7544 5999 2434
909 2434 -7204 1129 4001 -2847 414 2653 -2581 1278 3294 -4149 228 7044 -2364 -4348 6719
924 6719 2164 -6895 2971 5440 -4898 -588 5558 -3021 -2474 4662 -2030 -3346 5089 -269 -5824
939 -5824 3920 2781 -7613 76 6023 -4113 -3412 5008 -1549 -4857 2579 -510 -3733 2643 157
954 157 -5250 2156 1847 -7730 -280 6408 -4953 -5116 5959 -1121 -8088 2063 2337 -5964 -397
969c97K747p042K277L470o782K885O313q085j513R623n720p695J0237J512r495
984g665M939N274q316J84O306n307n73P510n388l430Q565l643q674R325M046j1051
1000g898L264R014q528m368R320k322n248O192L68m980L835l18n286N649L137
1015A831q675L504Q355r771l934J1497l048q581Q638L769r986L101N068o493K47
1030d478O754n239j381P409n009n049Q681m67p512O436M324q928K316O199p068
1045c012p06Q213m879l779Q408k775q195Q547L622j0988L935R130r227l611R401
1060D084k131o329N764J625n462K994K66l937M830Q23p405N243N979j0540j114
1075e310J1851n002q556R978L424j1167K864P162o362j102N816k987j025M085
$$ plain form
969 -397 2350 -4692 -2415 1055 -5727 -2842 3471 -4614 -6127 3496 -2224 -9919 318 1830 -7665
984 -7665 -2726 2548 -5768 -5584 722 -4585 -5158 2352 -3036 -6466 2099 -1544 -10218 -893 3153 -7898
1000 -7898 -4634 4380 -4148 -8516 804 -1518 -6766 -574 -206 -5186 -1351 -1669 -6955 -1306 1831
1015 1831 -6844 -3340 5015 -4756 -8690 2807 -241 -8822 -184 3585 -6401 -3300 1768 -4725 -4478
1030 -4478 2276 -2963 -4344 3065 -1944 -6993 1688 1221 -6291 145 4469 -4459 -2143 4056 -3012
1045 -3012 -3718 4495 -384 -4163 4245 1470 -6725 1822 5444 -5544 -1609 7521 -1706 -5317 4084
1060 4084 1953 -4376 1388 3013 -2449 545 811 -3126 1704 2527 -4878 365 6344 -4196 -5310
1075 -5310 6541 1539 -7017 2961 6385 -4782 -1918 5244 -1118 -2220 3596 609 -416 3669
1089C669m642j403P374m316o281R694Q42j1616M665R107j0875k652J1916m392
1103A090q830Q466K192r224L675N628o530K03N574m721j449M833k821k012N372
1118A446j969l323N303j733n483O862J667q760M928O740j0364j686J1245n166
1132b93q088J0161K150j0449L340N726o686n23N770l847p85M850n478k054Q706
1147B500l953p600J0741L245j3878M545J1284r701n839J2671J85j0370M931N777
1161D538n464k116L479O01L18j449k167M570N41q045L806P664q223m380J1588
1176E261k377j1099Q370N526j1417J980R602p194m256R401k629o481P621J269
1190C577p708M737M329p728J949O301o792p76Q514n211m983Q817r38r147P051
$$ plain form
1089 3669 -973 -2376 4998 682 -5599 4095 4937 -6679 -2014 7093 -3782 -6434 5482 1090
1103 1090 -7740 726 2918 -6306 -2631 2997 -3533 -3330 2244 -2477 -3926 907 -1914 -3926 1446
1118 1446 -523 -3846 1457 -276 -5759 1103 2770 -5990 -1062 5678 -4686 -6372 4873 -293
1132 -293 -8381 1780 3930 -6519 -3179 2547 -4139 -4662 1108 -2739 -3524 1326 -4152 -6206 2500
1147 2500 -1453 -9053 1688 4933 -8945 -4400 6884 -2817 -8656 4015 4200 -6170 -1239 4538
1161 4538 -926 -3042 437 1038 1356 -93 -2260 2310 2851 -5194 -1388 6276 -1947 -6327 5261
1176 5261 2884 -8215 155 5681 -5736 -3756 5846 -1348 -5604 3797 1168 -5313 2308 3577
1190 3577 -4131 606 4935 -2793 -844 5457 -1335 -2111 6403 1192 -3791 5026 4088 -5059 1992
1205A992M896r670M03Q571n754n090O863M87n341J508K062j418K9k091J41N333
1221B921l430n974Q726K708j2826L164J3190r809p517J4508P84j4573O299R858
1235H029j0406k385J0003l126n624N140p89l859L948l73m670N798J320q945L787
1250b152O615r228j740J0384l615p282P105K011p764K692M512l614j94L328k248
1265a190l54K256l064J385M707m645j348P257m545n501Q950R49j0504O341Q185
1280H879j1761j891J1974n395r285J0925K884j1533L189P695p460k984P805k293
1294G49l089M347j736k728N039k479l427P088P05q209M582N889q403j451R652
1309F529k599o145N623J999n414J206J580k133K208k61l479M043J576q239K381
$$ plain form
1205 1992 6888 -2782 -2379 6192 438 -4652 2211 2698 -2643 -1135 927 -491 -462 -2553 -2412 2921
1221 2921 -509 -6483 2243 4951 -7875 -4711 8479 -1330 -8847 5661 6445 -8128 -1829 8029
1235 8029 -2377 -4762 5241 2115 -3509 1631 842 -3017 931 558 -4112 1686 3006 -5939 -2152
1250 -2152 4463 -4765 -6505 3879 264 -7018 87 2098 -5666 -2974 1538 -2076 -2270 1058 -1190
1265 -1190 -1544 712 -2352 -967 3740 -905 -2253 5004 459 -5042 3908 4857 -5647 694 8879
1280 8879 -2882 -4773 7201 1806 -7479 3446 6330 -5203 -2014 5681 -1779 -4763 3042 749
1294 749 -2340 2007 271 -2457 2582 103 -3324 3764 4469 -3740 842 6731 -1672 -3123 6529
1309 6529 3930 -2215 3408 5407 -7 1199 2779 646 2854 2593 -886 3157 4733 -3506 -1125
1324a125Q179q326m105J1499k385j0714P253N930j0527N63R936n871m956Q318
1338C669j575o511N979J936o497L551L781o396J083M868m844j017N946l394l454
1353b875O287j822n825N465J523p102L448M420o682l94O248m680k917N581j483
1368h08l588M668n17m521M932K02o198M491N263q902M43R873o366o882J1022R09
1384D021j0790N056P243q491j771P825k822m317N132q29l191M037j535l581M812
1399G99j0n950M220M368p215l71P444m359m683P201K35n761L923K347n304K640
1415d76K875m673J774M486n498k92O290m404l986P598l80p542O036L535q623J743
1431a537P277o949j978P713k776o093O643J078p240L592M574o015K36N120m124
$$ plain form
1324 -1125 7054 -1272 -5377 6122 3737 -6977 276 6206 -4321 -3758 6178 307 -4649 3669
1338 3669 2094 -4417 1562 3498 -2999 552 4333 -2063 -980 3888 -956 -1973 3973 579 -2875
1353 -2875 3412 1590 -4235 1230 2753 -4349 -901 3519 -3163 -3557 2691 -1989 -4906 675 -808
1368 -808 -4396 272 -245 -4766 166 368 -5830 -1339 3924 -4978 -4535 5338 -1028 -7910 3112 4021
1384 4021 -6769 -1713 5530 -2961 -4732 3093 271 -4046 1086 257 -2934 1103 -432 -4013 799
1399 799 789 -5161 -941 3427 -3788 -4159 3285 -1074 -5757 1444 1679 -4082 -159 2188 -3116 -476
1415 -476 2399 -2274 -500 3986 -1512 -1804 4486 82 -3904 3694 3314 -4228 1808 5343 -3280 -1537
1431 -1537 5740 -1209 -3187 4526 1750 -4343 2300 3378 -3862 -270 4304 -1711 -1475 3645 -479
1446d79j222M399k371j709M695k045l687N756j93o738N447L868p786N68P660n071
1462A092m653P362n80n920M318J754m974J935K513n068J936M001n774j13O888
1477D717n093m809Q278k84q104N507M468p889J75O633m492k794O131j740l585
1492b881M623n48m577M212J626n660L176L498o171K65N884m291k635O309j866
1507I64n381N661P43o173L471L979o561K42O710m728l490O883j596n083M946J710
1523B297n527K969K556m542J140M248m805k73O241m322l824P257q35o543M871
1538I08L901p259J361N633n008j731N278j962l146M846j608l606M615L16n776
1553c238M376L282o446L83O692n027l190O672j064n538N142J436n721K662L230
$$ plain form
1446 -479 -1701 2698 327 -1382 3313 1268 -2419 3337 3144 -3594 1853 5721 -2065 -1497 6163 1092
1462 1092 -3561 3801 3221 -2699 1619 3373 -1601 334 2847 -2221 -285 3716 -2058 -2171 4717
1477 4717 -376 -5185 3093 2809 -5295 212 4680 -3209 -3034 3599 -893 -3687 2444 704 -2881
1492 -2881 1742 1194 -3383 829 2455 -3205 -29 3469 -2702 -2437 3447 -844 -3479 2830 964
1507 964 -4417 1244 1987 -4186 -715 3264 -3297 -3055 3655 -1073 -4563 2320 724 -4359 587 2297
1523 2297 -3230 -261 2295 -2247 -1107 3141 -1664 -1937 4304 -18 -3842 3415 2580 -3963 908
1538 908 4809 -2450 -1089 4544 -464 -2195 3083 1121 -2025 2821 1213 -2393 2222 2538 -3238
1553 -3238 1138 4420 -2026 -1643 5049 22 -3168 3504 2440 -3098 2044 3480 -2241 421 3651
1568C651m865O35M965m724j182N946k985m283N901J94n829L850L086o299J589
1583c50M548n472o19N895l548l389O151j119n738N022K295p080K182N497n733
1598a458q91N620l052l197M859o80m236M572M46n216L261L176o490J247O151n285
1614a173k459O471k156m828N045J348n474K629L151n038J360L907m922n31N944
1629C274l996l095O614j080o204M666L121o619J578N309m914j793N144k226k711
1644b932M750r31m174M466J244n995L585L623n594K9N865l582l578O060r49m676
1660b789M113J699n098L073K596n147J093M499m509r86N769k977m063N986m57
1675B802n494L979K984o070J998M406n309j348O375l471l579O304o09n712M136
$$ plain form
1568 3651 -1214 -579 4386 -338 -1520 4426 1441 -2842 3059 3253 -2576 1274 4360 -1939 -350
1583 -350 4198 -1274 -1893 4002 454 -2935 3216 2097 -3641 1381 3676 -3404 -1222 4275 -1458
1598 -1458 -2349 3271 219 -2978 1881 1201 -3035 1537 1983 -3233 28 3204 -3286 -2039 4112 -1173
1614 -1173 -3632 2839 683 -4145 900 2248 -3226 -597 2554 -2484 -1124 2783 -2139 -2670 3274
1629 3274 -722 -3817 2797 1717 -4487 179 3300 -3319 -1741 3568 -1346 -3139 2005 -221 -2932
1644 -2932 1818 887 -3287 1179 2423 -3572 13 3636 -1958 -1929 3936 354 -3224 2836 1887 -2789
1660 -2789 1324 3023 -2075 998 3594 -1553 -460 4039 -470 -1456 4313 1336 -2727 3259 2802
1675 2802 -2692 1287 4271 -1799 199 4605 -704 -2052 4323 852 -2727 3577 2968 -2744 1392
1690A392K964o024J017M761l769j246M534k720k113M364j660l415N106o5n601
1705b475M099K934o758R16O078m413l766O436p00n152L764J982m534J720K002
1720B133l534J367K622m590R37M967m727k625O525j484o379N504L035p238J191
1735b296O360n049k699O160j165m546M068R33m640K730J743l864K165K280m252
1750b072P78M004m076j258N388k423m327N739K24n972L655L079n522M84N328l435
1766d06k976N221q22l945L989K50l665L101J173m590K669L094n577Q67O014m567
1782a70m215P924n28p531M913M799p211m74O496l196l504M224L19k651J722j27
1798G90j180J886j047k626M454O41n709K667M997o169j872P369k371n670N771
$$ plain form
1690 1392 4356 -1668 -651 4110 341 -905 3629 909 -1204 3160 1500 -1915 3191 3126 -2475
1705 -2475 1624 4558 -2200 -1284 4794 381 -3385 3051 2351 -2801 963 2945 -1589 131 2133
1720 2133 -1401 -34 2588 -2002 -1065 3902 -825 -3450 3075 1591 -4788 716 3751 -3487 -2296
1735 -2296 4064 -985 -3684 2476 1311 -3235 833 1766 -2874 -144 1599 -2265 -100 2180 -2072
1750 -2072 -1294 2710 -1366 -2624 2764 341 -3986 1753 1977 -3995 -340 2739 -2783 -2299 3029 -406
1766 -406 -3382 1839 1017 -2928 1061 1311 -2354 747 1920 -2670 -1 3093 -2484 -1617 4397 -170
1782 -170 -4385 3539 3011 -4520 393 5192 -2019 -2493 4003 807 -2697 1527 1846 -805 917 790
1798 790 -390 1496 449 -2177 2277 2918 -2791 -124 4873 -1296 -3168 4201 1830 -3840 1931
1813A931K234o427J998L998m693j60L951k523j252L697k458k067M318j117l944
1828b514M340J346o190K382N181o061j411O993k917m701N209J125n691K035L900
1843C026l731n80L005j659q78J795j645L48K422l120p69M780k073n208O280J781
1859C774p880K563O552o007l989Q098q31o711M591L228n386N07L315k810j97K459
1875A276k514K99L205l528j683N311j880m651N387K107o796J786N746m836l024
1890c795N895n97m078K961J209l141J194J032j797K094J88l513K481K510n415
1905b772N80O188m223l537O950n30p176M318M374o501k43O654l061m486N251K2
1921A808m388K933J882k776P84J341k598J261J394l219J789L456m372j633N705
$$ plain form
1813 1931 4165 -2262 -264 3734 -959 -1119 2832 309 -943 2754 296 -1771 2547 1430 -2514
1828 -2514 1826 3172 -3018 -636 4545 -1516 -2927 4066 1149 -3552 1657 2782 -2909 -874 3026
1843 3026 -705 -1285 1720 61 -817 978 -667 -319 2103 -1017 -1786 2994 921 -4287 1993 3774
1859 3774 -4106 -1543 5009 -998 -4987 3111 2280 -4431 160 3388 -1998 -1491 1824 -986 -1183 1276
1875 1276 -1238 -939 2266 -1262 -2945 2366 486 -4165 1222 3329 -3467 -1681 4065 -771 -3795
1890 -3795 2100 1503 -2575 386 1595 -1546 -352 680 -1117 977 1165 -2348 133 2643 -2772
1905 -2772 -2192 3996 -227 -3764 3186 2656 -4520 -202 4172 -2329 -2572 4082 1021 -3465 1786 1808
1921 1808 -2580 353 2235 -541 243 1584 -1014 247 1641 -1578 211 3667 -705 -2338 3367
1936C367j717n348M949L057o372P02N278m325j993M245p74k088K498k36k030K249
1952A462r96k710L683J252n573L003M599o554j590P316k733n447N923K623o854
1967b596J088N070m556j293M115j184k001K311p09j629K448j233j898L528j19
1982A342m161K617K785n210N17N365m096k579N460r26m894M036K366n201J075
1997a504L622l529p99L341j884j448L407j671k032L802r21m329M318J978o014
2012c663K008M877m323k712O145j303n091M014K415m974J102K929k355n25K232
2027G76j750j28K166k614J49L469k302k989M745N04n339K702M230n456o57N576
2043C082k364l491M342L05m182K580J916l488J293K043l235M49L347l037n07L688
$$ plain form
1936 3367 1650 -3698 1251 4308 -2064 -1362 3916 -409 -2402 1843 1069 -1019 1479 1243 -787 1462
1952 1462 466 -2244 1439 2691 -2882 121 4720 -1834 -3424 3892 1159 -4288 1635 4258 -2596
1967 -2596 -1508 3562 -994 -2287 1828 644 -1357 954 245 -1384 1064 -169 -2067 1461 1342
1982 1342 -2819 -202 2583 -2627 -2110 3255 -841 -3420 2040 1114 -3780 256 2622 -2579 -1504
1997 -1504 2118 -1411 -2210 1131 -753 -2201 1206 -465 -2497 1305 384 -3945 373 2351 -3663
2012 -3663 -1655 3222 -1101 -3813 2332 1029 -4062 -48 2367 -2607 -1505 1424 -931 -1456 776
2027 776 -974 -1102 1064 -1550 -1401 2068 -234 -3223 1522 2026 -3313 -611 3619 -1837 -2494 3082
2043 3082 718 -2773 1569 1874 -2308 272 2188 -1300 -7 2036 -1199 -750 2597 -440 -947 2741
2059B741j965l296M495N4m880L623K594m662K48M200l325k096M686q76l454L119
2075A206P94l623J985J072k385J261K050l225M80K929l380q42M631j511m568M810
2091A684J221n743K118M228m726j029M583j494l200L348O9k882K420M17k719K133
2107D28J194l763J673K545l929j67M611k107l648M127L44m400K437K896l804m5
2123a608L517k792j651L543j098k072L324o82l044K551P10l533K126K710l973
2138a972O5L903k639k508M546q60l842L808J256m399J916K893l747k40L828k426
2154d18j454L182p24k709K920M95l327K738J327l752J503L134m384o04M619j961
2170E85l236M356M3m101K097K985l764K60L049k724n62K898j988j035L369j442
$$ plain form
2059 2741 776 -2520 1975 2029 -2851 772 3366 -1296 -1048 3152 -173 -2269 2417 1541 -1913 1206
2075 1206 2000 -1623 362 1434 -951 310 2360 -865 -385 2544 -836 -1678 2953 1442 -3126 1684
2091 1684 2905 -2838 -720 3508 -1218 -2247 2336 842 -2358 990 1059 -1823 597 1014 -1705 428
2107 428 1622 -2141 -468 2077 -1852 -2019 2592 485 -3163 964 1308 -3092 -655 2241 -1563 -1608
2123 -1608 1909 -883 -2534 1009 -89 -2161 1163 481 -2563 -12 698 -2835 -709 2001 -1972
2138 -1972 -1907 1996 -643 -3151 1395 535 -3307 501 1757 -2642 -726 2167 -1580 -1820 2008 -418
2154 -418 -1872 1310 586 -2123 797 1292 -2035 703 2030 -1722 -219 2915 -1469 -2073 2546 585
2170 585 -2651 1705 1748 -2353 -256 2729 -1035 -775 2274 -450 -1012 1886 -102 -1137 2232 790
2186G90k434L252N12m187K140L249m314k03M284k432k812M144k50l587K919J197
2202B268l502J154K488l475N40K921k652o49L159j838k268L350o9l513K812J579
2218B305l992J089L380l481j140M113j853k644L437J66l665K082J884l546R86
2233h79K609k437k49K813k427j383L571j568k506L234P40m146K020K691l734l51
2249b002L986k194k298L470p10k648K220J018k947K168J038k960J235K585l872
2264a911k51M578k843k609M331J23m316L064J635l399L67L432k845j204L489j613
2280B8j981L203l21k849K562P92l164J477K437l240J74L637k658j949L578n73
2296A153l075K752J253l513J570K121l155K12L028k320q80K792j229k006L056
$$ plain form
2186 790 -1644 1608 2120 -2067 73 3322 -992 -1195 3089 657 -2155 1989 1739 -1848 1071 2268
2202 2268 -1234 -80 2408 -1067 -527 2394 -258 -907 2252 414 -1854 1496 1427 -2086 726 2305
2218 2305 -1687 -598 2782 -699 -1839 2274 421 -2223 1214 1380 -2285 -203 1681 -1865 -879
2233 -879 1730 -707 -956 1857 -570 -1953 1618 50 -2456 778 1518 -2628 -608 2083 -1651 -2002
2249 -2002 1984 -210 -2508 962 252 -2396 -176 842 -2105 63 1101 -1859 -624 1961 -1911
2264 -1911 -2162 2416 -427 -3036 1295 1418 -2898 166 1801 -1598 -1231 2201 -644 -1848 1641 28
2280 28 -1953 1250 929 -1920 642 1434 -1730 -253 2184 -1056 -882 2755 97 -1852 1726 1153
2296 1153 -1922 830 2083 -1430 140 2261 -894 -682 2346 26 -854 1938 709 -1297 1759
2311A759n33k827L056R38m211K194K642l823o07M619k319l524M851K75m402J897
2327a5L103l742l64L486k101j208K440j097j501K595j006k418L191P8l550K430
2343C21K374m088J73L541k580j617L224m47k905K803L76k938J797R92k551J132
2359c93J980l184K80L025k578j928M400r45m019L523K311n013O23M065l203k027
2375c083M470j196l498K860J237k821J144J685k282M02J486j682L92J682j904
2390a108n57L037j815k028L527j85l478K451K227l966K88L981k768j888L418r07
2406B29k215K491J22k490K435L60k924K124K175m219M75M542l076k921M958J10
2422B176m922K413L661l957q36M078j888k212K673J48j589Q87N54j287J056j97
$$ plain form
2311 1759 1226 -1601 1455 2393 -1818 376 3018 -805 -1412 3207 888 -2636 2215 2490 -1912 -15
2327 -15 3088 -654 -1018 2468 367 -841 1599 502 -999 1596 590 -1828 1363 1441 -2109 321
2343 321 2695 -1393 -1220 2321 -259 -1876 1348 901 -2004 799 1175 -1763 34 1026 -1525 -393
2359 -393 1587 -1597 -1317 1708 -870 -2798 1602 657 -3362 161 2472 -2541 -1918 2147 -1056 -3083
2375 -3083 1387 191 -3307 -447 790 -2031 -887 798 -1484 -1082 404 -1278 -886 796 -1108
2390 -1108 -1665 1372 -443 -2471 1056 871 -2607 -156 2071 -1895 -1607 2374 -394 -2282 1136 229
2406 229 -1986 505 627 -1863 572 932 -1992 132 2307 -1912 -1437 3105 29 -2892 2066 2176
2422 2176 -2746 -333 3328 -629 -1465 2613 725 -1487 1186 1334 -255 632 1186 -101 955 758
2438G58j588K349K94l378J774K629l818l03M500k438l101M265K83m230J635L080
2454B711l586o2L198k094j188K738j022j856K599k4l243K882J040m072J682L191
2470B894l925o91M398k031l267L988Q73m236J138K801k442q75K162p02o70P30
2486A45q78K89J336j837p47L414j869k898L879R31m909J831M583m498k084N257
2502A945j031m341L502K030m175M74L139k675m87K571j881n26K530j710j322K919
2518I62n22l256K833J597l760J138L069l233j388M241j261k741K284J015k127
2533a149O51J007j592J034P10j603J336J162l110O81L257l130j502M685m77m782
2549b822L148L030n318M37M845k768l029M258L37m022J846K270k959O15J808j731
$$ plain form
2438 758 -830 1519 1813 -1565 209 2838 -980 -1283 3217 779 -2322 1943 2226 -2004 -369 2711
2454 2711 -875 -937 2261 167 -1021 1717 695 -1161 1438 1414 -1829 1053 2093 -1979 -297 2894
2470 2894 -1031 -1722 2676 645 -2622 1366 2239 -1997 -859 1942 -500 -1375 787 85 -585 145
2486 145 -733 -444 892 -945 -1692 1722 -147 -3045 834 1765 -3144 -1313 3270 -1228 -3312 1945
2502 1945 914 -3427 75 2105 -2070 -1596 1543 -1132 -1619 952 -929 -1455 1075 -635 -1957 962
2518 962 440 -2816 17 1614 -2146 -1008 2061 -1172 -2560 1681 420 -2321 -37 978 -1149
2533 -1149 -498 509 -1083 -49 661 -942 394 1556 -1554 -873 2384 -746 -2248 2437 1960 -2822
2549 -2822 326 3356 -1962 -1525 3320 552 -2477 1781 2118 -1904 -58 2212 -747 -132 1676 -55
2565e5K57Q07j882N19K610k452j097L441r54l380L408J345l822J031K896k687
2581a5j541L392j093j329J721l00j204J931n41k472K299M55l216J753K922l730
2597i68n92M422k356l662M428J056m926J915L415l695q61L370p47k513K754Q7
2613A127k431J431M88j531J105M83k240J716J218l488J192L133k705j671L835
2628A662j023l365K902J433l635O49K901k180j053K568j160j285K224j028j363
2643a753K391l51k531K779Q46l936J619L322l657j101M284j347l477L177J682
2658A947l739Q10K563k112n62K219j629n48J736r66o45J901p32j975K664j95k830
2675b093K266K040l401n8L804k510k238L557l1l140K376J184k784R30K124k617
$$ plain form
2565 -55 202 1009 -873 -354 2256 -196 -1293 2148 1194 -2186 1222 2567 -1255 -224 2672 -15
2581 -15 -1556 1836 743 -586 1135 835 -369 1562 1021 -1451 848 1303 -1913 -160 2762 -968
2597 -968 -1560 2862 506 -3156 1272 2328 -2598 -683 2732 -963 -1824 1546 799 -1714 1040 1127
2613 1127 -1304 127 615 -916 189 672 -1568 148 1366 -2122 -930 2203 -502 -2173 1662
2628 1662 639 -2726 176 1609 -2026 -1377 1524 -656 -1709 859 -301 -1586 638 -390 -1753
2643 -1753 638 287 -2244 535 1381 -2555 -936 2386 -1271 -2372 1912 565 -2912 265 1947
2658 1947 -1792 -982 1581 -531 -1093 1126 -503 -1051 685 -281 -926 975 243 -1732 932 737 -2093
2675 -2093 173 2213 -1188 -1246 2558 48 -2190 1367 1336 -1804 572 1756 -1028 -98 2026 -591
2691e91R3K256j681o09K206r66k150L081Q4l382K374J649l505N33L314k742j730
2708a766L720q02k685K572O48k546Q67J586j977L93J564j997J54K123k311p88
2724a245L531j756k501K865R90l571J282K806l377m80L462j751k047K717k53k274
2740a602J634R03k181J038J461k424L86J870k215k95K745j221k105K908p1l396
2756b565K325J730l155K62K819k155j249K787q21j985K426P9k240J570J225l005
2772a952J394J564k607M46K572k327j266L387q67k890K965Q78l281J230K191k425
2788i88p79K996j276j389K186o33j460K017j6k291J835J261l097J443K266l013
2804i38m58L528j595k536L256K80k976J741J864k925J23K873k253n17J924j032
$$ plain form
2691 -591 -498 1758 77 -532 1674 708 -1442 1639 1723 -1659 715 2364 -1141 -608 2706 -36 -1766
2708 -1766 1954 1152 -1533 1039 1687 -859 8 1594 -383 10 1574 -423 -269 1854 -457 -1245
2724 -1245 2286 530 -1971 894 1884 -1687 -405 2401 -976 -1456 2006 255 -1792 925 672 -1602
2740 -1602 32 935 -1246 -208 1253 -1171 -785 1085 -1130 -1425 1320 99 -2006 902 831 -2565
2756 -2565 -240 1490 -1665 -1403 1416 -739 -1988 799 -22 -2007 419 498 -1742 -172 1053 -1952
2772 -1952 -558 1006 -1601 -1155 1417 -910 -2176 1211 344 -2546 419 1297 -1984 -754 1437 -988
2788 -988 -1767 1229 -47 -1436 750 117 -1343 674 658 -1633 202 1463 -1634 -191 2075 -938
2804 -938 -1396 2132 537 -1999 1257 1537 -1439 302 2166 -759 -636 2237 -16 -533 1391 359
2820C59j137K126n56j731J735Q83k922J304K241l185L50K790j992j672L296p39
2836A150k474K326O51k688J049J706k303J6K137j754p39K736j228j933K801j34
2852A319l187K555J126l204Q77K416k847q10L269j258k417L070L45k811J414J276
2868A133k085R4J845j974K94K025j944m95K285j147k180K935M83l153K005J725
2884A846l178J27L177k157j660L018p56k320K327P14k532J395J463k688M48K467
2900A691k408o26K998j454j650K564K68l081J736J428k307N84K421k308p87K427
2916A496j010j743K427j30k052J777R53k318J096J095k184M70K171k179q80L340
2932B329j393k452K986M54l522J946K177l100l25K900j555j284K322o26j761J563
$$ plain form
2820 359 -778 1348 792 -939 796 1679 -1243 61 2302 -883 -533 2257 265 -1407 1889 1150
2836 1150 -1324 1002 1653 -1035 14 1720 -583 -567 1570 -184 -923 1813 585 -1348 1453 1319
2852 1319 -1868 687 1813 -1391 -514 1902 -945 -1755 1514 256 -2161 909 1254 -1557 -143 1133
2868 1133 -952 -858 987 -987 -693 1332 -612 -1107 1178 31 -2149 786 1269 -1884 121 1846
2884 1846 -1332 -1205 1972 -185 -1845 1173 417 -1903 424 1138 -1394 1 1464 -1224 -776 1691
2900 1691 -717 -1343 1655 201 -1449 1115 1383 -1698 38 1466 -841 -257 2164 -144 -931 1496
2916 1496 486 -1257 1170 1040 -1012 765 1718 -600 496 1591 -593 -123 2048 -131 -1011 2329
2932 2329 936 -1516 1470 1924 -1598 348 2525 -575 -900 2000 445 -839 1483 857 -904 659
2948F59P42k396J514J215k620R08J814k233m24K660j314j446K511k53l153K150
2964C34J416k506O23K049k049q43K342j193j387K425n74k143K465J91k888K112
2980C74J542l255N34K769k211j273L063q94k552K169J295k857J031J845k420j64
2996a004K324j358p27J974j075j156J776j88j919K058P29k569R24J824k888J37
3012a138K838j525j904L071j61k678J342J507k378P72J828k048j7J811j574q47
3028a101K424p22j962K309O21l077J851J747l072J64L279j845k189L035m96k229
3044a263K023P39k186R41J105j940L54J503j991J97K251j507j524K766o44k579
3060a755K230J470l163Q50K319k333n38K284p52k135K525r9j985J487N55j942
$$ plain form
2948 659 1401 -995 519 1734 -886 22 1836 -397 -821 1839 525 -921 1590 1337 -1816 334
2964 334 1750 -756 -133 1916 -133 -976 1366 173 -1214 1211 637 -1506 959 1150 -1738 374
2980 374 1916 -1339 -805 1964 -247 -1520 1543 649 -1903 266 1561 -1296 -265 1580 -840 -1004
2996 -1004 1320 -38 -765 1209 134 -1022 754 566 -1353 705 1434 -1135 -211 1613 -1275 -1138
3012 -1138 1700 175 -1729 1342 1181 -1497 -155 1352 -1026 -254 1574 -474 -491 1320 -254 -1101
3028 -1101 1323 601 -1361 948 1569 -1508 343 2090 -982 -818 2461 616 -1573 1462 966 -1263
3044 -1263 760 1499 -687 254 1359 -581 -227 1276 -715 -518 1733 226 -1298 1468 824 -1755
3060 -1755 475 1945 -1218 -368 1951 -382 -920 1364 612 -1523 1002 903 -1082 405 960 -982
3076i82N94J712k410P40J852k259l34K701j368k343K961J64k729J315J864k464
3092i86j30K670j509j857K523l58j723J824o1j304J204O33j712O48J353k057k70
3109a112K717j888j743L313o19k556K005J280k645M15K331k174n69K292j028j212
3125a193K053p97j319J890j50k320J835J146k650P45K421k382j542L341r07j637
3141a466J997O58k567R73J620j674k70J850j137r61J713q48j180J958o31j376
3157a341J627P48k445Q31K228k526m09K486j371j355K419k63k221J675Q46k074
3173a145M60J639j867q7J992j083j007K154j332j166K242M1k313J736J389k781
3189a128K54K692k192j347K510l13j773J737O02j909N30J193j693M47J250j669
$$ plain form
3076 -982 -388 1324 -1086 -346 1506 -753 -1087 1614 246 -2097 864 1028 -1701 -386 1478 -986
3092 -986 -1116 1554 45 -1812 711 353 -1370 454 393 -911 293 926 -786 -138 1215 -842 -1112
3109 -1112 1605 -283 -2026 1287 668 -1888 117 1397 -1248 -833 1498 -676 -1245 1047 19 -1193
3125 -1193 860 63 -1256 634 484 -1836 -1 1145 -1505 -760 1661 -721 -2263 1078 171 -1466
3141 -1466 531 1189 -1378 -405 1215 -459 -729 1121 -16 -977 736 -112 -1292 666 35 -1341
3157 -1341 286 1034 -1411 -580 1648 -878 -1287 1199 -172 -1527 892 629 -1592 83 929 -1145
3173 -1145 -685 954 -913 -1000 992 -91 -1098 1056 -276 -1442 800 841 -1472 264 1653 -1128
3189 -1128 -874 1818 -374 -1721 789 476 -1297 440 1042 -867 -337 856 -837 -390 860 -809
3205h09Q5J934j550j071K575j005j860K240P84k736J170J574j967m43K437j278
3221H0j561K061jj747J546M55j989R16J233k024L63J956k166n25K552j292j823
3238a966K697J33k545J175J372k098j21K563j581j172J913k20j898J838J89j719
3254a440J123P70j882J193R21k303Q78K062k155j134K903m88k447K176Q33k573
3270a563O37J996j650o97K061r67r85J667p19j348K101k71j806J346P63j880P01
3287f14J954j721q75K575q10j897K172K12k519J364J532j890J5J603j470m21J560
3304G70m72j207J606l12j512J901J66j933J267J024j969k27K812j760j474K574
3320A254k39k034J353J238k253L17J663j732m69K032j043p52J752o74j107J725
$$ plain form
3205 -809 -724 1210 -340 -1411 1164 159 -1701 539 1323 -1413 -243 1331 -636 -1079 1358 80
3221 80 -1481 580 579 -1168 378 833 -1156 -240 993 -1031 -668 1288 -878 -1403 1149 -143 -1966
3238 -1966 731 864 -1681 -506 866 -1232 -1353 1210 -371 -1543 370 150 -1748 90 279 -1440
3254 -1440 -317 453 -1429 -236 685 -1618 -740 1322 -833 -1967 936 448 -1999 177 1010 -1563
3270 -1563 -926 1070 -580 -1277 784 -183 -1168 499 -220 -1568 533 262 -1544 -198 565 -1315 -614
3287 -614 1340 -381 -1256 1319 509 -1388 784 996 -1523 -159 1373 -517 -502 1101 -369 -790 770
3304 770 298 -909 697 385 -1127 774 940 -993 274 1298 -671 -898 1914 154 -1320 1254
3320 1254 1015 -1019 334 1572 -681 -364 1299 -433 -902 1130 87 -665 1087 413 -694 1031
3336A031j32j996J833M48k076O01K061k083q58K206n59j668J919K96k289J151
3352a15J190j918L67J290j250l95J806j321p25J992p55j772J851N91k230J161
3368b33J291k400K94J941j157j347K079j48k007J706Q04k040J008Q29j361QJ744
3385A011j619n47J835r59j313K285n76j972J947J030k688O51J866j603r94K347
3401G01o22j616K332j29j636R01Q34j632M94J368j660L35J593j648p05K239o23
3418E26j603J817M61k277Q69J612j903m16K079j179p52J467j53j169J443K5j580
3435g33J030Q64j920O13J657j749o43K123r65j498K454j32k191J322J174k046
3451f40O2J745j324q23K185n93j513J453J79j721J394L27j166L41J139j453K38
$$ plain form
3336 1031 899 -1097 736 1184 -892 -291 1770 -313 -1171 1035 476 -1192 727 1023 -1266 -115
3352 -115 1075 -843 -476 814 -436 -831 975 -346 -1071 921 166 -1606 245 836 -1394 -233
3368 -233 1058 -1342 -1048 893 -264 -1611 468 320 -1687 19 823 -1217 -209 620 -741 -733 1011
3385 1011 -608 -1155 680 -279 -1592 693 117 -1855 92 1122 -1566 -915 951 -652 -1646 701
3401 701 79 -1537 795 666 -970 -69 765 -867 -373 995 -665 -330 1263 -385 -1090 1149 526
3418 526 -1077 740 1201 -1076 -207 1405 -498 -914 1165 -14 -766 701 548 -621 822 847 -733
3435 -733 297 1161 -759 -146 1511 -238 -881 1242 277 -1221 1233 1101 -1090 232 1406 -640
3451 -640 -578 1167 -157 -980 1205 612 -901 552 731 -990 404 731 -435 -94 1045 -408 -170
3468a70J344j321p92J950o65j642J815M15j996O54J232j577M33J234j510n75K002
3485H31q67j180J782k45j483J389P32k171Q41J590k034o66K414q75j675K015K18
3502F16j998J059J249j892K01J335j025n80J346p23o16J440n15j120J463k7j580
3519a367J187R64j785K71J536j476m60J766o81j275J551K23j840J246J022k117
3535a235P05J443j452m10J769r97j161J721K3j916J331J070j692L19J635j652
3551d99p52K037n67j082J103N69j622J252J01j245N50J032j540L88J345j496j53
3568e79J681j155q04J745k21k267J813J161k125P4K133j716q51K065l28j614J342
3585C54O58j765R67O92j505K84J527j692m38J884o74j196J516j5j649R19R84j580
$$ plain form
3468 -170 1174 -147 -939 1011 346 -1296 519 934 -1062 -408 824 -753 -320 914 -596 -1171 831
3485 831 -36 -1216 566 321 -1162 227 959 -1212 -371 1219 -815 -1481 933 58 -1617 398 616
3502 616 -1382 -323 926 -966 -765 570 -455 -1035 311 -412 -1028 412 -103 -1223 240 213 -1367
3519 -1367 -180 784 -1001 -730 806 -670 -1130 636 -45 -1320 231 454 -1386 -140 882 -1235
3535 -1235 -530 913 -539 -949 820 -177 -1338 383 406 -1510 -179 891 -801 -482 1153 -499
3551 -499 -1251 786 219 -863 240 809 -813 439 540 -705 -155 877 -663 -275 1070 -426 -579
3568 -579 1102 -53 -857 888 667 -1600 213 1374 -751 -677 1456 -260 -1111 954 626 -988 354
3585 354 1012 -753 214 906 -599 -315 1212 -480 -918 966 292 -904 612 597 -1052 -133 851 -729
3603g29K95J423j378l05J262o00p23R26K2j055J188L74k036J332Q35j771P16J369
3621A145j689n03K160j231j571K120K85j895Q66J219j699n76K325j396o23J404
3637C41j31j573J334O5j334J088M42j473M28J512j691J01J641j078r88J734l29
3654H9j480J135Q04j742Q54P32j123j18J403r16n31J400l88j453J364L26j425
3671a069R41J112j911M2J733j222r86J901j39j618J238L37j497O20J256j569K60
3688e71J312r15m45J505j039n73J269l07j122J376L36j648R20J040j611J06J519
3705A152j102q01J267k08j200J539N51j865M07R52j215L34J253j291o04J801o33
3722C37j682J783M70k124R09J552j993K10J541r27q50J713o72r81J136l7j266
$$ plain form
3603 -729 -434 989 -389 -694 568 -32 -755 171 193 -862 326 700 -1336 -4 831 -940 -224 1145
3621 1145 -544 -1047 1113 -118 -1689 431 716 -1179 -313 906 -793 -1369 956 -440 -1063 341
3637 341 210 -1363 -29 36 -1298 -210 232 -1241 -813 699 -992 -891 750 -328 -1316 418 89
3654 89 -1391 -256 548 -1194 -340 392 -731 -849 554 -362 -893 507 119 -1334 30 356 -1069
3671 -1069 -128 984 -927 -885 848 -374 -1360 541 402 -1216 22 359 -1138 -518 738 -831 -571
3688 -571 741 -174 -619 886 -153 -726 543 236 -886 490 826 -822 98 1138 -473 -367 1152
3705 1152 50 -751 516 308 -892 647 1198 -667 -260 692 -523 -189 1064 -227 -831 970 337
3722 337 -1345 438 908 -1216 -307 1245 -748 -538 1003 76 -774 939 267 -714 422 385 -881
3739h81J122L81j337M24R37j079k95J784j273p91J603l03j468J331O06j848M93
3756e94J222j326l73J495p60q25J694p72q21J473j0j624J060P30j454K11J475
3773H01j062j085K201p28j070J204M95j653M57J106j345k9J245r22o33J513o63
3790a68p70J141J15j544J288J68j233N04J519j824j6J503p55r68J589j56j565
3807a172J535L34j654R46Q38r35j68J267r46q09J306o43o95J674j5j901J121J078
3825A161j703n9J783j716n10J614m35j391J645J18j216Q18O07j374O53P57j237
3842d85J06J180j016m26J411l56j412J705j06j464N61J223j185m3J212p00j058
3859h53J554k57j390J016L31j187O76O91j020J61R24j209k52J577o87j332J888
$$ plain form
3739 -881 241 622 -715 -291 646 -433 -728 1056 -217 -1008 595 292 -1176 155 761 -1087 -594
3756 -594 628 -698 -1071 424 -336 -1161 533 -239 -1060 413 403 -1221 -161 569 -885 -674 801
3773 801 -261 -1346 855 127 -943 261 756 -897 -440 666 -679 -708 537 -385 -1018 495 -168
3790 -168 -938 203 318 -1226 62 230 -1003 -499 1020 -804 -820 683 -72 -1040 549 393 -1172
3807 -1172 363 697 -957 -11 827 -108 -276 991 45 -764 542 -101 -796 878 863 -1038 83 1161
3825 1161 -542 -601 1182 -534 -1044 570 135 -1256 389 507 -709 109 716 -658 -5 752 -485
3842 -485 -379 801 -215 -641 770 414 -998 707 601 -863 -302 921 -264 -307 905 205 -853
3859 -853 701 444 -946 70 401 -786 -110 581 -439 -278 646 -563 -815 762 75 -1257 631
3876F31l73j407R10J209j639J06J324j327l73J345k93p96R31k81r19J039J58j008
3894g63M98Q37j255j32J347r31q33J905p21j276J547K03j367L51J253j190m71
3911i98J544p54p11J131L05j202J124j81r25N58R50j417J7J318r68o08J681q42
3929B2r92J457K28j248M99Q56j456M23R81o84m19J027p51q99J207j90p79J161
3947D43J15j652J070J052j530J05J455j233p75J918n20j153J402P6j651J006P84
3964I12j187jR07r23k41J234n04p51J205j37j355J160L44j249L88J174j203l58
3982e85J469o33q36R34L63j332O66P60j271K23P76q15j59J124j094k31J203k08
4000C54j435J322M88j799J015J073j434j40J360r27m32J212m02q41Q68K10j264
$$ plain form
3876 631 258 -1149 -239 970 -669 -563 761 -566 -939 406 113 -683 248 -33 -952 87 245 -763
3894 -763 -265 572 -683 -815 532 -399 -1232 673 -48 -1324 223 426 -941 -590 663 -527 -998
3911 -998 546 -208 -919 212 517 -685 439 258 -667 -109 841 -576 -559 759 -209 -817 864 22
3929 22 -970 487 715 -533 -34 822 -634 -211 770 86 -333 694 -57 -956 251 61 -718 443
3947 443 558 -1094 -24 1028 -502 -397 1058 -175 -950 968 448 -705 697 773 -878 128 912
3964 912 -275 -276 631 -292 -533 701 197 -554 651 514 -841 319 663 -586 -198 976 -227 -585
3982 -585 884 251 -585 349 712 -620 46 806 -465 -242 534 -281 -440 684 -410 -641 562 354
4000 354 -1081 241 729 -1070 -55 1018 -416 -556 804 -123 -555 657 255 -586 282 492 -772
4017g72N04N89n13k35J068q60o01J513p94q78J896n36j392R79O46j312M43J582
4035A327j537p1J236p82m96R70j09j405J290K21j253Q71P26j535L12J047j053
4052b41o43K071j010j143J629K42j437O93Q10j063m27J489o21o82J245l09j079
4069d76J086N4j312J169N57j725P46J168j386o1J229q91p52J564j43j573Q76P23
4087H53j031J46R21j069j80J210q23m91J159R5j329J022K0r97J007O93j608J82
4105b20J382j534k56J620n03j002J143M1j080N51M24r61K26J074r94l82J021l19
4123B31p08J238k91j167J169L98j597P18J202j437m05J593n58j292J545q3j301
4140g45Q08M81r44L58J086r37k08R38p37m41J107n18p58J032j7j178O10J291j880
$$ plain form
4017 -772 -268 321 -192 -427 641 -219 -820 693 -101 -979 917 381 -1011 -32 614 -698 -255 1327
4035 1327 -210 -281 955 173 -323 647 538 -867 423 644 -609 262 988 -547 -235 812 -241
4052 -241 -884 1187 177 -966 663 905 -532 161 971 -92 -519 970 349 -333 912 603 -476
4069 -476 610 664 -648 521 1078 -647 99 1267 -119 -180 1049 158 -594 970 827 -746 130 853
4087 853 -178 -32 889 -180 -360 850 27 -464 695 790 -539 483 503 -494 513 1206 -402 -220
4105 -220 1162 -372 -628 992 489 -513 630 671 -409 142 566 -395 -169 905 -89 -471 550 231
4123 231 -477 761 470 -697 472 870 -727 -9 1193 -244 -649 944 386 -906 639 556 -745
4140 -745 63 544 -400 -42 1044 107 -101 837 100 -341 766 248 -510 522 505 -673 -63 1228 -652
4159f52M22J233p25o61J185j60j202J278%r64O32O31j369N81R57j453J93J058
4177I84o04p94J585m70j517J496J35j156N01J029r72m63J175k89q97J001j59r56
4195c71Q90K91j031N55P37j200M27Q60q57l03J329r78p97J194N01j622J048K95
4213I68r70M6J232j182m66J000l25q05J116j6j104O71L90j149P51P03j269m2J284
4232H33p94r40J427j94q94N95N71j053K73P14p57J77P82o60n69J081k93q99R95
4251C95R5j571J242N83j308K59J255j550k76J406k06j417J256K18j240K61J217
4268F19j100J0R45p63l70J137l34n55R95J64j668J233K76j365N58J204j034l71
4286d19J322q26m03Q66k5j098Q95j36o43N68O15j075K6J114j074k91J705p35j263
$$ plain form
4159 -652 -230 1003 278 -383 802 642 -560 718 718 -246 386 1017 -352 229 1186 -267 -74 984
4177 984 380 -414 1171 701 -816 680 815 -341 160 1189 217 -246 929 640 -257 744 585 -371
4195 -371 519 810 -221 334 1071 -129 298 1158 301 -2 1327 349 -448 746 1247 -375 673 968
4213 968 -2 44 1276 94 -372 628 303 -502 614 598 -506 165 555 -594 157 860 -409 -451 833
4232 833 39 -901 526 332 -562 33 604 -449 -176 538 -219 -42 740 80 -489 592 299 -600 395
4251 395 490 -1081 161 744 -564 -305 950 -600 -876 530 324 -1093 163 381 -859 -598 619
4268 619 -481 -471 474 -289 -659 478 144 -411 584 748 -920 313 589 -776 -218 986 -48 -419
4286 -419 903 77 -326 540 515 -583 312 176 -467 101 716 -359 -333 781 -293 -584 1121 386 -877
4305h77J681j0j764J109P20j245j00J803j156p15J212j58j057J316J54j298Q06
4322D21K59q68O56O04j162M6Q36p28n11J061j10j262J432n4j114N06Q95j404j03
4341f00J337q75k35J038m60p91J071K9r24N01Q64j483P7J415j291m30J814o76
4359C81j120J185L48j288L61Q32j102j11P93l82l49O01J16q63Q80l41p71Q63K16
4378B49j434J254N05j433jJ475r10q14J834l45j348Q69M72j215M62J116j325R3
4396d96J010o38m77J249l66j261J414j98j074R63M15j093K17J128q66p45J415
4413E97m71p16R09n4p23M38O16r60L35K91m48k3P41l42q46J343l78o82R08M0j282
4434g07L95J143j256J97J254q31q38J187j33o66N80M28j409Q62M61p74J22Q55
$$ plain form
4305 -877 804 794 -970 139 859 -386 -486 1317 161 -554 658 500 -557 759 913 -385 421
4322 421 680 -188 468 1072 -90 -44 792 64 -447 614 504 -758 674 620 -494 12 907 -497 -600
4341 -600 737 -138 -373 665 205 -586 485 514 -410 91 955 -528 -451 964 -327 -757 1057 381
4359 381 -739 446 794 -494 -133 699 -403 -514 279 -103 -452 149 265 -598 282 -59 -830 33 249
4378 249 -1185 69 574 -859 -860 615 -295 -1109 725 380 -968 -99 373 -842 -380 736 -589 -496
4396 -496 514 -124 -601 648 282 -979 435 237 -837 126 541 -552 -335 793 -73 -818 597
4413 597 126 -590 319 265 -458 -20 596 -364 -29 262 -186 -209 532 190 -656 687 309 -373 535 575 -707
4434 -707 -312 831 -425 -228 1026 195 -643 544 411 -255 325 753 -656 206 667 -107 15 870
4452H70j096j11J178n38q47Q61J75j205R05Q83j475K24R67p78n12J072m90m00
4470c17N92K29q55O00L95j328Q03N69j551O62R94p77m59R07m46j284J300M30j452
4489i88R90O15j091J99R53q87m91J097l49n91P11M1p30M21M69p24O9Q68o28m61
4509e07J058m98j338J636M6j020L07Q22j168K71J016q59l61J316p68o38J130n37
4527i2q79J055mo34Q33M39j394P2J284o46n81J009l42j114J318J32r55L97N35
4546D33q04J14O56r02j10R94p40m72J157k03p06O84N36j075N18O71j095J2J200
4565H68p89o10Q69R9r58P84L72n99l68Q13q40L71O74p65k66J144l09j199J091
4584C82M03j509P29Q64j146R3J139r93l58J054k42r85R24M48j419Q94P2o23j7
$$ plain form
4452 870 -226 -337 841 303 -544 317 492 -713 192 1075 -400 -176 791 13 -499 573 83 -317
4470 -317 275 504 -351 249 644 -684 119 688 -863 -201 793 16 -443 464 18 -1266 34 464 -988
4489 -988 2 617 -474 -275 678 -209 -700 397 48 -543 168 209 -521 -100 369 -355 -286 582 -46 -507
4509 -507 551 53 -1285 351 397 -623 -316 506 -662 -391 625 -234 -595 721 -47 -685 445 -92
4527 -92 -971 84 80 -554 279 718 -676 -604 680 34 -547 462 120 -994 324 456 -499 -102 433
4546 433 -371 -257 399 -503 -613 381 -359 -831 326 123 -583 101 637 -438 80 751 -344 -332 868
4565 868 79 -531 338 437 -521 263 635 36 -332 481 -359 12 686 -79 -345 799 490 -709 382
4584 382 785 -724 5 869 -277 -184 955 -38 -396 658 416 -569 355 803 -616 278 350 -273 -290
4603b90J054j144J32P97m75o22P54J25j033O08J066j528J26R99q93k6Q61n49o02
4622f40R41j71p85Q49n6o30M02L09n89k0R32l73p02J000n93m30N58O44j483Q29
4642hO48j321N2R87l87m75P47k25k99L93j56l96N53K62r52M19P25j287K47J244
4662G71o94q50J289m13p88O38O31r98J48R98q33l60Q88k86p64R51l36n12P28M5
4682B53r08Q48M38j016j7J125p56k15R62p94n34R71L49j302L56P14o35m3N58o89
4702c35N4Q33m46k55N00J4p87Q21k8q63J8J186j319J75Q48n74m77J040J51j235
4722f79L51N91m71l8O56o53J55N08m71l28O67m90l22Q51O5q56L26P23r00l89J382
4743F78o81o79R04O0r09L68L03l39J89O42r34K09M22n90J48O92n72o38R70l23
$$ plain form
4603 -290 764 -380 -248 549 74 -548 206 331 -702 -94 972 -556 -430 569 -324 -350 511 -38 -640
4622 -640 301 130 -655 194 138 -492 -90 219 -370 -390 542 169 -533 467 -126 -556 2 646 -837 -8
4642 -8 640 -681 -629 358 -29 -504 243 18 -281 112 -44 -440 113 375 -577 -158 567 -720 -473 771
4662 771 77 -773 516 103 -685 -47 584 -414 -266 732 -101 -461 427 141 -623 328 -8 -520 208 253
4682 253 -655 193 631 -385 -402 723 -33 -248 714 -80 -614 357 706 -596 -240 474 -161 -204 354 -335
4702 -335 -281 552 106 -149 351 365 -422 399 371 -492 -474 712 -607 -432 416 -158 -635 405 556 -679
4722 -679 -328 263 -208 -246 410 -243 -88 420 -51 -379 288 -202 -524 327 392 -464 -138 585 -315 -704 678
4743 678 -3 -682 222 282 -627 -259 44 -295 -106 536 -398 -189 233 -357 -209 483 -89 -727 243 -80
4763h0r66Q15O13q04q3J163q77k44P07r3n83O12lp05N38K03q14M00M61r35L91
4784b84P68j094K4J109n86r42J341j95p40M84O16j024L20P49j95o24M66j03M5
4803A35K9k6o76O09L80p81L35Q72j381J47J159r83k22P50m03m87Q54J56p70p4
4823c77R52p51n9P31l73k60N46k39m27O37J39q78O94J56q53K1J148j058j34J295
4843I10n27q68J073j66j018N13O90n14m46P96n19k23Q15m37n12P79k22r48J185
4862C61j94p11N60N72r80j31Q90m74o05J167j37r74O52L27q52K09N87n49K93K04
4882B15n79J79O94n87n03N63Q7o42N68M28r77L16O85r50M5Q22m06o91O33M30q94
4903e64M19N66o69O2P10j030J45Q16m78k27O44l81m01L69L63j056N10R76q06m37
$$ plain form
4763 -80 -1046 -231 382 -422 -505 658 -219 -463 244 151 -432 180 177 -528 10 213 -601 -201 260 -675 -284
4784 -284 484 -610 -586 523 -63 -1005 336 141 -599 -115 501 -523 -203 546 351 -273 193 90 135
4803 135 164 138 -538 71 451 -330 5 877 -504 -357 802 -181 -403 347 -56 -543 311 467 -303 -377
4823 -377 575 -176 -235 496 123 -137 409 170 -257 380 519 -359 335 491 -362 -341 807 -251 -385 910
4843 910 383 -485 588 422 -596 -83 607 93 -353 443 -76 -299 516 79 -433 346 124 -824 361
4862 361 167 -544 16 588 -392 -523 367 -107 -712 455 318 -656 -4 323 -529 -320 267 -282 11 215
4882 215 -364 -185 509 -78 -581 -18 69 -573 -5 423 -554 -238 447 -503 -458 364 -42 -733 -100 330 -564
4903 -564 -145 421 -248 -186 524 -506 -361 455 -23 -250 394 13 -388 -19 344 -712 -202 774 -32 -469
4923d69R16N1q22O69l17n03N45M41j036P71J31p27L81L90n88Q1P61o41o25R23
4943C32J01q43M99N43j132J55Q28n95k27Q25k24n16O20m00l76R77j51q43N72L36
4963D81o64lP02n70l69L95L45j021R77J30q74J16Q38q18r9Q88m86j20K47j2l71
4984b88N38k46l33M10K41o35q2J043q07l58J208l33j041Q40J71o97L49N43j118
5003e95J22M69k85j35M30j54l22N60q9m85N90k1o23O39K89r08M25O30m68p48Q15
5024A36J51o45O26L74j091J12O92n41O7K49m41J33M69m58m53P86J49j102R33K74
5044D20r44J44J096j131j95Q51Q0r60Q76Np00L74M37o04K21L70k22m24R15n57
5064E2m44P37j28o70N33M66r74K37P41q70j8R72o27q60J288j58q89O99K44o50
$$ plain form
4923 -469 447 498 -324 345 28 -475 70 511 -525 246 377 -350 31 421 -167 -86 675 34 -591 332
4943 332 433 -410 89 632 -500 -345 483 -112 -339 486 262 -254 366 -34 -410 567 416 -427 145 481
4963 481 -183 -186 516 -54 -423 -28 317 -704 273 403 -471 -355 483 -335 -434 454 -32 -152 95 83 -288
4984 -288 250 4 -329 81 322 -313 -395 648 -159 -517 691 358 -683 157 328 -369 -20 523 -595
5003 -595 -473 -4 -289 -424 6 -148 -470 90 1 -484 106 85 -538 101 390 -518 -93 537 69 -679 136
5024 136 287 -358 268 642 -449 -337 355 -186 -119 130 -311 -178 291 -167 -620 166 315 -787 146 420
5044 420 -524 -380 716 -415 -610 241 321 -639 237 242 -458 -84 353 -251 -30 340 118 -306 609 52
5064 52 -392 345 217 -453 80 546 -428 -191 550 -320 -338 634 7 -853 435 277 -612 87 331 -319
5084c19L26J42n21L12M38n65j9O90p36m56J043q4r50N57P29n72j77P22m19l28
5104a87O00j98n62P49j02o33L74l8m52M8O54j037O43N15r35J81P58l67n09N05
5124GM50r94L41O66j001J42O09n41O9L78j62k85J96j13q6K00M24p21K78L78o66
5145d31N1R30l93p73O98k30o24N70P73p95j90O48m14k80O00k32j54L10Q5o89M06
5166a34K03l15K56M04p85j33Q57n93N8P56n74p48Q13M64n86P5N69o26q6M22l34
5187c7l26N13j56n69Q73k18l48O01L3o19K10M16k99n95J014n58l79O61M7o62K94
5208a04M99n07o9N34n10nN28m63m74Q07m86k59R32j09r74N63O99r94J05R71n49
5229A35o96O49L11q27L60O3k02J21M05n53J70N07q99%P89p02j54R79m10n26K43
$$ plain form
5084 -319 7 149 -372 -60 378 -187 -206 484 -252 -708 335 251 -699 -142 587 15 -162 560 141 -187
5104 -187 413 215 -347 402 300 -333 41 3 -449 -401 253 -784 -141 374 -561 -380 378 11 -498 7
5124 7 457 -537 -196 470 -531 -389 220 -321 -252 126 -36 -321 -125 -238 -324 -124 300 -421 -143 235 -431
5145 -431 -380 550 157 -616 82 -148 -772 -202 571 -224 -414 234 -180 -460 140 -92 -246 64 149 -540 -134
5166 -134 69 -246 10 414 -371 -504 353 -240 -182 574 0 -748 65 529 -57 18 587 -39 -125 297 -37
5187 -37 -363 150 -6 -575 298 80 -268 333 366 -253 -43 373 74 -521 493 -65 -444 217 264 -398 -104
5208 -104 395 -112 -181 353 -157 -162 366 -97 -571 236 -250 -509 423 314 -660 -97 602 -392 -287 684 135
5229 135 -561 88 399 -428 -68 -5 -207 -86 319 -234 -64 443 -456 -456 333 -369 -523 456 46 -480 -237
5250b37P90r86L00P77p42l06M15K13m60N9L71n04J13L67l06j93K93l28J34M01
5270A71n39J06K55j98m42J160j04r71K30P85q19j21O91j4l72K68J48l84K76j03
5290B3m63M80j18j71nO81r35L25Q76o59m92Q75l90p34N58O19p18oN40j87k61K71
5312A09Q9m78J95N24p47M44K49p05N93r4n14P8Q47o68k91N92%n50J10Q25p85P9
5334i8L72m07j93O29k42j64K85l76J55O19p28m42O66J88o44M39M21j010k2R84
5354D32k40p17P92j0n56J73M46n67j38N95o38O48Ol69k2M37l13o23Q75J21p11
5375c79L74O94j240K05N63l84m44Q99j79m85K05J59j19K27k46Q0m0M76m92L2L58
5396B64m89k61O29j27m32K28L80l85p6P71n88m41P98n6q41P23j06l18O50j32p07
$$ plain form
5250 -237 553 -433 -133 644 -98 -404 11 224 -236 -177 194 -310 -197 170 -136 -329 -36 -364 -230 171
5270 171 -368 -262 -7 -205 -647 513 409 -562 -332 453 -366 -487 204 190 -182 86 234 -150 126 23
5290 23 -440 40 -78 -249 -254 427 -508 -183 693 34 -458 417 27 -707 -149 470 -248 -254 286 99 -162 109
5312 109 198 -280 -85 439 -308 136 385 -320 273 179 -335 -257 590 -78 -369 223 223 -327 -217 608 -177 -98
5334 -98 274 -133 -326 303 61 -103 182 -194 -39 580 -148 -590 76 264 -380 59 480 -530 -552 432
5354 432 192 -525 267 257 -299 -126 320 -247 -385 210 -428 220 226 -143 -165 272 -41 -664 211 332 -379
5375 -379 -5 689 -551 -346 217 -167 -611 288 109 -376 -171 -12 -131 96 -150 -70 -110 366 -126 -94 264
5396 264 -225 -486 143 16 -416 -188 192 -193 -269 502 -86 -527 271 215 -626 97 -9 -327 323 191 -516
5417e16O01N8n82K60N45n31J07L34j57m38N05J33q19M89N02o89K82K27n13j42
5437c44M04K41q11Q74j94m52K33J32j42M7L41o04n0R76m62q54R69j10q07O73N56
5458F16q87K47K53k85M5P6j8l71P93m05o07Q30j06o12M96M31j163N58M55o57k25
5479e36R75k97n32N32J67o02J21L37k27k18M76l25q3L06n14J46O04l96n84O49
5499aK01l13N5L27p16J19R28n11m31M86j62m10M30K30o83L35M44j022M12N77n51
5520b56R6N25n95j41M70k8n02O45N6p60L5Q10m97j46P72k30q25O28L89j019M45
5541a28N09p81K38K61l71K10J58j33j35N54l04m09P46o1p53J70P56n48l16O13
5561B76l16m88O07J8k44M07j75n11N24K31m61J38M12o04j11Q91o66m31O08K09
$$ plain form
5417 -516 85 143 -439 -179 366 -165 -58 276 119 -319 186 319 -500 -11 491 -198 84 311 -202 -344
5437 -344 60 301 -510 364 170 -282 -49 83 -59 -12 329 -275 -325 651 189 -665 304 194 -613 60 616
5458 616 -271 -24 229 -56 -11 65 47 -324 469 64 -543 287 181 -431 65 496 -667 -109 346 -311 -536
5479 -536 439 142 -390 142 309 -293 -172 165 -62 -280 196 -129 -212 94 -420 -274 330 -66 -650 -1
5499 -1 200 -113 -58 269 -447 -328 600 89 -342 144 -18 -428 2 232 -451 -116 328 -694 -282 295 -256
5520 -256 -160 365 -230 -371 99 71 -431 214 270 -490 -455 355 -142 -288 484 254 -571 57 446 -573 -128
5541 -128 381 -400 -162 99 -272 -62 96 -37 -172 382 78 -331 415 354 -399 -229 527 -21 -337 276
5561 276 -40 -528 79 97 -147 260 85 -426 98 329 -132 6 418 -186 -297 594 -72 -503 105 314
5581C14n53Q02k27n79P7M75k47k60L64Q3m39R3J96j18J80r6m83M63L50n43j09
5602b57N45l67j32N63k34k89L70J36n88K22J48m05n4M16j97o3L96j90l02L91L44
5623D53n84J69J92p99M31L37l24k64L62j05j61P37l71n93M56N53r48K92O25p83
5643c25J14L89On68P39k80n00P92j54l61J78M15q35J61O03n39r2M69j4n35M41
5664A04J24n42L40K92n20J5J61j95J81M20n47k39O52p8m84M04J03n65K46N90l78
5685H4n67Q22p4m86M07M91q46J28L07l32R2K58k26JM87k43m96R35n67m37O73K30
5707F41q85L91O15q96q7K99o7l30O65J9o63L24J30k53K40J72n48k7M92p11K19
5728b60M63j42m65N44K82p79N09K43q49J25O70m23j70M82j86n02P11j41l02J84
$$ plain form
5581 314 -239 563 336 -243 -166 309 62 -198 166 249 -190 -97 99 -19 161 65 -418 45 395 -148 -257
5602 -257 288 -79 -211 352 118 -171 199 335 -253 -31 117 -288 -342 74 -123 -186 210 20 -282 109 453
5623 453 -131 38 230 -569 -138 199 -125 -389 -27 -132 -293 444 73 -520 -64 489 -459 -167 458 -325
5643 -325 -211 178 184 -384 355 75 -425 367 213 -148 30 445 -390 -229 374 -165 -257 212 198 -337 104
5664 104 228 -314 26 318 -202 -187 -26 -221 -40 380 -167 -406 246 168 -316 88 191 -374 -128 462 84
5685 84 -483 339 265 -221 186 677 -169 -41 266 -66 26 284 58 59 546 303 -193 742 175 -262 411 641
5707 641 -244 147 762 -134 -221 78 11 -319 346 365 -298 26 156 -97 143 315 -233 -260 232 -479 -260
5728 -260 203 61 -404 140 422 -357 152 395 -454 -329 341 -82 -252 230 44 -458 253 112 -190 -6
5748fj45J68J4J93m18K05M45n36l42O83j38n82O08K5p21M00L58m70j2N90m06k0
5770a07K48k87j25M66O6k37J43j07o00O47K6k28j72M81K1l37M30M8p72L27O04
5791E35r96J26N66j21o0K9l68N9M21k78k13Q33n06l63K47N90p67J59P49r45J47
5812a56L41J82o23N50K07o17j39Q84j155N69K92n92j07P98m78k56L11K95p77N47
5832G6K30p08M19N07m19o4P03n22l08M41l1p23J60J73K45o8n6n8J55K76q26P6
5854c22N46l44k94M41L81q00J56P43p72J3N67m74Q4K96j09n99K79J87l09N66j38
5875I8l79J91L70l42M25j38l32k59M83J65r11N93J96l37J81M33m26j17K23r0l80
5896c53N39J1m98K42J67j93K22J25q35O40J75n3l50R38q67k38M52L53o61k1P12
$$ plain form
5748 -6 -151 17 31 224 -194 11 456 -80 -422 261 123 -459 149 174 -547 -147 211 -259 -271 319 -87 -107
5770 -107 141 -146 -271 195 261 24 167 60 -540 107 133 -95 -267 214 235 -102 328 376 -396 -69 535
5791 535 -461 -335 231 110 50 79 -289 -230 191 -87 -300 533 27 -336 -89 501 -266 -107 642 -303 -156
5812 -156 185 367 -256 294 501 -116 -255 629 -526 43 335 -257 -364 434 -44 -300 11 306 -471 76
5832 76 306 -402 17 524 105 41 744 222 -86 355 324 -399 -239 -66 179 111 55 -3 152 428 -398 -322
5854 -322 224 -120 -414 27 408 -392 -236 507 -265 -252 315 -159 -75 221 112 -487 -208 -21 -330 236 98
5875 98 -281 -90 280 -62 363 225 -107 -366 117 282 -629 -36 160 -177 4 437 11 -106 117 27 -353
5896 -353 186 197 -301 -59 108 -85 137 262 -573 67 242 189 -161 777 -90 -328 124 477 -184 -205 507
5917E07l90m45M65p1m84L50R1M2N3K8n41M44R8n64L68M25n04J53J14j96k44O50
5939C49k20k88L53J07m77K68O8m95L95n3n3J03mj8l88O07j80l67K37M08m86J03
5961c1N39o09J62M91n21m60O93j96k59O3N80o31K06K48j19k26M70n29j2N18K0
5982C97m19O5J36l81R9M51l16n57Q47m23m60O21K16n40K01L59o63K87J87k00k1
6003a14L79p28L36N38l65l78L93L2l53J32J92l51J8K81k44k57Q30o09l9M87l04
6024a24N9R4l1j39K08p5Nk57L75j98m71Q65j12n92N17K18m50o7O28l40k37L33
6046B09m02K39N8Mm10N43J2m31L97J44m42j95N24l08k61N35k38k97K91L09l32
6067e1j48J28k74O6O27m07k32L80l9m1J44N6m87L76M07o51L47K57p42L14M09n17
$$ plain form
5917 507 117 -328 137 66 -418 -68 23 65 118 146 -395 49 147 -417 -49 376 -128 25 139 -57 -301 349
5939 349 129 -159 194 301 -176 92 160 -335 60 7 -46 57 53 35 -353 254 74 -293 -56 352 -134 -31
5961 -31 508 -101 61 552 31 -429 264 68 -191 -128 452 -179 27 275 156 -70 400 -129 -141 377 397
5982 397 -22 43 179 -202 -103 348 32 -525 322 -101 -561 60 276 -264 -63 296 -367 -80 107 -93 -114
6003 -114 265 -463 -127 411 46 -332 61 93 -260 -128 64 -287 -269 12 -232 -489 341 -268 -307 180 -124
6024 -124 -65 29 -2 -141 67 -8 -3 -260 115 -83 -554 311 199 -393 124 342 -108 -175 453 113 -124 209
6046 209 -193 46 104 108 -302 241 253 -178 219 363 -79 -274 250 -58 -319 216 -22 -319 -28 281 -51
6067 -51 -199 -71 -345 -279 348 -59 -291 89 50 9 153 209 -278 98 505 -146 201 458 -284 30 439 -78
6089g8o0N50p7m98M50k81n6l39P30n56K54L99l85k66L31j9j49L78k69l40J53N25
6111C97m53p2M93l61N5L68n74k45O47q1o06K21L39m20K51L09n97K40k2N7k9L58
6133B75j01n57M16P5k00J52j32p4j8L86l40l92R59m12l0n9p8K02k08L44k84j74
6155b50M95k95j10N46m03j57M61k55k68RM99k19l03L69k28k1L93j19m36M35j27
6176A6k96J07L37l62J48J29kj72j67K09O2J82j38j87J1N05q26M40L97o04j60M82
6198A11M3m19M97R4o84M18K28n83O11j35k72K45jP8j80J18k19k5L90j16n29K61
6220f9M69l13R2J60m85o9M11K8l48N66l19m62M69K1k60N1M48n84K2O13j63m78
6242b00M59k79l49N90K6m90L34j64n8K36J54k36l97M40j95j19M68j52m53N06J27
$$ plain form
6089 -78 -138 412 335 -163 287 6 -50 -389 341 -215 39 438 53 -213 118 99 -50 328 59 -281 -128 397
6111 397 -56 -128 365 4 59 427 -147 -392 255 174 -432 -211 128 -292 -41 268 -329 -89 -111 -54 -83 275
6133 275 174 -383 33 108 -92 60 -72 -146 -164 222 -118 -510 449 37 7 -52 -130 72 -136 208 -76 -250
6155 -250 245 -50 -160 386 -17 -174 287 32 -236 -227 272 53 -250 119 -109 -130 263 144 -292 143 16
6176 16 -280 -173 164 -198 -50 79 77 -95 -262 -53 9 191 53 -134 -123 382 -444 -4 393 -211 -371 111
6198 111 154 -265 232 326 -358 60 288 -295 316 181 -91 154 153 231 51 169 -50 -75 315 199 -330 -69
6220 -69 400 87 179 339 -146 -215 196 224 -124 442 123 -339 130 151 -109 -58 390 -194 -172 441 278 -200
6242 -200 259 -20 -369 221 247 -243 91 -73 -131 105 259 23 -374 66 -129 -248 220 68 -385 121 248
6263B48m68K3L30l96PM34l63j68N79J72n56o0O94n28Mo9J48J29j17k34j25M41
6285A25o3l5J7J16k34q0K73k18j66N65k81m86O58p6l83M81k66j20P1L98l25l18
6307c47K64J28k59K94k66q8K97K2m14L43J71l75J18N10l63j24M85l24l23N44k85
6328Hk73L94N2k06j71L12k56J62L86l27j49M66n02k0J30O6n00O35k8j54j82N70
6350D13l26o8K89m36J23N4p8k67M10J19l21j26J76Rm12P44m36j61L67k5l76L29
6372AK73j29k63N85n59k68O85m47K37p8l26R0L16P9k90J02Lk95R2L46r6j17N25
6395D66n69j43K63L73o10J6L16o9k50M09j92j48K11R7m80N56N0l93m9J25l59J34
6417b46M13k44j54N07k83k31M12J79l75p4K75n04K83J53k46R5r0J13n8K1j5l66
$$ plain form
6263 248 -220 -197 133 -263 -256 178 -185 -353 226 398 -158 -218 476 -52 -48 -117 31 160 43 -191 -316 125
6285 125 62 27 44 160 -74 -154 119 -99 -265 300 19 -467 191 115 -268 213 -53 -173 -102 296 -29 -347
6307 -347 -83 45 -214 80 -186 -274 23 45 -369 -26 145 -230 -112 398 35 -89 396 72 -251 293 8
6328 8 -265 129 181 -25 -196 116 -140 22 408 81 -68 398 -104 -124 6 72 -428 207 179 25 -157 413
6350 413 87 19 308 -128 -5 49 -29 -296 114 233 -88 -214 -38 -29 -441 303 -133 -294 73 48 -328 1
6372 1 274 145 -118 467 -92 -360 325 -122 115 37 -289 -199 117 196 -94 8 11 -284 -192 154 58 -59 466
6395 466 -103 -246 17 390 -220 -204 112 43 -207 202 10 -138 73 170 -310 246 296 -97 -146 -21 -380 -246
6417 -246 167 -77 -231 276 -7 -238 174 353 -22 -96 179 -325 -42 111 -135 -40 -130 -17 -75 -54 -69 -435
6439d35M65J13l54J21K97l50K53J35m31k2N43j68j71k3J28j00LK58o6l11K22M4
6461A51l19L74l00j35Q20m36l29N1L18l28K28K90p34K12L09k6m21M32J26m13J23
6482gL34p02N42K52n79J76p6k13K23M01k23k58pJ62k44m6P32o83K11L17m56R9
6504d5N3N7k38L27q6n25K63L86j85K58l6l37j87M86j23k41L11p3k53Q2M14p76
6526d68K63N31m03r4K61j78K35lj10m6q0N11m15L18l19j38j64M14l26K4O66m78
6548Al69M89K49l69K5R9l69K64J28j91J53l52L15j7J42l38J34J88J41n50L70K13
6570C56l45J02j85r7q3K59J54l97J29L54l31L72O6n11Q9J48jk59L87P4l02j18
6592a39M97o56L46K78l27m1J34Q1j81L18R5q01L31M3k05J46O3J48k93R5j04R5
$$ plain form
6439 -435 30 143 -211 -90 207 -143 110 245 -186 -208 335 167 -4 -27 101 1 4 262 196 -115 107 151
6461 151 -168 206 -94 -229 591 155 -174 -123 195 -133 95 385 -349 -137 172 146 -275 157 283 -130 -7
6482 -7 327 -375 167 419 -160 16 -60 -273 -50 351 128 -130 -137 25 -219 -265 467 -216 -5 312 -144 -45
6504 -45 8 65 -173 154 68 -457 -194 192 7 265 229 -108 -295 191 68 -173 138 65 -188 -106 308 -468
6526 -468 -205 326 -77 -171 90 -88 147 144 34 -12 -92 419 4 322 3 -135 -299 115 -211 -187 479 1
6548 1 -368 121 370 1 26 125 -244 20 148 -43 110 -242 73 56 198 -140 -6 182 323 -227 143 356
6570 356 11 113 -72 -169 -252 7 161 -236 -107 247 -84 288 354 -157 -68 80 79 -180 207 281 -21 -139
6592 -139 358 -298 48 326 -1 -42 92 173 -8 310 405 -396 -65 -22 -227 -81 -18 130 -163 -68 -172 -77
6614g7R3j03r3M13j82l30L55J11m16P8L98l92j22O58j40n78O39k95j41K74pj70
6636b7k53J15J46j48L34n1k10J72j58p2K01Q0j09l19K23j36r5J81L1l89P06l65
6658a43j16O3K58p1k64N63o53O56m66j48J37L42l2j77j26K22j09Q7J93l23j27
6679b34N05n70q4O70n09J87L71j02m25K44j33Q5j73J77K0j8Q3m57j7M47J63m30
6701b00O03j83l99k97M90R8l65L59j42oK97L5k73J39k42J67m6J06k98K18J35k48
6723e2q8K82J31k11J4L6l68N43k77m66K85K07k79K36J42k27M2K39l50r7N99m10
6745f9j77L64j73j42l6N57l87k50N90k43m55N19mo0L1k53K75J51j70j46l2K58
6767A48k10P9M6r3j72J22J5j04J14M74n68k38O77n51r0J65L65l50L29k98m3M2
$$ plain form
6614 -77 16 -87 -180 233 51 -279 76 187 -229 -151 247 -145 -267 391 251 -327 312 17 -124 150 143 -27
6636 -27 -280 -165 -19 -167 167 116 -94 78 -80 -152 49 129 20 -299 -76 -212 -307 -126 -95 -484 222 -143
6658 -143 -259 -196 62 -9 -273 290 -363 293 -173 -321 -184 158 126 -51 -177 45 -64 23 216 -107 -234
6679 -234 271 -299 -383 287 -222 -35 336 234 -191 53 -80 5 -168 9 29 11 94 -363 -380 67 230 -200
6701 -200 403 220 -179 -476 14 112 -253 106 -36 -42 255 290 17 156 -86 81 35 141 -157 61 196 -52
6723 -52 -140 142 273 62 76 112 -256 287 10 -456 -171 36 -243 -7 135 -92 -50 189 -161 -258 341 -69
6745 -69 -246 118 -55 -197 -233 324 -63 -313 277 34 -421 98 94 34 65 -188 87 238 68 -78 -110 148
6767 148 -62 17 63 -30 -202 -80 -65 -169 -55 419 -149 -387 290 -261 -351 -186 179 -171 158 -140 -183 -141
6789a41%l17M16Rj00l9J54J78k19M21l72k34K42K21l49l2K89m9l69L86q4J27k55
6812a17K85r9K9J81m91P6K07n3j09O29m74k75L57k48pL3K61j15j19J36k64J12
6834f5L38%k37K26o1k34K08q1k02q1N12m87J47O06n39k56K32j82Q5l2K8l12M51
6857F4K01k59k44L39J48k18J27p8j07R4Jk66J60L87j11j51k0L42m97M65l27k88
6879b38M98q6l83J02N17m84J33Pl68J10J43K7%J50j80l80P91n27j72N3M40l16
6901a63O2K17m28L05R2N0n03L10J27q38N87J54l83M76K12J7k12K41k80j31M89
6922D01m67j53L54r0j33k2L80k22k0K16k70o1K34K80n95P2K64m74M08j11k09J45
6944g3J74j14k52K78k06j48M77Rk06K43j65m41N07l2R3l48K63J3j63J59L14m48
$$ plain form
6789 -141 -141 -458 -42 -33 -133 -172 -18 160 -59 362 -10 -244 -2 219 -130 -162 127 78 -291 95 11 138 -117
6812 -117 168 69 98 279 -212 -136 71 18 -91 538 64 -211 146 -102 -109 -76 185 70 -49 87 -177 -65
6834 -65 273 273 36 262 201 -33 175 94 -108 -189 323 -164 -17 589 50 -206 26 -156 -71 -103 -75 -387 64
6857 64 265 6 -238 101 249 31 158 80 -27 67 68 -198 -38 349 238 87 67 409 -88 377 50 -238
6879 -238 260 174 -209 -107 410 -74 59 66 -302 -192 -49 -22 -22 128 -52 -432 359 -168 -340 -287 153 -163
6901 -163 -101 116 -312 -7 85 135 -368 -58 69 -769 -182 -28 -411 65 277 294 82 323 43 -88 401
6922 401 -66 -219 135 45 -88 -110 270 48 28 244 -26 -87 147 427 -168 -96 168 -306 102 -9 -218 -73
6944 -73 101 -13 -265 13 -193 -341 136 145 -61 182 17 -424 83 51 144 -204 59 72 -91 68 382 -66
6966f6q2M58k91j77M62j85k01L02l25j32R0K96k59K38J64l15QJ78kj39L03K0o45
6989c00K77L0J00K31m7m23J65J4k11K82J81n26J44J69J71o64L34J30j54M8K10
7010A61j29r1J08o9k17K58K93q3j80j78k05M59q3k9j41j73L60k68M23l29k04M72
7032A55m66L23r6K59l53k3N65m09J09k93K1k0M46k44j00K76k12o3K62o7j1J06
7054A65J85k90k18L23k60k52M39L2l48J20J59j44K09k5L8q8J15K88m49m1M4k05
7076b03L4J70LJK48l41Q6K57l48m0L11p5l08M45k6l38L16j69k08n1K74m0qj95
7100b05L38N8k9J11k90K23M74j029L18L50l39J0R3J1q7K53j76k49LK87j75R1l7
7123Dj71K19j12K07m57K17j16Q1O6J21Rl01K62K61n50K18J23k30M74n27j86K59
$$ plain form
6966 -66 -148 310 19 -158 304 119 -82 220 -105 -237 -147 149 -110 128 292 -23 -15 163 161 22 325 345 -300
6989 -300 -23 7 107 338 291 -132 33 47 -164 118 299 -227 -83 86 257 -407 -73 57 -97 -49 161
7010 161 32 -59 49 -20 -237 21 314 231 51 -127 -332 127 44 15 -126 -299 61 -207 216 -113 -317 155
7032 155 -311 12 -84 175 -178 -201 364 -45 64 -229 -208 -228 218 -26 -126 150 -62 -125 137 70 59 165
7054 165 350 60 -158 165 -95 -347 92 124 -224 -104 55 -89 120 95 133 45 160 448 -1 -42 2 -203
7076 -203 -169 1 4 5 253 -88 -2 255 -93 -133 178 103 -205 240 214 -124 192 23 -185 -236 38 -2 -10 -205
7100 -205 133 191 162 273 -17 206 680 -349 -31 319 -20 -10 83 94 7 260 84 -165 -162 125 -50 41 4
7123 4 -167 52 -60 147 -310 -93 -209 -128 -62 59 68 -233 29 290 -260 -42 81 -149 325 -202 -388 -129
7145a29K87K2k95K68k45RK80k05j47O0J70k52L12q0k72N1K67k20J76N4ql50L01
7168E4j75K0J96J07k81j95M77k24j13J59k31R1K42k74K1K00N2k12P3j82K10k67
7190b52P08m14Q1k4p6Q2M4k88k45N19j42J78j09K5l48K19J77k2k14J94j42j06
7212a55J22n5k1Q1L15l87K61k8m05L84m4j21R3J69k75l55O79j87m0j06J34k42
7234a83K04J16j35p2J61J8j88j2O2j82R5K22mj78N03n58J83J65o2m18K1j4JM23
7258A68J58n76J9J91k20L55m8J32L9j80R5n8Pj62j61K34Q7%j81K37j61LJ68q7
7282E9M4QJ20l27J19n3J23k92L75l09P3J62l37n8N1N66q35J91O27j60k82K0L69
7305B54l32Q5j45N6j05L47o01L18J39j0j50M4P1Q2K10j42j76L88p1j73j68J47
$$ plain form
7145 -129 158 180 -115 153 -92 -83 197 -8 -155 -95 75 -177 135 55 -217 -166 101 -119 57 111 103 -247 54
7168 54 -121 -101 95 202 -79 -274 203 -21 -134 25 -206 -115 127 -147 -126 74 126 -86 -13 -195 15 -252
7190 -252 456 42 123 99 23 105 149 -139 -384 135 -7 171 62 87 -261 -42 135 113 -101 93 -49 -155
7212 -155 -33 -88 -109 -28 287 -100 161 133 -272 112 68 -53 40 209 -66 -421 258 71 31 -75 59 -183
7234 -183 21 137 2 -70 91 109 -79 -91 -29 -211 -116 106 102 -76 427 -131 52 217 155 -263 -242 -256 -255 168
7258 168 326 -250 -231 -40 -260 95 47 179 218 38 133 75 82 -80 -241 -7 80 80 -101 136 -25 -22 146 59
7282 59 103 111 231 -96 23 -30 93 -199 176 -133 -60 102 -235 -293 -242 324 -511 -320 307 147 -135 -115 254
7305 254 -78 7 -138 -82 -187 160 -441 -123 16 6 -144 -100 -29 53 263 121 -55 333 262 89 -79 68
7327F8j46j28M36l32N3J25K23o51N14k51r2J46J11J89j2j75l58K25J63j70L6K3
7349cM7j42Q4k99KO20m79L92k85K03m9q7n0J57K2p5k7N3J42j48j10J1P2k85j80
7374d14L60j1L8j78J98l1M00k64l06L26k9r5J40J56n1o87O21q3j34p3L39k51O1
7397C2K18k84k58M64Ok76K07j65L0M9J50l63R4m6L1o1K54k81K7L3l8L4J41J35
7421A33l63M02J95m88O7K5J67n56M52k83L14J4m02J36N22Ol75o4L15l1n6K71m69
7444f8M9J17n3j86m3J53K1R4J97m49K05Q1k34M13k30q2m9N3J71j09j39L78l20
7467c0j48L52l13L23j99k6qJ3N7k15L05J96l82M9M56l57L3k30J70m43L11K86k52
7490e2L75j91l52O9K42m64K98J63m0l00N50k16k56L72j48l42K07J66j71l3K43
$$ plain form
7327 68 -78 -206 230 -102 -49 76 299 -352 162 -89 -181 -35 76 265 253 78 -280 -55 108 -62 -26 -3
7349 -3 44 -98 -14 -313 -311 309 -170 222 -63 140 91 4 -46 111 133 58 31 84 226 78 -32 -21 51 -234 -414
7374 -414 -54 -65 -27 -205 -7 -38 362 98 -208 118 89 -6 134 290 239 -448 173 90 -44 -117 222 -29 32
7397 32 250 -34 -292 172 178 -98 109 -56 -26 23 173 -190 -96 -142 -111 -172 82 -199 -172 -139 -177 -143 -2 133
7421 133 -230 172 367 -121 -54 -29 138 -418 34 -249 65 79 -323 -187 335 341 -34 -98 217 186 130 401 -68
7444 -68 -19 98 45 -141 -184 -31 -10 84 281 -168 37 118 -116 297 67 -15 -64 -11 160 51 -88 290 -30
7467 -30 -178 174 -139 184 -15 -41 -49 -36 21 -194 111 307 -75 -26 430 73 106 -124 46 -397 -86 200 -52
7490 -52 323 132 -220 -151 91 -373 -75 88 48 -252 298 82 -174 198 50 -292 -85 81 -90 -123 120
7511A20l95K59K84l31Q5K57l78m3j57M95k64J88n7j8m9K35k81p4J53k55J94l24
7533c56M36k63K98J63l93J34M6p9l18N00m54j75N08j17r8J74K08l04K21j17Rr4
7555g1J95Nk96N16j54n40M32k44N6J95J34l16K01q3J23k15N0l1j29M24m8l87N8
7578a25Q4l9J8O0P5o9K92j31m99L40L7r3j46L84l64OK75n3k82K58P0j18J89k19
7602e0K37Q9m86L02O5l13K56k68L09o1m04M89j21k33L03q2j88Q0R1J07j16K28
7624B34j31k98J34J7l3J51j41o9Q7K94l72Q9Q4j06J27K77l94j36R2K22l12J99
7646A5K8m85O88j62N0l82K33%N3J45r9r1J11j87K1K62j0k56K18r7k55M89k08j04
7670b3k52K17K07m02K74M7k32J58L39k83J53j35n86J3O10j55k0r0j6J51O5K26
$$ plain form
7511 120 -275 -16 268 -63 22 279 -99 -142 -299 196 -68 120 63 45 -4 231 -50 -124 29 -226 -32 -356
7533 -356 80 -183 115 278 -115 19 65 -14 -332 168 -286 -461 47 -70 -168 6 214 -90 131 14 23 -71
7555 -71 124 129 -167 349 195 -345 87 -157 -101 94 228 -88 113 30 153 -62 -12 -43 -172 252 204 -183 -125
7578 -125 -41 -80 -62 -2 73 4 296 165 -334 6 43 -50 -196 188 -176 -170 105 52 -230 28 98 -20 169 -50
7602 -50 187 276 -210 92 157 -156 100 -168 141 80 -324 165 44 -189 114 32 -156 -76 15 122 6 234
7624 234 103 -195 -61 -44 -77 74 -67 -136 -49 245 -127 -38 46 -60 67 344 -50 -186 -94 128 -184 15
7646 15 43 -442 246 84 134 -248 -15 -15 38 183 84 -7 104 -83 -62 200 190 -66 152 55 -200 289 81 -23
7670 -23 -275 -58 149 -253 21 68 -164 -6 333 50 203 68 -518 -505 105 -50 -70 -160 -176 -25 40 266
7692B66j82k71J65L7n9j09L09j4j75L44k75k66J89P6q4J94l70J50K60j59o8P5
7714C3n8M8J70j95j42K6J63K2o0O8k32K45k22K52q9J7Q3k76L64k86J64j52L92
7737C35j94k47M29m11k05j3L44p7j02M09J29o66J44L15l47J34J15l66M54k31j02
7758a53K73J79l87J50M1m25L66j03oMJ27K7k5j35J3k21J4M6P1J98J48l70K53L
7782H8n1q7J4J81p6p1J90J20m44K03j45l8K14p1qk05J19M4l92L66J44j73L97m26
7806a07R0j27N6J93j05R6k82P9R9Mj23Q8J25l80N19j74k15J09J00j53J25K01l33
7829a15p1L63l05J50M2K56n06L78l18q7K14KK31k92lK55j40R1K7j68J8K42k55
7852IL13m76r1r1J57J69R5k5M8k29M4Mn3QL14o7j17L16k61J5j31L2K19k04P5m33
$$ plain form
7692 266 84 -187 -22 15 -44 -153 156 142 -33 311 36 -230 -41 35 -49 145 -225 -75 185 26 -42 33
7714 33 -25 23 193 -2 -144 -118 45 67 7 75 -157 88 -134 118 29 46 129 -147 217 -69 95 -57 335
7737 335 141 -106 323 -88 -293 -306 38 -39 -141 268 397 -269 -125 190 -157 -23 92 -274 180 -51 -153
7758 -153 120 299 -88 62 103 -322 44 -59 -65 -61 66 93 68 -67 -54 -275 -261 -215 -144 54 202 -168 85 88
7782 88 37 -50 -36 145 69 -2 188 308 -136 67 -78 -116 98 27 19 -186 -67 -23 -415 -49 95 -78 319 -107
7806 -107 -17 -144 -88 105 0 96 -186 -107 -8 -4 -127 -39 86 -294 225 51 -164 -55 45 -108 17 218 -115
7829 -115 -186 177 -128 22 64 320 -186 192 -126 -213 1 3 234 -58 -61 194 54 145 172 4 22 264 9
7852 9 322 -154 -245 -336 -179 -10 85 60 108 -121 -77 -73 -126 -118 196 129 12 328 67 82 -49 -17 202 -2 73 -360
7878c60K25L41l67K63J44k02k64J58Q2k72L89l32K37j67L53m55L23Kq0n8m4%J39
7901E5Km58K47J17J11l49K09n8R9K04j02l17J45J05O9k23J45P6q7J9j71n4J87
7924b9O2n9j27J56M6k45K90j03K0j25O7j01O0J03k60L28j3rl17K01J30j90j06
7947b21L93l23J38j68j23M06P4j08k30L13j47Rj87J04r2k8K35l2j89L47j98q0
7969a07N7K42m16L39k68L74o3J41l17Q6J61k17M9l55J21L69J8j15j32R2L19o02
7991b24L76k60j79J10O24n22J49P8o9l29K09K45k32k0J35m07J05J55J1j47M41
8012B49l21k0J86j44j98J84Lk62K66M1J11j77L93k43j35J26p1j37K44l42K31k15
8034b31M27k25q7J01J26m30J38J76K5J61k52n4L02k30j52M2K18n4K02r4k08k05
$$ plain form
7878 -360 -135 206 -161 102 246 44 -220 -62 20 -252 137 -195 42 -125 228 -227 96 98 18 -40 -84 -84 55
7901 55 57 -401 -154 -37 74 -275 -66 -124 -25 179 77 -240 -95 10 79 -144 1 77 -10 9 -162 -216 -29
7924 -29 33 -26 -153 3 49 -196 94 -9 11 -114 -47 -148 -88 15 -245 83 70 61 -256 -55 75 -115 -221
7947 -221 172 -151 -13 -181 -304 102 176 68 -162 151 4 13 -174 -70 -162 -190 45 13 -176 171 -27 -107
7969 -107 -50 192 -224 115 -153 221 158 299 -18 68 229 12 61 -294 -173 196 214 99 -33 59 378 -224
7991 -224 152 -108 -287 -177 447 -75 74 152 83 -246 -37 208 -24 -44 91 -316 -211 -56 -45 -192 249
8012 249 -72 -92 94 -50 -248 -64 -61 -323 -57 -16 95 -82 311 68 -67 59 -12 -149 95 -247 -16 -231
8034 -231 196 -29 -116 -15 111 -319 -181 -5 20 181 -71 -125 177 -53 -205 -163 55 1 203 109 -99 -304
8056c04K69j39J90K2q1N2m95N84k9q1r4L28J5L4k50Pk23K06l3O4m2K51k66K31
8080B16n0l36J91K24j58q7J7q2J84k35j55J93Q1N6j77k58L26R1no7p8k15M24J66
8104B66k08m2j24j15J89K80j77M0n8k45K15J43k72k00L81l75J85K33l12l4L48
8125A18j08Q3N3Q3j88l54K37K99m88K55J45m49K96j61k6L13j53K1Qk4J09j29K88
8148B28p6k65MJ79k56N18p2l03M8J81l01k0L06r0L2r8J7K4q4J84j77j04J32j82
8172a75M7J58n1n8P4K58o27L49j02N2K1r6m2K98m6J2m66O06o51
$$ plain form
8056 -304 -35 -174 16 38 -43 9 -486 98 69 -12 -106 222 237 271 21 28 -195 11 -22 42 0 251 -15 216
8080 216 166 -170 21 245 87 0 17 -65 119 -116 -271 -78 3 59 -118 -376 -50 41 36 -31 -109 -324 100 266
8104 266 58 16 -108 -223 -34 246 69 109 51 -194 21 164 -108 -308 73 -302 -117 116 -196 -230 118
8125 118 10 93 146 229 41 -313 -76 223 -265 -10 135 -314 -18 -179 -205 108 -45 -24 -16 -40 69 -60 228
8148 228 152 -113 -109 70 -186 332 260 -43 5 186 -115 -135 171 81 113 15 32 56 -28 156 -21 -125 7 -175
8172 -175 -128 30 -21 -79 -5 253 -374 -25 -127 -75 -54 -150 -192 106 60 72 -394 212 -439
8191d39
$$ Imaginary data points
##PAGE= N=2
##DATA TABLE= (X++(I..I)), XYDATA
0@%%%%%%%%qJ6j6J6j6K1k9L2m0M8n2O0p2Q8r9J09j25J45j66J86k10K38k68L00
32A58l36L76m18M64n16N73o35P04p80Q62r52J055j170J298j444J613j808K034
50A078k303K632l040L561m259N237o696R095j3695K5410j02539j89631L76531
63A01381P7285l55616L7423L27514j24962k52561J61553J69232j80641r1492J72495
74D1611M5123j53786j3192J19492j8962j09357L7647R1196n2512p2973O0056M0419
86A4762p1003k2308O4456P260m4975J10L0000K262k5687j3170L9041K6032n1058
99d4278j0473P2829j8743p7290O6917O4858j01472j4111J29375n0062j24165J16325
111I710Q5654j62961j8199J85287n5698j76489J15162J33938j59449q1098J80102
$$ plain form
0 0 0 0 0 0 0 0 0 0 -8 8 -8 8 -8 13 -16 16 -24 24 -28 32 -40 48 -51 58 -67 78 -88 98 -112 126 -142 158
32 158 -178 198 -220 244 -272 301 -334 370 -410 452 -500 555 -615 683 -761 852 -956 1078
50 1078 -1225 1407 -1633 1928 -2331 2906 -3790 5305 -8390 17020 -85519 -275150 101381
63 101381 178666 -176950 -139527 187987 63025 -189536 -27983 141249 -39392 -130884 41611
74 41611 86734 -67052 -80244 39248 20286 -89071 -51424 39772 -12740 -85713 -25657 14762
86 14762 -56241 -78549 -14093 -6833 -51808 -51698 -21698 -19436 -45123 -58293 -19252 6780 -44278
99 -44278 -54751 18078 -665 -77955 -11038 53820 -47652 -61763 67612 17550 -106615 9710
111 9710 95364 -67597 -85796 99491 43793 -132696 -17534 116404 -43045 -124143 55959
122E5959K7318j79886J5020J62518n4460j44363Q5846J27624j07983r8621J30762
133A9734O3580j45475j9021J51932j8488j29057N9292R9267p9542n9796Q0875
144B3301K9516o0272r635L8137J1266k2653l1715J9927N0023l8662n9560O5291
156A4964M7284r5142k2160J04723j9878r9341N5946P2179p9856l7346Q3222J320
168B5915p2416K3989N3286l6015l2293M1173J8783m0768p758M4630k707m7581
180c1762J8930M9601l9480m0553O1555J9170p8314J0506P7193m6596o1731P1246
192I765K9839q2096P27P1266k9779n2512L8867K8714l4343j4520K1043J2245r571
205a0355k2595Q053L8331j7221m5181L9475M3321n8315k5632P1063M222o8867
$$ plain form
122 55959 83277 -96609 -81589 80929 26469 -117894 -32048 95576 -12407 -111028 19734
133 19734 83314 -62161 -81182 70750 52262 -76795 -17503 81764 2222 -57574 23301
144 23301 52817 -7455 -17090 21047 32313 9660 -22055 -2128 47895 9233 -50327 14964
156 14964 62248 -32894 -55054 49669 29791 -69550 -13604 58575 -21281 -58627 24595 25915
168 25915 -46501 -22512 30774 -5241 -37534 3639 22422 -18346 -26104 18526 15819 -31762
180 -31762 -12832 36769 -2711 -43264 18291 37461 -40853 -30347 46846 250 -61481 9765
192 9765 39604 -42492 -41765 29501 -278 -52790 -13923 14791 -19552 -34072 -13029 -784 -10355
205 -10355 -32950 -24897 13434 -3787 -48968 -9493 33828 -24487 -50119 20944 25166 -43701
217d3701J8719N8881l0398m2686L2550L1237k9776k7217K6399K8841l0012l1468
229c8631L9298K6847n4164j3070O2210r889n9564L2638M3889m7977j8985M9840
241A2442n424l6634K1761J7153k2170L358J3690j2301K949J1247j3442O21J6427
254I677j0684o978J5919m646j0562J3916l092j3849J7199K576k4827J2878K1469
267A8996k9912r646L5149p457l1806K0013J8810k4200o462J7292R3o993k346M41
281h028J3276j612k4484J2968K9355k8182k1398M2996N327m7661J3806M0294k8773
294b116k3732L3729N999k7386L408J3896n417k927l220r42J4470o452k1535J7054
308e171J7972k9125n570L3037r350k6444J9108J1915k1642L142J3314r516J479
$$ plain form
217 -43701 -24982 33899 3501 -39185 -6635 24602 -5174 -32391 -5992 22849 -7163 -38631
229 -38631 667 27514 -26650 -39720 22490 12601 -46963 -14325 29564 -18413 -37398 12442
241 12442 7018 -29616 -7855 9298 -12872 -9514 4176 -8125 -5176 6071 -7371 -6750 9677
254 9677 -1007 -7985 7934 3288 -7274 6642 3550 -10299 6900 9476 -15351 -2473 18996
267 18996 -10916 -20562 14587 7130 -24676 -4663 14147 -10053 -16515 777 870 -6123 -8469 -8028
281 -8028 5248 3636 -20848 -7880 21475 -6707 -28105 14891 20218 -27443 -13637 26657 -2116
294 -2116 -25848 7881 13880 -13506 -10098 3798 -1619 -4546 -7766 -8708 5762 -690 -22225 -5171
308 -5171 12801 -16324 -21894 11143 1793 -24651 -5543 6372 -15270 -12128 1186 -8330 -6851
321f851P472j4037K885J7244j6042r533K6875k963k6371J5219J5988k1522k654
334a4290J9517o090p848P826n698j650J0652j0677o473K2622m598k5399J7465
347d641J7635k8715l526L0220q408k0337J5751O746j4623L661N205m847Q264n85
361A800j4477J2176J1404k4132n56K8653j1658k1258K1446Q299k3647L913J6359
374H322r447k713P848p120J819Q775j4581p78K2352j0184k0109K2582R534k8530
388a2230L904K4912j4441j2706J7470N12j1741N445J94l887R703n242j0838J6369
402G424M071k3743P755K2114j8702j1823K4018j539k0528J1590R722j3765L580
415A74P304j0863L657R794j4441q95J8884j0680j4510J9216L351j9813O808J2961
$$ plain form
321 -6851 621 -13416 -10531 6713 -9329 -18862 8013 5050 -21321 -6102 9886 -11636 -14290
334 -14290 5227 -863 -8711 -885 -6583 -8233 2419 -8258 -14731 7891 3293 -22106 -4641
347 -4641 12994 -15721 -19247 10973 2565 -17772 -2021 4725 -9898 -6237 -1032 -5879 2385 1800
361 1800 -12677 -501 10903 -13229 -13785 14868 3210 -18048 3398 11697 -11950 -8037 8322
374 8322 -1125 -3838 4010 -3110 -1291 7484 -7097 -7875 14477 4293 -15816 6766 16300 -12230
388 -12230 -8326 16586 2145 -10561 6909 7421 -4320 1125 1319 -2568 7135 1893 -8945 7424
402 7424 11495 -12248 -4493 17621 -1081 -12904 11114 9575 -10953 637 10359 -3406 174
415 174 7478 -3385 272 10066 -4375 -5270 13614 2934 -11576 7640 10991 -8822 -2014 10947
429A0947j1827k518Q140o165R84O248j2137J128J7365j3410j5518K3939M815k9908
443a7917Q967K5706j9291j5280K2629L168j8046L670R672k142j586m432J159J2600
457H877q055j7335K0377J3882l0236j881L3070j3933k8119K5374J4752k8647n84
470a2458K3332r887j3492J0673K816n234J875j822J042O293q598n158J5232k304
484B310j5467J3226R781k0152K288J9004j4713r227K2412l122k0573J5707J0951
497A2425k1959R38K0267r705j2060J2978L348r514k59K376K848K430j0557q19
511g263J8721r526k3135K2372J8135l3380n560L8806j0534l5963K4031K4841k9375
524g830j1846K9610L008k3723P52J7791J342j6491l819K1293L839k8491K611L2533
$$ plain form
429 10947 -880 -3398 4742 -1423 -439 5809 -6328 -5200 12165 -1245 -16763 7176 11991 -17917
443 -17917 -8950 16756 -2535 -17815 4814 7982 -10064 -6394 3278 1136 -450 -4882 -3723 8877
457 8877 822 -16513 3864 17746 -12490 -14371 18699 4766 -23353 2021 16773 -11874 -12458
470 -12458 10874 987 -12505 -1832 984 -4250 -2375 -4197 -3155 3138 -5460 -10618 4614 2310
484 2310 -13157 69 9850 -10302 -8014 10990 -3723 -12950 9462 6340 -14233 1474 12425
497 12425 -9534 -8596 11671 1966 -10094 2884 6232 -3282 -3541 -1165 1683 4113 -6444 -7263
511 -7263 11458 1932 -21203 1169 19304 -14076 -19636 19170 8636 -27327 -3296 21545 -7830
524 -7830 -19676 9934 12942 -10781 -10029 7762 9104 -7387 -11206 10087 13926 -14565 -11954 20579
538B0579j5161l1639K8551K1914l7781p397L7297q965l1094J9422J8369k1350
550g255o753J6553n35r503n6M473N602m794r582J1632Q738k0209p65K5474j1051
565A969k2044K4237J1660l1102K942L0300j7349k1319K6580R308k7446J628K2619
578A1983q454j6477R118J3606p696j4616P450J7900j2658k0999K2551J9788l3870
591a2374j0205M1807m973m2594K2287L5989l3540k0891L8259P208l5171M524K7502
604A7828p609j8822O585J6333k647j9322J912K4914o812k9042J8188K8110l0676
617a060k0549L9404M961m0504J0096L5421k1605k4042K5887J1472k4278l577K0119
630A1745J841j6444j720J6156J392k0309L158K4883j1874k3458K3566J5959l3573
$$ plain form
538 20579 5418 -26221 2330 24244 -13537 -20934 16363 7398 -23696 -4274 14095 -7255
550 -7255 -14008 2545 2010 -7493 -7549 -3076 2526 -2268 -11850 -218 8520 -11689 -12454 13020 1969
565 1969 -20075 4162 15822 -15280 -12338 17962 613 -20706 5874 15182 -12264 -10636 11983
578 11983 3529 -12948 -3830 9776 2080 -12536 -5086 12814 156 -20843 1708 21496 -12374
591 -12374 -22579 19228 14255 -28339 -6052 29937 -3603 -24494 13765 20973 -14198 -9674 17828
604 17828 10219 -8603 -2018 14315 11668 -7654 -5742 19172 12360 -16682 1506 29616 -1060
617 -1060 -21609 17795 22756 -17748 -7652 27769 6164 -17878 8009 19481 -4797 -8374 11745
630 11745 13586 -2858 -4578 11578 12970 -7339 -4181 20702 8828 -14630 8936 24895 -8678
643h678k624L6261j3708k9826K7710J6866l4713k864L1706j1291k2887J7993J3079
656A7024j7527o866J1605M192r132p216R518J1931j5084j3768K3222O925l1101
669a6277L979L4030j5762k8500K5787J8111l1860p938L0270O33k4541L984K0182
682A2098m858k1152L242K3206n193k6661J3899K7651k6468k4743L6935J1694m2606
695b2956O261M1659k1759l1927L0452J5676l2739M2K8764q694j8358J0592Q946
708E959q855m930N136P394k282r913M959J0864j2250q808J8736L346k0419P532
722c531J7025j6940r863J9569Q18j6426P469J1061r743o289O161L323j566m608
736c540J081J1657m920j7072J2654J6621k2841q136L2667l804l4485J8158K7179
$$ plain form
643 -8678 -11302 24959 11251 -18575 9135 26001 -8712 -11576 20130 8839 -14048 3945 17024
656 17024 -503 -7369 4236 8428 -704 -7920 1598 13529 -1555 -15323 7899 14824 -16277
669 -16277 -12298 21732 5970 -22530 3257 21368 -10492 -18430 11840 12473 -12068 -8084 12098
682 12098 7240 -13912 -10670 12536 7343 -19318 -5419 22232 -4236 -28979 7956 19650 -22956
695 -22956 -16695 24964 3205 -28722 1730 17406 -15333 -15291 13473 4779 -13579 -2987 5959
708 5959 -2896 -7826 -2690 4704 2422 -7491 -2532 8332 -3918 -12726 6010 9356 -11063 -3531
722 -3531 13494 -3446 -13309 6260 7078 -9348 -1879 9182 -561 -6850 -689 2634 1068 -3540
736 -3540 -2459 9198 4278 -12794 -140 16481 -6360 -14496 18171 14367 -20118 -1960 25219
749B5219k9731j4410L5601J385l2005Q598K3785j5231j5831J5372J0942j1848
761A846r288R402J0186j2846j1800J8141R952k2503k596K5557q137k3508J6400
774H06J5951k0278m367J9067l411j3738O580N351n072R43q02R14N105o558o686
789f195J2835J502j6962Q032J5053j6782q127K1502m395j9187J4131J1257j9373
802f709r71J8446q133j2688J2026N235j1345j39Q163j024m928j844N776M490r209
817b854m347J5315j246j8484R576J7625j8582j0719K4677j300k3172R766J7273
830A3528j5802p857J5121K14j1168K978M088j177k98l780J306Q676o429r685J3197
845B912N441j7749K957J7595j0804j1490J5941L155j5476M481R950p776k437O169
$$ plain form
749 25219 -4512 -18922 16679 18064 -13941 -5343 18442 3211 -12620 2752 13694 1846
761 1846 -7442 1960 12146 -700 -12500 5641 15593 -6910 -9506 16051 7914 -15594 806
774 806 16757 -3521 -7888 11179 7768 -5970 610 5961 889 1832 1030 1944 7049 491 -6195
789 -6195 6640 8142 -8820 -788 14265 -2517 -10644 10858 6463 -12724 1407 12664 -6709
802 -6709 -7680 10766 2633 -10055 1971 7206 -4139 -4278 3885 2861 -2067 -3911 1865 6355 -2854
817 -2854 -7201 8114 6868 -11616 -2040 15585 -2997 -13716 10961 9661 -13511 -3745 13528
830 13528 -2274 -10131 4990 5204 -5964 -2986 1102 -75 -373 -4153 -2847 5829 -600 -10285 2912
845 2912 8353 -9396 -6439 11156 352 -11138 4803 7958 -7518 -3037 6913 -863 -3300 2869
859B869k651j100K399l505J021M865n912k606R117l351p953R263K102j1808N866
874a384Q149j1364j125J3374p849q748J3327Q61j3471O888R236j1400j938J0576
888E132l561n938O050k65k943L535k689j838P582l752q157R675L737j3424L428
903c428J2982j0548p971J3133R6j2152O310O120p941O77M761n232J282L797n768
918c882Q87Q036o929m928J0640j250j0361P448O021j0277Q20Q805p014l144Q021
933B893l423m402P801k422p280P841K303j0709M621Q425r657k587R787m036o335
948g180P466L00n753M549O89o732N595L108r179L758Q797r911l658J1943l736
963E6r161R398L704r820K982N740o569l96N788m724j80O883n751m334R019k267
$$ plain form
859 2869 218 -882 1517 -1988 -967 3898 -2014 -4620 4497 1146 -6807 2456 4558 -7250 -1384
874 -1384 6765 -4599 -5724 7650 -199 -8947 4380 5241 -8230 -1342 7894 -3506 -5444 5132
888 5132 1571 -4367 1683 1418 -1525 2010 -679 -2517 5065 1313 -6844 2831 6568 -6856 -3428
903 -3428 9554 -994 -8965 4168 4264 -7888 -1578 4542 -3399 -2722 2039 -3193 -1911 1886 -3882
918 -3882 -2995 5041 -1888 -6816 3824 2574 -7787 -339 5682 -4595 -3775 5030 -1984 -5128 2893
933 2893 -530 -4932 2869 447 -6833 1008 3311 -7398 -2777 5648 -4009 -6596 3191 -845 -7180
948 -7180 286 586 -5167 -618 71 -6661 -1066 2042 -7137 -3379 5418 -4493 -8151 3792 56
963 56 -9105 293 3997 -5823 -2841 2899 -3670 -4066 1722 -3002 -3182 3701 -2050 -6384 2635 368
979C68q866Q520M982j0573K078P879p660k827Q194k531l805P145k345o331P785
994B013J41r419O757P415j0691o28J0645o362p049R560J251p344M317L314o197
1009b277J838K944n456L500N140p748K30R246o993o313J1099O19j0392O221O367
1024H025r751n53Q105m889k803P563l413m201O310j717o510O681K890q738L870
1039H69O361q510j392Q812n218l902Q465j955o878P100J077q960N672O564j0168
1054b063m6J0415p039o644R832Q34q345M303M114n991P80K318l613K363K980o772
1070b574J553P050p840m166J1399j896j1125Q218N995j1280l27R469m812m623
1084d959O572o94l931M189j553l400O480p89p303P047M240j1608K032J1120q161
$$ plain form
979 368 -8498 22 5004 -5569 -3491 4388 -3272 -6099 2095 -436 -4241 2904 559 -5772 2013
994 2013 2154 -7265 -508 6907 -3784 -4412 6233 -129 -7178 2382 3633 -3711 606 3920 -2277
1009 -2277 -439 2505 -2951 549 5689 -2059 -1829 7417 424 -5889 5210 5829 -4563 1658 8025
1024 8025 -1726 -2279 5826 937 -1866 5697 2284 -1917 4393 2676 -3834 2847 5737 -3001 869
1039 869 7230 -1280 -2672 6140 922 -2980 5485 3530 -3348 3752 4829 -4131 1541 8105 -2063
1054 -2063 -2109 8306 1267 -5377 4455 5289 -3056 1247 5361 -630 150 2468 -1145 1218 4198 -2574
1070 -2574 -1021 6029 -1811 -5977 5422 3526 -7599 619 6614 -4666 -4993 4476 -336 -4959
1084 -4959 1613 919 -3012 1177 -376 -3776 2704 1915 -5388 1659 5899 -5709 -3677 7443 -718
1099g18n967J1955j359j0979O714N299r519J161P793n791k898O515l255l487N174
1114F38l71m004M381m0m595L933J035n546M819L683p677J403Q287p723m120J1684
1130E787j976j0016Q234N459j0975R63Q837n463l468P146k452l311M936k807m316
1145c422Q038j182r222Q109N443j2886M98J2885p180q938J2000K946j1816K691
1159b036Q349n932l335N512M57q74m38j472K778J852o362J540Q578o176o361J0124
1175F204P23j1812N056Q951j0274k004J0709n233p814R174Q54r266N700M413q703
1190c322J883O197p123r58P842m133m471Q250j819p431P266K581r440M277P546
1205G145q533k126R203l163p213O727K918o302R34L148k360l80k95l57L815k164
$$ plain form
1099 -718 -6685 5270 3911 -7068 -354 4945 -4574 -3413 4380 -1411 -4309 2206 -1049 -4536 638
1114 638 267 -3737 644 604 -3991 -58 977 -4569 250 3933 -3744 -2341 5946 -1777 -5897 5787
1130 5787 3811 -6205 2029 7488 -3487 -2524 6313 850 -2618 4528 2076 -1235 3701 894 -3422
1145 -3422 4616 3434 -5788 2321 7764 -5122 -4624 8261 1081 -7857 4143 7089 -4727 -2036
1159 -2036 6313 381 -2954 2558 3015 2141 1703 231 3009 4861 -1501 39 8617 2441 -3920 6204
1175 6204 6927 -4885 171 9122 -1152 -3156 7553 2320 -5494 3680 4534 -4732 968 5381 -3322
1190 -3322 -1439 4758 -2365 -3323 4519 386 -4085 4165 2346 -5085 2181 4762 -4678 -401 7145
1205 7145 -1388 -3514 5689 2526 -4687 2040 4958 -1344 -410 2738 378 -2 -297 -654 3161 997
1221I97o154N771M611j0884j94J2973o446j0623J2620M210j5318L299J2735q619
1235a022n668J0859k70q204M878K607n151L148K232m724L543L043p662J379P979
1250F967o548m433J0040j103r395N216M592p611L36O462l621k406L831k062j511
1265a246K697j505n07M335l149l044O075j163o697P031M067j0156K695R791r249
1280b5n061J2636j678j0947Q849O102j2011K5J0044n807n551Q527m55n817L130
1295A961K84m058L391K31m642M848K584q705J677P709p063l966R800m64q067M443
1311c7L956n721L7M215j931L10J379l416K170K879o737L54Q811n280o790R902
1327D101Q19j1739M353R146r910k753J0749l852q137P884J212p807L989M565o331
$$ plain form
1221 997 -5157 614 5225 -5659 -5853 7120 674 -9949 2671 6881 -8437 -5138 7597 -1022
1235 -1022 -6690 4169 3899 -4305 573 3180 -1971 1177 3409 -1315 2228 5271 -2391 -1012 6967
1250 6967 419 -4014 6026 4923 -4472 744 5336 -2275 -1939 4523 902 -1504 2327 265 -1246
1265 -1246 1451 -54 -561 3774 625 -2419 3656 2493 -4204 2827 6894 -3262 -567 9224 -25
1280 -25 -5086 7550 5872 -5075 3774 9876 -2135 -2110 7934 2127 -3424 5103 4648 -1169 1961
1295 1961 2245 -1813 1578 1809 -2833 2015 4599 -4106 -2429 5280 -1783 -5749 4051 3587 -4480 -37
1311 -37 3919 -1802 -1765 2450 519 829 2208 -1208 962 3841 -2896 -2542 6269 989 -5801 4101
1327 4101 4920 -6819 -2466 6680 -3230 -5983 4766 914 -7223 661 1873 -5934 -1945 2620 -3711
1342c711Q75N123n523j162O427l564k857O099j182m750N210P70o155M243L724
1357C567o677J214O057n043k661O841k285m898N451Q59n518L283J519m902K761
1372d32K859o323J865O522p128k744J0139l661q639R469L980j1163K596R286p035
1387d09m686Q987o29o278M964J704m583K643J371m205L212K401o256J906O044
1402F186o319k716Q323k801o278O381K308p324K501L873n069K88M334l629j031
1417i73N277l754k811O355j837n438O409K070q112L296N922p823o16Q410m447
1432A928n070Q084p45p452N057L519p692J530O442n650k358N920k632l939M901
1447A843p73l702M203j31n285M426K196o438K424N915o650k014Q286l018o441
$$ plain form
1342 -3711 -2836 2287 -3236 -4398 2029 -1535 -4392 1707 525 -4225 985 1755 -4400 -157 3567
1357 3567 -3110 -1896 4161 -882 -3543 3298 1013 -3885 1566 2425 -3093 190 1709 -3193 -432
1372 -432 2427 -3896 -2031 4491 -2637 -5381 4758 1097 -7542 1927 5907 -5256 -2660 6626 -409
1387 -409 -5095 3892 3263 -3015 1949 3653 -930 1713 3084 -1121 2091 4492 -1764 142 6186
1402 6186 -133 -2849 5474 2673 -3605 2776 5084 -2240 261 4134 -935 -647 3687 58 -973
1417 -973 4304 550 -2261 4094 2257 -3181 3228 5298 -2814 482 6404 -1419 -2035 6375 1928
1432 1928 -3142 4942 4197 -3255 1802 5321 -2371 -841 5601 -49 -2407 3513 881 -3058 1843
1447 1843 1070 -2632 1571 1440 -3845 581 2777 -3661 -1237 4678 -1972 -3986 4300 1282 -5159
1462e159O676K198p220K842M344n266J92M092m007m65N074m108k221O281k626
1477F27n937O736K459q776K873O627o842k395P619k845m563N559N49n175L581
1492I7J593m958K706L153n239Q16N495m672k122O468k447m439N861N95o174M247
1508I80L086o547J908N364n554k054P254l127n049O143M77o125L497L565n787
1523a969R79M417m282p08M925l340k667O634k422n456O601J472p708L453N888
1538E817o829j300O971l431m256N933j66m766L922O87m539K995K595n632J938
1553f1N005o140j745P297l001n936O586J308o776L264L820n981N30M805m099j521
1569b645N386k819l644N913j167n271M690K134o046J789N173n456j045O065l916
$$ plain form
1462 -5159 1517 3715 -3505 -663 3681 -1585 -1393 2699 -1308 -1773 3301 -807 -3028 3253 627
1477 627 -5310 1426 3885 -4891 -2018 4609 -2233 -4628 2991 146 -4417 1142 1691 -3484 97
1492 97 1690 -3268 -562 2591 -2648 -1832 3663 -1009 -3131 3337 890 -3549 2312 2907 -3267 980
1508 980 4066 -2481 -573 4791 -763 -2817 4437 1310 -3739 2404 2881 -3244 253 3818 -1969
1523 -1969 -990 3427 -855 -1563 3362 22 -2645 3989 1567 -3889 2712 4184 -3524 -71 5817
1538 5817 -1012 -2312 4659 1228 -3028 2905 2739 -2027 1895 2582 -1957 1038 3633 -1999 -61
1553 -61 4944 -1196 -2941 4356 1355 -4581 2005 3313 -3463 -199 3621 -2360 -1830 2975 -1124 -2645
1569 -2645 2741 -78 -3722 2191 1024 -4247 443 2577 -3469 -1680 3493 -1963 -3008 3057 -859
1584h59k977N835j262m730N104R52o423L373M095o347Q3O538m117l274N904j318
1600E77m572M380J310n181K951K678n259J414M582n257p24O249l379m419O555
1615A905J38o627M071L620n829Q22M593m065p80M847l285k405N951j697m830N428
1631A857J577p373L450N024n474j251O207l044m301N617n77m324M353R89m883
1646b153K888K808n757J082N637m669k284O206j923n290N158J442n774L283L096
1661C750n149O30M247l932j294N080k623k923N311j150n422M930J991n818K239
1676a33M317n368r32N698m193k758O299j179n368N125J237o413K334M706n273
1691a901j180N721k992k923M482p00l748L577O46m224L143K290n766J548M900
$$ plain form
1584 -859 -3836 1999 737 -3993 1111 2063 -4360 -987 3108 -3239 -3156 3382 -735 -4009 1895 577
1600 577 -3995 385 1695 -3486 -535 2143 -3116 -1702 2880 -2377 -3101 3148 -231 -4650 1905
1615 1905 2043 -4584 -513 3107 -2722 -1900 2693 -1372 -2152 2695 -590 -2995 2956 1259 -3571 1857
1631 1857 3434 -3939 -489 4535 -939 -2190 4017 973 -3328 2289 1712 -2612 1741 2730 -2153
1646 -2153 735 3543 -2214 -1132 4505 -164 -2448 3758 1835 -3455 1703 3145 -2629 654 3750
1661 3750 -1399 -769 3478 -454 -1748 3332 709 -2214 3097 1947 -3475 1455 3446 -2372 -133
1676 -133 4184 -1184 -2116 3582 -611 -3369 2930 1751 -3617 1508 2745 -3668 -1334 3372 -1901
1691 -1901 -3081 2640 -352 -3275 1207 507 -3241 336 982 -3242 -99 2191 -3575 -2027 2873
1706B873n438j323O885k495n474N609J297n786K617L559m634L07L340l400j37
1721b200L650l371j024N031k505m365N981Q78p256M093M909o641j700P675l496
1736c41m584O034P06n387K809K686m695J213L568l630K51L420l123j415M798k260
$$ plain form
1706 2873 -2565 -3888 2997 502 -4972 637 1934 -3852 -1235 2324 -2310 -2003 1337 -2063 -2200
1721 -2200 1450 -1921 -2945 2086 -419 -4784 1197 2075 -5181 -1088 3821 -2820 -4520 3155 -341
1736 -341 -4925 1109 1815 -3572 -763 1923 -2772 -1559 2009 -1621 -1370 2050 -1073 -2488 2310 50
$$ [...]
8191B0
##END NTUPLES=NMR FID
##END=
