##TITLE=1H_EC-3189(33)
 CDCl3, 8 sc, 
 16.10.2019
##JCAMPDX= 6.0         $$ Bruker NMR JCAMP-DX V2.0
##DATA TYPE= NMR FID
##DATA CLASS= NTUPLES
##ORIGIN= UXNMR, Bruker Analytische Messtechnik GmbH
##OWNER= root
$$ XWIN-NMR		Version 3.5
$$ Wed Oct 16 14:41:33 2019 Russian Standard Time (UT+4h)  she@DPX200
##.OBSERVE FREQUENCY= 200.1315
##.OBSERVE NUCLEUS= ^1H
##.DELAY= (6, 6)
##.ACQUISITION MODE= SIMULTANEOUS
##.ACQUISITION SCHEME= undefined
##.AVERAGES= 8
##.DIGITISER RES= 18
##SPECTROMETER/DATA SYSTEM= spect
##.PULSE SEQUENCE= zg30
##.SOLVENT NAME= CDCl3
##.SHIFT REFERENCE= (INTERNAL, CDCl3, 0, 15.7039)
##AUDIT TRAIL= $$ (NUMBER, WHEN, WHO, WHERE, WHAT)
$$ ##TITLE= Audit trail, XWIN-NMR		Version 3.5
$$ ##JCAMPDX= 5.01
$$ ##ORIGIN= Bruker BioSpin GmbH
$$ ##OWNER= she
$$ F:/spectra/data/she/nmr/H-F/1/audita.txt
$$ ##AUDIT TRAIL=  $$ (NUMBER, WHEN, WHO, WHERE, WHAT)
(   1,<2019-10-16 14:40:33.96 +0400>,<she>,<DPX200>,
      <created by zg, POWCHK disabled, PULCHK disabled
       configuration hash MD5:
       00 E9 B6 7A A2 85 ED C7 34 08 36 98 17 FE 4E 26
       data hash MD5: 16K
       0D FB 5B 44 84 C9 88 37 45 6E 81 8F BD CB D3 00>)
$$ ##END=
$$ 
$$ hash MD5
$$ 6D B0 32 AE 41 4A 0C 8D BF A5 A4 A2 A6 76 3C 6E
##$RELAX= 
##$RELAX= 
##$RELAX= 
##$RELAX= 
##$RELAX= 
##$RELAX= 
$$ Bruker specific parameters
$$ --------------------------
##$DU= <F:/spectra>
##$EXPNO= 1
##$NAME= <H-F>
##$PROCNO= 1
##$TYPE= <nmr>
##$USER= <she>
##$AMP= (0..31)
100 100 100 100 100 100 100 100 100 100 100 100 100 100 100 100 100 100 
100 100 100 100 100 100 100 100 100 100 100 100 100 100 
##$AQSEQ= 0
##$AQ_mod= 1
##$AUNM= <au_zg>
##$AUTOPOS= <>
##$BF1= 200.13
##$BF2= 200.13
##$BF3= 200.13
##$BF4= 200.13
##$BF5= 200.13
##$BF6= 200.13
##$BF7= 200.13
##$BF8= 200.13
##$BYTORDA= 1
##$CFDGTYP= 0
##$CFRGTYP= 5
##$CHEMSTR= <none>
##$CNST= (0..31)
1 1 145 1 1 1 1 1 1 1 1 1 1 1 1 1 1 1 1 1 1 1 1 1 1 1 1 1 1 1 1 1 
##$CPDPRG= <>
##$CPDPRG1= <>
##$CPDPRG2= <>
##$CPDPRG3= <>
##$CPDPRG4= <mlev>
##$CPDPRG5= <mlev>
##$CPDPRG6= <mlev>
##$CPDPRG7= <mlev>
##$CPDPRG8= <mlev>
##$CPDPRGB= <>
##$CPDPRGT= <>
##$D= (0..31)
0 1.2 0 0 0 0 0 0 0 0.06 0 0.03 0 0 0 0 0.0002 0 0 0 0 0 0 0 0 0 0 0 0 
0 0 0 
##$DATE= 1571222433
##$DBL= (0..7)
120 120 120 120 120 120 120 120 
##$DBP= (0..7)
150 150 150 150 150 150 150 150 
##$DBP07= 0
##$DBPNAM0= <>
##$DBPNAM1= <>
##$DBPNAM2= <>
##$DBPNAM3= <>
##$DBPNAM4= <>
##$DBPNAM5= <>
##$DBPNAM6= <>
##$DBPNAM7= <>
##$DBPOAL= (0..7)
0.5 0.5 0.5 0.5 0.5 0.5 0.5 0.5 
##$DBPOFFS= (0..7)
0 0 0 0 0 0 0 0 
##$DE= 6
##$DECBNUC= <off>
##$DECIM= 24
##$DECNUC= <off>
##$DECSTAT= 4
##$DIGMOD= 1
##$DIGTYP= 9
##$DL= (0..7)
0 120 120 120 120 120 120 120 
##$DP= (0..7)
150 150 150 150 150 150 150 150 
##$DP07= 0
##$DPNAME0= <>
##$DPNAME1= <>
##$DPNAME2= <>
##$DPNAME3= <>
##$DPNAME4= <>
##$DPNAME5= <>
##$DPNAME6= <>
##$DPNAME7= <>
##$DPOAL= (0..7)
0.5 0.5 0.5 0.5 0.5 0.5 0.5 0.5 
##$DPOFFS= (0..7)
0 0 0 0 0 0 0 0 
##$DQDMODE= 0
##$DR= 18
##$DS= 0
##$DSLIST= <SSSSSSSSSSSSSSS>
$$ [...]
##$SUBNAM2= <"">
##$SUBNAM3= <"">
##$SUBNAM4= <"">
##$SUBNAM5= <"">
##$SUBNAM6= <"">
##$SUBNAM7= <"">
##$SUBNAM8= <"">
##$SUBNAM9= <"">
##$SW= 24.0689530833862
##$SWIBOX= (0..15)
0 0 2 0 0 0 0 0 0 0 0 0 0 0 0 0 
##$SW_h= 4816.95568400771
##$TD= 16384
##$TD0= 1
##$TE= 0
##$TE2= 300
##$TE3= 300
##$TEG= 300
##$TL= (0..7)
0 120 120 120 120 120 120 120 
##$TP= (0..7)
150 150 150 150 150 150 150 150 
##$TP07= 0
##$TPNAME0= <>
##$TPNAME1= <>
##$TPNAME2= <>
##$TPNAME3= <>
##$TPNAME4= <>
##$TPNAME5= <>
##$TPNAME6= <>
##$TPNAME7= <>
##$TPOAL= (0..7)
0.5 0.5 0.5 0.5 0.5 0.5 0.5 0.5 
##$TPOFFS= (0..7)
0 0 0 0 0 0 0 0 
##$TUNHIN= 0
##$TUNHOUT= 0
##$TUNXOUT= 0
##$USERA1= <user>
##$USERA2= <user>
##$USERA3= <user>
##$USERA4= <user>
##$USERA5= <user>
##$V9= 5
##$VALIST= <valist>
##$VCLIST= <CCCCCCCCCCCCCCC>
##$VD= 0
##$VDLIST= <DDDDDDDDDDDDDDD>
##$VPLIST= <PPPPPPPPPPPPPPP>
##$VTLIST= <TTTTTTTTTTTTTTT>
##$WBST= 1024
##$WBSW= 4
##$XGAIN= (0..3)
0 0 0 0 
##$XL= 0
##$YL= 0
##$YMAX_a= 335007
##$YMIN_a= -355865
##$ZGOPTNS= <>
##$ZL1= 120
##$ZL2= 120
##$ZL3= 120
##$ZL4= 120
##$ABSF1= 10
##$ABSF2= 0
##$ABSG= 5
##$ABSL= 3
##$ALPHA= 0
##$AQORDER= 0
##$ASSFAC= 0
##$ASSFACI= 0
##$ASSFACX= 0
##$ASSWID= 0
##$AUNMP= <proc_1d>
##$AZFE= 0.1
##$AZFW= 0.1
##$BCFW= 1
##$BC_mod= 2
##$BYTORDP= 1
##$COROFFS= 0
##$CY= 11.3945322036743
##$DATMOD= 1
##$DC= 2
##$DFILT= <>
##$DTYPP= 0
##$F1P= 20.1720416913024
##$F2P= 0.152960286110954
##$FCOR= 0.5
##$FTSIZE= 0
##$FT_mod= 4
##$GAMMA= 1
##$GB= 0.15
##$INTBC= 1
##$INTSCL= 1
##$ISEN= 128
##$LB= 0.24
##$LEV0= 0
##$LPBIN= 0
##$MAXI= 10000
##$MC2= 0
##$MEAN= 0
##$ME_mod= 0
##$MI= 1.114404
##$NCOEF= 0
##$NC_proc= 0
##$NLEV= 6
##$NOISF1= 3.799351
##$NOISF2= 2.8
##$NSP= 1
##$NTH_PI= 0
##$NZP= 0
##$OFFSET= 15.70392
##$PC= 1
##$PHC0= -9571.688
##$PHC1= 15.40093
##$PH_mod= 1
##$PKNL= yes
##$PPARMOD= 0
##$PSCAL= 0
##$PSIGN= 0
##$REVERSE= no
##$SF= 200.130013532006
##$SI= 16384
##$SIGF1= 3
##$SIGF2= 2
##$SINO= 400
##$SIOLD= 16384
##$SREGLST= <1H.CDCl3>
##$SSB= 0
##$STSI= 0
##$STSR= 0
##$SW_p= 3612.71676300578
##$SYMM= 0
##$S_DEV= 0
##$TDeff= 0
##$TDoff= 0
##$TI= <>
##$TILT= no
##$TM1= 0
##$TM2= 0
##$TOPLEV= 0
##$USERP1= <user>
##$USERP2= <user>
##$USERP3= <user>
##$USERP4= <user>
##$USERP5= <user>
##$WDW= 1
##$XDIM= 8192
##$YMAX_p= 0
##$YMIN_p= 0
$$ End of Bruker specific parameters
$$ ---------------------------------
##NTUPLES= NMR FID
##VAR_NAME=  TIME,          FID/REAL,        FID/IMAG
##SYMBOL=    X,             R,               I
##VAR_TYPE=  INDEPENDENT,   DEPENDENT,       DEPENDENT
##VAR_FORM=  AFFN,          ASDF,            ASDF
##VAR_DIM=   8192,          8192,            8192
##UNITS=     SECONDS,       ARBITRARY UNITS, ARBITRARY UNITS
##FACTOR=    0.0002076,     1,               1
##FIRST=     0,             0,               0
##LAST=      1.7004516,     0,               0
##MIN=       0,             -355865,         0
##MAX=       1.7004516,     335007,          0
$$ Real data points
##PAGE= N=1
##DATA TABLE= (X++(R..R)), XYDATA
$$ [...]
2747F186p109n043J86L991P495j497j0856j974R020M087j571m475o218K308J0312
2762D842J654r252m339L097N046M410l046r593j02J0131K997m709m611k525L948
2777b052Q744r78j0719k155P240M097N26l901p553J841J0328J524p892l584J487
2792c047M650N737k515r980l25Q736K792k616m089m284L116Q900j64q720k502
2807d311L893L744K926l105p836Q00Q901J566m936l049j535K853P033j424q994
2822c474l28N934K095j55k787n451J811Q415o12o348j554J006K366M407k011p506
2838d192O96O666N03k246j433l443J805O720o51o744n74K680J073K357j449n672
2854c904P18O260l30l360lj749L77M863m92o084Q37L437m53O53j46l882J43N457
$$ y = [6186, -923, -5966, -5780, -1789, 5706, 4209, -6647, -8621, 399, 4486, 2915, -1560, -7778, -5470, 4842, 6496, -2756, -7095, -3998, 1048, 5458, 2412, -7181, -7283, 2848, 5845, 1136, -3475, -6000, -2052, 6692, 5714, -5005, -7160, 80, 4177, 4703, 802, -6751, -4910, 5418, 6942, -950, -4534, -3047, 1603, 7340, 4825, -5155, -5480, 3256, 6048, 3432, -657, -4941, -1825, 7075, 6911, -1809, -4311, -418, 3326, 6252, 3147, -4689, -3889, 5012, 6578, 1642, -1407, -2942, -89, 6944, 5520, -3474, -3802, 2132, 4227, 4072, 1285, -4166, -2355, 6060, 5448, -900, -2454, -1448, 918, 5325, 3314, -4192, -3496, 3170, 3673, 1427, -6, -3449, -1644, 5076, 4425, -2319, -2893, -213, 860, 3217, 1768, -3904, -3186, 3074, 2744, -616, -619, -2368, -1991, 2872, 2380, -3704, -2867, 570, 117, 770, 624, -3258, -3115, 2342]
2872B342q19l428Q18m64l40L763K11n407N57L478r89M34Q72l344j430M784M74
2889A512k964Q02k23j949L388J795m005j321L251r01L25K263k850k820M100J730
2905B133k682R0l3j871L010K829l907k093K827M97M60J525l073l136M182L326
2921D084l220j220K73j169K866L340m595l478L509K243k40K26k932l181N096M064
2937E666l901l003Q66M04K662K754n156m347M265M078j221q63l312k010N197M591
2953F670m955m448J972J957K197J426n442m412N701M888k613l335k038k79N367
2968B656M148o690n245L974L446J298r02n426k958O717N091m953m513pJ661M695
2984B992K086o886n143N599M833j223k769l577j147O875M283o445n122K265L125
$$ y = [2342, 1523, -1905, -1087, -1551, -1891, 1872, 2083, -3324, -2767, 711, -278, 156, 1028, -2316, -3746, 1038, 1512, -1452, -650, -873, -2822, 566, 2361, -1644, -2965, 286, -615, -290, 1973, -877, -3697, 403, 2133, -549, -459, -492, -2363, 647, 3476, -431, -2524, 303, 800, 1260, 2785, -288, -3424, 758, 4084, 864, -356, -83, -1252, 1614, 4954, 359, -3119, 390, 2633, 2393, 2619, -313, -3494, 1602, 5666, 1765, -1238, -372, 32, 2694, 5448, 292, -4055, 210, 4288, 3067, 2204, -1108, -3118, 2079, 6670, 1715, -2733, -761, 1196, 3393, 4819, -623, -5035, 666, 5554, 2941, -394, -2432, -2711, 2656, 6804, 114, -5131, -1157, 2289, 3587, 2685, -2741, -5699, 1018, 6109, 1156, -3357, -3364, -1703, 2992, 5078, -1808, -6951, -1352, 3481, 2258, -511, -4088, -5235, 1640, 5923, -522, -5644, -3379, -254]
2999b54L010J79o444l735O991M927l668l491j730O47O006K765p392m761M609M440
3015B099O17j266n839k073P767M642n859m394P61K463M247J272p177l782O132
3030c90M526j473k719l646l81O824L110o313l885K848L092K095l16o307k389O987
3046A663M177m256k911j114J288M935J876o866l108N237K645m60r70m537j146
3061c547O543L158n396l250J503J423L318O94n724k467N279K584k380j369k183
3076a814o10N603J986n614k724L091J341R91K48m240j727N318J853l263j672M8
3092a185n01L958J561n362k192M045J070n40K80k920j691M548J876m179r34R99
3108a167j27K062J606m386j769L701R02j419P84j711j844L476J839l690o51J618
$$ y = [-254, 2756, 2935, -3509, -7244, -253, 4674, 1006, -2485, -4215, -3568, 2438, 5203, -2189, -6950, -2341, 2099, 2716, 1450, -4389, -6462, 1305, 5947, 88, -4306, -3545, -1082, 3165, 4437, -2740, -6522, -390, 4136, 2663, -56, -3702, -4083, 2741, 5851, -462, -4347, -1499, 1593, 3688, 3372, -2935, -5324, 1663, 5840, 1584, -1327, -2441, -1153, 3782, 5658, -1208, -4316, 921, 3566, 3106, 2136, -2401, -3547, 2996, 6154, 758, -2492, -989, 434, 3752, 4446, -1278, -3745, 1534, 4118, 1738, 369, -1814, -2424, 3179, 5165, -449, -3173, -82, 1259, 2250, 2498, -1742, -3469, 1849, 3702, 439, -1233, -1185, -1686, 2272, 3833, -1529, -3721, 324, 1394, 854, 1134, -1786, -3477, 1071, 2947, -1232, -2166, -1167, -1294, 768, 2374, -2012, -3781, -80, 822, -597, 187, -1524, -3368, 108, 1947, -1743, -2394, -776]
3124g76p19J042K029k837k632L456J363k487J332p17k155K386K661l221r71J949
3140b97j052M99K434k023l270L342J347j737P80n29k508K139L299k486k123J419
3156g66k04L86K575j575m048K308L185j544j1l02k564J824M068j953l403J147
3172h77P65N90K344j850m174K301L782j484j079l84k083J666M670k184m637J234
3188a400K486L55P16j421m261K583N060j858k946k17q87K197L978k537n542K008
3204a686L818j03l11j927l504K823N512k022m693O3J356J693L082l296n121K199
3220b117N029o84j920j624k076K832N082k603n631R71L017J069J529l519m709
3235e354L269N496j493l512j227m91L222L954l505n766K137M502L72l51k836l580
$$ y = [-776, -1495, -453, 1576, -1261, -3893, -437, 926, -1561, -229, -946, -3101, -715, 1946, -1275, -2246, -297, -1349, -850, 1584, -439, -3709, -367, 980, -757, 23, -506, -3014, -875, 2424, -62, -2185, -766, -970, -584, 1991, 416, -3632, -1324, 1861, 317, 306, 4, -2560, -736, 3332, 1379, -2024, -877, -112, 478, 2822, 972, -3202, -901, 2881, 1397, 318, -66, -2149, -483, 4187, 2003, -2634, -1400, 1086, 1441, 2157, 736, -3525, -942, 4118, 2260, -686, -903, -1790, 407, 4385, 1848, -3694, -1686, 2132, 2029, 1718, -209, -3713, -890, 4622, 2600, -2093, -2030, -674, 1019, 4101, 805, -4316, -2117, 2912, 2228, 308, -1316, -3392, -560, 4522, 1919, -3712, -2741, 276, 1345, 2874, -645, -5354, -2085, 3411, 1918, -1594, -2821, -3312, -90, 3864, 359, -5407, -3270, 1232, 1604, 1253, -1583, -5163]
3251e163L641N353k384m639j34J657K346K583l962n065L177N299j240k061j734
3266b326j542L344M695l528n123J541L027J193O69l114l804L308N305k203l395
3281a953n36J54K866L371l468n018K631L642L94n61k649k855L955M504k897l978
3297b398O28J300J635K398l085m386L154M043j200k153q03j351K786L986l227
3312A327m132J891K003L01J242k691l319L714L746k443k370R1n17K043L122l057
3328I51l888K327K514m68l2j303k891L094L795k826k692J224J31M54K210j818
3344G82l519K338K719j537k62n86j866J738L302k358k902J513P10l19J628j391
3360a0l016K310K700j965q05N67j810J217K865j877k925K034Q81r73J585n09l077
$$ y = [-5163, -1522, 3831, 1447, -3192, -3326, -1669, 677, 3260, -702, -5767, -2590, 2709, 1469, -592, -2326, -3868, -524, 4171, 643, -4480, -2939, 88, 1281, 1950, -1164, -4968, -1660, 3645, 1442, -1953, -2489, -2335, 531, 3902, 434, -4584, -1953, 1689, 2083, 1522, -1127, -3982, -27, 4477, 1580, -2398, -1770, -470, 1165, 3563, 478, -3908, -754, 3289, 2089, -64, -867, -2218, 568, 4554, 1327, -2805, -914, 1089, 1390, 2632, -59, -3378, 336, 4082, 1639, -731, -640, -1157, 886, 4008, 951, -2937, -610, 1904, 1436, 1404, 101, -2790, 304, 4099, 1273, -1419, -195, -64, 390, 2600, 782, -2737, -399, 2320, 783, 521, -65, -1931, -193, 3109, 751, -2151, -638, 72, -247, 1381, -10, -3026, -716, 1984, 19, -786, -219, -2029, -812, 2053, 176, -2749, -715, 166, -807, 778, 269, -2808]
3377b808J369K634j073q80O45j304j54L146q34l165J121J516q44R80J78l044N18
3394a999L380q57j862J077j040m6L101p41l406O30K161n61N42L81k968K11L476
3411A479k91k198L86l20L1K818m6m058L19L094m08K53k28k606K03L764K10l315
3429i13L66M01J95K513k43m130K40L537q5j126J4j967O05L650o5m081J02J776
3447G89P5J857p05m038O02M258K21k495m99j098N16M111l08m917J7K858L74P12
3465B330r68l487K67M824L63l727q38N21O26K942j30n101j87M039M58p35q09k498
3483b110J82M624O0m420o14J349R77J984j019l959L05M304K43k012j210j221J075
3500a462M126n85m481n22K793P67N83r80l702M36M916J23l392q84J94J152L185
$$ y = [-2808, -1439, 1195, 122, -758, -113, -1417, -1571, 1575, 741, -2424, -1303, 213, -631, 349, 527, -2517, -1999, 1381, 524, -1338, -261, -1301, -1347, 1754, 1013, -2393, -1763, 398, -163, 379, 760, -2208, -1997, 1479, 1188, -1010, -624, -944, -913, 1905, 1859, -2199, -1880, 1214, 806, 1059, 831, -1775, -1572, 2192, 2402, -913, -547, -146, 49, 2562, 2319, -1811, -1571, 1966, 1881, 755, 769, -1198, -593, 3057, 2992, -1089, -987, 789, 864, 2721, 2016, -2022, -1420, 2838, 3059, 564, 65, -1033, -517, 3594, 3286, -1631, -1614, 1244, 1618, 2330, 1362, -2125, -1858, 2966, 3329, -398, -1236, -715, -89, 2853, 2723, -2378, -2565, 1474, 1932, 1197, 388, -2110, -1928, 2696, 2756, -1664, -2278, -929, 48, 2032, 1013, -2946, -2641, 1663, 1906, -106, -1316, -2537, -1462, 2664, 2079, -2402, -2924, -131, 636, 1219, 239, -3463, -3027, 1889, 2012, -1380, -2264, -2070, -918, 2267]
3517B267p95m671J94L586N64q27r22k072N43L887M49m110k13J150J065J735n10
3534A320m402M30M512j4j929k78j473O67L960n91m042RK305P87K37l21l327M66
3552a684M606Pl102n06M09J06L006j26m237L51L146o7n21j57k440L37L923n85
3570B466l507R50R56l54J750jl522J19L672m34j508J23j321R6L179M5l585J77
3588f99J676l88Q24L30l360L08L237k26j816K5o07k38K945K35l541k73K327k74
3606D85j56N23k438l05L478o49k184P09j07p61K338R8k935j74K852r58k06L08
3624h2j669o35L068N9k451Q23J46l12J078R30k626p79K633j7q22M30j047r32K681
3643D76O71k319k89Q32k25J061J048k714r92K777L53q58Q2p30j393K547J505k950
$$ y = [2267, 1472, -3199, -3005, 581, 1145, 318, -604, -2676, -2133, 1754, 2203, -1907, -2120, -970, 95, 1830, 1320, -3082, -2652, 1860, 1846, -83, -361, -1834, -1167, 2793, 2202, -1840, -1831, 474, 1261, 1498, 1177, -2150, -1684, 2922, 2929, -173, -679, -270, -164, 2842, 2716, -1521, -1170, 1976, 1909, 1388, 1231, -1209, -872, 3051, 2466, -1041, -91, 865, 511, 2261, 2260, -1262, -1143, 2529, 2095, 587, 710, -611, -515, 2664, 2709, -876, -699, 977, 589, 1413, 1743, -1617, -1309, 1928, 1702, -114, -89, -696, -934, 2011, 2246, -1295, -1568, 759, 485, 329, 852, -1586, -1891, 1587, 938, -1246, -537, -644, -1405, 933, 1031, -1904, -2078, 774, -184, -390, -82, -1751, -2386, 682, 741, -1710, -887, -741, -1053, 25, 955, -1671, -2450, 183, 166, -656, -226, -1273, -2205, 476, 1147, -1172, -1461, -629, -854, 207, 1255, -1459, -2451, 326, 679, -179, -97, -827, -2220, 327, 1832, -1118]
3661a118m43J496n4M57J073k252j326K876J010j967K29l55q91K477J598l365q10
3678a365K047K68J5P44k174j291K902J600k722n84M90k53J517J549l583j375K683
3695D68J096o85k23j186j324K748J683k830j008J434l28J412J161l018j749K952
3711F03J343j981L22j023j291L287J430l168j560J844P04M42M97k576j466L127
3727E34J447k215q88o9m21K549J259l564j719K300J084j11j07j948j204L155J822
3744A904k529j501Q69m9J627J093l163j381K678J491j289pj466o93L016J346l054
3761a108j207J779K56M95P33k659j399L326J028j529q74j54n16K145J508k889
3777a065j836K263J137n63K78k004q71L179J318k637q03P22j57J785J192k955
$$ y = [-1118, -1561, -65, -119, 338, 1411, -841, -2167, 709, 1719, -248, -19, -374, -1265, 1212, 2810, -555, -1365, 682, 950, 965, 1709, -465, -1756, 1146, 2746, 24, -560, -70, -323, 1194, 2743, -840, -2215, 468, 1564, 879, 656, -530, -1854, 894, 2577, -253, -1261, 173, -155, 1257, 2418, -600, -2349, 603, 1946, -35, 287, -736, -2027, 1260, 2690, -478, -2038, -194, 510, 952, 1449, -1127, -2593, 534, 1981, -234, -1122, -1191, -1612, 937, 2196, -1368, -3087, -787, 297, 186, 79, -1869, -3073, 82, 1904, -625, -2126, -1257, -1306, 321, 1414, -1749, -3130, -452, 1039, -250, -257, -1723, -2416, 600, 1946, -1108, -2315, -536, -280, 215, 948, -1711, -3110, 216, 1244, -285, -1159, -1313, -1829, 316, 1824, -1065, -2901, -638, 499, -64, 214, -1790, -2661, 518, 1836, -801, -1604, -882, -1039, 746, 1938, -1017]
3793a017j430K644J047j104K96j602o05K752J412k538j292J405j1Q46Q20k243
3809f20j641K769J276j804J09o32q47K376J417l237q97J747L06N0Q71j811j576
3826b144K532J513k001k39K75r59J706J650k658j371K036P80p50N77j127j451
3842a631K388J192k227m83Q63n60O44J628k508j376K050Q75j290M15l65j469J604
3859b50K100k298j122R74l91M55J583k005j701K133J536j539J91j68j630J687
3875d45J891k069j275J513L6j6J227j549j759K010J377j639l31k7q10J327J779
3892A240j826j815J428Q98p18P82j004j958K157K053j966q03N72n93J079J742
3908A268j551k251J753J606j104O41r77j419J826J879j556j570J377k07L20J700
$$ y = [-1017, -2447, 197, 1244, 140, 436, -1166, -1771, 981, 2393, -145, -1437, -32, -43, 803, 1623, -620, -2261, 508, 1784, -20, 89, -543, -1390, 986, 2403, -834, -1731, 16, 322, 372, 1243, -568, -2144, 388, 1901, -100, -339, -64, -1023, 683, 2333, -325, -1696, 340, 1120, 370, 947, -180, -1631, 757, 1949, -278, -761, 102, -458, 186, 1814, -694, -2070, -20, 855, -435, -20, -385, -1854, -250, 1850, -448, -1570, -596, -987, -532, 1051, -954, -2655, -522, 1014, -525, -334, -502, -2132, -445, 1446, -623, -1898, -385, -349, -365, 862, -687, -2446, -436, 941, -698, -1029, -1056, -1866, -539, 1240, -586, -2401, -973, -75, -793, -11, -1015, -2973, -816, 1237, -729, -1532, -960, -1553, -474, 1268, -283, -2534, -781, 825, -279, 362, -615, -2034, -208, 1671, 115, -1455, -78, -285, 35, 1735]
3924A735j582k157K156J406j072k81j71j280J090K400k067j388J192N88R2Q39
3940A500j060k381K070J531j187o02M04p52Q71J970j692k270J776J400r85N35
3956A128n75j946J846K077j882j217O83m24P15J870j446k465J974Q87p39n6l66
3973F4j654J577K073j673j779J240K37j20J436j348j763J377J779j269m59J21
3989a61j199Q60K434j965k049J564Q19k96O27q64k148J748J981j621o83J53l39
4006a139L18K501j652k335J374J780j132N26o22j883J383K110j424j474J369n11
4022h11j82K048j163k120J507J597n99l40J29j663J036K403j647j727J218J00
4038b14K91J271p22k228J135K247j213n04K32r63O97J969r39k240J263N58n17
$$ y = [1735, 153, -2004, 152, 1558, 486, 205, 34, -1246, -156, 2244, 177, -1211, -19, 569, 661, 1500, 440, -1941, 129, 1660, 473, -129, 275, -477, 394, 2364, 672, -1598, 178, 1578, 593, 1128, 553, -1393, 453, 2530, 648, -569, 114, -310, 405, 2275, 829, -1636, 338, 1225, 486, 430, 64, -1590, -13, 2060, 387, -1392, -152, 85, -35, 1401, 53, -1710, -333, 1446, 177, -282, -161, -1360, -500, 1934, -31, -2080, -516, 303, 7, 634, -230, -2378, -630, 1351, -270, -953, -800, -1139, -821, 1680, 28, -2307, -933, 847, -285, 241, -381, -2264, -881, 1229, -195, -1669, -300, -811, -993, 1055, -108, -2228, -721, 876, 277, -63, 66, -1597, -561, 1842, 195, -1532, -314, -214, 77, 1348, 626, -1602, -467, 1780, 567, 63, 295, -668, 29, 1998, 1059, -1181, 82, 640, 123]
4055A23J018j24k361J029K185j143j207R41n11K70K018r91k224J246J428j248
4071D49P43j14j650Q18K444j541j366Q35n2J6J571r14k304J043J946j004k33K62
4089I49j639Q90K128j190j795J158M77q56J028o5k275R95J976j089r60Q14j375
4106h29K95K501j001k467J239J175o10L24j15k176J020K243r40j598Q93n50N7
4123e39K168j015k611J234J458p93J43K00k110R11K572j229j970J095J26l6J485
4140A089m80k674J008K328q21p57K93j292J99K630r99k230J038J080p63P81n1
4157C79k194J011K178j068j076O31m59K20J919p05k409J236J278r10O03K66j994
4174a094N46K185m70j915J298m65k37J712m82k166R02J495r52J27M86j309K46
$$ y = [123, 1141, 1017, -1344, -315, 1870, 727, -480, 461, -50, 220, 2238, 1247, -977, 269, 1697, 449, 1192, 1078, -572, 246, 2690, 1149, -217, 618, 566, 582, 2153, 1239, -1065, -22, 1924, 920, 687, 949, -690, 200, 2328, 1138, -657, 501, 978, 122, 1150, 1085, -1190, -195, 1781, 692, -268, 546, -829, -534, 1967, 966, -1501, -262, 913, 303, 627, 512, -1664, -644, 1599, 659, -939, -46, -596, -539, 1629, 614, -1997, -763, 695, -98, 45, 245, -1865, -954, 1618, 389, -1581, -486, -360, -396, 1089, 609, -2065, -1057, 1271, 450, -307, -14, -1306, -1107, 1523, 524, -1706, -668, 412, -351, 430, 379, -1815, -804, 1374, 306, -770, -139, -598, -378, 1541, 836, -1573, -337, 941, 31, 634, 900, -1094, -548, 1637, 1167, -748, 550, 85, -152, 1560, 1078, -1088, -186, 1309, 357, 484, 970, -339, -93]
4191i3K220j041j720O99Q90o86R71%k198Q90J745r84r01J209j081l65K249p69
4209A035k080R57J182p93O21K62j852N02J857q14j139O85j60n43J844n58k030
4226a024P76J376q94K7P14j669j00K219r11j445J025J44q92J078O6j858L65J384
4244C81m49n98R81j194m75K255n68j657N56R00q83J054M91j982p3K056p51p58
4262g14O54q64k09J626K86k012M19P64o89O50R77k104k71J988m84j090J036n21
4280e58q51K024L38k050K3J034l54J78Q23j436m80K207k63j159N99j31m05J174
4298G13K30j656J23J587m97l19N45r77p29K326L8j756L38M78m42Q84N95j930l48
4317g97K003k33j296Q12n19p73J821L38j862K1J013n12N98P66j819m74K216k7
$$ y = [-93, 2127, 1086, -634, 65, 955, 269, 1240, 1240, -958, -68, 1677, 693, -208, 1001, -80, -445, 1804, 1035, -1045, -88, 1094, 301, 922, 1184, -668, -166, 1691, 877, -262, 423, 263, -280, 1564, 1006, -1024, -248, 1128, 234, 261, 975, -694, -794, 1425, 514, -931, 94, 238, -654, 424, 490, -1368, -1003, 381, -68, -666, 315, -879, -1354, 901, 333, -1324, -768, 132, -751, 303, 794, -1188, -1261, 795, 44, -714, -60, -924, -1133, 493, 779, -1233, -814, -50, -739, -89, 888, -1216, -1487, 501, 17, -1073, -37, -558, -1409, 615, 953, -1097, -1074, -40, -394, -216, 607, -829, -1309, 898, 635, -524, 75, -56, -461, 713, 943, -713, -590, 997, 500, 181, 726, -251, -980, 1346, 1384, -372, -34, 444, 2, 886, 1481, -449, -797, 1206, 973, -323, 489, -30, -803, 1018, 1356, -506, -485, 528, 16, 614, 1380, -439, -913, 1303, 1276]
4335A276j247J85K3n69J533O25k559L0J754m98j65O60j415p62K329L47j881k2
4353c56N16m90J190J68k205m07K497l50p89M69j052o14K197K33k236p8J148n56
4371g15P35M32j796k53K170n8j299N24m69l74J677K34k375R0J254n7M7N32j603
4390a304j06J974q8j550K13L40p82J393M76k497J64J846n04o2J38j196n9K497
4408H93l16j742q7J054n37R29O27j887m73K249k44j027N25k35p30J726K71j795
4426g99K27J357n05O9L12j281o92K320M15k079N01L10o33J037P79k349J77J522
4444F88l71n83J061r64j048K342k03j527L21R51q14O93M02j313l96J932m03q37
4462f9R91o02p71J451J95j948Q20P78j104K80R08j303o80J615j87j228P77J07
$$ y = [1276, 29, 214, 237, -332, 1201, 1826, -733, -703, 1051, 553, 388, 1048, -367, -1129, 1200, 1547, -334, -356, 160, -330, 860, 1028, -1177, -1584, 913, 563, -226, 243, -809, -1423, 774, 1007, -1229, -1307, -159, -715, 20, 452, -1344, -1597, 573, 515, -784, -260, -729, -1103, 574, 808, -1567, -1477, -223, -280, -233, 299, -1304, -1410, 564, 476, -1074, -861, -521, -1303, 90, 566, -1931, -1767, 79, -425, -487, -349, -1545, -1604, 893, 577, -1165, -1252, -198, -735, 194, 821, -1066, -1539, 710, 466, -561, -36, -271, -1001, 725, 996, -799, -572, 785, 280, 349, 661, -620, -1312, 1008, 1423, -656, -155, 155, -478, 559, 1338, -1011, -834, 688, 317, -266, 795, -169, -1217, 1125, 922, -605, -284, 667, -147, 546, 948, -365, -761, 1171, 768, -69, 922, 320, -451, 1000, 1195, -753, 67, 845, -259, 21, 929, -374, -1054, 561, 374, -854, -77, 30]
4480C0j241J394L72j547L42J197j046l16J421j329p02J372N98j512Q59J39j321
4497a290J129Q10j380l05J387o51l77J057n58j310J594K20j117J78Q03j214L14
4514g10J208j203m41J175j73q39R01n19j070J289R62j762L12Q88r72J00J707j409
4532e56r14J124M57o63O88n6j421J088J305j118l81O20m67Q8J488j193j239J543
4550C93N59j085N17K28j617J073J293j288r09J329q9n06J478j057j588J589J301
4567A621j596k32M33q14P49J723j757j099J207L83j06M69l38j474J142J486j427
4584C70m99R05o68M02J264j548j387J542R57j247M48q5j321J557J346k075p66
4601h05J266l7m25P84q24j670K158R83j512m05M61o62P33J572j929j204J498M07
$$ y = [30, -1211, 183, 555, -992, -650, 547, -499, -815, 606, -723, -1425, -53, 545, -967, -108, 31, -1290, -161, 649, -731, -1036, 351, -300, -677, 380, -178, -1488, 106, 326, -791, -613, 190, -1024, -710, 498, -705, -1146, 29, -144, -983, -82, -601, -1671, -382, 580, -1182, -870, 18, -954, -854, 853, -556, -1470, -346, 111, -552, 136, 80, -1341, -253, 1052, -66, -447, 173, -294, -206, 1282, 89, -1150, 393, 952, -133, 384, 612, -1005, 68, 1361, 73, -836, 493, 404, -102, 1376, 319, -1269, 320, 1621, 25, -207, 226, -588, 161, 1884, 127, -972, 235, 618, 512, 981, 643, -831, 311, 1797, 370, -129, 776, 108, 510, 1774, 226, -1161, 381, 1338, 91, 539, 454, -867, 690, 2036, -39, -805, 461, 424, -1, 783, -41, -1711, 447, 1430, -82, -487, -26, -688, 45, 1617, -312, -1516, -18, 389]
4619C89j71J27q74q04J487J141j451o77J110o99K86J128j559j072K032M39r03
4636g1k31m7p28R69J191j879n61J306j51M1M43p66r55J775O37j483j17L86m59
4655g00R63R97j830p69J730K43q61N45o98p29J545P55j611l42R21r4q1J240j675
4674d51o12J852R2j146L56lo25J292Q12j827o07J882m33k04N46r57p78J981K42
4693A412j722L80L90l66L89R17j111q04J594n2q90M83l9p81J174L85j417M43P08
4712A093o99r9P46p27o89J653p08j132J011K86p58M68O85j076JR49n56p46R69
4731F71k66j124J380Q8j073K22Q67j027J41P15r40j98J311r35n87J247O3j545
4749i90Q68K26m84K22Q81j248n0J144m10o10Q53o06m82R39K9r66K61P43p16J86
$$ y = [389, 218, 345, -529, -1333, 154, 1295, -156, -833, 277, -422, -136, 992, -567, -1639, 393, 832, -71, -302, -349, -1077, -108, 1083, -796, -1357, -51, -202, -161, 282, -484, -1439, 336, 973, -510, -627, -241, -700, 263, 1260, -570, -1339, 391, 634, -227, 318, -380, -1109, 436, 1191, -420, -762, 159, 65, -16, 1224, -451, -1063, 789, 881, -265, 91, 88, -537, 755, 1567, -260, -867, 1015, 582, 378, 924, -33, -811, 1170, 1412, -310, 70, 460, 94, 483, 1400, 289, -515, 1079, 1027, 137, 620, 581, -200, 974, 1359, -58, 385, 1093, 394, 295, 1041, 314, -375, 1278, 570, -562, 449, 735, -23, 445, 1130, 54, 55, 1004, 448, -298, 671, 405, -719, 661, 749, -324, -102, 765, -262, -121, 594, -346, -544, 767, -168, -755, 492, 555, -990, -122, 104, -380, -158, 723, -525, -575, 569, 159, -451, 402, -204, -686, 253, 282, -684, -423, 320, -396, -210]
4769b10Q49j346l11J512o6r65M11j04o14J375J85j536K77J047n41j30O13q43m01
4788g98J837j96j344K79N58n50P32K80j295o3J648l90o24N36m74l93J482j54j678
4807f07M00J116m60L57L88j410o1J909n38j206P18k84k70J450n13j798N71J602
4825A364q33j37L47q88P1J524j60j448J66Q20l52P91m2j610N11J361o37n41J42
4844D49l32j7J357n51j650N61J140n68RJ90j324K28J846r64j102O55M03l98J068
4863A000p79j487J022J397q20p05K11l43J32J460o14j484N72O91l11M88k45j420
4881a235P50J740j091j030Q01k03LJ138p30j284Q81Q54o09j13J16r14R07J111
4899A092p67j527Q06N44k54L79l23j138J125J166j337n03O22j92K32J008j010
$$ y = [-210, 639, -707, -1018, 494, 428, -537, -126, -230, -844, 531, 716, -820, -543, 504, -37, -167, 446, -397, -798, 1039, 843, -501, -222, 336, -214, 518, 798, -497, -560, 1088, 698, 74, 610, 136, -257, 1225, 1071, -607, -207, 909, 449, 806, 1194, -216, -277, 1632, 1094, -112, 606, 322, 52, 1502, 989, -809, -238, 1364, 531, 394, 741, -147, -76, 1448, 1288, -160, 6, 826, 474, 1265, 1223, -387, 124, 1485, 848, 307, 449, 117, 100, 1457, 906, -744, -183, 957, 389, 398, 588, -736, -508, 1338, 374, -728, -73, 330, -68, 1000, 221, -1266, -244, 1153, 333, -372, -161, -504, -372, 1088, 474, -1010, -438, 253, -58, 430, 185, -1235, -485, 1255, 164, -866, -65, -268, -265, 873, 143, -1141, -260, 594, -15, -128, -12, -926, -19, 1092, 325, -1202, -396, 148, -106, 273, -50, -1188, -63, 1103, -234, -737, -115, -307, -75, 933, -77]
4916g7q39Q94O09p34L96l0j021J138J289j676r63J503m20j84R75n85j177J119
4934B17O80r26J65P7n98O71N46q47q32J332k9q44Q51j47j172J259P21j164k89
4953c29P53l28J69P35j067q50J273L73r15N97M03j213Q86N34j466K3J074m70l18
4972a36Q61k58r53R81J36j062K75O15r69L53N83q07j39R68l86q14O49K15m60M37
4992H9N04j505l9J399q67m16J021o45k26J148k19j422J012N98n76k04N62j011
5010g97J83J066n57m63L79J24q38Q31m8j092P49P02q51r9L52j88O2Q88r28r75
5030a500J228L24q17M23Q0p26P20R78j388l63J091j62l15R30q08j031J709L11
5048F84r12j65M93o48O58O27j339n41J628j48o71N81m96m82J237L61j194o8N17
$$ y = [-77, -916, -22, 587, -147, 249, 219, -802, 336, 1625, -51, -1014, 489, 69, -115, 860, 275, -902, 217, 897, -29, 136, 213, -385, 286, 832, -15, -847, 485, 456, -388, 463, 316, -856, 403, 1124, -40, -329, 424, 96, 265, 1000, -67, -917, 356, 729, -186, 411, 814, -399, 487, 1021, -445, -422, 652, 182, -136, 725, 467, -486, 495, 631, -431, -156, 459, -510, -157, 426, -381, -520, 448, 62, -752, -103, 112, -348, 89, 593, -912, -951, 448, -419, -835, 186, -459, -685, 463, 244, -1178, -166, 432, -144, -348, 214, -797, -614, 452, -105, -568, -189, -65, -903, -72, -120, -1212, -463, 239, -612, -711, -359, -547, -485, 403, -525, -1500, -272, 52, -765, -342, -262, -988, -268, 710, -678, -1041, 50, -112, -427, 503, -305, -1336, 373, 684, -228, -393, 100, -548, 110, 737, -602, -1143, 485, 337, -334, 247, -249, -731, 506, 867, -327, -395, 122]
5067A22l29N17N24j058n75J278K82r93L52j16n10J180M26j327k52J174j21m61
5085A13P55j062m40J472M24j740J59M84k03N61J17j258N2J344j39p44M62o73j20
5104d36R88J20j157m03J176l04N9K33q34n88J681K78j232l11O19o21P97N85j642
5123i92L7J444k98n74J71n69QJ320N0j589QJ286r17L47N10j486Q7J478l45o03
5143f27m6kj16J049k12j543N14J088k03j42m3q44L81J045J5j195J07N22k59N47
5163C6k03p76L81J298n13p27P74o23L8P90l06j183O77R72p11L37K6r63N74J085
5183I83n58j323J097K32m28P95n39j025P60R50n53r20Q06l81k35J372p95m59P26
5202E05L22q22K81J66p55M26Q47o95l93M10K93k56K47l67r25J036P68q96l16L38
$$ y = [122, -207, 310, 834, -224, -799, 479, 761, -232, 120, 4, -506, 674, 1100, -227, -479, 695, 574, 113, 868, -194, -634, 838, 1262, -478, -319, 165, -38, 523, 640, -618, -566, 778, 639, -105, 357, -316, -436, 552, 672, -485, -888, 288, -16, 43, 276, -558, -1146, 535, 813, -419, -730, -111, -732, 65, 650, -992, -955, 489, 191, -383, -212, -781, -773, 547, 597, -992, -984, 302, -615, -268, 242, -1244, -1157, 321, -24, -627, -673, -675, -791, 258, 46, -1497, -983, 105, -98, -240, -283, -1127, -746, 299, 314, -881, -774, -252, -511, 36, -167, -943, -562, 736, 223, -504, 270, -353, -315, 475, 169, -1014, -337, 635, -76, 261, 287, -676, -102, 983, 425, -898, 199, 431, 3, 798, 259, -766, -6, 944, 391, -529, 277, -104, -339, 1033, 238, -221, 505, 827, 5, 286, 452, -303, 123, 970, 275, -118, 292, 585, 329, 576, 209, -716, 320, 1088, 192, -124, 214]
5222B14l15J19P78r32k98J267l52m52J76k49n17R23N82j508R4P93l9n24P68r50
5242d22m84J411M3r59K86K44m75O54J55j021j00P98J50q81K90N4n93J132j28j082
5262i28K7J217n25P0K58q22n8J163k83j208K73O89k43N42K21j648L74J462m32
5281A49p89N65l20j90J248l06j548R36O30m21L30j13q39K32J087r1j055L93J48
5300D6k92R37l84j298Q64J087r62k54J70r3J02J147q62j090P48Q42o90O61l85
5319B94j154Q64Q15m37p57P31n6n0O88l84j040P65P36p39J58n1r37Q74Q77j050
5339A47q22J076L95m51J46l53q85J099R03j070m13N63m77O53Q26j597o53J296
5357C83J21m26m7Q8o93R91N57r88q18Q99j85J75P5m22n65J157M67j063n0L93l72
$$ y = [214, -101, 18, 796, -136, -434, 833, 481, 29, 205, -44, -561, 362, 944, -564, -470, 323, 284, -240, 528, -422, -906, 505, 548, -411, -125, 119, -356, 298, 453, -568, -668, 130, 280, -601, -311, -257, -850, 282, 154, -928, -901, 316, -209, -139, 119, -703, -761, 402, 119, -1089, -816, -127, -370, 172, 393, -1255, -881, 581, 149, -640, -75, -395, -585, 663, 357, -1191, -255, 375, -46, 284, 171, -668, -436, 651, 560, -495, -102, 46, -246, 691, 307, -991, -127, 960, -2, -256, -86, -179, -77, 1070, 208, -882, -134, 708, 18, 679, 294, -860, 4, 819, 382, -375, 356, 300, 250, 938, 554, -486, 279, 1015, 276, 434, 383, -554, 320, 1197, 147, -675, 401, 796, 345, 491, 138, -747, 352, 1255, 185, -228, 335, -142, 511, 1337, -260, -913, 383, 504, 78, 31, 119, -574, 417, 974, -14, -832, 67, -118, 57, 132, -290, -855, 302, 769, -294, -344, 49, -323]
5378c23M41O13j138o43J135K05p62K82k06l79Q38M36j316m4J072l06r4K15p94
5397g68k30J177J93q84J43N02q21J094L52j337k04J133j75m54K09k17k99J214
5415F28o8j400K27P46m3L10m8j023L23R64k19p03J78M09l26N94j33r85L16J058
5435H05n34k50N99r42K13J167m15j345Q67K33m93O85O6j137N27J102p12l98P7
5454A15J7k02J059o43j022O03J283o82l08j3j47J05J115o03j194N35N74q34P61
5473E19j74j046Q76N10q32k28O14j55Q0O38p27j101J214L93p16L24J5q43Q09N20
5493F90j309L4N14K12k66K62j46r89J043O94j239o1M60k25J86Q65j127p42J403
5512B59m7o28L55n62k56R61N86j282m20J347o17p8N96q36m80J167M95j179j52
$$ y = [-323, 118, 731, -407, -1050, 85, 290, -472, -190, -396, -775, 63, 499, -817, -861, 211, -95, -189, 26, -768, -998, 179, 372, -512, -369, 133, -688, 406, 758, -579, -783, 350, 175, -279, -70, -287, -586, 628, 560, -840, -613, 133, 90, 400, 352, -671, -348, 616, 397, -306, -128, 281, -45, 549, 416, -569, -253, 805, 271, 21, 620, -322, -109, 1058, 643, -702, 165, 398, -95, 590, 656, -481, 46, 1148, 436, 38, 115, 132, -70, 989, 346, -676, -73, 1210, 528, 220, 207, 60, 165, 1280, 677, -517, 18, 592, -242, 519, 345, -701, 175, 685, -147, -375, 239, 84, 164, 802, 75, -1026, 188, 581, -135, 189, 204, -639, 170, 690, -619, -585, -71, 141, -125, 137, -9, -998, 45, 739, -500, -561, -101, -326, -140, 725, -402, -1144, 259, 212, -416, -61, -623, -879, 82, 668, -614, -1034, 313, -304, -382, 214, -622, -1102, 65, 560, -619, -771]
5531g71N90m10P76J86j366J75J088j24o12L25j58l06J085J9j198L23N59p7J35
5550B39n6q46J07J239J35q43j9J01k70O45M0j315K79J379o72j60L21p69K7J209
5570G71k29j392Q95L88k81L55K00j199j63J739o48n21Q9j83K37R62k81j606P62
5589a05J078m80k38q3l64J00J304n15j180L18P85o13N29k29j033O31J087q21q05
5608f34L45kj15P32j09j533J072N10n46J0J05o73O67P61o26o37P42K71n73O04
5628C71n68r14R91P12p81m78K88k14L55P04q07p43J082O18r34K66j46o48P41P85
5648F80j263m95P68K29j36L13n16o73J228J56q82nK72k65N99Q08j203n49J203
5667B69M9n36O6k19j78R08N37j073o69R61jJK79r68MJ264l16q27L0L32l32P59
$$ y = [-771, -181, -591, 185, 371, -995, -820, 268, 144, -468, -143, -301, -607, 478, 497, -701, -378, 181, 104, 239, 183, -663, -556, 683, 818, -25, -44, 57, -213, 432, 472, -843, -564, 815, 143, -17, 304, -465, -438, 771, 542, -850, 45, 433, 152, 507, 707, -492, -655, 1084, 436, -85, 4, -179, 58, 1020, 739, -867, -105, 973, 493, 255, 172, -192, -92, 1212, 697, -483, -165, 620, 7, 536, 307, -726, -95, 992, 171, -634, -289, -291, -406, 326, 217, -1316, -244, 266, -280, -270, -165, -838, -171, 590, -36, -673, 69, 340, -233, 371, -197, -1111, -120, 592, -189, -667, -379, -593, -238, 466, -341, -1084, -2, 616, -318, -52, -198, -846, -105, 680, -583, -1078, -310, -81, -217, 96, -420, -1093, 135, 291, -591, -596, -324, -589, 10, 818, -385, -934, 269, 318, -218, -152, -371, -549, 359, 896, -177, -846, 115, 114, 115, 394, -574, -570, 694, 378, -449, -419, -87, -419, 340]
5689C40K00j421K09J275n78j58L83m66l61J326M16j539m5O93j09M00nj344N04
5708b80J183m93n28L58N3m17P28j59j237M08R28l20k26M18o49K17P05l3j528N03
5728c69M73j31J44L5r37L96J274o04n11k35J84r2P56j8j427O60P42m09n9r1p08
5749i27M95J284o82r89O30L48k35L18m5j483R31O33k17n07K72j34k1O29m70j184
5769a354J014M41l39J62l76k80L81R05p68o93L86L60j02P66j024o63Q57R34o26
5788a9k47J42l27N17O21j138l23O95K28J0k86O4o81Q80Q16j466M2O91k31N3L90
5809D31n54q40J342M13r20QO9k74P18J91j047k5J017k87j22J34k43l73Q29J39
5829F06n34j11M70l34K38N03j087k41J188K2p45K26K76p34J018P2j343Q2Q14N0
$$ y = [340, 540, -881, -672, 603, 25, -133, 250, -216, -577, 749, 1165, -374, -419, 274, 165, 565, 560, -784, -280, 903, 410, -118, 240, 293, -124, 604, 445, -792, -384, 544, 224, -2, 416, -233, -16, 689, 656, -872, -369, 104, -27, 117, 152, -785, -389, 885, 281, -230, -465, -281, -373, 383, 365, -1062, -402, 340, -69, -128, -219, -927, -432, 852, 170, -819, -189, 159, -76, 242, 197, -1286, -355, 278, 61, -446, -174, -308, -329, 300, -170, -1354, -340, 101, -238, -76, -452, -732, -351, 554, -214, -907, -521, -161, -263, 503, -521, -1184, -327, 607, -19, -266, -124, -451, 66, 687, -451, -774, -79, 149, 159, -127, -63, -744, 136, 952, -514, -472, 219, -12, 41, 431, -123, -963, 379, 792, -128, -120, -51, -325, 393, 584, -463, -488, 529, 242, 120, 254, 11, -362, 467, 606, 72, -39, 431, 97, 335, 838, -249, -490, 698, 720, -25, 201, 477, -257, 761, 833, -510, -428, 386, 436]
5849D36j22J63j030J19J127J98j581N55L38m88O34J9j093M35J330o99o79J11q8
5868c15J10O19j51q57K00O65k92j23J05m02L6J025m39j047L26P06k50M27m19p22
5888g98K91J032l30r99O31p3j47N81k61p90N72O38o96Q9j61m7J46R83q30m54N99
5909b4J46k47M48l51q63O63P89q79j95O48l63K85O77p37q94J068K66l53M9m78
5929c45j10O60R45j273k42M76K12K8K12m62p79R24O54p98p3J02l98P58K67r46
5949a88l72Q69N32o26J98m03j38O97O02r82p09J087j25k3L78q16o14J276j2p29
5969i8L52l65R3N58M90j334pR70j89m58J37l90k36J103q8q90RO02k38M96J93j290
5991e80p9J368K0j025K02j21p2Q40j9j172J3Q55j10k16L47r97O12M02r1p63J66
$$ y = [436, 314, 477, -553, -434, 693, 891, -690, -135, 203, -285, 349, 368, -725, -290, 1040, 341, -338, -227, -315, -205, 414, 263, -594, -394, 271, -21, -144, -39, -441, -405, 620, 181, -866, -540, 166, -84, 343, -76, -798, -507, 525, 195, -804, -173, -246, -393, 188, -73, -863, -291, 347, -349, -260, -421, -468, -322, 661, -169, -623, -24, 122, -125, 323, -28, -891, -228, 561, -318, -513, 135, -228, 57, 734, -3, -897, 171, 437, 84, 133, -345, -455, 205, 1150, -123, -365, 111, 323, 351, 563, 101, -678, 246, 900, 102, 29, 131, -267, 491, 758, -188, -560, 309, 841, 215, 413, 10, -128, 569, 1171, 189, -520, 567, 442, 419, 797, -19, -633, 643, 631, -98, 254, -111, -18, 540, 1030, -304, -311, 659, 470, 12, 149, -241, -477, 626, 538, -352, -343, 259, 21, 517, 710, -580, -659, 709, 729, -296, -94, -215, -287, 553, 534, -638, -625, 230, 120, -96, 251, -746, -134, 268, 177, -586, -420]
6012d20K07K9M76k7j011J76P93k03p5j07m49M44P56l24r85L13O06l39j22K71p40
6033g31J15J509q60p17O70K2k09O78k27j174Q77Q30p42o5L71n40K61N41l57r45
6053f93O25M89k04Q3K7j076P21O91k17r53M24N7J22O46n32p03N50O18k72l23K29
6074C09p57Q38M33q13o32Q81L04m39L74l85n00N18P44j115J16L78j86J64N43p77
6094bm76Q82K52n49p9K69k42K48M52j031k42J026m12k11L37l95l77R78J56p91
6114b07j41N00m93L69L48q83n1J102o5q64L03k3m91R29K12j188L15L64k34N1L65
6135B18o60J38Q07j31j184N80K37n0K16k42o08M43O97l12p08K44K40l24O17j89
6155B9o89J31R46l10j76J94q10L80O47j27r15L04O99l06M26m75o58O57P44l65
$$ y = [-420, -213, -184, 292, 265, -746, -570, 223, 20, -55, -162, -611, -167, 589, 265, -720, -407, 199, -140, -262, 9, -731, -616, 893, 33, -684, -14, 8, -201, 477, 250, -924, -47, 783, 41, -24, 347, -193, 68, 609, 252, -693, -68, 421, 217, 300, 327, -749, -28, 663, 446, -507, -83, -26, 96, 742, 210, -493, 57, 675, 403, 80, 309, -448, 390, 823, 10, -622, 259, 563, 124, 498, 113, -387, 131, 875, -240, -124, 254, 68, 232, 775, -2, -478, 404, 656, 107, 28, 297, 55, 303, 755, -276, -518, 508, 96, -115, 222, -173, -550, 428, 584, -207, -348, 152, -341, 28, 376, -507, -558, 544, 479, -385, -82, -105, -596, 333, 545, -643, -328, 36, -198, -147, 218, -442, -304, 503, 372, -812, -232, 5, -45, 171, -71, -679, -236, 461, 149, -559, -315, -75, -399, 218, 29, -660, -529, 417, 107, -69, 125, -685, -305, 342, 215, -700, -396, 303, -3, 423, -52, -710, -53, 691, 326]
6175C26n78L60m58K56P78n82q26M80O91k79jm83j89N48Q21n96p78N12r8L19K62
6196D85k79j012R27O30p19l41M85n35O23O78p44q49R01L25j64k68K54p09N08P27
6216I23p12o37O74l7nN64q27n05O45R22j110K26k01m86Q94N46j228m86Q21K33
6236B14J02Qp19k62O87M85p92l01L03K05j6M94q64k13R94K71l79j98l77k93J026
6257C75r9o96k14O16lk16J72q0m31O10N94r14n6P3j61M05K91r61L01M40j30k85
6279c69K06o4m21O22K84q80J02M86M0J87j74o27K1J190k68p44M79o3j85L56K8
6300B06q18K64R53l64R0l82k02k1Q62Rj339M00P10j51J12J99p47j59R97l9j147
6321e67O98j01J01K08qo46%R18j65l46J52m16J05P97m49q27P51K41l50L93j45
$$ y = [326, -252, 108, -350, -94, 684, 102, -724, -244, 447, 168, 167, -316, -505, 43, 864, 268, -510, 2, -96, 223, 485, 206, -806, 121, 751, 32, -309, 176, -359, 264, 942, 198, -651, 250, 575, 411, 143, 397, -312, 196, 923, 211, -426, 248, 211, 206, 770, -57, -562, 83, 1005, -105, 121, -80, -566, 328, 874, -354, -840, -19, 214, 316, 324, -395, -657, 30, 515, -277, -578, -275, -70, -86, 408, -456, -669, 325, 596, 217, 19, -358, -651, 375, 276, -420, -634, -18, -21, -237, -65, -145, -576, 34, 628, -286, -342, -269, -430, -25, 266, -695, -394, 46, -84, -369, -163, -227, -648, -26, 258, -622, -520, -34, 6, 193, 19, -608, -587, 603, 335, -409, 70, 7, -178, 178, 206, -612, -348, 605, 241, 331, -51, -253, -274, 588, 597, -742, -342, 368, 217, 329, 528, -219, -378, 619, 580, -567, 131, 30, 131, 339, 331, -315, -315, 603, 438, 92, 244, -172, -67, 730, 281, -546, 205, 446, 96, 489, 344]
6342C44n01J31P79o15m65M71J53j73O88o90p23Q77R8o86K39K19l90M25K48l90
6362C9o02O61L35o52K51j09o46P36M99j037k08O51m3p8L05l20n65R89q8n08n2
6383d42L07j59L23K57o05l14N83L39m23K76n49l58R33j4n57Q1L69k30M44K0r87
6404g06j76J269l33n06J3M56l18Q21J01j254K4O25P0j70j1l38NQ28P3q57k41P35
6426A10k08N96l08m96p8P53R1n43l22K59P5P58k36q68j58Q81l96L80j82n00M07
6447A5O17k40q03M20N8k1L10Pp02M00O06l15m57K03m02L26N01m4j004L63P11j07
6469D42k11j11o40L51J089o91o50K51R8K23M89k06r42M71M67j08o23K69r2R8Q94
6490H68p77m74K32N48k96J16m75o25P35P59n03m58O4M6M09K68m85q56P02O56o53
$$ y = [344, -157, -26, 753, 138, -327, 144, 297, 124, 812, 122, -601, 276, 374, -312, -73, 146, -244, 181, 429, 39, -563, 98, 433, -219, 32, -77, -723, 13, 512, -525, -733, -82, -125, -203, 102, -218, -783, 206, 118, -390, -442, -135, -294, 29, 286, -319, -633, -50, 289, -134, 142, -407, -765, 168, 154, -403, -322, 47, -183, 261, 281, -706, -882, 387, 54, -452, -439, 17, -301, 520, 621, -633, -609, 16, 86, -84, -95, -433, -428, 400, 473, -384, -625, 110, -98, 498, 190, -306, -384, 369, 460, -83, -405, -146, -71, 687, 451, -417, -575, 306, -90, 290, 108, -392, 15, 632, 392, -411, 9, 67, 46, 356, 363, -339, 61, 667, 352, -105, 98, -304, 22, 523, 479, -525, -162, 549, 442, 231, 120, -520, -169, 920, 229, -421, -170, -72, 151, 640, 434, -508, -37, 430, 322, -301, -32, -124, -26, 868, 91, -383, -151, 397, 101, 217, -258, -883, -148, 611, 108, -350, -286, -240, 169, 437, -48, -904, -202, 454, -199]
6511a99J69k4k72J27O68o57m52M00K34j37L22m65l66P66k6l46%j09qN15J20o18
6533c58l13P21Q0k80k73M53m84K87O63p43j91M72j17J75M16p66j45O75J01m45
6553g2k25L45q4L25K36p16k77O69Jj16l21O2J92L05K67o15l41P68k63J8j08p2
6575b2l74J191l11q16K83L46l05M62J77n85R3M26k08m26L67k83j15O88l99j53
6595C6l08O51l99k73L53r5q0O68l21m95K61n5O0K13P4p20L25L48j7k45l7j23J48
6618c1M47l19n63N28J74l32R9l1k69J42O51p99k78N12N0J62K93n38n55M78Q67
6639F88q83j90L11l43N06J59m66r4K58K56k28J66m18k32L58O43q75k81M28m2K83
6660DL74o25l66N53L65l82N7j88j2J36O50r85j67M14L87o2k17l43p1Q96j6n49
$$ y = [-199, -30, -54, -326, -199, 469, -188, -640, -240, -6, -143, 179, -286, -652, 114, 88, -258, -258, -367, -375, 140, 260, -358, -671, 50, 130, -150, -423, 30, -454, -167, 496, -247, -438, 34, -83, 92, 508, -258, -403, 272, 373, -72, -297, 48, -36, 289, 525, -191, -468, 201, 202, 86, -235, -173, 19, 324, 591, -24, -365, 403, 140, 158, 50, -22, -396, 795, 484, -332, -49, 297, -8, 454, 631, 46, 139, 565, 357, -69, 298, 15, -100, 588, 189, 36, -272, 379, -20, -293, 60, -35, -115, 553, 232, -263, -2, -57, 3, 216, 290, -430, -105, 243, 226, -19, -56, -179, -31, 416, 97, -466, 62, 236, -96, 3, -28, -297, -155, 496, -303, -581, -69, -19, 143, 436, -102, -657, -179, 688, -195, -385, -74, -417, 89, 248, -218, -312, -54, 202, -26, 140, -278, -510, -152, 491, -384, -665, -237, -279, 4, 378, -247, -613, -60, 305, -77, -20, -208, -220, -84, 566, -419, -586, -172, 215, 153, -64, -407, -478, 418, 402, -147]
6682a47k19M43K66k09M69j041J5P39N2n36J27pj21K45N05p80l06J060m37L26k95
6703A49j86k31J059k7o95j73K14J07L62j87o27m0R88k88k98j71m2j61J007j73
6723E87j124L74M00M7J27J12r19J47Q12j62k09m49p1O01j8Nn59j90Q60j50j38
6744H3J4l26p1P48k90o32K43Q2K56J48q1n30R9O26Q1n27J7k6j79M45J46j033L68
6767c39O13l82J55j38m78L67O21m59o14P54k23O8K41m01n6J5N91p35q5N15k26
6788a96J00K22j89l58K99K81j89M1k35j50L95M14m11m09M27k19J46L90k93j40
6808g4L27J72o54K15L38k19J8j0l20J04J81M30m56L6K80m41L11L36p29PK24J40
6830B16J75M1m58k03O11l0k86j67L90k44oL33n86J22O50q6l73L40k06m30M75Q4
$$ y = [-147, -366, 77, 343, 134, 603, -438, -423, 316, 368, -168, -41, -48, -169, 76, 581, -199, -505, 555, 118, 444, 149, -37, -268, 791, 764, 69, -104, 110, 217, 579, 392, -235, -275, 713, 425, 127, -44, -86, -247, 760, 587, -537, -163, 237, 284, 411, 523, -396, -249, 563, 401, 192, -257, -328, 273, 255, 260, -299, -489, 371, 221, 83, 97, -229, -300, 448, 158, -474, -231, -149, 107, 255, 174, -356, -257, 369, 450, -77, -60, -86, -265, 180, 326, -707, -339, 274, -108, 47, -91, -569, -202, 419, -40, -654, 100, -123, -55, 186, -215, -271, -256, 335, -400, -485, 30, -196, -96, 126, -63, -421, -122, 159, -30, 11, -224, -374, 21, 435, 24, -385, 42, -177, -31, 359, 66, -74, 253, 425, -229, -14, 324, 105, 123, 113, -207, -103, 78, 508, 52, 88, 368, -73, 238, 574, -155, -148, 76, 216, 391, 432, -26, -229, 382, 352, 66, -101, 289, 45, 39, 372, -214, -92, 558, 472, 99, 439, 233, -197, 278, 362]
6852C62n71q2O45j10l33k6j37n6J022m73n61R3K94k86M33J08p28P3N25l16l77
6873e01M45l0k86O13k07m17j7Q73m21k72J74l18J03N24l67k58J96NJ54j26m28
6894e61k45P43L15j12l97J60k08%P65l95o78M04M39k52J08j83j31J9M86k39m78
6915d40K27J41N7N5m0n10L45O13n05Q4q4n19Q83K80n45n07N76J67o2J06o38q5
6937d01M53L66j89l25j68K17M55J42o14l75L54M74j87n19L71j71L01O23r63j93
6957c49L74M3J98J14m24m77P42O01o22m09J14M4L41k3m56o5J66N96m25rj87RK82
6980A78K55o38j29O14j5L4j6j28q03P40M18p73N7nK9M04J66o61l94R07j98P3K35
7003C50n74o17J280j46p02j71O27k00J41J50n97j96R78j17o32M00j56k64N92j34
$$ y = [362, -209, -291, 354, 244, -89, -115, -252, -308, 714, 241, -320, -227, 67, -219, 214, 322, -406, -333, 192, -124, -501, -56, -86, -372, 241, 34, -383, -400, 473, 52, -220, -46, -364, -261, 263, -104, -362, -166, -161, -7, -133, -561, -806, -63, 252, 140, -257, -97, -305, -305, 460, 65, -613, -209, 230, -22, 86, -97, -228, -209, 277, 38, -440, -213, -72, -15, 40, 0, -510, -165, 448, -57, 27, -57, -576, 307, 587, 42, -465, 111, 278, 216, 322, -316, -401, 52, 418, 229, -96, -264, -47, 408, 550, -64, -439, -85, 389, 202, -317, 54, -117, 184, 807, -156, -349, 25, 68, 266, 380, -44, -521, 221, 822, 200, -209, -95, -51, 290, 267, -189, -254, -88, 508, 83, 74, -113, -104, 178, 433, -205, -334, 280, 265, 299, 283, 155, -648, 92, 510, -263, -206, -211, -182, 222, 388, -273, -667, 240, 42, 115, 350, -224, -841, 439, 293, -409, -580, 47, -153, -12, 138, -459, -655, 323, 206, -426, -26, -182, -446, 146, 12]
7023A2o67L84R27p38j67M33l65l10O56K39p12L19p4K17o4P6m68k79P40m0l19L44
7045A44k33n1M39qo02q7O99l30O4L36p01Q8N45l52OP8J84k72J55J98o30L84M55
7068E09n88k04N45j90k5L40k45k82Q8N87q20O48m26n5M05J41l92j09K58M9l28
7089i4N15j30m22M18J70l69J19o8J85r2J83l73l92R66n53l06J17L18n35M60J25
7110B42m18q2M17o4j47M86p38J43Q6L72n37J63o4j70K34J64l57k45Q82n59k61
7131d53L69J57j13oN40o94l20K14O08j86Mn18j19P22lp47L85R6k21L09j24k67
7153c67j23P03l1m14R8m58K08N75l96o4k01N83j25K21k62l32L31M23k51n03L11
7174g4J38p0L05j74m56J30Q28n54K05k2q31N65O06n26m87J50M69k63L96K41j022
$$ y = [12, -655, -271, 656, -82, -249, 184, -181, -491, 165, 404, -308, 11, -63, 154, 90, 166, -302, -581, 159, 119, -200, 144, -89, -140, 299, 291, -311, -398, 301, -29, 35, 371, -330, -242, 303, -49, -43, 35, 219, -53, 102, 300, -330, 54, 509, -79, -283, 262, 72, 47, 387, 142, -140, -52, 535, -285, 363, -63, -118, 287, 428, 36, -73, 185, 234, -94, 421, 291, -131, 287, 457, 88, 207, 139, 324, 232, 415, 42, -350, 616, 63, -243, -126, 192, -343, 117, 242, -176, -258, 159, 95, -52, 434, -304, -161, -75, 297, -240, -77, -141, -311, -77, 87, -270, -515, 367, -192, -453, -84, 73, -40, -46, 494, -200, -520, -306, 302, 116, 120, -398, -517, 205, 202, -545, -160, -64, -285, 24, -100, -367, -490, 213, 182, -232, -134, -592, -384, 191, -205, -269, -470, 113, -12, 209, -53, -385, -54, 369, 118, -385, -74, 64, -6, 299, 125, -331, -201, 627, 73, 278, 256, -575, -10, 596, 70, -417, -267, 202, -61, 335, 576, -446]
7195d46L21R10o66j26k11M6K34N68m55o24M83M09l37M0k24R1P2O34l49o93L51
7216B8OJ87J37J02n95K65N23m29l94O8j47J84M24k77l10J32L14j69O8j36m44N17
7238E4K81l10k41R0K22n0M45m18m49M99K4j02n5k25j63L12N90p43j38J94J96O4
7260G7J66n75m40O52K97l17l10M19j44O0J85j95k81P32l5n06j27J04k14N80l2
7281I6n41J85K48j26N0K35k53l58L81K35n21Q7L60k63L67K34o83r4O32J22o99
7302c06M33q1k79N32p4n97J90M57j96O4j10L7j90K58P3k37QL89n82K86M41j008
7324d92L38L19J93l39J06k39J35K32R0o25L62K36l49r8N45j58m87P75l64l09K14
7345H5K5j05K07j49m33L33L15m23l07M69K42j94N94n78j26J64Q9l26l9K07l35
$$ y = [-446, -125, 785, 119, -7, -218, -172, 62, 630, 175, -449, 34, 443, 106, 146, -78, 13, 85, 719, 370, -323, 28, 34, 221, 358, 460, -135, 130, 653, 224, -170, -102, -249, -65, 359, 82, -228, -96, 218, 49, 117, -19, -463, 54, 335, 25, -216, -126, 96, 46, 491, 73, -376, 123, 147, 45, -10, -235, -398, -86, 504, -239, -377, -183, 13, 77, 243, -332, -772, -120, 177, -140, -450, -31, -175, -115, 70, -125, -406, 326, 291, -215, -342, -238, -452, 128, 96, -445, -260, -12, -138, -88, 147, -106, -464, -83, 152, -369, -282, 78, -185, 182, 416, -267, -361, 271, 393, -306, 127, 46, -233, 299, 225, -372, -182, 275, 79, 143, 33, 70, -120, 138, 211, -26, -18, 371, -211, 75, 516, -492, -154, 165, 358, 19, 125, -114, 21, 253, 343, -282, 80, 316, -33, -131, 414, 256, -231, 544, 180, -129, 85, 110, 5, 212, 63, -370, -37, 278, -145, -452, 17, 259, 65, 659, 81, -45, 119, 208, -118, -157, 50, -285]
7366b85L43K93m84K8P8L9p4M14n73j43M63l2r1p8J24j35N2M65o27q7L57K62n83
7389b74R0l3p2M37J98o67j21N53j69k42N64o14j45P36k79l28P1L25j99N34J0n90
7411b15l32O08P2L9k43k64L3L22O5m49Q0L60L5J6j32l72J27M94J58m96o3K67k24
7434a14J67L99p39k4P40k27j76rj51K0M58j70l12J52J49j48J54Q4m74OO93k3m59
7457dQ3l05J42O31l48o13M95K71l89K42j57k52M6N35l38k61J75n7K70M5J02p02
7479c89K42P67l92p9k62K9o5M70l95k02N5L44o8J39k39k89L31K75j55j19j92K05
7501A1j54L79k45k28N7K24K13m96L6l86M39M18j86l07n4K77r1K68j60m52L36L00
7523A99m63J73N4k94K5M07j19m06J62L82j56n1P1l21R0M45m84k12O59k43k99M05
$$ y = [-285, 58, 351, -133, -105, -27, 12, -62, 352, -221, -364, 99, 67, -24, -102, 22, -113, -61, 404, -223, -310, 47, 309, -274, -184, -217, -289, 148, 346, -321, -442, 111, -58, -300, 264, -350, -495, 241, -38, -366, -295, 30, -169, 365, 375, -215, -547, 61, 133, 172, -71, -335, -302, 20, 85, -364, -284, 76, 111, 127, -5, -377, -250, 244, 402, -94, -157, 110, -114, 53, 452, -287, -311, 429, 202, 26, 17, -134, -114, 344, 174, -138, 14, 163, 15, 169, 253, -221, -215, 478, 455, -4, 79, -226, -84, 547, 199, -414, 81, 352, -37, 205, 48, -204, -158, 377, 39, -222, -47, -104, 166, 211, 313, -389, -147, 620, 228, 149, -113, -84, -149, 321, -74, -276, -221, 123, 55, 194, -45, -334, -3, 272, 117, -2, -194, 11, -143, 236, -9, -237, -180, 44, 257, -239, -203, -589, -150, 268, 82, -225, -279, -2, -93, 175, 15, -437, -101, 199, -264, -91, -37, -331, -306, 101, -18, -424, -262, 120, -36, -87, -16, -337, -247, 198, -286, -498, 161, -82, -381, 24]
7545B4Q7k95PL46k47l5K16r5K7K64m10j77O28l66k29J7M04k09j3M19n70J9M48
7568B60j67p9J40N4k23J5J1j10J40L05k72Q1L77o54M7L57p2m27K80q1l28N76o7
7591A63k79J13N61p07O1K85k92j76K66J80m76L48K67l77J1J98j68K48o6J05l28
7612f3R8J5k69L64k99k19M53J43l96K2O8j36j20M06m6l42K07K44k5j13L2j79r0
7635b45J94J79j98n1j04m1O46l01k88K34K61k75k18j66j1N77J83l19j91Q1M4k30
7657b39M3k09Q2M71k9k24l5J39k18kL98l5m97L39Kk06L03r0k08K39K63m04k48
7680c65L40J42k60L31m39N2K63J84k51J23n2j07K76J76j32o56N49L6k3l8k74j56
7702b81P00Q5n20j7J56k06L96J48j93l79K85J40l24j16K51j79P7N06n64k26K28
$$ y = [24, 111, -184, -177, 169, -78, -113, 103, 8, 35, 299, -111, -288, 340, -26, -255, -238, 166, -43, -56, 363, -207, -188, 260, 93, 14, 154, 208, -15, 0, 11, -99, 41, 346, 74, 155, 532, -122, -75, 282, 210, -217, 63, -18, -346, 230, 163, -116, -3, 558, -149, -88, 197, -95, -271, -5, 175, -301, 47, 314, -63, -52, 146, -22, 226, 160, 265, -63, 35, 50, -219, 145, -154, -373, 80, 223, -173, -151, -83, -219, -339, 67, 21, -321, -114, 130, 105, -8, 24, -155, -245, -51, 128, -70, -121, -225, -266, 380, 79, -209, 25, 286, 11, -207, -373, -384, 193, 376, 57, -134, -53, -9, -239, -196, -405, -323, 148, 119, -105, -140, -1, -219, -221, 177, 142, -355, -16, -14, -220, 83, -7, -215, 24, 287, -117, -365, -25, 117, -143, 188, -251, -199, 64, 248, -3, 120, 68, -39, 237, 413, 281, -375, 174, 210, 187, 149, -125, -281, 419, 504, -16, -33, 123, -83, 313, 461, 268, -111, 174, 314, -10, -126, 125, -54, 23, 529, -35, -261, -33]
7723c3J94l00M55l49l10N30j53k97J15o0J30j67N20m11J61J69j81j21K35q1j44
7744i8L78j01k93K62l4k59J44K1J10m04P87l00l98J09J25j54RM40l92o3K22j44
7766c3k54K46Qj86K86L3n75L64K14q9j53j5j60N3M92o6l64J38K4j99M05ro90K25
7790c05O32l90l34O34l82Q5M86k31n09K44K34l60K3J49j63J56N15m52j47M46n6
7811B75m75L83j94l66M54k2j79L2J02L6m7K67m98j60K59K93m2l6j64M6J97j95
7833c4n1pK00j13J81P1n8o92O21m0k61L7N56j10m7K22n66j45J86J17J92k8k67
7856c6M7K93J90n44K0J34On18L86l24p2N60k21K11l2j99R7L6K69l47k24L14k59
7879b13J09j0J58l83L92l41j65K82K54K5mO1l30N2K95j62k36R2J9j09L84m7m27
$$ y = [-33, 161, -139, 316, -33, -343, 187, 34, -263, -148, -208, -78, -245, 275, -136, 25, 194, 13, -108, 127, 46, -98, 280, 179, -114, 148, 114, -145, -1, 20, 130, -274, 513, 213, -185, -76, 49, -105, -96, 344, -48, -111, 111, -33, -287, -41, -33, -219, 67, 100, -475, -111, 103, 14, -139, -154, -314, -261, 231, 165, -199, -61, -37, -236, 169, 160, -530, -305, 327, -63, -397, 237, -145, -60, 426, 195, -314, -70, 164, -196, -173, -24, -187, -31, 484, 32, -115, 331, 275, -200, 183, -11, -377, 77, 55, -124, -92, 10, 46, -1, 266, -232, -392, -133, 160, 118, 82, -82, -36, 161, -34, -85, -92, 108, -5, 176, 247, 189, -503, 118, 78, -183, -146, 410, 300, 253, 475, -91, -236, -50, 67, 259, 231, -36, 11, 304, 494, -50, -30, 104, 110, -408, -22, -346, -418, 142, -79, 132, 100, -99, -2, 34, 303, -44, -268, 46, -213, -104, -114, 44, -339, 53, -288, -453, -171, 83, 108, 104, 165, -165, -113, 182, 20, -216, -124, -105, -214, 170, 123, -304]
7902c04L29Nk27O8j8k07L09N75o05l37K02P6J78l8q7k40J66M04n37Q8L68l4m40
7925c06M89j30m68L79L01j43p7J42m66K91N04n19q1K41o7j19L07J7l65K02L92
7946E24m68l51K95j9j2N30m21l93L39Q5k87L20n1m26K41N02o25p4M68k8o4K16
7968C01j97m56L37M60m70Q3n8Q9J10K21k78k26P2P7R3k65P1j3K06k4k8Ko9j44
7992a06L61lk25k84L83R1l56K88k61m81M38L70k66k48N54k35p2J89l55K2L51p9
8014G6k44J09L9l91L63q1J8p7J73M2Q7J9k34j89K66M0p0k75K21j40j19N09l71
8037b29j17K83O0m4R5j52j20L88J28p18J24M42k16MK3j32K27J85q8m67L87Q5L0
8060A78l54L60k00j69M03j60j81J97R8m04M46m4l6j0K22k25j39M0K14m97K54J15
$$ y = [-304, 25, 30, -197, -129, -147, -354, -45, 530, -75, -412, -210, -134, 44, 6, -81, -321, -155, 249, -288, -200, 168, 134, -306, 183, 53, -415, -36, 265, 122, 45, 187, -279, 12, 516, -3, -84, 157, 90, -29, 278, 295, -70, 132, 524, 56, -295, 0, -19, -31, 499, 78, -315, 24, 109, -178, 142, 91, -335, -94, 408, -217, -291, 177, 149, 85, 301, 104, -352, -15, 445, -25, 58, 0, 89, 199, 420, 142, -84, -12, 65, 158, -107, -36, -49, 157, 133, 105, 107, 38, -106, 255, 252, 27, -257, 126, 217, -139, 149, -112, -593, -155, 215, -51, -299, 255, 20, -52, 137, -218, -196, 155, 76, -168, -59, -20, -411, -48, -129, -111, -188, -15, 27, 114, 133, -101, -290, -24, 16, -54, -329, -108, -248, -367, 142, -229, -346, -63, -3, -47, 48, -104, -224, 164, 292, -426, -302, 140, -76, -72, -49, -181, 46, 231, 143, -324, 63, 148, 178, -176, 184, -16, -185, 218, 58, -123, 74, 172, -232, 214, 170, 134, 124, 346, 121, -18, 22, 236, -261, -7, 108]
8082A08m09L86N7j95J81rm62L61o0j33J90K62k39k1J24R2l35O6K41k22lJ21j81
8105h0O9J90l86J63J89n9j53r5K61j57K32J74o42K44K65l25J66J96k02n04K31
8126b23K91k54j29L69l38K37K97o12r0J31L78k03P3j66L78j07K64l06l35N39l08
8147a14RR3k06J48J23L8m12J9M50k86L75k40k25n0J80p5K26j51K3j73M81j36j90
8170i3k51M18k3q3L66l68k69N34k00j13P7On0M58j98o59O93k37Q2J48j05
$$ y = [108, -301, 85, 142, -53, 128, 119, -343, 18, -42, -175, 15, 277, 38, 17, 141, 233, -102, -36, 205, -17, -20, 101, -80, -11, 179, -207, -44, 145, 86, -67, -162, 99, -58, 174, 348, -294, -50, 215, -110, 56, 252, 50, -454, -223, 68, -186, -315, 54, -284, -47, 250, -362, -452, -321, 57, -146, -73, -239, 139, 32, 296, -10, -345, 194, -114, -105, -12, -218, -70, 53, 91, -321, -302, 148, -138, 237, -3, -228, -278, -98, -173, 53, -98, -75, -248, 233, 97, -93, -344, 74, 51, -32, 334, -34, -303, 231, 31, -82, -5, 1, -49, 409, 211, -448, 245, 8, 90, 238, 133]
8191A33
$$ Imaginary data points
##PAGE= N=2
##DATA TABLE= (X++(I..I)), XYDATA
0@%%%%%%%%lJ1j6J6j8K6l2M0m8N6o6P6r2J06j22J41j63J86k12K44k76L11l51L91
32B05m40M95n48O09o80P54q36R29j027J136j259J395j545J714j905K120k369K662
50A410l005L417l927M571n413O568q259J0985j6094K8881j14369k60630J84066
63a71799K45778O6708j38766j65151m591K04619R7772j58003j74495L7567J67819
74G458J33984p2281k40291r4446J94649J90667k9395j56700j19882L2383J67567
85A3713M8040j75126j26470R9507J60889M3026j19573j87232j6344K08766J38855
96H8051r4924j49330l7551Q4192J32196O383j54604o5355J35662J24160k9499
107C9381j18565r8663M7829J82539P2359j29846j13226K8359Q7632O6472k9117
$$ y = [0, 0, 0, 0, 0, 0, 0, 0, 0, -3, 8, -8, 8, -10, 16, -16, 24, -24, 32, -34, 42, -50, 56, -66, 75, -88, 98, -114, 130, -146, 165, -186, 205, -235, 260, -288, 321, -359, 395, -441, 488, -539, 597, -662, 733, -812, 902, -1003, 1117, -1252, 1410, -1595, 1822, -2105, 2466, -2947, 3621, -4638, 6347, -9747, 19134, -95235, -355865, -171799, 73979, 140687, 1921, -163230, -167821, 36798, 134570, -23433, -197928, -160361, 7458, 141442, 69161, -171130, -265576, -70927, 119740, 90345, -66355, -186237, -153854, 13713, 61753, -113373, -239843, -140336, 20553, 63579, -55994, -243226, -259570, -50804, 88051, -6873, -156203, -193754, -109562, 22634, 29017, -125587, -190942, -55280, 68880, 39381, -79184, -177847, -130018, 52521, 124880, -4966, -118192, -89833, -2201, 64271, 35154]
118C5154j21008k2216J34990P2509q6385j00881k2770P0738J18703R277j31372
129d3261o8840P0066P3507J1306m2479p0035J6517J12920K0804j02488n2911L7550
141c7344O1893N9173j5841j02155k8235Q5034M5016k9862l2814k6390J5254O4462
153E8191o562q7489k0302N0388K2926K550k0793o4373j2920O0675P491m9479j0615
166g0312N389l495J9441j0552n4183L692M7735l604j8708L301k0457p444M0293
179f8904M494k9849J6920K0194k0669N324J9539j4891N223K7703j4958p869L5257
192b2486j345l1547J2495J5816l364K4371M379m9292l515N0578N980k2499o093
205b6522j5742J0078N2502p813o5624m951M5296K1443R253k3291n7692J3534P9582
$$ y = [35154, -85854, -108070, 26920, 99429, 13044, -87837, -110607, -39869, 78834, 88111, -43261, -112101, -42035, 31472, 42778, 299, -69736, -53219, 59701, 80505, -21983, -74894, -37344, 24549, 83722, 67881, -34274, -62509, 22525, 67541, 37679, 4865, -21525, -6271, 58191, 51629, -35860, -56162, -5774, 17152, 19702, -1091, -65464, -78384, -17709, -10218, -59697, -70312, -64923, -68418, -48977, -59529, -113712, -110020, -62285, -65889, -84597, -81296, -101753, -109197, -68904, -64410, -94259, -77339, -57145, -77814, -72490, -52951, -67842, -62619, -34916, -49874, -57743, -22486, -23831, -55378, -42883, -27067, -30431, -6060, -1681, -50973, -54488, -3910, 2070, -20429, -26522, -42264, -32186, 20316, 12503, -53121, -58072, -12776, 8667, 17920, -5371, -63063, -49529, 30053]
218C0053P274n7361k1612J1985L5770M7917k9425q4846N265Q1053K9974k7521
230B8526m9524m3761M1800R0360j5482r6629k3683N1113N1336J7894o3341r1168
242a02559L0333J12508J9054p6390o5637q008P1140Q1802m5495j15576l340R3533
254h635N4319k2173q0860o3799O8504J24815q749j12638n0826M5563Q8382M9186
266H3089p6300j11200L4743J25479L1704p4217q6401j7038R8906J07040n4998
277F0807j40211k1886R3883Q1987l848j02301q8071P0239J31089q088j15362o6820
289a08582L3474J07327O6225r1088j34138K1576J26194N4168n3400r9257m0985
300a18486R7445J13932m7678j31003k6253Q3091R5676J4454j11556j03770O8232
$$ y = [30053, 37327, -20034, -41646, -29661, 6109, 54026, 24601, -60245, -54980, 26073, 56047, 28526, -20998, -64759, -22959, 67401, 51919, -44710, -68393, -17280, 34056, 51950, -11391, -102559, -72226, 40282, 59336, -17054, -82691, -90699, -19559, 62243, 16748, -98828, -102168, -8635, 45684, 23511, -57349, -121148, -52644, 72171, 63422, -49216, -100042, -54479, 33903, 83089, 6789, -104411, -69668, 55811, 87515, 13298, -73103, -90141, 8765, 115805, 60807, -79404, -101290, -7407, 74580, 70732, -31569, -119640, -49401, 81688, 73600, -41762, -108582, -75108, 32219, 98444, 7356, -126782, -105206, 20988, 75156, 21756, -77501, -118486, -21041, 92891, 45213, -85790, -112043, -28952, 66724, 81178, -30378, -134148, -65916]
311f5916J38459J2106r6551p9485J0964J08823P8956q5215j28201J7187J16104
322B7231O4309l8956j13364o0153R9061J24803l1845j19443m6386N3845R7578
333E6680L4643j00637j04366N4222J22173K2099p6009q9681j2228J05978Q9747
344A02621o5978j17133m488P8745O5632q935r5190o5491P6081J03204k1337r1536
356d3805n0380K6434Q9059M8712q1119r5038K9136Q3807K9042l3898p0668k9909
368i8627P7040P5936m5078q2955r621M5448N9137J7617p0404o2715M7430P1581
380B4789k503l9210l4130k364N8246M3903n1039n7525K2961M6524K1462l764m5491
393a8141l2618M7534M9999k2475l3390l122P873L0803K1684m0689l4837L3874
$$ y = [-65916, 72543, 84649, -11902, -91387, -80423, 28400, 107356, 22141, -106060, -88873, 27231, 91540, 52584, -60780, -120933, -21872, 102931, 71086, -48357, -94743, -40898, 56680, 91323, -9314, -113680, -59458, 62715, 84814, 8805, -80876, -93104, 12874, 102621, 36643, -80490, -84978, -6233, 59399, 50464, -44726, -110217, -34136, 69068, 47731, -43805, -94185, -67751, 21308, 70020, -11099, -106137, -77001, 6806, 35848, 1950, -68718, -98627, -21587, 54349, 9271, -73684, -83305, -37857, 21280, 38897, -31507, -94222, -46792, 24789, 22286, -16924, -51054, -53418, 4828, 48731, -2308, -59833, -36872, 9652, 31114, 27350, -18141, -50759, -3225, 46774, 24299, -9091, -12213, -4340, 26463, 48147, 7458, -27379, 6495]
405F495L2476o554q214j8172j7836K8851K9739k4700k0074J3377l58j103J2660
418B6587j5358j8421K2164R250k0806J821O525j8707J015J6950j1546m939J5104
431I639j5740j9886K0013J0833j4154J917j934j5441J7190J8901k7381j7268K2386
444a0925J0704m72L475k4643j9050L7521K6992k6201k1577J511O844K7126J1662
457B2967m4985k6227M0363L1559j1192k1859k9201k481N4574K8261n0330m0370
469d8921J7747L2513K4430q765n5717j8963O1434M1486l1644m2622j5413K3915
481b0520O0302J2465p0239l9882M7567N1367M767l5053n2088M962P8382L3637
493G5667o2435n4859J2989N0451M7420j8433q3479k4571P5825N6058k9397n9133
$$ y = [6495, 38971, 32417, 24203, 6031, -11805, 17046, 46785, 22085, 2011, 15388, 15030, 13927, 26587, 11229, -7192, 14972, 24222, 3416, 5237, 11762, -6945, -5930, 11020, -526, -5465, 9639, -6101, -25987, -5974, 4859, -9295, -7378, -9312, -24753, -7563, 11338, -16043, -33311, -10925, -221, -693, 2782, -21861, -40911, -3390, 23602, -2599, -24176, -22665, -15821, 11305, 22967, -22018, -48245, -7882, 23677, 12485, -9374, -38575, -41056, 13518, 41779, -8551, -48921, -31174, 1339, 25769, 17004, -38713, -57676, 3758, 45244, 13600, -29022, -44435, -20520, 39782, 52247, -17992, -57874, -10307, 41060, 45827, 10774, -41314, -36352, 42030, 75667, 13232, -41627, -28638, 21813, 69233, 50800, -32679, -57250, 18575, 74633, 45236, -13897]
505a3897l5071L2390Q1474J1944q6464n1805M5532O6301K2588m5537p8183K398
517d8330R6140M5122o0852o6944k631N8513O9452j6101r7652l2096P8813O7673
529I1107j5313o8187n5411L4373R9543J6205r2682o1576L4843P2002L8451m9674
541D3681r6873n144R9597N1241n6666p7968k2817N8636Q4236j5477j06977m1762
553h6293O9166P1991K048o7972p3190K6906J04435K5801q1827o3468J9067P1127
565A7791N3688m0214r6891p933R0873N4390l4917o9270l6705N0017Q8440n336
577F3933r3512l9933N1425O4097J5395n6825p5370J8631R3968K7922o3005o0151
589e3425j283N8589O2169k8164q8429j3077P1420M7301j6534n5041m2803L8018
$$ y = [-13897, -48968, -16578, 64896, 76840, -9624, -61429, -15897, 50404, 72992, 27455, -50728, -48330, 47810, 92932, 32080, -34864, -37495, 21018, 90470, 74369, -23283, -55379, 23434, 91107, 75794, 7607, -47804, -13431, 86112, 102317, 9635, -51941, -17098, 54904, 93355, 43681, -53192, -58336, 41261, 92502, 35836, -42132, -64949, -6313, 77923, 62446, -44531, -86293, -17127, 54864, 56912, -11060, -84250, -57344, 47091, 72892, -8935, -72403, -53336, 17791, 71479, 31265, -65626, -73559, 17314, 71704, 36787, -32483, -69188, -19171, 69269, 63933, -29579, -69512, -18087, 46010, 61405, 4580, -70790, -52159, 41809, 69731, 6726, -53425, -54708, 3881, 66050, 37886, -50543, -63620, 7800, 55101, 38567, -16474, -59277, -21259]
601b1259Q2653K764p3375l6606K9919N3146K9935l8811o7286J1175P2186K1452
613F5893m0060m3072j2415M1622N7447k0258p3364j4923M6196L4235j111l9339
625H51m4174K0775N9580J16m9411k4822R681L3124L1946k5660n5924M490M6558
638G130J5252j3732k0532j9550J8754M1739q086l9145k486K1315J5490J1733j6406
651A1476l3773J0413L5972n30j7419l989o556N292K1932q740k8091O317J6948
664I252l169k00l528j9476K475K0435n290j0747Q237n184j1080J3100N410j3160
678a2925M924P234j0788M744J5275j2582j2052J1267N215M029J2063j3600k3801
691b0997J4350K3899n403q081n806j1486J3745K5432j7801l1326O904K0522R045
$$ y = [-21259, 61394, 64158, -9217, -45823, -15904, 37242, 67177, 28366, -38920, -27745, 44441, 65893, 25833, -17239, -29654, 11968, 69415, 49157, -24207, -39130, 7066, 41301, 40190, 851, -43323, -22548, 37032, 37148, -12263, -37085, -27404, 5720, 37666, 12006, -43918, -39428, 7130, 22382, 8650, -11882, -31432, -12678, 29061, 20975, -18170, -20656, 659, 16149, 27882, 11476, -22297, -11884, 24088, 23558, 6139, 2150, -4406, 886, 22818, 14078, -14013, -7696, 9252, 6083, 5883, 2355, -17121, -14646, 5789, 499, -10248, -2011, -7195, -18275, -5175, 235, -12925, -8001, -767, -11555, -6811, 8464, -4118, -16170, -4903, 312, 4341, 16404, 2804, -20997, -6647, 17252, 11849, 3768, -2038, -13524, 221, 25653, 7852, -23474, -16570, 3952, 12997]
704A2997Q75k4543k8302K1829L6465r929k6983r678K765K4938K1847l1017l9558
717d8294J9773M0731P975j6966l0865j6935L8572M4767k0964m5138m186K5836
729e694L1962Q522m4382l9145L5092N3668l598l9525l2047N90M7899L6319m0563
742I098n6104R963M5259K3189j7023n1740k5312N2045N4885k5659n8469j8685
754e8553K7669N1693J7388n6329n1492L4868O1168O868l9208m5473J077O5762
766A5438M5179m6732o4183M493N1355M3201p493o3541l5851N5070O2085j8039
778D0982n7818k9046K4778O3125K2569o4090n9182K7238O2094K0733l2400n8191
790c9208j2871O5049M8293m2097o1726l432M5023M9450k715p0127m1549N2647
$$ y = [12997, 13872, -10671, -38973, -17144, 19321, 9392, -17591, -27269, -24504, 434, 22281, -8736, -48294, -28521, 12210, 20185, 3219, -27646, -44581, -6009, 38758, 17794, -27344, -31530, -5694, 26268, 34790, -9592, -48737, -13645, 40023, 36425, -3100, -35147, -34557, 13342, 49661, 9098, -47006, -37043, 8216, 31405, 14382, -37358, -62670, -10625, 44260, 18601, -39868, -58553, -30884, 20809, 38197, -18132, -69624, -34756, 26412, 33280, -5928, -51401, -50324, 15438, 60617, 13885, -50298, -45805, 5550, 48751, 41258, -22283, -58134, -3064, 59021, 40982, -16836, -45882, -21104, 42021, 64590, 500, -58682, -31444, 30650, 51383, 18983, -39208, -52079, 12970, 61263, 19166, -42560, -45992, -969, 48481, 45766, -24361, -65910, -13263]
802a3263O4336n689n1481m0342J4322O7378K8271o0251n6221K2832N7013K8146
814E5051k7908o5632j9225O5489N2526l2427n8371j7659L1621N2763M024o5428
826b5176m0408M2664N3714m40m2791m6047N154O5270L1841n0406n0570R991M2386
839d818L2035j4500n6585j8332N5372M3508k3136m4179k0544K2940N3733J2505
851C7999n4595l5591K9170L9126R617k2570l9530k448N0899K5702l6287l6222
863c4730J685K6877L2333l116m7776k0075L7271K8799j0321k2148j9412P632M0020
876A7039R580l9749k1267K0172K3176J1381r302l2787n441L6227J6511j9950j4965
889i375j250R121K3294J530l1952r729K4639J2865l426o876j7109k721K4742P655
$$ y = [-13263, 51073, 45384, -6097, -46439, -32117, 35261, 63532, 3281, -52940, -30108, 26905, 55051, 27143, -38489, -57714, 7775, 60301, 27874, -30497, -48156, -16535, 36228, 40252, -25176, -65584, -22920, 30794, 30354, -12437, -58484, -53330, 11940, 43781, -6625, -57195, -47204, -4818, 27217, 12717, -43868, -62200, -6828, 36680, 13544, -30635, -51179, -28239, 25494, 37999, -16596, -52187, -23017, 16109, 25726, 3156, -36374, -38822, 12077, 37779, 1492, -34730, -33045, -6168, 26165, 23049, -24727, -44802, -7531, 21268, 10947, -11201, -30613, -22981, 17039, 26619, -13130, -34397, -14225, 8951, 20332, 11030, -21757, -27198, 9029, 25540, 5590, -9375, -10625, -1504, 21790, 23320, -8632, -18361, 6278, 19143, 15717, 8841, -8268, -10989, 13753, 21408]
903B1408j9972n715O833K35O255K262j7295l557J8364Q60j0054L000l041p117
917g534J0557N125j1514K518P950j0114k641J0634m091n142P932l495o598J1621
931E208J103j6607J243J2015j296J502j61j7701j885K2327L251j6400l972o43
945a2016L403J6578l139k7914k552K4754Q513o530j2111j7950O838L3451K904
958A4229l0098j1137J2349J4697J2825j1951l2659L538L8468J0962k1818k0315
970b0910p337J9404L4988o386m2104q226K8521K0930J68k3530k8504J5507M6743
983B9264L012l8687k2415R965L0968K6431k0553m8208J308M4757K0077j8878l1381
996a4340j6649K8185M6545q929n2360j6893K9740L4361J0313l2826m4058J5029
$$ y = [21408, 1436, -4279, 2554, 2789, 9044, 11306, -5989, -9546, 8818, 9678, -376, 2624, -417, -7534, 3023, 8148, -3366, -848, 7102, -3012, -5653, 4981, 890, -4252, 3680, 185, -6413, 5208, 6311, -10296, -9053, 2962, 1666, 3168, 3007, -14694, -16579, 5748, 8999, -7401, -11373, -12016, -8613, 7965, 4826, -23088, -25640, -886, 7627, 1097, -11014, -28964, -22126, 11325, 14229, -15869, -27006, -14657, 40, 12865, 914, -31745, -28207, 10261, 21223, -595, -20910, -28247, -8843, 26145, 19759, -22345, -30571, -2050, 18880, 19048, -4482, -32986, -17479, 29264, 32276, -6411, -28826, -18861, 12107, 38538, 17985, -30223, -28915, 15842, 35919, 17041, -14340, -30989, -2804, 43741, 34812, -17548, -34441, -4701, 29660, 39973, 7147, -36911, -21882]
1008b1882N2904J0738l6928l0683J434L7660L5882k5694n6844j735M8000K8839
1020D1691j2319m0968k9093L1328N4874o973n2353k1724K4383M1293J7009l9904
1032G244n1870J6912N9739J5748l3746m0100r085M1807M5291k3120n7475o741
1044c5396M1362L3393m414m4620l6623L1767N8623j948m8234k8543J2714M2581
1056B0662K7223l4797n2054J1182N0897J8733k4081m0150j4969M0822M7901j9155
1068C2214n3226j2278L0303L5593P554l9673l9399K5034N0863J302l6883k8396
1080b6992L516M0104L1552l0219m9661L952L9067K1329j0054l4897k2507L1155
1092c655M1185j3690m0315j1388J8433L0909J3230l3569l7216J8239L9998N143
$$ y = [-21882, 31022, 41760, 4832, -25851, -24417, 13243, 49125, 23431, -33413, -35148, 12852, 41691, 29372, -11596, -40689, -9361, 45513, 38540, -13813, -35537, -11154, 30139, 47148, 7244, -44626, -27714, 32025, 47773, 14027, -26073, -35158, 6649, 51940, 28820, -28655, -35396, 5966, 39359, 34945, -9675, -46298, -14531, 44092, 42144, -6090, -34633, -21919, 20662, 47885, 13088, -38966, -27784, 23113, 41846, 17765, -22385, -37354, 3468, 51369, 32214, -21012, -33290, -2987, 32606, 40160, 487, -38912, -13878, 36985, 38287, 1404, -26992, -23476, 16628, 48180, 17961, -31700, -27748, 11319, 32648, 22594, -12303, -34810, -3655, 37530, 23840, -16475, -27863, -9430, 21479, 34709, 1140, -36076, -17837, 22161, 27304]
1104B7304k0973k3365n986L1009K8278k2641l5985M317K5623J7388r21k8400k3755
1117b8107K3743L3041p350k3670j0131L301K0918J5428k2673k5914J2849K2796
1129A4231K398p873j6359j1423K0105K1871j3427j8873K705P189P948O860j4628
1142G24j4846J6095J6440p532p788l218l635J1859J4120j2452j2530Q856N513
1155A1606k592L907l903r498J0153Q966j0108l872N216n164O24R426m376p373
1169C012O424k081q353Q555O551r786j046M726n268K590Q083r893p940J2531N725
1184A3830o054n69n233o690J4625J1325j4373j0126O546L261N034L663j5632j0453
1198a0846J8787J2795j2449j1387m868J459J8570R019k4300j6923J4142J3984
$$ y = [27304, 6331, -17034, -23020, 7989, 36267, 13626, -22359, -18042, 7581, 24969, 24048, -4352, -28107, -4364, 28677, 21327, -2343, -12474, -9173, 11745, 27173, 4500, -21414, -8565, 14231, 16629, 8756, -7603, -19026, 1079, 22950, 9523, -9350, -6645, 544, 8492, 15352, 724, -14122, 1973, 18413, 10881, 3093, -125, -3760, 8099, 22219, 9767, -2763, 6093, 11606, 9014, 12921, 9018, -480, 9673, 18639, 8531, 4659, 9875, 4711, 5335, 14761, 10385, 3012, 9436, 7355, -998, 7557, 14108, 4322, 3276, 8002, 2734, 5324, 13407, 3514, -4426, 8105, 13830, 7776, 7207, 1974, -4716, 9909, 21234, 6861, -3265, 3281, 6542, 11576, 15239, -393, -10846, 7941, 20736, 8287, -3100, -7968, -6509, 12061, 21080, -3220, -20143, -6001, 7983]
1210G983J514p006j8979n737K7091J5545k2005k0319K315J3382J9585J689l0564
1223a5506j5653K5563K2234o456j7152j5540N440L2498J1288l2209k3232J5378
1235a3347K4001J2662j1462l2477p502L6321K2118k1310k6395m598J8273L0337
1247B6621r57m1580j8795L0246K9122j792k3747k7163N338M2712J5069l4238k8132
1260b7296R910K8223K1874j2772m1960q630M1454K7544j6746k9530j4963J7064
1272e828M0294L909m3133k2528K5638L0844O049k4164l5538M053M5970J7786l2668
1285A0684l1002P73K6559K9192j0052m6459j1612L7906K7485j1731l0713k3044
1297c2014J6504M4340O653m2890k5333J7697L0789J4949k0472m0297J344M5098
$$ y = [7983, 9497, 2491, -16488, -22225, 4866, 20411, -1594, -21913, -19598, -6216, 13369, 15058, -15506, -31159, -5596, 16638, 10182, -6970, -22510, -17070, 15428, 26716, -5493, -28725, -13347, 10654, 23316, 11854, -20623, -28125, 8196, 30314, 9004, -17391, -21989, -3716, 26621, 25664, -15916, -34711, -4465, 24657, 22865, -882, -28045, -22707, 20005, 35074, 836, -27296, -17386, 10837, 32711, 19939, -22021, -30651, 10803, 38347, 21601, -7929, -22892, -5828, 34466, 38375, -4758, -27286, -1648, 29196, 35245, 11081, -24457, -20404, 25566, 43352, 10684, -20318, -19545, 7014, 36206, 26154, -20305, -31917, 5989, 33474, 21743, -8970, -32014, -15510, 28830, 35483, -7407, -32740, -15043, 15746, 30695, 10223, -30074, -28730, 16368]
1309A6368J8475k6476k9620n363K4621L4342p229m4149j4505L0710K6135k641
1321B0668k5976k7007J2405M1251O037l6020k2775R801K5529K0401j6339l9694
1333c1719k817L7307J7376j6353k3992j1710J8597L3004l356l7177j2001K1538
1345a1303K1645O217j7935k8168O658L5404P648k3444j5250J602J6586K0988r374
1358A1274l1322k455K6400J1792o074j5261j5363J0388K7852j779k5626o717J0437
1371f454J1305Q982j0272k3564M426K4726M089j3081q450m417Q542J8343m252
1384I923k0594J62J3138L510K200m779j3349L753J8198j578j2291J96Q91R38R522
1399I840j562j3998K603R684l406j771K110o777q93R921k203q762N270R02o856
$$ y = [16368, 34843, 8367, -21253, -26616, -1995, 32347, 25118, -19031, -33536, -2826, 23309, 20668, -5308, -32315, -19910, 21341, 27378, -8642, -31417, -21616, 3913, 24314, 7975, -31719, -34536, 2771, 20147, 3794, -20198, -31908, -13311, 19693, 16337, -20840, -32841, -11303, 10342, 16559, -1376, -29544, -22886, 12518, 20166, -3278, -18528, -16926, -340, 20648, 11274, -20048, -22503, 3897, 15689, 9615, -5646, -21009, -10621, 17231, 15452, -10174, -16891, -6454, 4851, 13833, 3561, -20003, -15577, 9149, 13238, 157, -8293, -12710, -4168, 14175, 9923, -10671, -10509, 2629, 6139, 8339, 3560, -9789, -6036, 12162, 10584, -1707, -1511, -620, 318, 9840, 8278, -5720, -3117, 6567, 3161, 1390, 3500, -3277, -4170, 5751, 3548, -5214, 56, 958, -5898]
1414e898N042M136p444m73M966m893m2Q715m904q028N775L155k569M888k339j1032
1430a0945N889J2919n563p713R43j964N055J1570p893j6388N565J1823Q46j009
1444C135p819j1995J0657J7758p656j5826n89M873Q596Q374j2795j9301J0042
1457a2546J9855j066j0263r485m137J5175J7572j3427k1701M247J5539Q415L3
1470H211j7621j5343J7394K4519p155k0403p394N758J8460J2775k0153k4293J0781
1483a4464K3705M846j1029j8794q208K3161K3693j5323k7125n02J5990J6466K925
1496A5341k4286k0289J9971K8029m753k1401j3367L851K6354J6391k4987k8005
1508b7151J0637K5830J0256r598k5290j1027K8076K6554j5555k8508n146J5708
$$ y = [-5898, -856, 3280, -4164, -4637, 329, -4564, -4606, 4109, -795, -8823, -3048, 107, -2462, 2426, 87, -10945, -5056, 7863, 2300, -5413, -4470, -6434, -1379, 10191, 2298, -14090, -8525, 3298, 4144, 3135, -4684, -16679, -6022, 11736, 4080, -11746, -12335, -7462, 1134, 9508, -3287, -22588, -12546, 7309, 6243, -4020, -13505, -17642, -2467, 15105, 1678, -20023, -15776, -237, 8178, 8211, -9410, -24753, -7359, 17160, 10005, -10398, -17792, -12034, 6426, 19201, -952, -25245, -14464, 9241, 14087, 3058, -15736, -23944, -783, 22910, 7587, -19538, -20040, -4050, 12416, 15341, -8945, -29234, -9263, 18766, 14013, -7388, -20755, -16904, 9450, 25841, 854, -27151, -16514, 9316, 19572, 9974, -15316, -26343, 1733, 28287, 12732, -15776, -20922, -5214]
1520e214K4456N143l0761k3772K1482K9345l20j9956k1032K68L1195J9389k5307
1533D916k9792O880K3817J5989o584k9724j4398K8031K7657j1770k5963j0740
1545b1681J1288K7803R399l0997k4965J8313K7408M533j6347k4163l746L1451
1557H296K1080k1652k7270Q41J8996K0138j570l0759j6731K5202K5442p059k1156
1570f202j4473N347K7902J1969k6734k2818J1443K1568Q270q792k4764p149K7458
1583C025J8716j6159k0645l267J2220K0378K712k7035j5655J9851J9243k347j3255
1596b218j5600N72K4730J1554k0983j7012O551J3242J0763k314k2093q556K0845
1609e19J4832r662j1701o231L506J7552O067j9182j1402J1545J0269J756l811
$$ y = [-5214, 19242, 24385, -6376, -30148, -8666, 20679, 20359, 403, -20629, -20361, 10834, 30223, 4916, -24876, -17996, 5821, 21810, 15226, -14498, -28896, -865, 26792, 15022, -10941, -21681, -10393, 17410, 26809, -4188, -29153, -10840, 16568, 21101, 4754, -19409, -23155, 8296, 29376, 7724, -19546, -18705, 291, 20429, 18859, -11900, -28631, -3429, 22013, 14954, -6202, -20675, -15328, 12574, 24543, -2191, -25009, -13566, 8002, 16272, 7480, -17284, -24433, 3025, 21741, 5582, -15063, -18330, -6110, 14268, 16980, -10055, -25710, -5859, 13384, 11037, -2218, -17818, -17246, 7484, 19038, -1945, -18957, -12406, 836, 11599, 9285, -12808, -21364, -519, 14313, 4651, -7050, -13281, -9775, 7777, 13844, -5338, -16740, -5195, 5074, 6830, 3019]
1622C019j3165l773J7639Q874j2678q035J963L421Q797K936j4411n930J2856N826
1636G339m507k085n349k351J2173N168j1293l939N225J32L171L879q152m782R423
1651D052K634n533J848l02n083M953O020o284k193M525m160l59P811k399o833
1666a303L530J740l258N280J120r972J086Q865j553l272N44n051L56J1281j50
1681I243j1970n09N398J186M567j760j2714N06J4753J344q851l669l320M184J3860
1696A2248j471j7717k855J1144O162Q32o524j3959K817K0058J992j5620p528K370
1710h051R116J2019n736k1514j050J8508P329o106j0704r902Q744K1125j760k2164
1724a0146o538J0850J2672N946j1414k0622M475K4812N147j5651j2384j432J4166
$$ y = [3019, -10146, -13919, 3720, 12594, -84, -8119, -6156, -2735, 6062, 8998, -5413, -11343, 1513, 7339, 2832, 747, -4602, -6953, 5220, 10388, -905, -4844, 381, 513, 3684, 7563, -589, -5371, 4052, 6686, 1153, 3001, 2699, -2384, 2569, 8589, 2305, 112, 4637, 477, 118, 7929, 5530, -1303, 2227, 3967, 709, 5989, 7109, -2863, -1777, 7088, 5535, 2263, 2807, -2244, -1888, 9393, 9243, -2727, -3236, 2162, 3348, 7915, 6155, -6559, -6053, 8700, 10044, 1193, -2476, -5796, -1612, 12248, 10777, -6940, -9795, 1349, 7511, 8343, 1819, -12140, -9323, 10735, 12727, -2893, -10421, -8051, 1065, 13084, 7348, -14166, -15216, 3292, 10621, 4515, -6189, -16091, -7347, 13778, 12018, -10146, -16684, -5834, 6838, 12784, 1370, -19252, -14777, 10035, 15182, -469, -12853, -14285, -119]
1737a19J8261q098k5892k477K0333J2606l121j5841j5691J0860K6883p06k2858
1750e860r892P608J6302J1825j3759k5005M251K5855Q190j2305j5910p196J6190
1763B94K3245p214k6640m511J6999J4997J860j7617j9724J2083K7936J031k1071
1776A668j2999L065J9132J6232j4696k7017L156K3956J0158q602j8895j0986J7273
1789A445K5244p256k5797p635J3088J6964O090j8071k2310J0349K6001K342j6984
1802C470j4671j135J9099J8039j4282k5988J683J9868J1081m164j8312j3295J5615
1815b992K3304n575k2066o947P748J6774R085j7628k1897Q301K2077M200j1090
1828C294j4692n757J6883J7985j1082k1585k70J3552J0941J212j6153j4964J2327
$$ y = [-119, 18142, 10044, -15848, -18325, 2008, 14614, 11493, -4348, -20039, -9179, 17704, 16998, -5860, -15752, -8144, 8158, 19983, 6224, -18781, -14530, 11325, 19515, 7210, -8700, -15896, 294, 23539, 16325, -10315, -14826, 2173, 17170, 19030, 1413, -18311, -6228, 21708, 22739, 1668, -11331, -8266, 10866, 27098, 12402, -14615, -11459, 12497, 22655, 14053, -4842, -15828, 1445, 26689, 19433, -6364, -13999, -911, 16053, 22143, 4072, -18238, -7889, 18112, 20454, 3470, -11201, -12336, 6763, 24802, 10520, -15468, -13785, 6083, 17164, 13000, -5312, -18607, -2992, 20312, 14737, -7329, -14276, -6528, 10246, 19331, 1703, -20194, -11893, 10184, 14384, 3294, -11398, -17155, -272, 17713, 6631, -14954, -15224, -1672, 9269, 10481, -5672, -20636, -8309]
1841h309K0248l068j3873p548J685J3770J1055j3187j7198O465J4916L801m614
1854D143j1337q079J3628J5453p386j3848j069N363Q956N341j1483j2351R080
1867c589J3251k038o485n826l144R682J1409q261j1856L819N891K502K296o618
1881A033p984P867R579n128n197M6j166M348P539n913q270N151L870k031J890
1896E634j219n797M347O101m999l368L224k091m99O441j877o321K633J399l367
1911B41L622K824o681j509N157j297r10K201m831l233Q202K998o925j734K39j398
1927c034O534M316r567n842P337L807j059k17o680l213J0771N799r818n965K159
1942d672L126O891J945j2923o733J1559P684m263n329n530j27J3462N286j4103
$$ y = [-8309, 11939, 8871, -5002, -12550, -10865, 2905, 13960, 773, -16425, -9960, 4956, 8757, 4143, -7194, -15273, -1645, 13808, 6422, -7426, -8495, -3132, 5824, 11165, -318, -12669, -3589, 9662, 7624, 1139, -4687, -7831, 1851, 13260, 4999, -6857, -3038, 2853, 5355, 7651, 1033, -6951, 916, 10495, 5367, 170, 216, -950, 3398, 10937, 5024, -3246, 1905, 5775, 3744, 5634, 4415, -1382, 2965, 9066, 4067, 699, 3923, 1832, 1333, 7774, 5897, -424, 2209, 3608, 241, 3863, 6687, 6, -1503, 3654, 2357, 1447, 3648, -1183, -4416, 3786, 6784, -141, -1875, -1636, -3034, 3500, 7816, -1751, -7593, -256, 3551, 2492, 2275, -4405, -7618, 3153, 8952, -866, -6831, -4672, -1546, 5345, 7290, -5633, -12366, -807, 6877, 2614, -2715, -8245, -8372, 5090, 10376, -3727]
1956c727r192O768Q424M828l004j4186m127J5636R549r220r287k610N293J3462
1970H607K819j8124q855J2123J2280J22p971j2758k93J8881Q349j4844j1968L145
1984h487J0049J0753l139j9160o371J8255J2927p473j2241p952O040J8558L359
1997A5118j9843j0903J1050J3165M193r212j7715J41K2430R649j4802j4313o17
2010a1659J1143J5734k186k1922p599J7076J3645l259j2954j2402N801K1835M602
2023A7855j9776j2200P217J3145Q968p569k0186j983K1039J0081j1197j3635m538
2036a2779J0284J7677j064k2210q240J3982J3143J397j1499j5123L219K1822N490
2049A6099j6857j1793L159J2325J1562n793k0569k741J8041R942o264j1650q772
$$ y = [-3727, -12919, -6151, 2273, 7101, 4097, -10089, -14216, 1420, 10969, 1749, -7538, -10148, -4855, 8607, 11426, -6698, -15553, -3430, 8850, 8972, 1001, -11757, -12050, 6831, 15180, 336, -11632, -8487, 1562, 12315, 9176, -9984, -16355, 1900, 14827, 7354, -4887, -12839, -6799, 11759, 15118, -4725, -15628, -4578, 8587, 12780, 3568, -14147, -14006, 8424, 18073, 3271, -11042, -11659, -516, 15218, 13032, -8890, -16489, 587, 14232, 10973, -1981, -14383, -8582, 13253, 17855, -1921, -14121, -6904, 6241, 15209, 7640, -12546, -14529, 6510, 16591, 5394, -8241, -12779, -2495, 15182, 14118, -8092, -16332, -2350, 10793, 12190, 691, -14432, -11213, 10609, 16099, -758, -12551, -9392, 2933, 14495, 8702, -11867, -14608, 3433, 13375, 7111, -4539, -13311]
2062a3311P773J8207J11j8937p291R969J0391M018q330j5874J691J8700N184j1626
2076F75r885o11R058J2133l882j7951k658J3697P590k573q226j0198N303J6345
2090H817J036j4479o182N102P520O575n043j4281M46J4247L709o740n940m056
2104i269M784J2426j877j3084k041P434M021J561l949r442K710J1531M69q475
2118c201k281N35L039P549k359j0803P25Q377O58j675j190n086J309Q910q09p101
2134c403K62J955k4M464j01p074M29O105j331j483K150l233j854O026P09n349
2150a752J391K039l114K747K979m996j409M143j298J9L138k595n114M646L564
2165D388l534k1J53l659L275O121m846n672L050K006J328K731m151p158N201P089
$$ y = [-13311, -5538, 12669, 12780, -6157, -13448, -3479, 6912, 10930, 2600, -13274, -11583, 7117, 12301, 675, -9210, -9821, -763, 11370, 7488, -10463, -13121, 576, 8166, 5593, -2633, -12831, -7528, 8817, 9853, -4626, -10808, -5706, 1814, 8389, 3346, -10935, -10489, 3758, 7467, 727, -5213, -9269, -4485, 7941, 6064, -7020, -9061, -1627, 2394, 3955, 6, -9436, -6726, 4805, 5274, -3201, -5482, -4947, -1908, 5641, 3282, -7521, -6796, 1581, 2239, 564, -626, -5712, -4403, 4507, 3698, -3403, -3141, -1186, -1210, 3254, 3153, -3921, -3492, 2613, 1282, -201, 1949, -1284, -3138, 2888, 3597, -1752, -361, 1678, -1436, 1311, 4290, -706, -2115, 2028, 730, 749, 3887, 1292, -3822, 824, 4388, 854, 833, 986, -2673, 602, 6723, 1877, -3795, -745, 1261, 2589, 5320, 1169, -5989, -788, 6301]
2181F301k984l282j703k097M777P851o774r069L366O063J920J73o126p324O940
2196a968R959l708p806j931J208O913N947q689j1243N977J0177O12m499o743m319
2211a0113R175J0701o985j1533N91O613O607J730j1118r612R538J2696k510r403
2225c623o018K78J1872R038j1125j3550M359J1382M834l199j1813o017J2114J3347
2239A1879o785j2653k853N321J1227M718j3649j1620Q667J3625P6p952r503j355
2253a0857J4588J0023j1071j3839K487J0295P978o18j4253q728J3109J3908m999
2266H023j2040n467L788J4018O447j4651j3138P783J3062L518o020j2978l598
2279a1253J5363J1394r816j3282M7P882J0469J354j5421r732J1954J3327k722
$$ y = [6301, 3317, 35, -1668, -3765, 1012, 8863, 2089, -6980, -3614, 2449, 4369, 4542, -1584, -8908, -1968, 7991, 4283, -3523, -5454, -4246, 2667, 8614, -75, -11318, -5341, 4836, 5448, 949, -5794, -10113, -938, 9763, 2778, -8755, -8164, -1551, 5056, 6786, -4332, -13944, -4406, 8290, 5780, -3623, -9641, -9363, 2509, 11547, 422, -13128, -8769, 2613, 7447, 4248, -7565, -13582, -1468, 11879, 5094, -7559, -10412, -5091, 6136, 10854, -2795, -14415, -5748, 7877, 7953, 1, -9502, -10857, 3731, 13754, 2683, -11156, -8669, 1626, 9604, 8986, -5267, -13995, -886, 13022, 8023, -4017, -9484, -5696, 8322, 14769, 118, -13020, -5237, 7825, 11343, 5323, -7655, -11253, 4110, 15504, 5688, -7594, -7547, 335, 10804, 12158, -3263, -12995, -1041, 12286, 9564]
2292I564r312q495J186J4457P211j3309j1756N190J0712N113l586j3767m927J4297
2306B578J1075p530j1106k856M977J1309L032j4066r659R602J0063L19o310r400
2320g972j320J3467P577j0420r953K421O080O961m11j2230n766J1324Q006m668
2334C096o631m307J919J0772L505j1222p463O302O621J886k391q970k468J0876
2348A525N647p564n586L28K823O909J708j0242m944Q106M791j634k306m883j181
2363f503Q836L671p926l776L263J903K943J299p064l080P132L360l532j291j318
2378b083j268N250K993o016k592M174Q46M2J912l987l206N430K827l974qN71k408
2395a497K722L826m203k407L170l17q92L392j751m480K991K707j963O66M90m537
$$ y = [9564, 252, -8243, -7057, 7400, 14611, 1302, -10454, -5264, 5448, 10561, 6975, -6792, -11719, 2578, 13653, 6123, -4983, -7839, -2862, 8447, 11479, -2587, -12246, -2644, 7419, 7738, 1428, -7972, -9292, 4175, 11752, 1332, -8621, -6200, -120, 6841, 6430, -5800, -11566, -242, 7764, 3096, -3535, -7842, -5923, 4849, 8354, -2868, -10331, -4029, 2592, 4478, 2087, -6883, -9351, 1525, 7172, -392, -5978, -5650, -2827, 4082, 5790, -4452, -9396, -1290, 3501, 1867, -439, -5322, -6503, 2333, 6004, -1922, -5698, -2435, -532, 2411, 3710, -3354, -6434, 698, 4058, 526, -765, -2083, -3351, 1899, 4892, -1124, -3716, 458, 1304, 1346, 3258, -729, -3935, 1495, 4322, 348, 340, 911, -1497, 1225, 5051, 848, -1559, 1611, 1294, 402, 3794, 2043, -2437, 554, 3261, 1298, 1964, 2454, -2083]
2411b083J292N913j945l512R75p49P2M776q99o832J282M915o91l34q04m688J511
2428a801P403j148o221k67J574J353M256k290q014J139P730L73l294k021l731
2443d959K817Q724k087r432m59M781L376J964l994q791K603J0665N90o844l695
2458d741q61M539Q322l339j1609Q3Q538L582r02n742p345M830J1718j358j0071
2473d356l056L328N939N313n590j1754K731J1890K020n798n925l342O792J1132
2487I324m125j3061p48P806N889J868q431r496N823J3230o68r499m978R36Q211
2502B081Q505o809j3242K095J0943L890l273p795n933Q022J2109l752j2083k315
2516g557N758P333M194q904j0747N064J2575Q00p421o444j739Q891R882o391j2850
$$ y = [-2083, -791, 5122, 3177, -335, 640, -109, -37, 4739, 3840, -2992, -1710, 3205, 2514, 2180, 1376, -3312, -1801, 5602, 4454, -1767, -2034, -460, 893, 5149, 2859, -5155, -4016, 3714, 4087, 793, -1228, -4959, -2142, 6582, 4495, -4937, -5396, -615, 2761, 4725, 731, -8060, -5457, 5208, 5798, -1046, -4741, -5602, -1063, 7259, 3920, -7689, -7606, 932, 4514, 3612, -2130, -9475, -4645, 7073, 5715, -4356, -7412, -4084, 1855, 7168, 1578, -10176, -7445, 4445, 6465, 667, -5258, -8600, -1808, 9324, 5199, -7862, -8610, -804, 5085, 6953, -1478, -10974, -5151, 8079, 7411, -2088, -7066, -6130, 2081, 10586, 3777, -9465, -7370, 3573, 7463, 4190, -3605, -9538, -1516, 10593, 6841, -5242, -7557, -1799, 5534, 9728, 824, -9923, -4859, 7716, 8516, 1095, -5349, -7088, 1803, 11685, 5294, -7556]
2531g556Q17R228N286p72q582q199P625J2614k757r918l862K530Q253O121q352
2546B476j1627M404J0763K067m635o643m513Q575J0101n400j1197J15N840N630
2560E956J907q345q594O588J0453j913o896m119J01P236P377p354r792K953P099
2575B657K512j240o763n488P091R066m429p467q39J888N118M289o660p932M771
2590c426P245o99l363l319k746N539P115n238o948J946L195J884K110m818n889
2605g412M843O563k647l488q43j271L466N217m399n809L027L461k51J228k447
2620g62m731M186M674k940k970J417n35Q56M269k876m610K973K643j843J416j59
2636A008l704J614M585k399k458K610j805m60M241m21m484J598K199j794J410
$$ y = [-7556, -6739, 2489, 7775, 7003, -1579, -9778, -2153, 10461, 7704, -2214, -6076, -3546, 4707, 10828, 2476, -9151, -4747, 6016, 8083, 3448, -3195, -7708, 867, 10968, 5568, -5629, -5514, 326, 5956, 7863, -482, -9076, -2488, 7965, 6052, -844, -4963, -4862, 2374, 9751, 2397, -7395, -4442, 2657, 5169, 3929, -2834, -8322, -1231, 7835, 3406, -4061, -4900, -3012, 2106, 6395, -265, -8197, -3426, 3819, 3120, -243, -3562, -6308, -769, 6346, 1108, -5840, -3894, -699, 1185, 3295, -1523, -7412, -2569, 3994, 1347, -2141, -2984, -4255, -789, 4428, 29, -5780, -2753, 708, 457, 1685, -762, -5493, -1307, 3367, 427, -2543, -1126, -1661, -805, 3464, 588, -4022, -1049, 1594, -249, 1167, 1008, -2696, -1082, 3503, 1104, -1354, 1256, -549, -1009, 3232, 2811, -1673, -75, 2124, 330, 1740]
2651A740J187m176J83M518q58k304J365j491q75M667M50n216j83K716l26J516
2667B913J005m970j357N427J645l535l77j665l58N439J630p159j967M658J012
2682B341Q02K54n658j815P511K253n519j996o0Q45N363N98q359k092O234K974
2698C676j453j949m879l48Q381K468p931l458K671L314L308q80q614j657Q628
2713A277L425m087l556k982J678Q458J299r621l643N714M156J424k990p137o20
2728g205J0173L126p101m439O4L601P222q37j0553k108Q402M068j821m032n269
2743f709J914R810J742r458m285M216M544M392l201r549k41J0369L712n747m841
2758c332k038L745Q922r0j0895l204P113M788O03m053p381J463J0763J674q139
$$ y = [1740, 2927, -1249, -1066, 3452, 2594, 290, 1655, 164, -711, 3956, 4406, -810, -993, 1723, 1397, 2913, 3918, -1052, -2409, 3018, 4663, 1128, 751, -914, -1272, 4167, 5797, -1362, -3329, 1329, 2341, 3143, 3397, -2261, -4076, 3435, 5688, 169, -1827, -1887, -1042, 4321, 4919, -3440, -5532, 702, 3676, 2223, 274, -4605, -4953, 3428, 5896, -2035, -5493, -2822, 492, 3800, 2920, -5694, -7351, 1277, 4702, 615, -2941, -5923, -4245, 4213, 5512, -4109, -7752, -2038, 2118, 3542, 552, -6585, -7205, 2968, 6094, -1007, -5446, -5382, -1781, 5441, 4604, -5949, -8057, 345, 4413, 2592, -1440, -6709, -4795, 5015, 6757, -2701, -6986, -2770, 1774, 6166, 2965, -6584, -6825, 3544, 7256, 1509, -3332, -5370, -1625, 7297, 7207, -3688, -6892, 221, 5009, 5612, 1559, -5822, -4359, 6404, 8078, -61]
2773f1m334J676M540O107k323j0653m83R300L413l755m094m199K977R194L69j0034
2789b360k767M800M546K514l862q644R54J0297J617o245l436r49L085P679j765
2804E464j0055q52P024K999r27l158n898J966R308k63p367k296J905K724M729
2819E303k303q536K93P788J144l289k297l084K300P726j605p806m44L888J749
2834H27K110k508o378J492P751l31n025o86m78J729M868r82p308M40M933M18k7
2851H45j332m088J017O469o31m941K23Q88J78L725q37n640L63N103j85j856M27
2868b72k592L89N075k61m852O51J840q11K335L98m805J14M780m86j875J137j858
2885a093j181M337Q21m191P5J975j403K288J608m179j528L967L24j709J747j784
$$ y = [-61, -4395, -2719, 1821, 7928, 5605, -5048, -5531, 3769, 7182, 3427, -667, -4866, -1889, 7305, 7674, -2360, -5127, -327, 4219, 6733, 2871, -5773, -4819, 5478, 7095, 850, -2586, -3535, -450, 7229, 5464, -4591, -5443, 1581, 4580, 3653, 495, -5403, -3437, 5871, 5608, -1759, -4055, -2150, 574, 5303, 3000, -5536, -5243, 2545, 3689, 400, -1897, -4981, -2681, 5045, 3440, -4366, -4810, -922, 827, 2937, 429, -5949, -4457, 3294, 2963, -2062, -2748, -3226, -1497, 3371, 2389, -4919, -4479, 454, 872, 845, -487, -4575, -3558, 2911, 2280, -2661, -2438, -1550, -1372, 2353, 1516, -4124, -3761, 1342, 1157, -699, -272, -2864, -2475, 2600, 2339, -2513, -1862, -22, -833, 1502, 1900, -2905, -2791, 1989, 1503, -372, 765, -1093, -2274, 2063, 2884, -1307, -1232, 743, -660, 1628, 3236, -943, -2471, 1496, 1820, 111, 1858, 74]
2901G4k436L513K636l625j068J744j283J759K652m109k354L562J914j950P07j872
2917a36k595M153L383m039k666K050N72J077J831l764l871M354L264j946j299
2932C68j339k087M439L594m384m051K658J672R19J399m609l879N130M483k908
2947A405l010r65p09M308L766n427n088L924L169K74l97m112k989N878M735m649
2963A13m432R24R95M012K180o055m715M837M700j171k582k952j654O586M826o956
2979a344m976K813L107K775O8o029l716O350N728l771m105j238N37O085K883p343
2995b176m712M881M274M29j657m723k483P560M654n695m667J132K563M130J092
3010D602p174m105O429N184k083l193l303J8O667L796p148m601L419L528K017
$$ y = [74, -2362, 1151, 3787, 162, -906, 838, -445, 1314, 3966, -143, -2497, 1065, 2979, 1029, 1736, -136, -2731, 1422, 4805, 766, -1900, 150, 722, 1799, 3630, -134, -4005, 349, 3613, 1667, 368, -971, -3058, 1381, 4975, 591, -3460, -802, 870, 1789, 3188, -1421, -5300, -170, 4313, 1405, -1605, -2570, -3279, 1029, 4795, -632, -5720, -1796, 1373, 1647, 1250, -2862, -5851, 27, 4762, 113, -4319, -3395, -2400, 1612, 3792, -2263, -6978, -2141, 2559, 1388, -1194, -4146, -5800, 786, 5612, -1344, -6320, -3507, -400, 2375, 2443, -3586, -7302, -952, 4776, 1005, -3100, -4338, -3801, 2284, 5167, -2176, -6888, -2007, 2267, 2696, 1039, -3684, -6167, 1393, 6047, 352, -4315, -3183, -620, 3510, 4602, -2572, -6677, -248, 4936, 2853, -340, -3643, -3625, 3042, 6838, -310, -4911, -1492, 2036, 4053]
3025D053p04o293k582P349M447m407l641p67P87N734K052p399l945N654L282l38
3041C282k066l784j470O889L662o276l515J405K492L092K35o597k659O338L389
3056D417k840k249k206pN693K388o444l309L612K388Q31k87n171j957O211K937
3072D007m491k295N1O48L824J568o315k148M791J741q08n57l218r52N028K138
3088C012m826j894J663J045K082N21m555k029M720J962k388k96j476p17L829J932
3104B585m616j423K617M82N39J250l662j985M449J460k665M8l63j335K741K184
3120B306l784j583L148j41o6J131j768k305L662J433k796J38N96j374J571K383
3136B551k753j974L019l9q17J812j483k544K794K174k490o41R56j737J203L110
$$ y = [4053, 3349, -2944, -5526, 1823, 6270, 1863, -1778, -2545, -1758, 3976, 6028, -1371, -5316, 338, 3620, 3282, 1216, -2568, -4038, 2851, 6513, 237, -3278, -1873, 619, 3711, 3946, -2651, -5310, 1028, 4417, 1577, -672, -2878, -2885, 2808, 5196, -1248, -4557, -945, 1443, 2274, 1987, -3184, -5141, 1070, 4007, -484, -2779, -2728, -2080, 1744, 3312, -3003, -5151, -360, 1381, 573, 16, -3202, -4154, 874, 3012, -1814, -3708, -2045, -1000, 1082, 1603, -2952, -4981, -261, 1701, -687, -983, -2459, -3176, 653, 2585, -2031, -3454, -837, -355, 184, 1434, -2228, -4213, 236, 1696, -969, -921, -1284, -2619, 122, 2306, -1478, -3061, 87, -54, -120, 1011, -757, -3062, 600, 2033, -763, -625, -29, -1403, 168, 2551, -202, -2176, 843, 804, -13, 1799, 316, -2228, 566, 2740, 250, -391, 565, -1172, 31, 3141]
3152C141k229k919K263J277j101J978j371l753K428L496k151j503M73r97Q58L880
3168C770k200l930J618K034j67M90r12l844K194M752k120k598K80j53J247L102
3184C563k275m747J699M050q04n96j148l244K700M836k065m586N19J812R28K333
3200B975k300n655K688N096j075k069j448j485K507M771k577n516J169K937J067
3215A085O81k464m191K789N261j269m066m25K8K421L700l089n578K109M767O5
3231A824j164k475k955L606N259k210n193L93J644K141K373l709n032L057N495
3246C054r51k691j794j470L693M628l107n761J817L413J066P24l205m137L898
3261h23N131j821l814p68N16K808L573l737n153K881M177j76j253k566k270L918
$$ y = [3141, 912, -2007, 256, 1533, 432, 2410, 1039, -2714, -286, 3210, 1059, -444, 29, -968, -110, 3770, 1570, -2360, -742, 1292, 1125, 1615, 703, -3141, -947, 3805, 1685, -913, -633, -786, 461, 3563, 1288, -3459, -1760, 2290, 1486, 890, -258, -3502, -802, 4034, 1969, -2617, -2098, -286, 642, 2975, 675, -4980, -2292, 2804, 1729, -340, -1788, -3273, -766, 4005, 1428, -4088, -2919, 18, 1085, 1766, -698, -4889, -2100, 3161, 1892, -2174, -2599, -2571, -150, 3550, 461, -5117, -3008, 1759, 1824, 660, -1815, -4770, -1164, 4095, 1885, -3308, -2915, -1271, 870, 3243, -466, -5498, -2441, 3054, 2103, -588, -2382, -3852, -159, 4469, 1362, -4399, -2582, 831, 1897, 2621, -584, -4721, -823, 4308, 2487, -1327, -2095, -1579, 1229, 4802, 1065, -4088, -1207, 2970, 2794, 1541, -1025, -3295, 623]
3277F23M815l157m702J070J676J825J853l284m991L531M899j730k013j512j079
3292b176L457L702l350m559J643K783P80N22k470l951L514M460k496k747J26N8
3308g04J948K798l212m288K645L344o75p04j645k382K818M037k772l716J332J179
3324CQ94J916l128l634L227K885j325j276p27j224J980L501k551l599J889J642
3340D73p0Q04j474l090K587K890j689j808O02o81R64K678k293l149K327J647q50
3357a32O39o87k552J542L475k037k213J087m4M3L014j561l383J786K013j359M23
3374E4N5k204J178L423j867k215J090R3k11K338m37l587J150K460q30l6M17j950
3392a079K27L295j156k378Q46O55o20J993K41l532O89K888n54q31N3j529J0L595
$$ y = [623, 5438, 2281, -2421, -1351, 325, 2150, 4003, 719, -4272, -741, 4158, 2428, 415, -1097, -2176, 1281, 4983, 1633, -2926, -1283, 1500, 2280, 2802, 332, -3619, -105, 4355, 1859, -888, -762, -704, 1244, 4042, 830, -3458, -813, 2531, 1856, 1152, -493, -2875, -57, 3980, 1208, -2508, -1176, 3, 897, 2813, -315, -3949, -722, 2163, 838, -438, -1165, -2389, -409, 3092, 541, -3058, -1169, 473, 403, 1207, -267, -3357, -770, 2120, 431, -1377, -775, -1456, -492, 2186, -107, -3256, -929, 718, -132, 507, -180, -2732, -1190, 2285, 248, -1965, -878, -922, -879, 2135, 574, -2809, -1023, 990, -369, 54, 109, -2095, -917, 2506, 639, -1576, -486, -393, -604, 1734, 1297, -2290, -1140, 1320, 490, 454, 871, -1079, -852, 2443, 1287, -1091, -245, 410, -210, 1783, 2024, -1508, -819, 2069, 1515, 684, 737, -792, -782, 2813]
3410B813o31k974L03J084M8J358J0l224N9L437j31j589L01j490L0L564j43l903
3428a078O2J838J09R43M2l590j07M136J79k623P4o53K1L463q2m510k73L244P0
3447A265p9o41k507o2M597Rl904k79P16M28K531j92m710j89M019O18j554p06k180
3466b820Q66L913M07m732l76J919P64J464o77m279K2N185K84k716q38p47N40L954
3484B133k52m951j72L129N46J27o43l374N05M978o8l673p41P49J048K625m08m848
3502c290O1M344N71j302n90k574Q91M674k51m206p37K182P23J515l98m304J33
3519b558M930K57k679o24n78O24L601j79m567j63K958P67L2p61l276P85M824l34
3537C059l469l45L07R03K803p68m462L59L330M27j244m43k230O92M442m42l773
$$ y = [2813, 2182, -792, -489, 595, 643, 2001, 2011, -1213, -1154, 2283, 2152, 563, 864, -626, -596, 2968, 2825, -1078, -1016, 822, 931, 1874, 1916, -1674, -1781, 2355, 2534, -89, -15, -668, -647, 2816, 2734, -1776, -2049, 1195, 1265, 1186, 545, -1962, -2024, 2573, 2582, -1322, -1601, -885, -457, 2074, 1882, -2828, -3017, 1002, 1620, 66, -640, -2820, -1954, 1959, 2366, -2366, -2742, -823, -59, 1405, 728, -3551, -3529, 1656, 1940, -776, -1614, -2361, -1821, 2133, 1881, -3070, -3242, -113, 433, 560, -83, -3457, -2952, 2026, 1958, -1715, -2456, -1707, -659, 1966, 1558, -3290, -3229, 1115, 1686, 384, -206, -2780, -1889, 2785, 2534, -1672, -2409, -227, 496, 2011, 1613, -2691, -2558, 2372, 2629, -50, -674, -1252, -628, 2973, 2794, -1773, -1936, 1022, 1789, 1821, 1060, -2216, -1431, 3393, 3059, -410, -755, -448, 455, 3258, 2490, -1972, -1613, 1717, 2144, 900, 457, -1773, -1081, 3361, 2919, -854]
3554h54l37J564j1J946l98l988K74L718r9j869p5r14k2L225j47l851M33J750L9
3573C84K00N9l100N23L721m77k445k67J27o3K479k68l560L03K743m88m47O5j915
3592b426R2L270r5k987L37O35k84J737J63l182O6L023k60r75N83j783k61L191
3610H44O9k948K87J022m14J100O42k594m17L078k49j642L83j30j089K625N39k830
3628a724P6J693n84O33R36k465o66K629Q20k075O14k78o26K191P11k720o43J903
3646D25R4J66P08j883j072K862J084k366j97O25j151K051P40k473j070K208M67
3663A218m53L47j551j008K685J220k929k80R54p72J350J437l246j201K934O01
3679A306j277O51j485r62K882J445k762j339J274K12O33J194k762j583K775J405
$$ y = [-854, -1191, 373, 362, 2308, 1910, -2078, -1804, 1914, 1815, -54, -129, -1043, -1065, 2160, 2013, -1838, -1405, 345, 384, 584, 643, -2457, -1934, 1787, 1310, -1135, -1402, -1275, -1338, 1141, 873, -2687, -2384, 359, -129, -576, -511, -2426, -2334, 936, 841, -2146, -1809, -1174, -1458, 279, 442, -2740, -2674, 349, 89, -886, -303, -2086, -2347, 844, 913, -2035, -1748, -726, -1140, -40, 602, -1992, -2409, 669, 420, -1222, -839, -969, -2058, 567, 1106, -1724, -1648, 45, -539, 94, 1030, -1435, -2101, 528, 1348, -727, -113, -391, -1017, 1174, 1885, -835, -1478, 425, 519, 685, 1393, -490, -1562, 1300, 2384, 18, -179, 446, -705, 1346, 2086, -387, -1457, 751, 1218, 765, 1112, -439, -1447, 1238, 2458, -471, -751, 203, -569, 781, 2218, -1028, -2229, 705, 1306, 29, 680, -805, -1767, 1115, 2560, -202, -1541, -267, -55, 578, 1772, -990, -2573, 202, 1607]
3695A607j671l34m95j050K423J573k833j823K004P04K4N55k258j794L359J666
3711A657k445q37J38k14K079J436l218j764K537J273p74M4j612j250L161J943
3727B154l085j180J178MJ205J218k783k023L282J570j607l81p62j066K799J716
3743B239l388j414J943L83P21K54k145j540L253J621k338q31N34m87K116J265
3759B186l264j186K312J188q81M04j587j027K727K038k975r58P41P5J293J016
3775B102k433k039L303R44j111j59r50j083K700J725l331j377J838K90M62Q64
3791A745k324j411L003J159k096j52K00q23J926J194k817j035K074N08k53O32
3807A530j745j520L119J130k218p61O40n75J538J152k679j577K597M38o91m8r28
$$ y = [1607, -64, -398, -893, -1943, 480, 2053, -780, -2603, -599, 105, 129, 684, -1574, -3368, -9, 1657, -788, -1625, -1487, -1701, 378, 1814, -1404, -3168, -631, 642, -132, -88, -1700, -2950, 211, 2154, -931, -2111, -933, -929, 276, 1494, -1289, -3312, -30, 1540, -67, -448, -1210, -2276, 523, 2239, -1149, -2563, -620, -237, 484, 738, -1407, -2947, 306, 1927, -411, -1242, -708, -1195, 921, 2186, -1078, -2264, 48, 1236, 355, 759, -828, -1855, 872, 2910, -65, -1023, -282, -207, 1086, 2102, -331, -2370, 933, 1877, 766, 607, -343, -1426, 1274, 2999, -332, -1709, 129, 419, 881, 1745, -579, -1990, 1013, 2172, 76, -76, 124, -699, 1227, 2421, -396, -1431, 643, 1151, 898, 1530, -215, -1735, 1384, 2514, 296, -465, 175, -400, 1138, 2290, -389, -1966, 631, 1069, 378, 330, -598]
3824e98j149K071J678k666p27J117m4M93J016j925j829K691O68j085L7K7j408
3841a633J831J450k398j111J828K7j27J114j854j370K361J485j956j58P1q70J458
3858A48J470k187j510J700P33m49J073j656k035K619J442j867n67R35j083Q69
3874c65J710j581j887K059Q46q95P70r59j210J823J411j737p96R60l73P18J653
3891B147j752j908K163R29j037J85k88j592J739J906k196j314R99M78M42J147
3907B048j473k208K209K081k151k14N57j371J228J954j597j993J474M76k93J231
3923A958j328j677J784K137j910r23P53p01O25J991j650k483J885J518j051J55
3939A083l64j919J703K113j828j603Q68M7J84J917j796k335K187J411j035n61
$$ y = [-598, -1747, 324, 2002, -664, -1391, -274, -318, 175, 1191, -734, -2563, 128, 796, -289, -252, -225, -1633, 198, 1648, -750, -1861, -33, -6, -133, 981, -873, -2243, 118, 1603, -353, -511, -440, -1310, 148, 1618, -569, -2079, -379, 354, -95, 978, -678, -2713, -94, 1348, -519, -1086, -151, -1234, -365, 1345, -236, -2123, -64, 782, -113, 657, -302, -1512, 311, 1722, -15, -811, 149, -224, 494, 2147, 395, -1513, 650, 1579, 542, 727, 439, -1153, 586, 2492, 296, -1018, -19, 459, 901, 2048, 575, -1633, 576, 2657, 506, 292, 849, -522, 706, 2660, 1063, -930, 544, 1020, 727, 1958, 630, -1047, 737, 2874, 964, 41, 794, 93, 718, 2709, 1059, -1424, 461, 1979, 928, 1083, 719, -1200, 503, 2616, 788, -815, 53, 100, 284, 2201, 405, -1930, 257, 1668, 633, 72]
3955G2J66j419J098K309j915j799J039N65r9J326j519j742J488K130j608m52J92
3972a68q09P86K134j664k471J702J106q72R48q48k134J928K221k028j116J025
3988b60n56N30J751j544k183J530J521p50J59l63j610J456K119j622j551J168
4004b05K74p7J626j265k007J572J615j317l08L41j028J037J760j122j985J281
4020A92R68o33R94p99k019J533J978j440j208R42p78K04K097j141j917J298J102
4037A373q08N99p0k000R47K605j442j474J019n21M6J941r10k383J232J721j143
4054G32R8k1j399P54K178j193k013J139K60m69J808r61k467J259K194j132n79
4071A88L44j338M23K148r85k252J194R49n68Q53m38k209R75K112j149j063O01
$$ y = [72, 238, -1181, -83, 2226, 311, -1488, -449, 116, 17, 1343, -176, -1918, -430, 1700, 92, -360, -168, -977, -191, 1943, 279, -2192, -490, 616, -256, 692, -156, -2290, -362, 1859, -169, -1285, -260, -816, -286, 1465, -79, -2262, -732, 789, 39, 198, -165, -1775, -319, 1800, 178, -1373, -205, 69, -8, 1618, 353, -1654, -82, 1533, 216, -92, 249, -779, 258, 2018, 896, -1089, 192, 1160, 527, 1521, 722, -1297, 236, 2214, 774, -434, 508, -270, -66, 2031, 890, -1027, 271, 1373, 565, 1164, 1094, -906, 41, 2646, 1204, -270, 749, 228, 274, 2215, 1305, -1078, 154, 1875, 732, 830, 809, -590, 164, 2342, 1149, -864, 275, 535, 66, 1874, 913, -1554, -295, 1899, 767, 188, 532, -806, -383, 1765, 780, -1472, -278, 671, 103, 956, 518, -1691, -716, 1396, 247, -816, -215]
4088b15o81M34J748j008k183J006J404o80K00J52j857N66K198j044j191M03L22
4105d26l04J580n20k395R30J901r20j43J93j486O00K399j285j744Q35M11m9J164
4123G41m74k455J130K195r02r71O13j029K25K256p03k320J194J065o35R12q4k276
4141a518P31K671j008j361R02o00j19K071n33k512Q87J606o81J05M01j838P27
4158f9J981j105j435O74N14k30J088p10k013J029J924q63o20N26j489L69K023
4175A594j82k529R09P87o03Q46K85j860M54J902q07j123P91l46m76J900n03k646
4193a607J240J482j347K67M78j478K40K192r71j521J221m85n23J413k68k421J167
4210i21J447q25k80Q49j476KK192m73j945Q60M03o32J196J1k369O27K233j053
$$ y = [-215, -896, -462, 1286, 278, -1905, -899, 505, -175, 25, 177, -1680, -1114, 1084, 40, -1151, -748, -426, -730, 850, 330, -2065, -1135, 766, -154, -297, -104, -1590, -990, 1409, 124, -1620, -785, -374, -423, 741, 267, -2188, -1058, 1137, 235, -736, -123, -1152, -927, 1329, 626, -1694, -500, 565, -70, 842, 758, -1518, -787, 1884, 876, -485, 417, -183, -302, 1769, 1236, -1276, -389, 1217, 536, 641, 1042, -796, -69, 1912, 807, -628, 46, 560, 330, 1418, 708, -1305, -276, 1648, 785, 165, 691, -798, -429, 1594, 1412, -1117, -208, 579, -24, 822, 1107, -753, -299, 1603, 796, -327, 464, 118, -358, 1542, 1039, -1607, -367, 1115, -232, 35, 513, -965, -725, 1467, 496, -1025, 196, -289, -812, 601, 333, -2088, -921, 526, -299, -579, 270, -1206, -1204, 988, 515, -1430, -570, -167, -799, 397, 408, -1961, -1334, 899, -154]
4228a54o26O99n55p48K262n94j716M89J122q99M86O66j821J86J947n96j039P00
$$ y = [-154, -780, -81, -636, -1384, 878, 284, -1432, -943, 179, -720, -234, 432, -1389, -1203, 744, 148, -891, -191]
$$ [...]
8191a34
##END NTUPLES=NMR FID
##END=
