##TITLE=1H_EC-3189(32)
 CDCl3, 8 sc, 
 16.10.2019
##JCAMPDX= 6.0         $$ Bruker NMR JCAMP-DX V2.0
##DATA TYPE= NMR FID
##DATA CLASS= NTUPLES
##ORIGIN= UXNMR, Bruker Analytische Messtechnik GmbH
##OWNER= root
$$ XWIN-NMR		Version 3.5
$$ Wed Oct 16 14:51:13 2019 Russian Standard Time (UT+4h)  she@DPX200
##.OBSERVE FREQUENCY= 200.1315
##.OBSERVE NUCLEUS= ^1H
##.DELAY= (6, 6)
##.ACQUISITION MODE= SIMULTANEOUS
##.ACQUISITION SCHEME= undefined
##.AVERAGES= 8
##.DIGITISER RES= 18
##SPECTROMETER/DATA SYSTEM= spect
##.PULSE SEQUENCE= zg30
##.SOLVENT NAME= CDCl3
##.SHIFT REFERENCE= (INTERNAL, CDCl3, 0, 15.7039)
##AUDIT TRAIL= $$ (NUMBER, WHEN, WHO, WHERE, WHAT)
$$ ##TITLE= Audit trail, XWIN-NMR		Version 3.5
$$ ##JCAMPDX= 5.01
$$ ##ORIGIN= Bruker BioSpin GmbH
$$ ##OWNER= she
$$ F:/spectra/data/she/nmr/H-F/1/audita.txt
$$ ##AUDIT TRAIL=  $$ (NUMBER, WHEN, WHO, WHERE, WHAT)
(   1,<2019-10-16 14:50:20.50 +0400>,<she>,<DPX200>,
      <created by zg, POWCHK disabled, PULCHK disabled
       configuration hash MD5:
       00 E9 B6 7A A2 85 ED C7 34 08 36 98 17 FE 4E 26
       data hash MD5: 16K
       5B 4F 3B A3 5D FC 68 CB C2 16 4D 8E 73 B3 90 78>)
$$ ##END=
$$ 
$$ hash MD5
$$ A5 3E 1D 42 15 7A B2 F1 51 61 7A A3 22 22 D9 DF
##$RELAX= 
##$RELAX= 
##$RELAX= 
##$RELAX= 
##$RELAX= 
##$RELAX= 
$$ Bruker specific parameters
$$ --------------------------
##$DU= <F:/spectra>
##$EXPNO= 1
##$NAME= <H-F>
##$PROCNO= 1
##$TYPE= <nmr>
##$USER= <she>
##$AMP= (0..31)
100 100 100 100 100 100 100 100 100 100 100 100 100 100 100 100 100 100 
100 100 100 100 100 100 100 100 100 100 100 100 100 100 
##$AQSEQ= 0
##$AQ_mod= 1
##$AUNM= <au_zg>
##$AUTOPOS= <>
##$BF1= 200.13
##$BF2= 200.13
##$BF3= 200.13
##$BF4= 200.13
##$BF5= 200.13
##$BF6= 200.13
##$BF7= 200.13
##$BF8= 200.13
##$BYTORDA= 1
##$CFDGTYP= 0
##$CFRGTYP= 5
##$CHEMSTR= <none>
##$CNST= (0..31)
1 1 145 1 1 1 1 1 1 1 1 1 1 1 1 1 1 1 1 1 1 1 1 1 1 1 1 1 1 1 1 1 
##$CPDPRG= <>
##$CPDPRG1= <>
##$CPDPRG2= <>
##$CPDPRG3= <>
##$CPDPRG4= <mlev>
##$CPDPRG5= <mlev>
##$CPDPRG6= <mlev>
##$CPDPRG7= <mlev>
##$CPDPRG8= <mlev>
##$CPDPRGB= <>
##$CPDPRGT= <>
##$D= (0..31)
0 1.2 0 0 0 0 0 0 0 0.06 0 0.03 0 0 0 0 0.0002 0 0 0 0 0 0 0 0 0 0 0 0 
0 0 0 
##$DATE= 1571223020
##$DBL= (0..7)
120 120 120 120 120 120 120 120 
##$DBP= (0..7)
150 150 150 150 150 150 150 150 
##$DBP07= 0
##$DBPNAM0= <>
##$DBPNAM1= <>
##$DBPNAM2= <>
##$DBPNAM3= <>
##$DBPNAM4= <>
##$DBPNAM5= <>
##$DBPNAM6= <>
##$DBPNAM7= <>
##$DBPOAL= (0..7)
0.5 0.5 0.5 0.5 0.5 0.5 0.5 0.5 
##$DBPOFFS= (0..7)
0 0 0 0 0 0 0 0 
##$DE= 6
##$DECBNUC= <off>
##$DECIM= 24
##$DECNUC= <off>
##$DECSTAT= 4
##$DIGMOD= 1
##$DIGTYP= 9
##$DL= (0..7)
0 120 120 120 120 120 120 120 
##$DP= (0..7)
150 150 150 150 150 150 150 150 
##$DP07= 0
##$DPNAME0= <>
##$DPNAME1= <>
##$DPNAME2= <>
##$DPNAME3= <>
##$DPNAME4= <>
##$DPNAME5= <>
##$DPNAME6= <>
##$DPNAME7= <>
##$DPOAL= (0..7)
0.5 0.5 0.5 0.5 0.5 0.5 0.5 0.5 
##$DPOFFS= (0..7)
0 0 0 0 0 0 0 0 
##$DQDMODE= 0
##$DR= 18
##$DS= 0
##$DSLIST= <SSSSSSSSSSSSSSS>
$$ [...]
##$SUBNAM2= <"">
##$SUBNAM3= <"">
##$SUBNAM4= <"">
##$SUBNAM5= <"">
##$SUBNAM6= <"">
##$SUBNAM7= <"">
##$SUBNAM8= <"">
##$SUBNAM9= <"">
##$SW= 24.0689530833862
##$SWIBOX= (0..15)
0 0 2 0 0 0 0 0 0 0 0 0 0 0 0 0 
##$SW_h= 4816.95568400771
##$TD= 16384
##$TD0= 1
##$TE= 0
##$TE2= 300
##$TE3= 300
##$TEG= 300
##$TL= (0..7)
0 120 120 120 120 120 120 120 
##$TP= (0..7)
150 150 150 150 150 150 150 150 
##$TP07= 0
##$TPNAME0= <>
##$TPNAME1= <>
##$TPNAME2= <>
##$TPNAME3= <>
##$TPNAME4= <>
##$TPNAME5= <>
##$TPNAME6= <>
##$TPNAME7= <>
##$TPOAL= (0..7)
0.5 0.5 0.5 0.5 0.5 0.5 0.5 0.5 
##$TPOFFS= (0..7)
0 0 0 0 0 0 0 0 
##$TUNHIN= 0
##$TUNHOUT= 0
##$TUNXOUT= 0
##$USERA1= <user>
##$USERA2= <user>
##$USERA3= <user>
##$USERA4= <user>
##$USERA5= <user>
##$V9= 5
##$VALIST= <valist>
##$VCLIST= <CCCCCCCCCCCCCCC>
##$VD= 0
##$VDLIST= <DDDDDDDDDDDDDDD>
##$VPLIST= <PPPPPPPPPPPPPPP>
##$VTLIST= <TTTTTTTTTTTTTTT>
##$WBST= 1024
##$WBSW= 4
##$XGAIN= (0..3)
0 0 0 0 
##$XL= 0
##$YL= 0
##$YMAX_a= 266387
##$YMIN_a= -283169
##$ZGOPTNS= <>
##$ZL1= 120
##$ZL2= 120
##$ZL3= 120
##$ZL4= 120
##$ABSF1= 10
##$ABSF2= 0
##$ABSG= 5
##$ABSL= 3
##$ALPHA= 0
##$AQORDER= 0
##$ASSFAC= 0
##$ASSFACI= 0
##$ASSFACX= 0
##$ASSWID= 0
##$AUNMP= <proc_1d>
##$AZFE= 0.1
##$AZFW= 0.1
##$BCFW= 1
##$BC_mod= 2
##$BYTORDP= 1
##$COROFFS= 0
##$CY= 11.3945322036743
##$DATMOD= 1
##$DC= 2
##$DFILT= <>
##$DTYPP= 0
##$F1P= 20.1720416913024
##$F2P= 0.152960286110954
##$FCOR= 0.5
##$FTSIZE= 0
##$FT_mod= 4
##$GAMMA= 1
##$GB= 0.15
##$INTBC= 1
##$INTSCL= 1
##$ISEN= 128
##$LB= 0.24
##$LEV0= 0
##$LPBIN= 0
##$MAXI= 10000
##$MC2= 0
##$MEAN= 0
##$ME_mod= 0
##$MI= 1.114404
##$NCOEF= 0
##$NC_proc= 0
##$NLEV= 6
##$NOISF1= 3.799351
##$NOISF2= 2.8
##$NSP= 1
##$NTH_PI= 0
##$NZP= 0
##$OFFSET= 15.70392
##$PC= 1
##$PHC0= -9572.071
##$PHC1= 17.40093
##$PH_mod= 1
##$PKNL= yes
##$PPARMOD= 0
##$PSCAL= 0
##$PSIGN= 0
##$REVERSE= no
##$SF= 200.130013532006
##$SI= 16384
##$SIGF1= 3
##$SIGF2= 2
##$SINO= 400
##$SIOLD= 16384
##$SREGLST= <1H.CDCl3>
##$SSB= 0
##$STSI= 0
##$STSR= 0
##$SW_p= 3612.71676300578
##$SYMM= 0
##$S_DEV= 0
##$TDeff= 0
##$TDoff= 0
##$TI= <>
##$TILT= no
##$TM1= 0
##$TM2= 0
##$TOPLEV= 0
##$USERP1= <user>
##$USERP2= <user>
##$USERP3= <user>
##$USERP4= <user>
##$USERP5= <user>
##$WDW= 1
##$XDIM= 8192
##$YMAX_p= 0
##$YMIN_p= 0
$$ End of Bruker specific parameters
$$ ---------------------------------
##NTUPLES= NMR FID
##VAR_NAME=  TIME,          FID/REAL,        FID/IMAG
##SYMBOL=    X,             R,               I
##VAR_TYPE=  INDEPENDENT,   DEPENDENT,       DEPENDENT
##VAR_FORM=  AFFN,          ASDF,            ASDF
##VAR_DIM=   8192,          8192,            8192
##UNITS=     SECONDS,       ARBITRARY UNITS, ARBITRARY UNITS
##FACTOR=    0.0002076,     1,               1
##FIRST=     0,             0,               0
##LAST=      1.7004516,     0,               0
##MIN=       0,             -283169,         0
##MAX=       1.7004516,     266387,          0
$$ Real data points
##PAGE= N=1
##DATA TABLE= (X++(R..R)), XYDATA
$$ [...]
2227a71P53L87o85m65J398o41q44J406o18p54K76Q31j234K71J002q39n10R89o54
2246a02p04R88q3p92P54J4p70J88Q61j260J22J101p66p84J391m76r74R67J91j175
2266a309M68R93r82j60R50n56m36R19j25p10P30J08r42O82L19p11l2J263r86k43
2286g60J198n12r70R70M98j377N95O93r82J19J379r25m19R20k03o68J018j7j215
2305f58Q82M52q20k0J092j063m30J620o14r21P90M49j000N65M38p93J75P40o47
2324B37q9R83p86m32J404k98r67R04P8j073M70P68j088j8Q30o51q81J183J99r84
2344b11P53K18q64K23M50n27k59Q51k77o47J000l80r37Q10O19r79N4O62j056J51
2364c46O11K3q13P07J1r24O76J19n45m1P84p38J55O51o91o3P95o12p21R36N7j047
$$ y = [-171, 582, 969, 284, -181, 1217, 576, -268, 1138, 520, -234, 42, 873, -361, -90, 912, 73, -437, 552, -102, -806, 182, 99, -693, 61, 75, -695, -507, 354, -906, -784, 317, -449, -1233, 158, -318, -1292, -325, -134, -1309, -841, 152, -830, -990, -40, -596, -1032, -113, -238, -948, -218, -110, -1052, -370, -51, -762, -794, 469, -517, -760, 438, -74, -1044, -74, 424, -953, -358, 335, -647, -528, 851, -74, -493, 427, 224, -444, 574, 557, -658, 224, 676, -144, -164, 928, -135, -565, 1055, 441, -480, 310, 759, -241, 324, 762, -31, 144, 884, 237, 148, 1131, 345, -87, 1317, 1019, 52, 956, 1034, -39, 431, 1199, 111, 93, 923, 272, -609, 574, 773, -211, 542, 760, -104, 119, 569, 42, -217, 634, 357, -290, 710, 330, -607, 203, 822, -157, -103, 559, -497, -346, 265, 288, -525, 182, 193, -731, -55, 64, -481, -522, 262, -476, -321, 330, -361, -424, 371, -241, -962, -26, 31, -1016]
2386a016M29O65o76qP36p67l73J142l28q93Q16K27q61L72O73j156M64P54r63R7
2406f66O40m74l93Q87j58n69L20O55j020R6Q90o90o1N77n0o38M08K98p94M23M59
2427A40q08L28O95p51j5O66m66k46O98R8j090J205k13o33M28P12o52l51Q46l63
2447B28n93P41L3m33O5P80j092N10N04o93O3M90n10m73J098Q5p59L72O37j460
2467d07M83Q22q76j99P59n18j55M69J87o61N51Q9r42Q87J38j026N46O36j080r5
2487c92J222l14q99Q55K88j359M30Q60n31n97O71j07n68O16Rq42P60j0k63J5K09
2508E3q10J78Q37o80k19J075l54q98O29K7o78K42J055q70o0L31p33O5J006n94
2528c98l5N35l06m84Q60j47r00M77O19p08m16J174n08o03R99k6q88P07N4p2j77
$$ y = [-1016, -587, 78, -598, -606, 130, -637, -1010, 132, -196, -1089, -273, -46, -907, -535, 138, -1018, -554, 200, -763, -666, -26, -500, -893, -6, -164, -733, -413, 242, -778, -682, 208, -482, -543, 34, -16, -654, -246, 52, -742, -319, 140, -668, -340, 355, -396, -411, 255, -211, -457, 241, 339, -751, 454, 241, -392, 36, 748, 96, -255, 591, 228, -365, 376, 409, -24, 41, 821, -271, 239, 743, 50, 113, 603, 93, -380, 718, 803, 44, 416, 1053, -407, 76, 898, 22, -177, 582, 64, -91, 378, 565, -96, 455, 544, -398, 489, 627, -399, 147, 783, -297, -392, 830, 516, -383, 472, 760, -599, -169, 691, 160, -437, 234, 127, -441, 175, 184, -658, 102, 92, -171, -156, 53, -757, -579, 258, -422, -641, 434, 80, -818, -189, -162, -840, -598, 457, -413, -473, -142, -875, -810, 196, -398, -433, 102, -204, -688, 172, 25, -875, -398, 221, -487, -903, 271, -237, -840, 159, 133, -755, -48, 6, -66, -243]
2549b43L62l16l92N81r7l83N43k01K4L76k77o05O37M51o15RN08j94l67P01l43
2570A59m33O26L14q64P7J025r31k10Q04n26PN28Rr17P48K74q67M68L18o09L59
2591C59N37n26m18N75J18r85P93rm90K39M55n52L25o3m17J16O22m52k09Q35m18
2612D35p97M77L33p88L11M82o26n9P22l04m35L81P5q37L94M19n22j28M47k68j13
2633d01M22j15p75P48J54o59O46n5n76L08M52k70n43P67m61p1L77J00l84j28K19
2654b45n7R1M11m43m17J049n51l10O05k79m23N47K55q24K78L48k93n9M77k96n58
2675f94Q78O0o59J77L24l06L28K34n69K73K80l06j62O90j87n46N99j6r34M17O47
2696E28n13J31J10j40j50O59n10l56L94J47k64L04K13p19r1Q41m54k15P33m84
$$ y = [-243, 119, -197, -589, -8, -105, -488, 55, -146, -122, 254, -23, -628, 9, 460, -155, -146, 362, 168, -199, 502, 159, -274, 352, 666, -198, -121, 904, -27, -237, 567, 41, 48, 576, 585, -332, 416, 690, -177, 291, 609, 0, 359, 896, 370, -48, 527, 645, -340, 453, 444, -46, 193, 648, 96, 421, 358, -59, 57, 679, 227, 18, 853, 435, -362, 115, 448, -340, -29, 453, -173, -232, 490, 186, -249, 132, 207, -630, -236, 183, -339, -467, -20, -288, -401, 21, -94, -869, -121, 33, -626, 20, -35, -611, -303, 149, -121, -664, 103, -358, -429, -52, 48, -336, -464, -245, -302, -211, 200, -243, -660, 389, -162, -472, 133, -146, -569, -22, 233, -591, -313, 35, -258, -317, 160, -136, -694, 184, 244, -415, -238, 86, -220, 108, 342, -227, 46, 326, 20, -142, 548, 361, -185, 414, 398, -536, -119, 528, 15, 146, 256, 116, -34, 625, 115, -241, 153, 300, 36, 340, 553, -166, -257, 584, 130, -85, 648, 164]
2716A64m90O73J08m07J98L19n57J16N01l75m45R62l59m46K42L23n56L18L25n25
2736H9N23j56n42k55R50j48r13Q12K74q07M93J53q84K40N47m35j99O28j54n60
2756c44N45p5m09M24J39l24r1N82n37o5M05n21m4L44o4m15J90J35k18J50P08n74
2778e9l31M58l38j57K76L6k80N95l93k60L60L43p51K58K71j28l04M68nm62J70
2799b33J40m15m7M97l54K00J22j20q1L22m02k67O01k68k17P32J4m50j74O73l53
2820h0j76N41l47j92Q16M2r95O30M70q02O3Q03q38J74K44P5m72M52K06o31R1L93
2842D67l60k83N50k80k73L13K12l16M94K3o84L91N2p46N52J21j46n7J29j05l30
2863b76N14k23m68O63Q7m90J26M68m72mK06K81q07N44J07o73L00J50o03N38M1
$$ y = [164, -326, 347, 455, 48, 246, 565, 8, 124, 625, 250, -195, 767, 408, -38, 204, 527, -29, 289, 614, 89, 612, 456, -86, -341, 609, 461, -452, 360, 634, -173, 320, 473, -411, -171, 376, -59, -258, 370, 216, -344, 201, 126, -283, 141, 280, -44, -135, 447, -90, -155, 250, -271, -315, 29, -35, -450, -260, -125, -343, -193, 515, -59, -390, 68, -270, -427, -151, -115, -395, 200, -193, -453, -93, 250, -501, -243, 28, -100, -404, 64, 59, -403, -233, -93, -508, -555, -58, -412, -212, -90, -210, -291, 31, -371, -638, -37, -305, -522, 210, 224, -226, -400, 273, -80, -256, 285, -62, -254, 562, 604, -391, 239, 709, -93, -30, 773, -65, 109, 353, 428, -44, 408, 614, -17, 74, 467, 107, -176, 374, 94, -179, 134, 346, 30, 524, 547, -137, 254, 306, -440, 112, 233, 87, 30, 159, 54, -276, 238, 15, -453, 210, 297, -193, -67, 401, -71, -75, 131, 412, -395, 149, 256, -417, -117, 33, -570, -32, 9]
2884Im15K00L25j44j4K48l32l55K73M46r01L41N54m60l09Q78n50m81Q81k31l20
2905c57K56k49n03P03M15n10%M95l35l06O17l31l24O48j62n30J33N99n81l8M47
2926H7m67K43J54Q0n21L47L26n31K58L46n86r5O66o85J83O37m16l17O40K2o21
2947b50K25N49q93K81O74q36k16O70l19k90P06j09n96M79K83p40J83O48m90L2
2967iK84l40q7J39J91m71O27ol60L4N64n62k49M84K7l47J95L26q27M23P7m70K60
2990i7L14l53K03J30q4l06O67o14l4R9N21p47K78M6l50K38L61m66m05P58j65k94
3012c00L43K75q34L56L78p14J24M28r9j06J21K60l95L9J60l08L89Ml17J5M14l08
3034g5q9J13j91K00K86J5p80M24P3j76k52N17l31Q2K24j53j64L09j73o2R4J46
$$ y = [9, -406, -206, 119, -25, -39, 209, -123, -478, -205, 241, -660, -319, 235, -225, -534, 344, -206, -687, 194, -37, -357, -101, -350, -853, -150, 265, -245, -245, 250, -85, -391, 226, -105, -429, 219, 57, -473, -340, 259, -322, -360, 87, -380, -137, 17, 97, -424, -77, 249, -282, -24, 322, -264, -359, 307, -378, -195, 442, 26, -291, 349, 371, -250, -25, 524, -369, -88, 586, -250, -466, 204, -115, -405, 301, 192, -404, 75, 358, -382, -199, 449, -41, -9, 275, -65, -152, -13, 178, -293, 334, 328, -32, 2, 566, 4, -245, 239, 266, -81, 114, 440, -387, 36, 113, -357, -97, 217, -136, 67, 197, 113, -193, 474, -140, -174, -75, 446, -301, -23, 23, -327, -89, 272, -194, -599, 159, -6, -300, 43, 318, -516, -160, 218, -496, -372, 56, -43, -149, -28, 232, -163, -124, 36, -272, 117, 121, -196, -181, 233, -75, -164, -51, -242, -42, 244, 259, -521, -97, -24, -200, -452, 65, -266, -184, 40, -113, -277, 32, -141, -203, -109, 37]
3056C7l89J19N11p06J41N21m83j93N05l0m74N04M73p22J74J20l27l63O94j74k53
3077c15O42j63n22L33O8j84R8j13J88j58N35m93k55M96j41l42N17N2n94M43P5
3098A67m30N8M61j88l44N26o0m19L85Lk87q8L21k54M1N16k71l29J50K05n10O00
3120B53J14n84N38j50l23K00P0J90m40M72l86l81M96K77m35K75K68n61j9K76j99
3141d9l08L99L5m68N84J41p13L14J41m02J89L86n88j02M23J53m79L92N4l71J86
3162h3N0m19K12N91o70q4L13j88J18M66k61l13J63J41o9J81K83n58J3K01k01n7
3184a71K14j69j62K63j45L07l7j22k34O5M50q7m44M32J62m05J73j71j70O47M3
3205D39m39j16K13O3l43M50k28n0J53K71o50J01K07k44RP77p30RN45l75L6k11
$$ y = [37, -352, -233, 278, -428, -287, 234, -249, -442, 63, 33, -441, 63, 536, -186, -12, 108, -219, -582, 112, -62, -315, 327, 164, -358, -25, 43, -141, -43, -156, 32, -126, 409, -84, -339, 157, 16, -326, 191, 243, -351, 92, 167, -263, -205, 256, 68, -276, 250, 190, -229, 156, 159, -128, -216, 105, -149, -108, 408, 137, -192, -42, 163, -347, 253, 367, -217, 321, 171, -152, 48, 118, 308, -132, 340, -46, -427, 69, 346, -89, 186, 454, -107, -126, 150, -49, -357, 42, 77, -391, 193, 334, -379, -65, 76, -326, -137, 249, -339, -441, -18, 135, -344, 48, 102, -269, -83, -33, -452, -240, 351, -319, -403, -90, -278, -160, 306, 45, -268, -105, 36, -33, 148, 431, -127, -114, 87, -114, -171, 43, -126, -288, -25, -170, 137, 100, -22, -256, -191, 259, 172, -272, 160, 322, -83, 90, -81, -251, 396, 439, 0, -116, 97, 160, -183, 267, 39, -11, 142, 413, -237, -136, 71, -173, -164, 613, -117, -108, 437, 62, 98, -113]
3227a13J60l13J79Q80p52r2K61k56j22L36k14N7K55p4j96j58N33o09M60J05n46
3248b19J85J37o2j02K00k5k46ML43k70j17M34n39O6K71jj72M09o8l49Q1O6p0Q7
3272D3o1k32K04J18j44k31N22k28k15L79J08k96J50L03n59j79K64J39k62M38k90
3293b9n18Q21K0n17K15J30n1l59N31n75J25K03j16n7K77m6k87M17K64p96L68j19
3315i9K02k12l7N1j21L12L1m20K72J89n32N23K06m00j86K93K56m47M52l90Q9l4
3337bM32k32k31Q5j38K3J70l74j8L48K03m18K62M04m82j00M42l43o1L12l67L9
3359d6L34k25k82L05M1l16M85nl95k11O65m67j07M98k40j75N61m77k44K45K43
3380A87m21%K80J27o17O10O8m93K07K34l63Q0L45k65J32K4m45o2O07L7o04K72
$$ y = [-113, 47, -266, -87, 793, 41, -51, 210, -46, -168, 168, -46, 11, 266, 192, -4, -162, 371, -238, 222, 327, -219, -34, 103, 41, -61, 139, 114, -132, -128, 215, -55, -172, 262, -277, -211, 60, 59, -113, 296, 228, -121, -40, 26, -44, 43, -18, -250, -46, 72, -72, -303, 219, -9, -224, 155, 263, -33, 117, 420, -139, -318, -54, 85, -177, 261, -29, -547, 274, 294, -223, -8, 122, 71, -288, 243, -332, -207, -4, -120, -177, 100, 54, -233, 184, 448, -348, 20, -99, 103, -109, -146, -95, -216, 96, 127, -293, -21, 168, -364, 159, 365, -35, -221, 72, 328, -119, 333, -57, 32, -2, 430, 198, -33, 52, -86, -63, 107, -267, -285, 63, 266, -152, 110, 514, 32, -68, 374, 31, -30, 282, -85, -46, 288, 63, -219, 86, 127, -189, 296, 291, -104, -315, 350, -117, -224, 274, 34, -141, 420, -57, -301, -56, 187, -234, -234, 46, 173, -444, 166, 234, -259, -52, 182, -181, -101, 244, -21, 111, 135, -310, -372, 235, 272, -332, -60]
3402f0J45k40J28N0j97N1Q2p1qM7J12k46K64L43n82L9J75k11j80M53l36p4L99
3425H3n04L01M99n1m64L17q0m02K13K7k31l9N65k53j86K7Q4j5L49j52q9lK76n81
3449c09K10j70M2N00j67r2O7K42j30m60K68l2r6N5L24l51K6J80j67j11J74o7j50
3472b14L28N0j99jN14m99j69J46J24j08O7J25q7jm8J20P8l35J5L8J30j35n4J08
3496gR8L1j47J12l95J44N5k9O7K80n06K6M32q2P2j99L61j76j27j87j03L55k98
3519b23J39j93J19L01m28J38L44m62m6p7N26l64K83J28l35J37j64%K16k78J73
3540f6L06k49j3m6K72m02J11J36N1k09N0K65m52L03q9j83O1L90m82K93q7M1k21
3563b20L06O0j25n3K89j43k2K43k19j93K31l66K09P9J01o2JJ54o4m32J56o8K48
$$ y = [-60, 85, -155, -27, 23, -174, -123, -41, -112, -120, -73, 39, -207, 57, 400, -182, -143, 32, -179, -359, 94, -242, -316, 83, -421, -120, 379, 328, -136, 181, 101, -301, -88, -61, -292, -331, 234, -19, -205, -178, -94, -109, 240, 88, -1, -4, 272, -309, -99, -269, -227, 273, 106, 14, 81, 323, 193, -267, 1, -31, -127, -72, 252, -99, -73, 107, -60, -171, 3, -64, -214, 114, 164, -35, -36, 478, -21, -190, -44, 80, -28, 39, 164, 77, 76, 28, 148, 226, -109, -94, -56, 74, -61, -115, -7, 91, 122, -25, 87, -308, -164, -109, -138, -71, 209, -297, -271, 161, 79, 151, -48, 313, 137, 10, -177, -280, 75, -223, -84, -277, -158, 143, -285, -147, 197, -265, -311, -388, 138, -226, 57, 185, -150, -13, -177, -177, 39, -239, -66, 240, -9, -22, -68, 204, -198, -87, 49, 100, -109, -59, 206, -246, 57, -32, -215, -154, 236, -246, 47, -40, 1, -220, 86, 146, 21, -32, 257, 114, 92, 335, 116, -77, 154, -212, -3, 76, 177, 115, 116, 270, 206, -226, -70, -138, 110]
3586A10o2J4o4J21r9k70N88R6l23q0J80j51j14L03j67m3K14j70l35K28K76j86
3608F6j6J27j74l2n8L15n4L3j47l64M03m0Kl8l13L87j57k74J92oJ06k1J23l95
3632c35L46q8J01m4q0j68M93o19L59Lr3K49p0Pm02L97k41O6K99J5k06j61J38Q
3656b6Q1N8k5j38J46j25k04M01m7k46J02J50o2K07o2qj98M9L45l54N2J49k86J64
3680A23K67l56K5J67l30K0K17N7k60M70m10m5L13l80J54J49m8J01m06M65j42j00
3702E1k7l2j23K53k4k38K5J47o9K0K52m54L47p9j31o9K06J00l46J20N8N6j83K21
3726H1o3l6k11J49J99r5l0j47K27P1k23K16K8n1k75No5K39q1N5l3o4P3k94K29
3751i6K57j22j78J4N3J53p1L53k30k08K2j17K49Q2j13j20M2j23j23K54j06M7j87
$$ y = [110, 48, 62, -2, 119, 20, -250, 338, 434, 111, 31, 211, 60, -54, 249, 82, 39, 253, 83, -252, -24, 252, 66, 50, 177, 3, -29, -87, 228, 174, 207, 60, -304, 99, 59, 61, 23, -290, 97, -60, -334, -142, -148, -42, -63, 60, -335, 11, -77, 24, -20, -100, -268, 225, -394, -35, -32, -125, 124, 54, 61, -341, 56, -185, -119, 180, 195, -11, -172, -34, -26, 55, 113, 88, -50, 96, -29, -233, 168, 121, -125, -23, 127, 65, 272, 210, 202, 4, 53, 398, 44, 96, 245, -41, 123, 390, 34, 59, 226, -104, -84, 133, 190, -70, 400, -10, -55, 258, -122, 32, 181, 133, 234, -172, 293, 151, 51, 24, -8, -131, 122, 98, -140, -115, 32, -37, -17, 235, -219, 128, 49, -82, -151, 55, 155, -191, -71, -13, 43, -140, 81, 18, -18, -229, -80, 119, 24, -6, -153, 74, 145, -78, 138, 166, 115, -160, -155, -220, 19, -62, -7, -40, -104, -31, -325, -96, 161, 39, -139, -125, -72, 81, 10, 363, 133, -75, -53, -170, 79, 161, 48, -72, -30, -153, -276, -22, -128, -81, -268]
3774b68L13k53R5K72k94O6q5P0j28J1K79L9k91J39L07o75Q75m57J19m00R0K09
3796C3j11J71j1K02l26J94j67R6k56p4M21J00l37j22K53k58J70K30j30K3k33j7
3818a49K04p3J81J78j01k21PN9j98k60M77J16l91L69k52j05N44j85k71K35n5j75
3840f6J0Q6M4k83J40J27k74K71J04oN2k28J4J15Kk95J99j98K35j63P6L92j44l84
3864a74mJ20M1p2K49n46J64l4kK09J81o4j58j83K70k31J52J02l0j39K48l3k78
3887b12J0K40k55J64j68K91k50J68p7K4QPK9j31k63N61o0l47N31J2n36J68K33
3910A47j28j23O6k3j05J26M7J46l85M03j56o1J71j67J8o8pjK8N32m38j45N34k12
3934A99q3k93K90j48J93J19k85l16M77j23L7N5j41O3K43k67j62K33j2J46j26p6
$$ y = [-268, 45, -208, -113, 159, -135, -69, -154, -84, -212, -201, 78, 117, -174, -35, 272, -403, 472, 15, 134, -266, -176, 33, -78, 93, 82, 284, -42, 152, -15, 81, -175, -249, 172, 272, -65, -187, 66, -192, -22, 208, 78, 101, -132, -149, 55, -18, 163, 341, 240, 19, 26, 85, -113, -373, 104, 220, -171, 198, -54, -159, 385, 200, -71, 164, 109, -66, -56, 30, 74, -209, -69, 58, -216, 55, 159, 153, 205, -23, -9, 106, 108, -187, 12, -186, 49, -114, -38, 354, 210, -174, -178, -58, -17, -89, 160, -386, -222, -256, -258, -49, 132, 68, -90, -273, -3, -234, -82, 20, -10, -149, 99, 66, -212, -202, 38, -217, -53, -221, 70, -180, -12, -89, -65, -57, -50, -21, -152, -415, 146, 86, -261, 270, 282, -254, -86, 147, 19, -104, -38, -61, -166, -40, 7, 153, -232, 171, 15, -46, 125, -42, -24, -92, -99, -100, -72, 460, 22, -123, 411, 199, 116, -177, 113, -35, 158, 277, -8, -324, 153, 30, 67, 122, -19, 44, 287, 20, -142, 91, 79, 225, 99, 23]
3956B3l4J80J60k42K85p0l12J27K26j36k4l3l28K22k2J2n9K80k22p4l7J60l29
3979b47P5K63J2O1l21K82j52L6j8k00J60K01l00Q6j19L71q4l84M32n23J37M50
4001B18n53MK84J14k17k46J17J47K1J82m43L90l9j14M0L7j03n9K39o1j19J13j36
4024a84J34m4m7j89K30J09J02l24K06MO4m9P0k50K6m2K2L33n9k95j51O92l94L3
4048cL4p2j25L24L1j25j68N54m88j61K22J05k33K08p9R5J55k91K41p8K24k30r7
4071D3O6O5p9J42L11m24M4M0j67m1K25j70J3k84NP1M37P6m42N8K73K5j83krJ3
4097A06J25k79M15J8l82j82L76P1k95K8J55J17l46R5l6j24L37j06m5l3j07Q2k49
4120b59J0J75k15K54l6q3J96o2k29L45k04R8l50L71J13M3j57l9m5q7j2j23K42
$$ y = [23, -11, 169, 329, 87, 372, 302, -10, 117, 343, 207, 183, 150, -178, 44, 22, 34, -25, 255, 33, -41, -78, 82, -247, -172, 91, 103, 164, -157, 125, -27, 9, -9, -209, -49, 152, -148, -62, -181, 190, 106, -278, 154, -369, -232, 218, -335, -331, -47, 67, -150, -396, -279, -132, -111, 71, -372, 18, -21, -135, -95, -58, -161, -220, 19, -42, -161, -48, -184, -50, -94, -141, -330, -100, 9, 111, -213, -7, -3, 61, 12, 82, -168, -142, -184, -162, 171, 112, -183, -334, 358, -36, -3, 31, -41, -166, 158, 189, 64, -104, 450, -38, -199, 23, 128, -105, 103, 24, 119, 274, -17, 224, 146, 370, 140, 43, 109, 174, 95, 237, 548, 124, 168, 208, 41, 0, 225, 55, 68, -216, -211, -140, 297, 373, -69, -11, 262, 287, 104, 102, 93, 106, 231, -48, 367, 385, 3, -179, 197, 268, -27, 1, 156, 273, -73, 22, -14, -138, 199, 93, 48, 15, -92, -10, -259, -249, -74, -289, -35, -71, -154, 42, -20, -249, 96, -108, -10, -360, 11, 124, 167, 10, -29, -74, -161, -173, -296, -54]
4143e4m4n5PJ88l22J50J15n9j70K09k59P4PL16j59r1lj30J33o5J42k24K50N4m
4168Fl4n9m20O06k21K28m04M17l45L99k07r2K00M3k2j83j30L16k87J73K33k8k25
4191c6R3J18k86K06M7j03J9K00rj44O5P2k52K53q8j61L06Qn45P61l59j5k6J14
4215B38k92K03J62k53l45N00L0j34r1K21j03KK41l91K95m9j45K50r0o0k37K64
4237B16k40O1n7J92n9k22M53l92k03M66k84j63L66o7j96K8j5p1K03j32l9m5L28
4260A28k16n09M20L77l64N3K63n44J6J20LJ9K56j13j37L20j93l6M36p2o36J59
4282b50J13J04j02K53q7k32L98o5j56p5J32l58J43M99k26k51mj02N12j07j92n7
4304a10K21J03j25L9l3j85k51N94j1k15L98l15n5K53m08L43j07N3Ql5k39L61k70
$$ y = [-54, -98, -153, -146, 42, -280, -130, -15, -74, -244, -35, -294, -220, -213, 103, -56, -147, -150, -280, -147, -212, -70, -294, -44, 10, 6, -28, -87, -507, 99, -122, 106, -298, 119, -226, 173, -34, -126, 74, 117, 95, -88, -218, 98, -189, -16, 217, 189, -36, 57, 175, -111, 95, 142, 39, 58, 258, 249, 105, 170, 242, -10, 243, 155, -6, 300, 308, -237, 524, 165, 150, 124, 238, -54, 149, 311, 58, -287, 213, 243, 109, 18, 239, 136, 138, 379, -12, 283, 234, 89, 339, 249, 189, -48, 216, -24, 37, -20, 172, 113, -109, 344, -48, -251, 215, -69, -232, 134, 67, -129, -101, -116, -187, 16, -116, -155, -200, 128, -88, -597, -177, 200, -164, -111, 152, -392, -376, -256, -253, -234, 22, -91, -228, 92, -101, -137, 299, 227, -409, -250, -137, -33, -135, 118, 31, -201, 197, 132, -24, -99, 33, -325, -182, 317, 91, -160, -164, -266, 246, 139, -53, -110, 111, 214, 89, 128, 95, -90, -341, 253, 242, 27, 425, 110, 55, 308, -100, 243, 136, 189, 197, 162, -77, 284, 14]
4327A4K90j62k04M61Mm42N36p0k19l58L98K9j78K48k59j31K85N7l05J67J67r8
4349B30k37L21l83L8J33J6j41M08m08j64K54K09l59K14L6l46L13P2l18l67P51
4370B72Mo21L18o6l24K01O02p08J37K07k09M7J86j32m21M32J40k80J41j17j73
4391c64J87K12j19l27L87K86n00R7J6k29J88J48P0j04J90j14l01K35l21J83L45
4412A65j54k67J52r8j91J59K74r6j49L51k6l23J84L59l63Q5l10K67r9K89m83K66
4434hL21l36n1M50j56l50M46j6o27N89o9n1j05K82J63l92K76m5l12J97K21k67
4456A60L04P6n22K87j3l29j30N84k00j03L76j24n92L75J43k54K2J56j71N5qJ07
4478A99l26N35K9m67K73J36J4l72M01l69J3L85j66k93J51J50l90L40l4m36L48
$$ y = [14, 304, 142, -62, 399, 403, -39, 497, 427, 208, -150, 248, 277, 99, 347, 88, -43, 242, 299, -6, 161, 328, 230, -7, 314, -69, -31, 102, 118, -23, 385, -23, -187, 67, 276, -83, 131, 167, -179, 134, 206, -112, -479, 272, 276, -345, -27, -93, -417, -216, 386, -322, -185, 22, -187, -140, 46, -86, -507, -75, 65, -215, -74, -191, -364, -177, 35, -84, -411, -24, 262, -238, -141, -125, -354, -166, -18, 52, -52, 138, 24, -277, -42, -363, -180, 165, 11, -256, -104, -202, -393, -234, 40, -56, -205, 146, 120, -203, -19, 340, -23, 62, -248, 19, -80, 209, -274, -8, 313, -23, -74, 376, 220, -130, 316, 300, -327, 262, 193, 142, 37, 319, 482, 90, 366, 321, 9, 206, 427, 160, 464, 540, 18, 305, 292, -37, -167, 417, 217, 114, 490, 366, -226, 149, 292, 38, 60, 216, 45, 100, 92, 199, -127, 408, 437, -30, 243, 379, 393, 21, 422, 53, 66, 451, 285, -8, 143, 293, -97, 243, 209, -227, 121]
4499A21N33m74j91J70j98j56J56q5k52J01M30k05N6L94n08k6K56k69m31N67j46
4520a57Q5k05N04n51m1L85j62J97j12j18j10J14K67p14P35l26j88O48l16k44K75
4541c4J51o9k28K18j60l22N72p1m05K35J52l43L11M3Q2l35J03J36k17L68j00j37
4563e0J03J00P9k94N93o08J29R3K72l60L25k2o37K16K80j12M4K11l99K00K43K6
4585D32n79N20k0l77N05l85k16M75M7l35J56K56k38j42K53l4n73K65N47n03k6
4606B8M72k91k39L99k50l22M20l97r7M94j70k25K19m6r6j65L67J78m62K17j7j32
4628a15K3J56k55K63O7l13J91L4jk76J90j94j59N11j90o28N20K60l78m3L29l43
4650c51j58N67k71j93J97M62q34M36J39l24J23J2j09L8N47o89JN51j75l39N68
$$ y = [121, 654, 180, -11, 159, -39, -195, -39, -124, -376, -275, 155, -50, 6, 400, -108, -134, 122, -147, -578, -11, -157, -72, -277, 227, -324, -365, 20, -142, 55, -57, -175, -285, -171, 96, -618, 117, -209, -397, 251, -65, -309, -34, 117, 48, -180, 38, -122, -444, 128, 57, -348, -113, 39, -304, 7, 50, 132, -203, -100, 36, -181, 187, 87, -50, 53, 153, 232, -62, 531, -77, 52, 145, 417, 57, 382, 360, -277, -61, 219, 107, 151, 362, -37, 163, 406, 432, -147, 373, 353, -24, 481, 96, -120, 355, 402, 67, 223, 479, 241, 99, 352, 318, -255, 10, 557, 54, 28, 500, 209, -30, 369, 119, -203, 217, -180, -277, 217, 47, -178, 41, -5, -101, -266, 101, 279, -183, 34, 17, -115, -92, 64, -191, 72, 139, -174, 17, 51, 50, -226, -36, -230, -389, 122, -68, -696, -176, 84, -294, -337, -8, -351, -509, 58, -213, -406, -209, 253, -581, -145, -6, -330, -207, -195, -304, -266, 281, -408, -407, 144, -31, -370, 198]
4671A98j37l14m7L88l0n08O41l51k67M00J03m9k24O2L4j8L46m37lK99p6l74N61
4694A97j27m98O02r3k43K16N96o88n7J96l04K15M15k4m36L26j60j50N7M1j99K35
4716A17L28l70n44P83k94j27M10L2q48N87K64j50l95N36n05J31K37m3k32J54K20
4737B91m51J66J54l88J97K79k92K11L7P4p52O25o7m45M42J72m18J7M29m58jK47
4759F9k21k79K22R3l44K73M71m50l39O41o03p9P33j76p32L23K82k49J20R3k23
4780c75l4L77k0j86l8o0m8N47l80k64L58M2m20L51N97r06m5P24o80l9N85r4l76
4803c84L99k30r9L16J39l54QM88l31j43L81j20k76M57k76m17O22j27p0j50N88
4824D21o17j49O14j95l05N63j1m22K01L98m55q5M12l31r6O11n21j06N65k23k72
$$ y = [198, 61, -253, -300, 88, 58, -450, 191, -160, -427, -27, 76, 27, -197, -135, -101, -119, 227, -210, -213, 86, 10, -364, 197, 70, -428, 174, 81, -162, 54, 650, -38, -95, 101, -203, 12, 427, 403, -33, 293, 133, -17, 40, 81, -118, 117, 445, 75, -469, 314, 20, -107, 303, 335, -513, 74, 338, 188, -207, 329, -176, -45, 192, 149, -83, 71, 291, -160, 6, 160, -228, -31, 248, -44, 167, 204, 278, -474, 151, 84, -361, 81, 253, -165, -148, 281, -177, -178, 69, -152, -431, -209, -116, -460, -187, 284, -166, -505, 136, -467, -546, 187, 11, -721, -398, -116, -365, -245, -152, -375, -409, -32, -52, -238, -276, -336, -384, 163, -217, -481, -123, -81, -501, -150, 447, -459, -504, 220, -460, -499, 86, -8, -384, 15, -215, -314, 2, 141, -213, -205, 283, -48, -191, 190, 70, -206, 251, -25, -442, 180, 53, -17, -167, 421, -196, -345, 269, 74, -231, 332, 321, -101, 100, 498, 43, -42, 370, 39, -57, 554, 33, -73, 492, 269, -3]
4845cM26K64o31j5N90o98N2L65k04j50L77j12k75Q2M49l34k85O27q23J77K43K09
4867C31n43N24k02j96N67o4p02K08N07m71r6N34m95l8L41j35m92M61P9l76K50
4888hJ73k77l73O08n00J55K15p7l98N67k22m1J38K73o53k33Q30l14k03M43l34
4909b31l66N18j6j74M6M91l43o0K58l69J21L4K6k70N21l97J24J27M02j030L96
4930a92M28j63m37Q59n55p3M02l0o27O12P3l88N3N69o16R1J45m7l42P25J7l35
4952A69m6M06m85j86N30m12J25L59Pn73O99k61n17O21R7m08J25K21m36j87P28
4973E76l58l32O35P0o92L73K72k64j72K82j84l01P06o96J65M33m14j29L58J52
4993D80p05K38M28m68K7M06o44M61L58o01j45Q4K20j94L89j16m31K05M51m23l80
$$ y = [-3, 423, 687, 56, 41, 631, -67, -15, 350, 146, -4, 373, 261, -14, 68, 517, 183, -102, 525, -298, -121, 122, 331, -212, 312, 110, -86, 481, 417, -285, -77, 430, -41, -137, 397, -98, -136, 205, 70, -422, 39, 118, -258, -8, 165, -112, -485, 123, -377, -222, -7, -84, -482, 85, -137, -178, -40, 233, -420, -653, 177, -137, -340, 103, -231, -597, -79, -95, -269, -223, 268, -75, -135, 123, -246, -125, -91, -65, -335, 186, -211, -87, 40, 442, -588, -192, 236, 73, -364, 495, -60, -133, 269, 239, -388, 224, 297, -91, -38, 531, -85, 6, 151, 104, -238, 487, 504, 169, 123, 529, 44, -142, 388, -24, 101, 460, 467, -106, 593, 332, -185, 436, 533, 125, 250, 471, 35, -152, 576, 218, -114, 521, 591, -101, 272, 544, 280, 108, 390, 206, -95, 611, -85, 80, 513, 99, -30, 328, 480, -225, 13, 441, -27, 0, 406, -238, 223, 581, -20, -165, -81, 139, -55, 334, 218, -213, -8, 443, 20, -360]
5014c60N78j97m17N38P1l86L88j82m34K13N30p37J75M09m23k36K59O5j88M15j27
5035d6l53J51K68m58K12K62k17j83K70j18m23O90M36j118N02J41p5m57M70%l97
5056d43M52P4n04L02K28l16J44L79p27K75L94o55L6O55m54j77M46j73m70N55K19
5077B40o07J02O26k16m19O41j22l85L53L00o72L88J92k95K10J66n23j07M08j82
5097I8m4L18J86o87L83J89l38j4M75k50q9J95j77l63P37k56n46L56J79m48J16
5118B0N00o7m47P15q16N8L71j75k52p2L95m2m40Q85p69R7K62k42n45P64%m55M4
5141b11L62m08pM23p04K60J88q8k75Q56o29j23O19k51o50K93M01l66j70M47L6
5162Cl36J95K2n98M56l2m99P78L78p55J4L89l22m6M83k71k75K75J56m51m5N54
$$ y = [-360, 218, 21, -396, 142, 213, -173, 215, 33, -401, -188, 342, -395, -220, 189, -234, -470, -211, -146, -334, 81, -46, -399, -248, 20, -438, -226, 36, -181, -364, -94, -212, -635, 55, 491, -627, -125, 16, -59, -516, -46, -46, -443, 9, 83, -421, -119, 109, -207, -63, 316, -411, -136, 258, -397, -361, 294, -160, -337, 109, -64, -534, 21, 240, -367, -265, 361, 145, -274, 367, 245, -140, 213, 513, -159, 229, 421, 126, 336, 502, -21, -128, 280, 98, 54, 372, 558, -129, 254, 443, 105, 91, 566, 316, 227, 422, 245, -118, 619, 363, -183, 173, 352, -96, 20, 520, 453, 6, 721, -95, -37, 334, 159, -93, -165, 230, 188, -252, 633, -136, -39, 223, -19, -564, 200, 200, -255, -211, 151, -257, -264, 159, -545, -285, -97, -185, -460, 396, -233, -356, 263, 12, -638, -345, 56, -310, -480, -33, 3, -333, -138, -116, -714, -258, -290, -789, -11, 367, -388, -374, 15, -307, -353, 130, -141, -416, -141, 15, -436, -481, 73]
5184G3m52K66J69m01K06J03O2o55N55O9j85P7J98n18J64O62o84RO92n56j44L82
5206I2J29m26O85K4m66l1K77k81N2M24l66j25O8K35k79K65N9j49L43O0o32j64
5228b06O92l05j60L56J5n61L58K53m85K87q3P8m59P94n29k0K68j97j72K99J98
5249D21o15N12M9k35k75M57l05j95M65p5m96L14M65p68r5M30n36M81K09j90k26
5270b08M63m28l12L97J24m87M32L06p44M5N63j68p23P18m0m98N38J40m43K30J36
5291D1l72J86L99p81N6K85k62k89O95o1o94Q53o2m01J7P56n49p1P16k87p00N80
5313E5K11r48P15K05l92J12M42p64K60O36q01j22Q80m59o65J048qo40L45J76j80
5334A06L1M88l61n93O13L8o73O43L98q04J22N45p04J33L83j24M2J76k17k99K66
$$ y = [73, -379, -113, 56, -345, -139, -36, 26, -629, -74, -5, -190, -113, 85, -433, -269, 393, -291, -282, 410, -146, -290, 92, 221, -205, 480, 504, 38, 7, 284, 3, 55, 479, 113, -12, 56, 291, 12, 277, 336, 187, 530, 590, -42, -206, 486, 181, 21, 377, 392, -169, 189, 442, -43, 244, 161, 239, -220, 574, 45, 25, 293, 96, -76, 223, 421, -194, 318, 367, 132, -143, 314, 9, -186, 279, 204, -292, 22, 487, -281, -376, 54, -482, -1, 208, 18, -208, 255, -173, -485, -88, 36, -451, -19, 287, -457, -412, 151, -17, -740, -22, -62, -560, -22, 118, -325, -95, 41, -331, -145, 254, -527, -471, -186, -448, -737, -42, -103, -797, 56, -6, -407, -390, 366, -183, -254, 462, 175, -525, 55, 266, -682, 33, 238, -154, -42, 400, -364, -104, 532, -269, -391, 489, 30, -635, 413, 405, -235, 110, 286, 106, 137, 625, 264, -329, 284, 322, -351, 292, 690, -114, 8, 553, -151, -18, 365, 241, 283, 459, 242, -57, 209]
5355B09J0j96j69N54l20o9P19q26J8O54m12k40N39k13l73O75k70o09N2N97l13
5376A7m6N58m31k12M99j06n79L98Q3j2l41N00n71j22N97m37N0M53l31l17K18K98
5398A66l29n2O25p40L0N33k30p51P48M7m97M99J08o01K92M39o11J26K32k88k39
5419d93O53k42n07O30j21m88L76K81k98qJ00j87j92O07o5o91N04N38p90J26N22
5440B55p54J49M38o5l72M72p5m70L20M02n01l2O69p10N5N08m98l1P23m80k08L87
5462A82Lm48L91N04q48J48M79n14o1M30l97k5O44j22m32N28r2l50J54N39o16k93
5484a96O64mq00O56j25l48L61Jl44J08M01l16P3L62m94j54M70k95m42Q17j07m88
5506b00M76J20o84J13M98n25nN74j60o18M02L8l39K38K73k80oL94m09m55Q71k64
$$ y = [209, 219, 23, -146, 408, 88, 19, 738, -88, -70, 584, 172, -68, 471, 258, -115, 560, 290, -319, -267, 330, 17, -29, 529, 98, -114, 385, 279, -300, 98, 181, 169, -172, 328, -243, -365, 232, -205, -155, 298, -33, -350, -132, 166, -163, -215, 410, -330, -300, 233, 3, -748, 0, 47, -450, 49, 157, -444, -152, 287, -324, -198, 34, -254, -493, 160, -82, -589, 41, -80, -568, -192, 89, -209, -217, -117, -304, -496, 111, 46, -645, -141, 397, -393, -267, 255, -499, -350, 88, 23, -349, 123, 48, -422, -102, 300, -201, -233, 436, -274, -219, 289, -209, -240, 483, 3, -205, 182, 185, -263, 128, 632, -216, -68, 411, -103, -164, 266, -131, -156, 488, 366, -66, 462, 370, 20, 174, 713, 97, -196, 468, 464, -336, 320, 195, -153, 208, 209, -135, -27, 374, 58, 131, 493, -1, -155, 315, 20, -422, 395, 288, -200, 276, 396, -288, -175, 323, -202, -207, 367, 207, -411, -9, 29, -310, -72, 201, -79, -85, 309, -100, -555, 316, 52]
5528E2n20K92N1j02r2N38j059K80O59m08l02M86M5r06O90Q4l97L78L11o88J90
5549d18N17k22k60M47m46j25O61n49j15M96K52n78r8Q67n38k69J99m0k5K48K09
5570B13o30M38J17k36N0J57l96Q3K97q1n53N91l9l32N69o4k78j2O47n06k81N52
5592C06j55l86O70j0l98K96j84m81O86J18l27q4Q41o17m79M94R5o39N73L2m21
5613g0K86J6j54P6M05n79R4J68j12m22M28J18n18M29K22n42N09J2k56k21M22J86
5635D97q51O80j62k74K56K6j86k15L25k54r9M77j04l19K91k55k18K68K46n92J50
5656c13K05l36r1P66k65m31O72l01j81Q7L94o06L53j83l01K25L76k50k58N99j94
5677c3m26K35L31l08J3J99n76L70K87m89k75P04j53m76K87K60n12N46jq5j88L34
$$ y = [52, -468, -176, -125, -227, -319, 219, -840, -560, 99, -309, -611, -125, -80, -986, -296, -212, -609, -231, 80, -608, -418, 99, -123, -383, 64, -382, -507, 154, -395, -510, -14, 238, -340, -438, 429, -109, -378, -179, -219, -244, 4, 213, -417, 21, 138, -98, -48, 109, -287, -204, 93, 12, -541, 50, 11, -321, 248, 184, -94, -106, 541, 35, -246, 306, 151, -235, 435, 425, 27, 323, 139, -342, 344, 462, 135, 51, 892, 275, -204, 290, 385, -254, 319, 351, -70, 216, 232, 78, 154, 559, -20, 74, 242, 130, -292, 136, 254, -264, 165, 387, -155, 354, 366, 110, -111, 311, 497, -354, 326, 164, -110, 146, 172, -14, -229, 96, -158, -257, 220, 116, -203, 88, -167, -385, -117, 129, -463, -313, -108, -444, -535, 231, -34, -465, 207, -94, -275, -188, 206, -400, -47, -230, -531, -306, 70, -180, -438, 161, -33, -459, -224, 107, -201, -188, 11, -565, -195, 92, -397, -672, 32, -121, -597, -310, -50, -562, -16, -17, -102, -290, 44]
5699D4%n89M69K13m22L80R9k53k94P05k88k33M25m77N6N11J42p80N69P7m78L45
5721B21L38m72J21L31m70k51N23L5m79N19J72o31J16M81n37q4N58m95Q0L20q9
5742C07n86Q37k06k75K26L26m83q7J79m19K92N27n70k89N76K37p43L88rl65J07
5763c0L91m33j01O87m90n7M82l94k76N28j96m45K00L81o43J25L68k6o45O38j70
5784a06k29N74k16o20J43O34k71j18N10m64l36N15j60m83M59J5m49N25J66m57
5804c68j54Q45o27j95N49j52k92M14K0n13J18N76o22J73M33o30m0M75P4m61J13
5825b64L93l95M05J90m37n7O78m51j60K85K13m68J69o4mJ22J12l31L6L09j34k33
5847h6L71j59k27N96k62k63K70L29q92L14O43q97L58K31j38k86O65O2o54L60N6
$$ y = [44, 44, -545, -76, 137, -285, 95, 194, -59, -353, 352, 64, -169, 256, -221, -165, 346, 488, -292, 277, 354, -124, 221, 559, 87, 208, 539, 69, -182, 341, 376, -103, 416, 588, -43, 73, 554, 17, -67, 491, -4, 76, 396, 307, -279, 558, 352, 77, 303, 629, 146, 59, 238, -181, 111, 638, 68, -221, 355, 592, -151, 237, 228, -137, -30, 361, -72, -173, 514, 24, -33, 449, 55, -221, 307, 111, -334, -134, 247, -396, -271, 97, 71, -574, 64, -106, -335, 239, 23, -597, -454, 180, -91, -209, 301, -163, -499, 16, -144, -627, -168, -153, -602, -77, 89, -368, -522, 323, -304, -499, 50, -102, -394, 20, 40, -473, -355, 221, -401, -228, 205, -425, -465, 10, 84, -377, -264, 129, -266, 139, 329, -108, -165, 513, 62, -98, 187, 400, -68, 101, 37, 33, 155, 267, -64, -28, 281, 147, -86, 285, 126, -101, 495, 233, -30, 240, 569, -323, -9, 634, -263, 95, 326, 188, -98, 567, 629, -25, 335, 391]
5868C91l55K88J90j71n3Q0k61J03L10l37n01O65j86m19K97M21n05k49P31k77l94
5889b32O37K4q75N99J99n97K25M46o23%M54m65nO14k43n89O57r9p07O41K11n00
5911b28k0P79o34m98Q69l93p76O99N8n32N25M14p84L80K37k78l58N49O6o82R97
5932C90m68l88K79O6l16K4P33n36k93Q68m60j89L69J95r22M65L76m91j28O84m11
5953a53k95O82l11l05M49j13m40P76m5n94l5P93q40l4R53n64J8M65o4n88M31O
5975A92n26K63N83m34K0L27j97l45M09j33j13L33r3m24k4P28m61N2K35k92k07
5996a07M85K1n28M95J20o48J40M90m75QL54k98k42N33m5n55M13k2q3J88K27p14
6018b43p8N26k59K42O5L3o53N54lm30K97K68k37l87O17n27J66L19l46m11M04J04
$$ y = [391, 36, 324, 514, 343, 290, 370, 109, 212, 522, 185, -316, 349, 163, -256, 41, 462, -43, -292, 439, 162, -232, 405, 429, -446, 153, 352, -245, -20, 426, -197, -197, 257, -208, -213, 401, 158, -431, 226, 127, -580, 61, 272, -228, -248, 531, -103, -601, 268, -125, -901, -202, -144, -676, -151, 263, -521, -141, 96, -182, -540, 9, 75, -607, 390, -78, -466, -187, -121, -437, -413, 320, -216, -509, 359, -101, -290, 79, 274, -648, -183, 193, -298, -426, 258, -153, -448, 234, -77, -382, 67, -46, -486, 290, 245, -349, -384, 409, -431, -465, 488, -76, -58, 407, 343, -245, 186, 192, -334, -71, 512, 78, 98, 425, 228, -117, 292, 159, 46, 379, 286, -138, -162, 566, 105, 157, 392, 100, -107, 378, 399, -129, 366, 486, -162, -22, 468, -7, 1, 355, 57, -185, 348, 303, -252, 161, 139, 56, 244, 471, -243, -321, 205, -54, 188, 253, 286, -367, 187, 184, -246, 51, 319, 82, -305, 312, -215, -49, 270, -76, -487, -83, 21]
6040B1o46M54K31m45R2K21k01j61N17m80m4M83J1m44M88k28k86M92O2k91mL63
6062B05p45K06K45J81n13K14K49p14L97K58j12o66N08K1n7L98L3n69M23K16n35
6083c57K19L36j93l15J86Pk76N09k30k67N65Rn70M72M24n95j19N78k29k48O31
6104E37l17n16N56k8n63O31K54n16j99P95o69j52N59j44k28N04j21m10L47j71
6124A49k26Q9N98q93J95N00k52p90P24j44lL69L71p32KK82j98j55N52j67m94L16
6146I3J70p98N23L83q16M28K73l75j21L94m14l47N23j28k44L90J68p29M22J85
6166b0l86K89K86n41p2M95n6n55P03p2n34M9N31n33j19N64m23j32P56m62k72M98
6188fp5l38K16L04n70J31N09m14m59Q01j08l74M39J09k66J8J03l25mM75k92q7
$$ y = [21, -625, -171, 60, -385, -293, -72, -273, -434, 83, -397, -441, 42, 53, -391, 97, -131, -417, 75, 137, -154, -158, 205, -540, -334, -89, 92, -421, -207, 42, -672, -275, -17, -129, -795, -287, -266, -323, 75, 108, -461, -38, 178, -357, -138, 198, 5, -310, -124, -117, -393, 116, -114, -381, 184, 193, -377, 95, 519, -76, -195, 383, 154, -94, 537, 220, -296, 260, 232, -331, 300, 554, 38, -161, 634, -35, -187, 372, 228, 0, 504, 383, -27, 320, 149, -77, 12, 610, -283, -88, 412, 160, -630, 94, -50, -53, 316, 687, -45, -43, 239, 41, -114, 438, 271, -223, 93, 263, -535, -12, 371, -445, -17, 256, -119, -240, 154, -260, -607, -84, -212, -456, -66, 102, -627, -205, -20, -406, -117, 169, -372, -444, 51, -5, -560, 143, 71, -463, -414, 117, -416, -535, 29, -394, -526, 230, -232, -504, -6, -81, -419, -203, 101, -469, -338, 171, -243, -702, 99, -9, -383, 56, 165, -101, -83, 20, -305, -309, 166, -126, -213]
6210b13N68r0p76N44L46n17L4K10l18K8N58j86k70K70k97J09N25l63l15M37L0
6231C14k60J34L41p72K50M39k16m97L83M8o1J92L08p77K92N89p80O2N19m02k79
6252a73O00j00l48L69m04k8K7M77n43k9N34k60m01N38J32m34M6R8k50J91J93n77
6274c42L29K66j42l99M41mm42N63j29l50K62K41q06M94J06k73j80N83k06o13O65
6295F4m5j93K81K67q43L59K63o78L10J66Q8n46P18j42n38L92K53m95P4N26o17
6316c36j23O25m01m08O85J03q49O74M31q05K42J04j95k68Q94p40lP02J5o61J49
6337a65M59o26L40J80j85o1K10j00n4N6J20l49J18L42n58L79J81j00l48O07o48
6358b02q3M16O9m87O38M2k69k08L17l99N11K81l74p81R68k68m02P50j42l64J0
$$ y = [-213, 355, 265, -511, 33, 379, -138, -104, 106, -212, -184, 374, 188, -82, 188, -109, 0, 525, 162, -153, 284, 314, 54, 188, 529, -243, 7, 446, 230, -267, 116, 164, 103, 295, 603, -174, 118, 707, -73, -11, 508, 106, -173, 427, 327, -21, 348, -56, -84, -57, 420, -123, -152, 382, 122, -279, 259, 391, -43, 3, 101, -149, 42, 235, -342, -13, 253, 111, -288, 153, 149, -293, 270, 141, -209, 53, 294, -512, -18, 88, -185, -365, 218, 12, -601, 64, 19, -174, 107, 374, -469, -110, 153, -525, -215, -49, 39, -507, 211, 69, -469, -77, 176, -319, -245, 281, -336, -459, 166, -235, -643, 42, 145, -704, -30, 401, -404, -162, -58, -253, -521, 373, -367, -370, 332, 347, -314, -165, 294, -332, 8, 188, 3, -58, 152, 52, -2, 54, 174, -175, -57, 285, -273, 106, 287, 187, -161, 446, -202, -285, 131, 200, -287, 351, 393, 124, -84, 233, -166, 345, 626, 252, -529, 439, 171, -231, 519, 377, 13, 23]
6379B3L92o94M21J68O5m64M79n69K32J91J3l85K75J04k12K44L02o47%M75k62l79
6401b28O34m19j56M56l7m79K49L75k86l50N67k40n05O30j8k93L44K84q28J25J18
6422e7m8k01K40J77m72J29P3n01N11J87o28N82K45n91K04M86m07m65O25l45l51
6443f07M09K82n89M43O3p7k05K85k17j41L25Q1k80M3M42m12J53L13o80M14Mr7
6465d8k69O78k08k99K84Q6n10M53L4m36J22N06l53m27P79l43J09K12j03m05K89
6486A51K62o55K27M54m97l33Q96k79p6K29J48o14M35rl51J59K40j44k23M07l27
6507A00j12N50l94k28L92M4n23P6M32n46K48L06j27k36K75k98k1M52J69q55N34
6528B38j6j71l05N36j74m48Q63k81l89k5K82m64L37M19p72J10M41j72k97L09K70
$$ y = [23, 415, -279, 142, 310, 375, -89, 390, -179, 53, 244, 257, -128, 147, 251, 39, 283, 585, -62, -62, 413, 151, -228, 406, -13, -169, 287, 250, -229, 20, 395, 109, -241, 326, 86, -419, 211, 193, -100, 244, 528, -300, -175, -57, -105, -306, -66, 111, -361, -232, -159, -660, -149, 38, -590, -8, 237, -354, -150, 336, -71, -536, 89, -256, -607, -198, 84, -505, -62, 1, -76, -281, 4, -213, -354, -29, 52, -228, -185, 257, -155, -2, 311, -369, 45, 49, -48, -317, 361, 153, -146, 138, 224, -286, 167, 201, -235, -113, 393, 40, -387, 392, 49, 158, 370, 267, -138, 151, 413, -242, -15, 439, -58, -391, 505, 226, 150, 379, 527, -87, 348, 339, -12, 147, 387, 243, 20, 427, 100, -12, 538, 144, -84, 308, 352, -171, -95, 337, -209, 39, 345, 218, -18, 257, -41, -62, 390, 559, -296, 238, 222, 51, -254, 282, 108, -340, 523, 242, -147, -172, 110, -354, -17, 402, -370, -260, 181, 9, -288, 21, 291]
6549B91r79M80K88j57J66j42k18k6L49J18o73M16j06k68N01j12k54J44j7r4m6
6570c39O06k57m00P15m60k73N52n0j61O1L37p90J97J50j42J30J91p9l65K52L24
6591A99o92P40k3n39Q6M02o1k21M74n66J15K92k50nK70Q8m93N03o4k57m2M66l77
6614D5j91M52j05k82M5J60k89J27K73Q3j32Mo3M25l53N6n3K9L3P2M9Q6m10J84
6638B45j2j76J67L37m42k04O54k52l59J68N17n74r1L87k74l78M50j17k79L31J64
6659B62q01M45K55m31K91R3N6l28N35m74l96M25K98o33M15J67n67Q5N63m06k84
6680d30N65l82J3J06k7l07L38j19j33K48J40k07k16K92j13J86K97o06o1M00L43
6701C27q03K30M55m22O7N8m4J34J34l78j35L63J71l29J66J32m12J09M13j25l51
$$ y = [291, -688, -208, 80, -77, 89, -53, -271, -297, 52, 170, -503, -87, -193, -461, 40, -72, -326, -182, -199, -293, -339, 267, 10, -390, 325, -135, -408, 144, 94, -67, -6, 331, -459, -262, -112, -254, -124, 67, -12, -377, -125, 199, -493, 247, 224, -315, -229, 173, 112, -109, 365, -201, -86, 206, -44, -49, 221, 309, -184, 319, 255, -2, -44, 422, 45, -146, 306, 201, -81, -36, 124, -165, -38, 235, 318, 186, 190, 127, 552, 199, 255, 202, 231, 264, 336, 385, 471, 61, 245, 233, 57, 224, 561, 119, -85, 569, 317, -42, 126, 643, 69, -22, 365, 91, -287, 163, 46, -233, 98, 262, -539, -94, 161, -270, 21, 114, 170, -158, 377, -97, -493, -68, 230, -403, 12, 179, -388, -303, 260, -146, -430, 135, -247, -234, -128, -155, -462, -124, -243, -376, -128, 12, -195, -411, -119, -232, -46, 251, -355, -416, -16, 327, -476, -246, 209, -213, -146, -88, -132, 2, 136, -242, -377, -14, 157, -172, -6, 126, -286, -177, 236, 111, -240]
6722b40M60j62m92O32j10m21K78J96n71L45J93Ql96N47j10m71N45q0k47M20M9
6743C73k67J2J62k31j10N92k76m27L02K46o34K76M15l98n9M28j05k98L5J60j28
6764F8L55k41l93L02L13n07j41O11j91k96P09k73n54L12J01m53M91k48o8K12J0
6785A19k08j8J89n17K94K47r3l06P89o36j51L99j76k42M29o0n6n63M73K69o54
6806d72K26J15k12K83j00j31nK62k64J03L51l45k95J70N46p33N14J06n17L80J4
6827dj79l29P58n26j31N99l53k81K8O41n84K93K87n30o5L41j14k38O91n77l6M38
6849A29J87m83J23O2j21L46j44j92L1N24k50l36N52j69m79K08N49o14K08L16l30
6870A17j23L11k35k02N64k6n50J14M15k36m68R41n81l0M21p9k67K00j01l67L72
$$ y = [-240, 220, 58, -434, 198, 88, -333, -55, 141, -430, -85, 108, 116, -280, 267, 157, -314, 231, 151, -96, 324, 373, 106, 118, 280, 49, -61, 531, 255, -172, 130, 376, -258, 18, 433, 35, -24, 404, 299, 1, 36, 196, 68, 423, 182, -211, 91, 404, -103, -244, 367, 176, -120, 589, 316, -238, 74, 175, -278, 213, -35, -103, 109, 119, -89, -107, 82, -435, -141, 106, 13, -293, 496, -140, -291, 108, -68, -310, 119, 59, 3, -560, -87, 182, -472, -246, -131, -343, -60, -160, -291, -296, -34, -298, -195, 156, -189, -484, -314, 232, -501, 13, 119, -398, -18, -4, -183, -512, 246, -280, -411, 188, -165, -446, -418, 223, -361, -68, 219, -311, -376, -35, -149, -387, 304, -273, -309, 129, 316, -167, -44, 18, -103, 243, 99, -93, -62, 462, 212, -124, 428, 259, -220, -12, 537, -77, 131, 447, 117, -6, 305, 70, -132, 432, 406, -144, -30, 385, 149, -319, 622, 41, 11, 432, 353, 86, 286, 185, -182, 190]
6891A90K78l89j54M48m81q0M88j65l73P15k07m95K57K55o43L28L33j64j68L17
6911B90k28R9Q5k73l2K79J8l67J02K70m97o1M66l79n4N42Ro95O01j86j35j25P54
6934D83n81l03N92l73N0K47J06n75L20O6l37K47M12o02J86R8l28k5L10L79q91
6955e19J88M16n05J8O54k04m26L29J24k68J14Q2m64M07n4j47J33L76l52K1K02
6976A25j04j79M29o5j90K39k1j87J29L81l63r3L3Q8k24M75k39n11J83K40j60R7
6998H3M10m79J97N43p14o9O69l71j6J24k23j10k7M66n65N8M73m91J96J48m10j3
7020a21O15p3l63J84j2k40l10O99o02M17o5j20p6L41l6k76q6L63k74J10J56l89
7042a58pK71l64J68N70n03n54Q31j12n67M50J23l04M0M84k80n06N36j50j79K3
$$ y = [190, 468, 79, -75, 373, -108, -188, 300, 135, -238, 477, 270, -225, 32, 287, -356, -28, 305, 141, -27, 290, 62, 161, 246, -27, -59, 220, 238, -129, -27, 243, -254, -315, 151, -228, -282, 260, 269, -426, 175, -11, -146, -271, 483, -98, -401, 191, -182, -132, 115, 221, -354, -34, 32, -305, -58, 354, -248, -62, 36, -292, -317, -7, 372, -519, -331, 85, -420, -402, 252, 48, -378, -49, 75, -193, -79, 3, -461, -54, -108, -255, -122, 254, -98, -77, 125, 21, -158, 271, 206, 16, 255, 234, 47, 176, 557, 194, 101, 134, 222, -2, 473, 234, -277, -94, 146, -14, 83, 493, 14, 211, 754, 40, -29, 640, 269, 253, 377, 154, 44, 17, 483, -82, -24, 449, -42, 154, 302, -108, -121, 494, 421, 58, 242, 230, -10, -320, 379, -223, 194, 129, 9, -67, 274, 238, -38, -124, 239, -35, 75, 231, -158, -165, 106, -258, -90, 480, -23, -577, 254, 142, -425, 25, 148, -156, -116, 368, 88, -418, 118, -32, -211, -188]
7063a88J83l76M58j84l77J74L70m38R5Q7R0k04M98r4k41q2N25o32j06N61l57j7
7085b55N66m67k30K27J22m66K97m3j18PM46l73P3L21o1o60R13j18k92K23K06m98
7107a80k23Q39j31j08L91j86n82N95k42q7k2M98p12J24O59n73J56J84k45j32M27
7128D50o5q13L22N30k24k01K72Q4o57Q30n32q0J66N2j53L87k20k35L04L86o19
7149a6N1R7M8k04K62J2n48L95O4k16J50J8l38Q5J16K29n84M39n1k59L12n2k11
7172b01L66N7m98J91L97m73j91P51k10o17L34M00o59K70L23l75k07Q38o14j65
7192b83N86m15j59K17O1l67L46m1j44J81K83l99L80J3l59j8l6N3k86J74K76n9
7214Dl50L67k12m09Q87j25n04M25n4l85M27J82n85L63L54o56J33N59m84j74N24
$$ y = [-188, -5, -381, 77, -107, -484, -310, 60, -378, -283, -196, -106, -310, 188, 94, -147, -229, 296, -336, -442, 119, -238, -255, 311, -156, -386, -159, -37, -503, -206, -249, -367, -360, 86, -287, -214, 107, 46, -614, 299, 181, -111, 112, 318, -180, -403, 436, 305, 197, 588, 402, -180, 415, 173, 86, 64, 562, -150, -26, 633, 60, 216, 400, 155, 23, 450, 385, -428, -106, 424, 200, -1, 271, 355, -302, 528, -4, -84, 82, 134, -19, 368, 148, -87, 217, 603, -16, 35, 132, 180, -24, 238, 250, -298, 97, 161, -55, 95, 113, -225, -140, -24, 205, -379, 60, 9, -250, 62, 10, -201, 165, 222, -276, -85, 312, -161, -352, 399, 189, -428, -94, 306, -353, -83, 240, -135, -342, 496, -118, -283, 303, -112, -271, -54, 7, -360, -14, -55, -199, -18, 265, -134, 246, 259, -100, -118, -154, -101, -387, -213, 63, 4, -346, 21, -191, -600, 287, 162, -342, 83, 29, -356, 71, 253, -332, 31, 385, -271, -138, 421, -63, -237, 287]
7235B87J12m69N5K1r6j33P29n81J2K95m52J45K01j0n60O38M4m90M38J58m54p7
7257a87M49o5l79M74q0l00K61M73p98K54J73j41K48J8m66j64M43j07L3K50j93
7278A96l86L41J89j99k50N30n88k60O71m60L22K2K48j42o2j5k89O8K61n39K43
7299i9K15j24m93R42j27m42L28J64n01j23J76j54r9L20o2k90N69j42m11K66K42
7320A55o45O8N39m76L51L97q48L68J69m64j56N69j16l17L64L54m18r9K91l1n01
7341d46L10L45m97K57J23l76J41J78l03J86M99n87J78L37o64K65K40J94q22N24
7361H2N9k55j56R05o76j93j9N50n96L78J90n10K23K76k45J74K11k28k85N25j69
7382B41l47K53K19m28J36M59o44K00K77l38j11O04n46j51N76l07j21L33L2m00
$$ y = [287, 399, -70, -15, 6, -90, -223, 506, -75, -63, 232, -220, -75, 126, 116, -444, 194, 238, -252, 186, 344, -110, -187, 262, 197, -182, 292, 212, -88, 173, 646, -152, 102, 275, 134, 382, 400, -66, -230, 213, 106, 139, 389, 196, -190, 151, 340, 141, -109, 421, -167, -427, 244, -216, 106, 128, 376, 234, 172, 157, -132, -64, 197, -342, -99, 116, -8, -501, 441, 314, -128, 200, 364, -137, -260, -84, -238, -337, -17, -79, -369, 200, 58, -353, -87, 155, -490, -422, 117, -359, -8, 389, -459, -91, 78, -386, -542, 27, -89, -406, -42, 312, -106, -205, 86, 55, -446, -136, 209, -288, -31, 92, -284, -143, 35, -268, -82, 417, -170, 8, 345, -319, -54, 186, 380, -442, 82, 141, -114, -270, 635, -41, -234, -253, 297, -299, 79, 269, -241, -18, 258, 13, 187, 398, 170, -115, 410, 241, -106, 147, 366, -62, 74, 533, -111, 89, 366, 28, -83, 521, -25, -176, 400, 93, -28, 305, 337, -63]
7402f3J92K67m10j5J56k4l34M10l9k5j44L47n95J18M51o75M08L48m47J0K54k54
7424f4k08M97j79k72K20J67j31o33Q17m05j20L45l8m78N54J10o57L48J80l81o6
7445c94O14o24J13L29p2l67N74j30l66J61K07k66K3J13r5l44O62n87j3O55l39
7466a46k8j07lk4K67J74l66K52J91k46l73R43n35j86L48J91m44k0L98n51K90K10
7488B35k67n4J33j52J45K46k37l7J53K07m63J34K17k76J38K62k05k01J81J11k76
7509fj68N70l48k42N10j67l23N82k20n16N85j4k89MK44k15R6K02l24m0K28R4n84
7532c41M89j42l31O08J7m28K65O6j87k01O25k59m02M69j36k12J85K64o09L57p8
7553A9J45j94Q9j70j62O18m91l1L2L60m96K44L8k62L3M68m43k0J62M9l36K5K27
$$ y = [-63, 129, 396, -14, -29, 127, 103, -231, 179, 140, 115, -29, 318, -277, -159, 292, -383, 25, 373, -74, -64, 190, -64, -272, 225, 46, -226, -6, 161, 30, -603, 214, -191, -311, 34, -4, -482, 72, 182, -475, -127, 53, -328, -394, 220, -404, -291, 38, -34, -401, 173, 43, -323, -162, 45, -221, -198, -85, -180, -524, 138, -449, -462, 193, -146, -174, -281, -284, -308, -41, 133, -233, 19, 210, -36, -409, 534, -1, -187, 161, 352, -92, -112, 286, -265, 25, 235, -32, -86, 47, -105, 40, 286, 49, 12, 165, 372, -91, 43, 260, -16, 122, 384, 179, -22, 159, 270, -6, -174, 396, 48, -194, 316, 149, -174, 408, 188, -328, 257, 243, -46, -42, 202, -13, 83, 285, -39, -79, 149, 243, -341, 148, 6, -325, 283, 300, -128, 137, 203, 16, -185, 440, 181, -221, 248, 112, -100, 85, 349, -260, 97, 19, 164, -30, 59, -111, -273, 345, -146, -177, -145, 215, -281, -37, 1, -261, -228, 240, -203, -223, -61, -12, -348, -323, -96]
7576i6m11K15N98o16K84K08k78k29K43p7o17N25J10j75L51L4k16p1J83K7k66M13
7598A39l35K7L77k71l34M10o5l79L04M57l68j54N57m44k25N47%m10J26L61m42
7619a22j01O48m41j96N46q2l62P73m38m19K93K77m97P7O50n28l2K34m22j56M30
7640A32J38k59K55k68J82j99M70m89j71J45K16n66K97O46p34L61k01k0J34K84
7660C53k85r5M47m14k09N57m40O0L28j47k50K21M6l63j4N87m41j34L22m53J17
7681b07J24J73o41N20K74m38K05K30l56j02K68k53Q6r2J90k02P4K82n53J06K91
7702b1Km95N61m33l4J81L13m56N57n6l97j23O40m32k63P68l62k88M35o8k86J90
7724f7Q1m16N94L3o14M79L13o00J95k4J21k94L47J41m42J3L43j86O3K77l57l1
$$ y = [-96, -507, -292, 306, -310, -26, 182, -96, -325, -82, -159, -776, -251, -141, -316, 35, 69, -147, -218, -35, -8, -274, 139, -196, -169, 208, -63, -397, 13, -52, -431, -127, 330, -38, -192, 365, -79, -304, 243, 243, -167, -41, 320, -122, -223, 425, -16, -212, 334, 252, -110, 663, 225, -194, 99, 376, -121, -44, 606, 78, 46, 280, -142, -298, 132, 270, 11, 266, -2, 180, -19, 451, -38, -209, -64, 152, -414, -117, 529, -205, 156, -45, -65, 69, 353, 68, -27, 420, 6, -203, 354, -86, -26, 302, 155, -95, 126, 172, -191, -205, 382, -59, -193, 129, -324, -207, -83, 90, -551, -31, 243, -195, 10, 240, -116, -218, 50, -203, -117, -209, -19, -221, -147, 135, -418, -312, -21, -19, -514, 47, -386, -420, -239, 74, -382, 175, 119, -278, -401, 239, -193, -456, 312, -50, -338, 97, 29, -257, -67, 14, -402, 192, 225, -389, 90, 403, -197, -2, -26, 95, -199, 148, 289, -153, -140, 203, 17, 80, 357, 0, -31]
7746c1QR6j61L60p8l30O1Q7q8J92o3l1k95Q30k57k58J92N0m94M49k6l05j68N90
7770C30j91l46Q85o46m24O83r3l41J87J80l71J07M13l48J24jO8k12L38j45l87
7791a90M1K92j71J00K16m46M75Q5m74J09K75l26l18M75J04l52p8M45m3m09K13
7812B3K22m10K61k53o5J81j29j64N6N66l05k74M44l81n3N90k20l84L44J55m37
7833b33J50Kj24J36L0j38N2K58l04j01Q5J56l63N07p0k86J26K13l14L3L74l02
7855a13k13K97L6k21M50j77l07j55P34m78j11M00m18L1L98J47n93M02k9k74K68
7876G4J68j18l31M94n08M8M02k5n17N07L13o16K09q6J42j62L12l15j66L20L16
7897D61n36L27j91k20O4N49m33l09M95P5k14J45j47k32K33K64o00M89j6j74J72
$$ y = [-31, -23, 73, -88, 272, 194, -136, -75, 12, -76, 116, 53, 22, -273, 557, 300, 42, 234, 284, -210, 239, 213, -92, -260, 330, 139, -207, 678, 32, -392, 291, 198, -143, 44, 224, -147, -40, 373, 25, 149, 148, 216, 4, 342, 197, -190, -149, 143, -28, 72, 288, -158, 317, 402, -72, 37, 312, -14, -332, 143, 247, -105, -183, 262, 219, -190, 23, 245, -165, 96, -157, -222, -41, -170, -334, -278, 288, -17, -291, 153, -228, -281, 309, 89, -295, 49, 204, -233, -83, -81, -205, -69, -39, -177, -125, 133, -171, -272, -187, -31, -394, 113, 43, -243, -117, 96, -218, -185, 189, -113, -326, -29, 7, -214, 236, 59, -248, -403, 331, -147, -258, 142, -276, -245, 153, 300, -293, 109, 80, -194, 74, 242, 124, -207, 287, -221, -173, 229, 204, -313, 194, 507, -109, 100, 14, 156, -6, 306, -9, -175, 145, 461, -75, 252, 61, -159, -95, 454, 21, -288, 207, 282, 68, 213, 66, -166, 67, 331, -269, 220, 204, 30, 202]
7918B02P5j21l04M40R9p78O32j50l84K51P3q4J20J80j91l59O02k09l32L32PQk42
7941a33L40k28j34J33J30k92K44lk59N8N57q69N83j54J07l09J41j66rM97m91k8
7963b85L19J95o22L62l9j08j33M08k35k61M45k98pK78L40q41N87J54n40K43L0
7984hQk07N32n28j20L42o4n4K13J85p89L76M07l85k44N84j44j78L60j3m02M20
8006B91j44j85pL40l65N6R3J05j68K35j90k89O04k44Mmp8p4K05k47J26j27N54
8029D91o09j20M13J96k65l4J10r0j23L1R0l57N31l38k9K83j04l62K29J73k23K24
8051A17L5m72L33J35L7n83M06J0q6L34l49j0l8K87k31J09K7k14P4J74m25J02L52
8074A24q3l96L04j7j92K46L16m59K0r0J25m89L89K81m02K61K05l10j15O31l98
$$ y = [202, 277, 156, -148, 292, 391, -387, 245, 95, -289, -38, 35, -49, 71, 251, 60, -299, 303, 94, -238, 94, 101, 109, -133, 207, -21, -155, -22, 108, -184, 60, 57, -202, -144, 413, -456, 127, -27, 80, -229, -88, -254, -263, 234, -257, -285, 34, 229, -393, -31, -70, -178, -311, 97, -138, -399, 46, -252, -259, 19, 359, -482, 105, 259, -281, -38, -8, 0, -207, 325, -203, -323, 19, -45, -99, 114, 299, -490, -114, 293, -92, -336, 248, 104, -74, 286, 273, -129, 291, 147, -38, -45, 295, -70, -14, 79, 184, 16, 251, 61, -228, 376, 132, 136, 132, 54, -20, 185, -62, 64, -63, 491, -118, -238, 175, 371, 106, 72, 182, 92, -31, 0, 90, -267, 264, -74, -103, 180, 76, -286, -57, 116, -107, 117, 152, -320, 13, 148, 185, -398, 8, 18, -68, 266, -83, -93, -131, 156, -75, 34, 61, -153, -79, 95, -330, -228, 124, 41, -355, -51, -68, -260, -14, 302, -157, -137, -227, -102, -591, -202, 79, -323, -62, 143, -167, -282, 349, -49]
8095d9n7l2P4k63M47m7n3M8K35l90k16N94k62k76N29l02n08O91j5m38L88p3j46
8118a21R3K55j77o7K66K6m12J78k67j85M66K51n58J38J76k61L48J72l93r0K22
8139F0K7j79M67J18m27NL39n06J78N12m67o8L86l02l20K42J41l41K23L70l45J16
8161B29j1l72J42K72k76k24L33K25o36M09J21l0k00r0K11j38M16k13n08M09j62
8182i3p2M87j63m52K35jJ51k4p4
$$ y = [-49, -106, -138, -64, -327, 120, 73, 20, 68, 303, -87, -303, 291, 29, -247, 282, -20, -528, 163, 148, -290, 98, 25, -121, -28, 227, 50, -17, 249, 275, -137, 41, -226, -411, 55, 306, -252, -114, 62, -199, 149, 321, -72, -162, 60, 87, -92, 375, 493, 66, 71, 410, -96, 82, 594, 127, 59, 445, 143, -177, 65, 206, -135, 88, 458, 113, 229, 218, -154, -12, 260, -16, -240, 93, 318, -318, 91, 212, 182, -18, -108, 103, -35, 381, 168, -340, 69, -93, -165, 322, 159, -293, -58, -59, 92, 68, -6]
8191f
$$ Imaginary data points
##PAGE= N=2
##DATA TABLE= (X++(I..I)), XYDATA
0@%%%%%%%%qJ6j6J6j6K4l2L2m0N1n9P2q7R8j10J26j47J70j93K18k46K78l14L53
32A86l96M44m93N49o12O78p52Q34r22J022j133J255j389J539j712J908k133K396
50A269k707L082l544M128m894N950p501J0002j4686K6335j01986j98617K22981
63f0188R3584j16987J6419J05916r4611q4413Q3888M0881q2712M169R1762J8241
75A5949q8177o7260J4365L5727L20J9891K5558o0638p8099L4685M3864m2503r134
88a55452N6899j747m4618p286l041m708L4335L0671O542M205k7911k7110M7913
101i1308L5524k7729L3340N8458n6906m1728P6505N947o5660O8931P6768r1726
113a9584m7087Q9130j0388q2975N8046P3416p0320m8733N5728J875o4962R004
$$ y = [0, 0, 0, 0, 0, 0, 0, 0, 0, -8, 8, -8, 8, -8, 16, -16, 16, -24, 27, -32, 40, -47, 51, -59, 67, -80, 90, -103, 115, -131, 147, -167, 186, -210, 234, -259, 290, -322, 356, -396, 438, -484, 538, -595, 660, -729, 810, -902, 1006, -1127, 1269, -1438, 1644, -1900, 2228, -2666, 3284, -4217, 5785, -8901, 17434, -84552, -283169, -60188, 33396, -83591, -67172, 38744, -55867, -140280, -56392, -15511, -98223, -94054, -2292, 15949, -72228, -139488, -125123, -89396, -89076, -69185, -43627, -104265, -182364, -147679, -103815, -146318, -155452, -98553, -100300, -144918, -152204, -155245, -159953, -125618, -94947, -88405, -84200, -112111, -139221, -91308, -55784, -83513, -50173, 8285, -48621, -90349, -13844, -7897, -73557, -4626, 72142, -19584, -66671, 22459, 12071, -70904, -12858, 60558, -9762, -58495, -2767, -892, -65854, -56850]
125e6850O8171j379o2258o341M8195j6025n3484M5939O8171n5295n0011P0252
137i15J8580p4922J9151P8674k4587l9859L6220O229l4492J2782K2822k809N557
150B2431j1240k4018J9536M339m2320J8986M7925m8419m4383N1547J202o7129
162g1543K0716N0619m1679k9101M0402o342m6696J1814L1555n810j0320K037Q27
175e3521k309o846P286K1410r929j5706L4054J2303m5774J885M6355j8830j9505
188d9127M9647j915o0354K0495M5700l4825j8654M1290m395l0920J6033O159k5516
201d6382M558J6467N72P519j2336l0049J9162K8807k7804l803M1880j4912l6715
214e3036L1143J9770l7151O572M3430o895k2733O886K784j655Q418M287Q763Q560
$$ y = [-56850, 11321, 9942, -52316, -58657, -10462, -26487, -79971, -34032, 34139, -21156, -71167, -915, 17665, -57257, -38106, 40568, 15981, -23878, 12342, 18571, -15921, -3139, 19683, 16874, 22431, 11191, -12827, 6709, 11048, -31272, -12286, 35639, -12780, -57163, -5616, -4414, -71543, -50827, -208, -41887, -70988, -30586, -36928, -83624, -71810, -40255, -46065, -56385, -54348, -53521, -55830, -62676, -55390, -33980, -43909, -59615, -25561, -13258, -59032, -57147, -10792, -29622, -49127, 520, -1395, -61749, -41254, 4446, -30379, -49033, -7743, -12138, -43058, -27025, -20866, -46382, -41824, -25357, -24785, -17266, -29602, -59651, -40489, -11682, -39486, -43289, -1409, -16321, -53036, -21893, -2123, -39274, -32702, 10728, 3833, -18900, -12014, -9230, -10885, -2467, 1820, 10583, 19143]
228A9143k3416j0509L1582n008l1428L1114K9835m2331j4530L5028j7019k6609
240b4148L7700J5510l5284M24J4961k1328j183K0706q434k224J7517j4236j8164
253a8183J5469J175p675K4098N681k7757M427J5124j7395M528K6199j3997j1041
266F53K5390q452k9742J8788J9552j6102O153J4165k5133j1657K0517L24m582
279I874J0506r662r516J7450r106k4403K2143J8579k4285L258K0064l0017j5960
292b1075L7587O322k5574J1365R767k0291L016J3483j2193K441J6431r070l877
305H332R929j8579p939L2766L203k7053R767J0060k4279L018K2891j5186r850
318b920K0690o599j7953R648k441j2740K0787R784k6805j324J4508j6742k117
$$ y = [19143, -4273, -14782, 16800, 11792, -19636, 11478, 41313, -1018, -15548, 19480, 2461, -24148, 13552, 29062, -6222, -5798, 9163, -12165, -13348, 7358, -1076, -3300, 14217, -19, -18183, -2714, -1539, -9214, 14884, 20565, -7192, -2765, 12359, -5036, -508, 25691, 11694, 653, 26043, 17591, -12151, 6637, 26189, 10087, 16240, 30405, 5272, -6385, 14132, 14456, 9874, 20380, 10718, 1202, 18652, 9546, -14857, 7286, 25865, 1580, 4838, 24902, -5115, -21075, 16512, 22834, -2740, 8625, 18392, -1899, 1117, 14600, 2407, 4848, 21279, 12209, 8332, 18261, -318, -8257, 24509, 27712, 659, 10426, 20486, -3793, -775, 22116, 6930, -2920, 17770, 11171, -6782, 2866, 425, -12315, 8472, 18256, -8549, -9873, 4635, -12107, -14224]
331a4224K4621q493j6963J6443J818j9205P685P987j0846J2540J1486k4021m940
344a6112J9207j0323o868K5924l602k5140J2573J0991j9554L317J6720j0582j138
357d587J4138j3794j1654J6380p69p766J8846q86k5803J0237J7137j7928r8K1558
371A5011j0275j1300J7494l991j6153J3953P740r573J1475L535k3278M869K2384
384B1891j2386o594K0341p515j7075J7626N764k0484P750J6264j1168p69P750
397B1395j5522j340K0872n486j1271J4905n244j7558J6430J0395k2275L003K0317
410B8621j3332j0155J3011p465j0272J8169J618j7282O204K877j6922Q056J5083
423A8211j7190n861J6673q213j2952J2176q87j1845J4091M510j8327K812R095
$$ y = [-14224, 10397, 1904, -15059, 1384, 3202, -16003, -8318, -331, -11177, 1363, 12849, -11172, -16112, 3095, -7228, -14096, 11828, 8226, -16914, -4341, 6650, -12904, -9587, 7133, -3449, -4587, 9551, -4243, -15897, 483, -286, -8052, 10794, 9908, -15895, -5658, 11479, -6449, -6547, 15011, 4736, -6564, 10930, 6939, -9214, 4739, 12479, 2906, 14381, 17916, -5362, -493, 21891, 9505, 2911, 23252, 15737, -1338, 16288, 22052, 1568, 9318, 25582, 14414, 13645, 21395, 5873, 4533, 25405, 19919, 8648, 23553, 18309, 751, 17181, 27576, 5301, 8304, 28621, 15289, 5134, 18145, 10680, 408, 18577, 20195, 2913, 9117, 11994, -4928, 3128, 18211, 1021, -4840, 11833, 3620, -9332, 2844, 1957, -9888, 4203, 8713, -9614, -6802, 2293]
436B293j4031M167J8281j4311j1754J9019m050j9069J4433J0599j7663K775J3204
449C893j2885p449J0422m520j427J1807r493j0755J3911l097j6759J6446J1187
462A281k3761M75K1180j4896j3575K0844K384j5907J1105Q138j4820L76J0144
475g032m128M785Q272j2167n62J4561q434o132J7672k338j5051J4751P422k2186
489a0567K462J9231j1091o619J5583r311j5482J5331O482j5651L836Q084j1235
502h947K90Q473j0100j659J2365m681m291J0549r666j0360K0682O166k0603Q170
516c612J5969j7948n341K2789n723j6328J6175R452j6076l516P853k775K459K883
530F261o702K283J435j4336M511J6031j5514j1949K3052J78k8265Q754J8641j7676
$$ y = [2293, -11738, -7571, 10710, -3601, -15355, 3664, -386, -19455, -5022, 5577, -12086, -9311, 3893, -8992, -16441, -6019, -10539, -11966, -159, -9652, -20407, -6496, -9593, -26352, -9906, 1281, -22480, -22005, -825, -15721, -29296, -8452, -6068, -21975, -10870, -2732, -17552, -17176, -7032, -11160, -6375, 1897, -10270, -10832, 3729, -4705, -10837, 6835, 4497, -10554, 4197, 11619, -10567, -8105, 11126, 35, -6584, 8999, -312, -15794, -463, 6019, -9632, -5796, 2288, -8947, -8657, -184, -10284, -11943, 422, -4259, -8550, 1999, -7667, -18027, 2655, 8821, -11782, -3612, 12357, -5591, -10932, 11857, 6134, -10194, 5981, 15433, -643, -4159, 3694, 919, 3378, 6261, -441, 1842, 3277, -11059, -6548, 9483, -6031, -17980, 5072, 5250, -23015, -14261, 4380, -13296]
544a3296m855K2694o115j8932J0619Q074q045M551N193m312N104P79r149P492
558a98R308j1246M106J7360j4325j5268K0082M281j8416R888J3245j8810n592
571e585J6528q069j2793J2285N068j0322K07j73o631L669K052m134P424k07j4617
586a5298P125J2634j6687m023K5209l805k1412J5223J1422k2269J922K5118p342
599G817j5641J2253M467j0987J774N565j118K946l846n886P423k112j5289J1044
613a590J5668j9871j0554K0577m125k1767J4010J4315j8242m008J6363n320j1506
626a6050P021O421q49K306l661Q6P035n309l649J6826P90j7848J0384J5678j9109
641G2o260K3859l402j7159J4713O768k1924J794J8603q148r316R490p72q542K664
$$ y = [-13296, -18151, 4543, -1572, -20504, -9885, -1811, -9856, -5305, -112, -4424, 680, 1459, -7690, -198, 9110, -2136, 1970, 19330, 5005, -10263, 9819, 14100, -4316, 5572, 18817, 7, -5585, 10943, 2874, -9919, 2366, 7434, -2888, -2681, -2854, -9485, -5816, -3764, -7898, -474, -681, -15298, -8173, 4461, -12226, -16249, 8960, 5155, -16257, -1034, 10388, -11881, -9959, 15159, 7817, -7824, 4429, 8896, -2091, -317, 5248, 4130, 7076, 3230, -2656, 4767, 2655, -12634, -1590, 14078, -5793, -16347, 4230, 105, -21662, -7652, 6663, -11579, -15587, 776, -4544, -16050, -9029, -2608, -3457, -1151, -4812, -4726, 2309, -3000, -6649, 10177, 10967, -6881, 3503, 19181, 72, -6188, 17671, 14269, -2890, 11823, 18591, -3333, -1539, 17064, 8916, -400, 9090, 8318, -224, 2440]
656B440n00k013M936j807m610O803l520j3155J0925J2327j4871k295J7231q477
670C414j4557J5926P618j5801M488J4672q426r024N651J923P98K566l694J059
684F613M266j1469m104J5797m133j7086J4869J1296k5598o263K2288o549j6476
697a6549J5990O765k0593p12J3520o262o489P099L019j325q14o723P12Q972l961
712g351k220J1619l962j3894J1070Q849j5533N13J6993o035j0156R325j820j1190
726a3792Q652Q422q868j353K662n723J352M338q305J657J0713q439p469J0840
740e313m027j2557J5148R946j8853j619J7203q515j0575J5064L660j2789N803
753g424R843q892n589O444K569K313j20n752K694M552q629M56J2289o903j0411
$$ y = [2440, 1940, -73, 4863, 3056, -1554, 5249, 1729, -11426, -501, 11826, -3045, -5340, 11891, 3414, -11143, 4783, 12401, -3400, 1088, 15760, 7334, -1690, 3961, 5884, 6682, 9248, 5554, 6613, 10879, -590, -4694, 11103, 6970, -10116, 4753, 16049, -9549, -15812, 6476, -73, -16549, -559, 6206, -14387, -15099, -1579, -7841, -14330, -7231, -4212, -5537, -6351, -13074, -12362, -3390, -7351, -9571, 2048, -1914, -15808, -4738, 4111, -11422, -10909, 6084, 49, -10107, -782, -2602, -13792, -5140, 3282, -5586, -6939, -4277, -10000, -8648, -4310, -12615, -10958, -245, -8684, -16153, -5313, -9340, -21897, -6749, 3197, -15656, -17275, -72, -8587, -19162, -4098, -438, -13227, -7424, 2419, -6473, -12062, -5618, -3049, -736, -856, -6608, -3914, 638, -7991, -7535, 4754, -2149, -12560]
768a2560J3848L507j9100K826J5321q542o122J1135l258j1453P152N307o551K414
782f076K121n011M961K215j0321L059J2368p562n359J1826l995j1297J2137P886
796F952j3963J509J1781p242n366Q374k054n203P499J999p539J583Q71l854M797
811A44K129q189K642O137q983j601R622o172n804J2727n45j5492O133J0092j0275
826g435j361J1623o004p596R111R61q598N071L953m528K551J365q166L394P375
841A716p377j004R588o564p914J0595P74j1177N589Q537r407k160O646n420k956
856a0534P359j337n114N198j749n959O565J641q134M634P280r227j846R322n219
871g120m689J0945N07r769N774M349q644K967Q257o870j608Q704m394o042P595
$$ y = [-12560, 1288, 4795, -14305, -11479, 3842, -4700, -10822, 313, -2945, -14398, -7246, -1939, -8490, -6076, -3955, -8966, -4005, -1790, -12111, -9052, 3316, -4246, -9605, 2221, -1774, -13071, -934, 6952, -7011, -5502, 6279, -963, -6329, 2045, -9, -5212, 2287, 4286, -3253, -1670, -799, -4653, 144, 2273, -5916, -3274, 2863, -6120, -7721, 1901, -4271, -10075, 2652, 2107, -13385, -7252, 2840, -7435, -8796, 2827, -3177, -10773, -1662, -701, -9299, -4228, -275, -4803, -2252, -887, -9053, -5659, 1716, -5661, -6665, 2923, -3641, -11555, -960, -186, -11363, -5774, 2763, -6644, -8804, -2158, -7578, -10534, -3175, -4512, -9626, -4428, -6177, -12136, -5571, -3930, -12064, -7430, -150, -9377, -11223, -1901, -7120, -11809, -864, -357, -10126, -4352, -3, -8647, -5680, 2577, -4293, -5901, 2803, -1591, -7633, -38]
886c8Q50o068O214K690q698K388N431n877P31P369n530l507Q494k933p872P967
902A611L909q656M139O035q830j265R271l553l935P562j453o030N826R73o438
917h34N147M965p633O10O961o875l272R339j362p192O416J238q276L303N015o862
933F88J041O176o363l086P096m109n393Q174J096r074L986L902q631J601P360
948D464n459l023O789l335n360O318k47n920O276K349q893J771N825o956p30Q455
964B324l639o254O396p18p029N671L261o457J940M873p336j545P552l799l152
979g912Q448j719q205N494K581o757L274N912o099p28O423n240l304P637p11n039
995e945P012Q39r170L707O533o058L78P172m130m065O410j384n030O196K309n601
$$ y = [-38, 812, -5256, 958, 3648, -5050, -2662, 2769, -3108, -2377, 4992, -538, -4045, 4449, 1516, -6356, 1611, 5520, -3136, 1003, 7038, -1792, -3057, 6214, 2661, -1274, 6288, 4835, -1195, 4631, 5604, -834, 4313, 9278, 1645, 2255, 9216, 2341, -931, 8408, 7046, -146, 6270, 7508, -768, 2535, 7550, 688, 1729, 7905, 1542, -1544, 5552, 1443, -3950, 4224, 5320, -3754, 232, 4134, -4497, -2896, 4464, -995, -4018, 2771, -564, -5924, 394, 147, -5773, 503, 2852, -6041, -4270, 1555, -5401, -6131, 2324, -1315, -7569, -1173, -1891, -8920, -3249, 12, -6445, -4505, 368, -6968, -8513, -961, -4760, -7912, 536, -1183, -9388, -3894, -1313, -8070, -4796, 1116, -4983, -5711, 712, -4528, -7832, -195, -906, -5945, 1067, 1906, -7264, -3557, 2976, -3082, -2704, 4468, 338, -3727, 2683, 1299, -3731, 2465, 4774, -827]
1011h27L543K805p340J400P616n188j476P896l634o668P201J952p382L908N272
1026I078o197k99N119n303j885P636k591m548N865j418p093N481M058p755J822
1041A970N871n957k343O780m022m738P952P00p477L406K938o815K402O420o635
1056D52j494O747l632n124N576K73n631M693K062o888J898L649o012L31O854n502
1072a748l909O623j412o894N960K446o898K126M569o156r50N987l206k403O819
1087I54k096n152M671R14n782N527M356p526K1P086m454l789P248m07n419M657
1103H09K133o401J259L883l936J236M232n247j950N505k280l708N853q25n687
1118e124M890K897p652J554O055m453j047O720m106n125P251J527n784L956K920
$$ y = [-827, 2716, 5521, -1819, -419, 7197, 2009, 533, 8429, 4795, -1873, 5328, 7280, -102, 3806, 9078, 2881, 2582, 7701, 2398, 513, 8149, 5558, 1010, 6875, 5457, -1636, 3845, 7903, 148, 1970, 7841, 1884, -459, 6321, 2299, -2439, 5513, 6213, -1264, 2142, 5080, -1735, 667, 7087, 452, -1042, 5705, 2073, -3051, 2525, 2798, -2833, 1860, 3922, -2966, -1068, 2581, -3431, -3100, 3754, -1748, -5657, 966, -446, -7340, -1380, 1066, -5832, -3706, 863, -5293, -6243, -256, -3462, -5865, 954, -1142, -6294, -1623, -709, -6491, -964, 3392, -4134, -4113, 2973, -1481, -5270, 1978, 1571, -3848, 809, 2942, -3459, -2200, 1683, -2253, -1017, 3215, -2032, -3982, 1523, -757, -4465, 1388, 563, -5124, -234, 2663, -4989, -3435, 2620, -1833, -2880, 3840, -266, -5391, 1860, 3387, -2397, 1559, 4479]
1133D479o223J916N695n795k267P087j273m105M872j172o611N326L990o697J023
1148B45M254n651j628O396k787m968N204J646n115J770N36l747K969L984m440
1163a332K33K808m353J0P153l470m986P514J734q238L146M922o625Q75Q322m508
1179C205n574N558k75m585M602J414o299K756L396o188m59N268l842j968O065
1194C074k515o565M415K446m956K490L276m890l36M337l237j497M572m71k434
1209b291L835j376m690M342K332m742K552L913o360o71O416m333l485P501r35
1224B008p426M601K788p729J223O910m642k923N358k101m937L955J441l896L683
1239a687J709n141J396L677l866K23O215k910l298N351m76n064M334L390m276
$$ y = [4479, -1744, 172, 5867, 72, -2195, 4892, 3619, -486, 4386, 3214, -3397, 1929, 5919, -778, 245, 4499, -1152, -2780, 3616, 829, -4139, 1065, 2711, -2404, -634, -98, -3845, -876, 3108, -1332, -1099, 1709, -2644, -2634, 4519, 1049, -3937, 3577, 5311, -2927, 219, 5141, -1484, -609, 7713, 3205, -2369, 3189, 2914, -1671, 2931, 4345, -1954, 802, 4198, -1990, -2449, 2819, -1023, -2991, 3074, 559, -6006, -1591, 855, -4101, -1611, 1665, -3225, -3561, 776, -2461, -3958, 614, 143, -2291, 1544, 168, -4522, -180, 2152, -2590, -38, 3875, -2485, -3156, 3260, -1073, -4558, 2943, 2008, -5418, -817, 1971, -5758, -4535, 2375, -2267, -5190, 168, -1933, -6870, -2915, -1474, -5370, -1687, 22, -5119, -3723, -46, -3912, -3689, 2526, -384, -3682, 1669, 1193, -3871, 463, 3853, -423]
1254d23J421L289m038k07L358k089l25M873l145l795N593j092n933N000M505p209
1270b17M23O139n483l526P533m00n549M313K024n764J223M313l489p7M626k633
1286C456k265M342j424l274M450J236m638L001J835m922J030M441l875j669N237
1301F961k776l937M005K05m896L074K038n071P95K596l962o47M380l432k763N368
1317A938j860n280M815K106n659J988N277o421j844O570k173m158M979J201n088
1332c609K068K195l973O91L510k853l39L170l978j943N277j374l977M425Q84n649
1348e475J933L201m938m22N451k350l047L740j273l117L875J362l807K605K043
1363b19m594J377M592m108j456O821j510m521L889P76m734L610M263n157q78M891
$$ y = [-423, 998, 4287, 249, 42, 3400, 1311, 986, 5859, 2714, -1081, 4512, 3420, -2513, 2487, 6992, -217, 206, 6345, 862, -2664, 4869, 4469, -1080, 3233, 5257, -507, 716, 5029, 1540, 1463, 6089, 3456, 1191, 5533, 4109, 835, 5285, 6521, 1883, 4884, 6719, 1797, 2827, 7268, 3393, 1724, 6961, 4185, 248, 4253, 4458, -438, 2636, 4674, -397, 398, 2994, -968, -1615, 2765, -667, -3430, 1938, 78, -5202, -387, 1719, -3940, -1952, 3325, -3096, -4940, 1630, -543, -4701, 278, 1479, -3609, -1541, 654, -3319, -2628, 882, -1971, -2310, 860, -3118, -5061, 216, -1158, -5135, -710, 174, -5475, -3542, -341, -5279, -5701, -250, -2600, -5647, -1907, -3180, -6297, -2422, -1060, -4867, -2262, -219, -4813, -3436, 1156, -2952, -4408, 2413, 903, -3618, 271, 1047, -3687, -77, 4186, -971, -1849, 3042]
1379C042k906k175L954q03l311M166R42m636J141J655k903J901L339m450j305
1394b349M631k419k576M420o08l882M014K372n916p9M958k730n97M607k343l727
1410b224L848N52l054K816Q82m063K392L204n514n94N393k448k458M427j700n253
1426c794L962K829m916L01L471l481r90L980k639k619L972R4k954K617r8m356
1442d621L430L211m676K63L284k837j515M525j506l759M250J567m846J438K520
1457G28l863O29M108l363j733L915j751k791L304P19l823K398J747m199M81L533
1473C9l286j249M696j909l425L718L32m112K418L106l773j2L072k884k72L653
1489A12j763k162L500j01l724L384J010m181K166L681m093j157L902k027k161
$$ y = [3042, 136, -2039, 1915, 1112, -2199, 1967, 2909, -1727, -586, 1069, -1834, 67, 3406, -1044, -2349, 2282, -137, -2713, 1707, 1099, -2783, 1231, 3603, -2313, -2392, 2566, -164, -761, 3846, 1503, -2224, 1624, 2176, -878, 1938, 2820, -1243, 1149, 4353, -1161, -1755, 3638, 1190, -1268, 3159, 1459, -3794, 168, 2997, -1919, -1618, 1853, -1628, -2618, 1362, -1277, -3896, 76, 170, -2784, -167, -265, -4621, -1191, 2020, -2656, -2393, 891, -1946, -3461, 1064, -442, -4201, 49, 1616, -3230, -1792, 728, -3135, -2506, 1602, -1761, -3494, 421, -1330, -4121, -817, -98, -3921, -1523, 224, -3975, -3494, 39, -3247, -4496, 200, -1709, -5134, -1416, -1084, -5196, -2778, 328, -3445, -3457, -385, -3269, -3541, 112, -1651, -3813, -313, -414, -4138, -754, 256, -3925, -1759, 1922, -2171, -3328, 574, -1453, -3614]
1504c614L906k33l916K551K397m057P77K704l423O67L764k560k356L600k59k832
1520b884L064J343m323K254K685l216n93L938j996j731M392j599l340K855J758
1535B607l227J953J770l686M11L623k215k247L929j138k294L458K3m317K269K880
1551C799l658O05K737l007j188M067j223k968K981O59l403K017J832l916J105
1566D39K975k278j444K860j396k206L408R9m198K619K007l906O98K706l015r24
1582a556L470j367k600K831m92k976L050R07l821J156K470l286l75L693k513k146
1598c555L788k08l389K378J368l742J340K555l318k37L169j808j737L732j327
1613i91k848L029J031l632J575K667l048l67L461k316j495L688r73k818L217O58
$$ y = [-3614, 292, 59, -3857, -1306, 1091, -2966, -2189, 515, -2908, -2241, 1523, -1037, -3393, 207, -52, -2884, 180, 1523, -2800, -546, 2139, -1077, -1670, 2268, 272, -1459, 2933, 1334, -2006, 849, 2607, -620, 1333, 3103, -583, -172, 3451, 1236, -1011, 2918, 1780, -514, 2944, 2967, -1350, 919, 3799, 141, 746, 3483, 476, -712, 3355, 2132, -836, 2145, 2804, -599, 1418, 3250, -666, 439, 3414, 1136, -308, 2552, 1156, -1050, 2358, 2457, -1741, 878, 2885, -1021, -323, 2383, -632, -1556, 1914, 547, -2053, 778, 286, -2690, 360, 1267, -2554, -1398, 1072, -2214, -2589, 1104, -1409, -3555, 233, 25, -3364, -986, 382, -3360, -2020, 535, -2783, -3020, 149, -1659, -3396, 336, -991, -3839, -810, 221, -3411, -1836, 831, -2217, -2584, 877, -1439, -2934, 754, -219, -3037, 180, 838]
1629H38l530J969K445l116r7L693k401j169L274p89k650K957M62k640J662J715
1645B623l217Q63L093k620j336L999j005k721K922K88l172K354J988l158N87K375
1661C863k281o42K952j434j750K848l4l039K476J049l707J476K603k941p59L001
1677C681j428k610L369l98k835K046J286l014P96J801k568m37L141k039j607K852
1693B036o80k581K262O07l251J782J938k906J1K654k113j794L210n40l075K468
1709B8P97k462J083J629l320Q37K946k479o28J982j004j954L065j25l374K026
1725i53J955l233L30L016k414j417L102n82k235K177L57j847J290J068k377P04
1741a059K198j738n14K482k105j010L173n62l043K300J507k951N31K842k707q36
$$ y = [838, -2692, -723, 1722, -1394, -1491, 2202, -199, -1368, 1906, 1117, -1533, 1424, 1886, -754, 908, 2623, -594, 269, 3362, 742, -594, 3405, 2400, -321, 2601, 2889, -283, 2071, 4059, 901, 1488, 3863, 1582, 940, 3892, 2458, 708, 3556, 3522, 483, 2959, 4008, 301, 1777, 4380, 1439, 680, 3681, 2253, -357, 3012, 2614, -221, 1825, 3111, 97, 893, 2694, 126, -311, 2830, 791, -816, 2036, 1356, -1225, 1037, 1644, -1607, 175, 2113, -793, -782, 1872, -241, -2035, 1175, 635, -2440, 28, 825, -1637, -554, 1075, -2245, -1408, 1538, -941, -1569, 413, -591, -2545, 520, 395, -2979, -953, 1002, -2231, -1901, 1115, -1299, -2716, 386, -196, -2431, -254, 103, -1744, -454, 614, -1763, -1059, 1139, -599, -1113, 1369, -736, -1746, 1427, 865, -2178, 122, 1629, -1322, -791, 2051, -656, -1492]
1757a492L008j089j691K136M5k346K028J056k988J079J824k362K29K661k093j364
1773a359L276o00k687K372J148l351J427K296k557o77K738j062j550K200j88j755
1789c29J322Q38k135J290J052k144N46K008k190r03L209j586k013K684R59l715
1805a107J323K266k428m22K545j469j536K042J00j388J211j2j729J716O93k522
1821g17P05K336k195n06K480j331k721L064J072l473J255J771k267J01J505j583
1837e04q86K120o38r82J259q18j459K130K51k889J627J424k546J10K826k141k238
1854c354L611J25k913J412J504k585P62J900j753r19J780n26j169K008o96j479
1870b292J926M07k233R35J313k175P04K450k430j340K529n5j851J213J173k007
$$ y = [-1492, 1516, 427, -1264, 872, 917, -1429, 599, 1655, -1333, -254, 1570, -792, -563, 2098, 5, -1359, 1917, 1317, -1370, 1002, 2150, -1201, 226, 2522, -35, -712, 2026, 964, -586, 1614, 1426, -329, 993, 1831, -304, 986, 2038, -106, 440, 2448, 258, -645, 2564, 978, -1035, 1649, 2608, -1107, 216, 2482, 54, -368, 2177, 708, -828, 1214, 1314, -74, 1137, 1125, -604, 1112, 1805, -717, -12, 2324, 129, -377, 2103, 772, -1949, 1115, 2187, -1286, -31, 1740, -527, -426, 1079, -504, -1390, 730, 92, -890, 369, -449, -1908, 222, 473, -2416, -789, 635, -1911, -1801, 1025, -1116, -3354, 257, 382, -2531, -1119, 385, -2200, -1438, 462, -1291, -2210, -430, -956, -2125, -117, -813, -2292, -366, 41, -2192, -1257, 56, -2119, -1415, 1035, -1395, -2735, -206, -261, -2112, -899, 274, -1733]
1886a733P18J480j420m37J443p73O3J523j257q48K078l65j887J803J137k468P76
1903a67K473k530j034K989k70k652K107Q56j988M05J773j849L17J274p17p55J308
1920A540r60q16J840o30j468K012Q13k868Q93K056k499n82K743j120j728K055
1936A281J00j843J161O53j524M16J405k014K26J615j481n27J763p57j442J790
1952H22L75k505Q62J969k132r50K442q51j853K022q9j515O55Q06j399L68Q43j200
1970a330J02J286j294m61J846j097j395K280n8j953J118J165j920j6K134j408
1986a001q60J518j72j407J357M27j301R20L63j512N24J864j696m20J734q54j177
2003a693J710p9j457Q20J355j972K93J579p38p94J650n63j140J499K78j384R48
$$ y = [-1733, -1015, 465, -955, -1392, 51, -722, -659, 864, -393, -1241, 837, 472, -1415, 388, 1525, -943, -167, 2306, -224, -1258, 1731, 1461, -1191, 916, 1772, -216, 189, 1962, 113, 430, 1704, 987, 232, 1540, 580, -236, 1604, 974, -494, 1518, 2331, -537, 356, 2412, -87, -669, 2074, 954, -774, 1281, 1381, -462, 699, 1352, -172, 244, 1649, -365, -139, 1476, -5, -532, 1231, 474, -968, 822, 1197, -1308, -446, 1523, -609, -1559, 883, 32, -1821, 201, 112, -1403, -748, 58, -1341, -973, -130, -1330, -1228, 58, -1236, -1697, 149, -948, -2343, -63, -121, -2074, -956, 209, -1711, -1727, 407, -1001, -1861, -343, -515, -1922, -565, -138, -1439, -519, -156, -1668, -1144, 720, -976, -1396, 338, -516, -1693, 17, -62, -1519, -699, 656, -1316, -1023, 556, -182, -976, 674, 111, -1029, 470, 748, -636, 312]
2020C12O03j347N46J131j654K79J816j433q91K271p39j667J662P81k008K43K444
2037B349j862p09J877q68p61P75K55j356J029N08j319O68R29j654N26J082j148
2054C21n43J885j089j130J473O40j886M30J370j513j61J463r04r57J571n26q23
2071c79R10K65j289P04P56j545J54J305q47n34J388p72j356J539O72k133Q33J072
2089G43j297j76J076p69o10J100J88j377J038L71j394R17N48j788Q30J224j714
2106a090K15J225q09r82J315M96j780R94R84j559L79P95j159j37J396p95o40J463
2124C11l24j221J060K81r96K89J516j801Q8J459q10p60J289j87j380P97R37j362
2142h14M85J440j167p27J100k91o08J024k65o47P56J24j153Q20P38j098j56J652
$$ y = [312, 915, -432, 114, 1245, -409, -130, 1686, 253, -638, 1633, 894, -773, 889, 1670, -338, -95, 2349, 487, -222, 1655, 787, 26, 801, 1056, -300, 729, 1237, -82, 586, 1515, -139, 387, 1469, 321, -222, 1663, 574, -556, 917, 1557, -329, 101, 1471, -42, -203, 1260, 356, -601, 970, 444, -379, 531, 796, -493, 211, 967, -578, -424, 881, 34, -500, 888, 116, -1240, 299, 971, -1162, -329, 743, -554, -730, 346, -423, -1033, 67, 255, -1122, -84, 287, -1107, -190, 358, -1430, -600, 624, -1090, -875, 350, -459, -1441, -126, 370, -1410, -416, 568, -991, -612, 183, -976, -1113, 283, -512, -1152, 311, -13, -1234, -174, 107, -889, -600, 916, -885, -797, 662, -148, -908, 381, 194, -1186, -389, 548, -814, -329, 1111, -56, -783, 317, 26, -582, 442, 177, -470, 286, 410, -743, 77, 815, -283, -439, 1213]
2160A213j370m77J448k8j215J156J18j173O29R05j337J47J070j056j89J247l63
2177G25q35P49J69q69P95O83j201M7J353j240n60J428k35r49R69j67r31M52P53
2196A136j159L7J120p99k99R67o07n84R59J96j836J306N61j056L57O88j104m45
2214e62J454p55r23J033r6q97N70L23r34R9J117j170k5J029j042l53J293l75r81
2233a195J107K18j573M52Q87j186J25J064o92n18J072j09p69Q48L9o83M00P39
2251B26j212J85J085r29l65J149k05j130J195Q8j228O26J008j204M2R35p55k6
2269e15R48l38n97O75O19j372N15O79j009M10P55p79l99J388n69r65J280L09j229
2288a94M35P06j039J53J077r56L0R77o27o79R38K07j210Q70L67j109O39Q59j375
$$ y = [1213, -157, -634, 814, 786, -429, 727, 845, -328, 301, 1206, -131, 16, 1086, 30, -159, 1088, 725, -110, 639, 808, -61, 734, 1417, 216, 263, 1616, 376, -184, 1244, 1009, 60, 1029, 862, -69, 383, 1136, -23, 14, 1134, 335, 36, 1003, 396, -188, 771, 967, -869, 437, 998, -58, 299, 987, -117, -562, 892, 137, -786, 247, 151, -746, -176, 147, -787, -688, 429, -741, -766, 263, -779, -1132, 161, -214, -1195, -88, 130, -1443, -991, -104, -1290, -1165, -101, -793, -1311, -239, -348, -1117, -269, -230, -913, -513, 226, -986, -801, 284, -645, -1010, 139, -66, -1196, -1, 87, -1141, -515, 493, -711, -669, 266, -489, -515, 433, 95, -502, 173, 792, -580, -65, 614, -395, 15, 770, -9, -408, 980, 411, -554, 726, 1035, -194, 241, 947, -92, 61, 1138, 182, 212, 1189, 562, -117, 821, 1028, -182, 688, 1055, -54, 585, 1444, 69]
2307F9j63J132o19o84J100J00j137L75P41j178K80P57r40l43J228n93o14Q75k89
2326I7p50O79M32j093M91P80q64j05Q18o39o64J102p6p66N08L45j037K76N16q20
2346g70J2R41o41k39O83j47q91Q85m6q45M34R67j281J16R59n63p31J232j34j125
2366a184P82L53q76N56N75r74J52O48n12l04Q54o77k60Q08k7q23O59N49j071J82
2386e90Q88n21n36R44M2p85N37K25n79K21M59j078O27M32m49j24R68r76j10Q35
2406D30k52o28O26P16r51K68Q81j195j64R86n11m84Q31M15j051K09O43q70L94
2425B93O95o55k03Q91r80mQ53m92n40R66j06q37M16O03j013l74J850j137o39J112
2445F99Q1p95L53o0k94Q3O02q15jN50k82k54N60R5j102R08L26j018M84K95p60
$$ y = [69, -94, 1038, 419, -265, 835, 935, -202, 173, 914, -264, 16, 773, -167, -510, 718, 125, -489, 386, 97, -653, 26, 458, -635, -144, 636, -228, -333, 485, -154, -818, 284, 208, -558, -50, 295, -742, -466, 50, -770, -758, 183, -458, -697, -14, -161, -1052, -167, -213, -1058, -624, 343, -938, -822, 137, -426, -1157, 75, -59, -1184, -402, -49, -925, -369, 206, -768, -616, 32, -480, -784, 70, -607, -867, -59, -86, -909, -250, 299, -772, -590, 298, -223, -759, 185, 227, -558, -21, 204, -375, -154, 305, -773, -146, 286, -163, -287, 681, -295, -405, 430, 178, -450, 176, 892, -59, 209, 1090, -105, -269, 717, 206, -278, 553, 968, -83, 126, 769, -101, 293, 988, 333, 130, 1021, 41, 37, 890, 398, -142, 824, 718, -119, 297, 900, -113, -487, 1363, 226, -413, 699, 780, -15, 338, 278, -16, 67, 669, -146, -147, 403, 121, -133, 427, 522, -580, 328, 654, -364, 120, 415, -345]
2466c45J65O92k32q62P96j87m85N18q5m73P29L02j057K05O35m86J0K95q2r82R27
2487bJ81j028O85L16o86p5R02m81p95J046j14o21O17L57q55M22O00p56N9L95m46
2508b79k12P54n06m28P63k36p41P19M08q46M66M89n03m28P16j92j79L64K4m76
2528c23N79L01j411Q13O98q86K05P73p17m71J052j76r37J029P5p43L43O95o37
2547B62l37P25l10p0M69k25o21M92J87n53M48K04n58O5N90n01k10O03k05m33N77
2568E99l9q33N30M34m27k16P19n99q5O46m08k30O20m36n30N62K52n30r7O42q33
2589b59K55M69j85n22L83J02o73J13O93p94N2M96k59j75M90n06q3M7Q5k80J96
2610c55N29n18J5N88q48O7Q45m60n98O00j25j16M06N8o33l0Q16n75m4M37k16m28
$$ y = [-345, -180, 512, 280, -582, 214, 27, -458, 60, -25, -498, 231, 533, -524, -319, 316, -170, -160, 135, 53, -929, -2, 179, -849, -164, 152, -534, -609, 293, -188, -983, 63, -51, -672, -55, 302, -553, -131, 469, -287, -228, 167, -279, -491, 263, -243, -671, 92, -144, -885, -166, 242, -604, -138, 351, -152, -580, 136, -56, -235, 129, 153, -323, 256, 557, -854, -41, 657, -229, -24, 749, 32, -439, 613, 437, -500, 529, 604, -139, 204, 899, 262, -75, 650, 340, 270, 739, 514, -107, 385, 572, 19, 467, 671, 113, 178, 768, 267, 57, 660, 455, 22, 599, 560, -273, 257, 691, 264, 48, 767, 168, 83, 729, 321, 91, 711, 275, -255, 307, 559, 29, -68, 574, -259, -4, 465, 280, -242, 141, 243, -430, -317, 376, -418, -366, 130, -129, -304, 186, -320, -403, -356, -271, -551, -355, 174, -344, -329, 259, -589, -522, 323, -137, -735, -135, -260, -376, 30, 88, -545, -575, 241, -334, -378, 59, -157, -585]
2632e85Q49j42o59J21N01p61K77P34r08K66O37o00j50M32K64j095P21K72n44J40
2652b30P90p37Q8K8k05O8L96j65l51O92P5m99N06L33r19%O29k62l92R42n92n33
2674c38P42R2q59K56P07p09J21N40m80KL00l4o68N53J93p32O95J64p98K54N45
2695E46k99k71L48n3m17L94k64j83J69M92k92j69L95n16j9O94l33m16M37K04r40
2716d93P49M9q45J31P34l24l38Q76o11k15M87o3m67M1N62o01M64K06o82J00M84
2737B44n05l80Q23j39l94M35P7n53L72K82n82k20J051o21n39P64m59OJ75N06q15
2758d72K73M68r08J90M43l38j21P15n95k61O23K89r73M48O13p18J41M80l93m76
2778e72Q14r2l62M54Q2p08K78O09j015K01P03n95k6M92k71l71M30J60o08K83O50
$$ y = [-585, 264, 122, -537, -416, 85, -676, -399, 335, -573, -307, 330, -270, -420, 12, 276, -819, -98, 174, -370, -230, 560, -177, -89, -61, -266, -198, 198, 33, -318, 374, 449, -50, 456, 789, -130, -130, 499, 237, -155, 787, 195, -338, 404, 496, -363, -107, 600, -109, 12, 552, 72, 74, 374, 340, -328, 225, 418, -314, 381, 545, -253, 1, 546, 247, -24, 324, 271, -146, 248, -16, -199, -30, 462, 170, 1, 396, -120, -139, 555, 222, -194, 243, 447, -493, 256, 305, -540, -409, 325, 1, -337, 539, -72, -287, 200, 137, -330, -289, 273, -328, 136, 342, -340, -240, 244, -261, -641, 182, 43, -351, 84, 161, -392, -20, 262, -320, -540, 511, -110, -649, 115, -344, -338, -163, 343, -472, -199, 269, -639, -449, -6, -344, -465, 250, -345, -606, 17, 306, -667, -219, 394, -324, -183, 297, -96, -572, 242, 150, -212, 242, 324, -384, -106, 503, -512, -311, 392, -203, -229, 263, -8, -379, 51, 211, -397, -114, 536]
2799E36r64J7Q98j97l93N22k25l35N40P0p37N27K54m71J43N05o75J42Q18q64o2
2820D9M62l76k31M27L65o08j15N09m04k21P90m56l70K89N4n7q5K99q08L57O94
2841E64p46K9P53m19n83L45J24l94N81q6m20K61K77p59J83Q87n90k56K52P5n67
2862d89K50K86n39L46L11l88k00M33J04o83R09m22m31M11P0l99J08M42m08j45
2882d34L79Q1n20M22k37l5L50O8l88K95K04l24k69N26m68j70N59nm44M92l62m30
2904g10P80J17n86J4O80m75j5K62k8j38K08M2n74O29J4q0m30N68l29K17q5j02
2926b1m91R70l34j23K67L19p48L17kk43j90R28m22l26M92l70k34K71J75J2j52
2947I5J87l93k2K27j80P4M13j05o94L79K35l42k48P86p58K21L00l37K3L67J52
$$ y = [536, -428, -411, 487, 290, -103, 419, 194, -141, 399, 469, -268, 259, 513, 42, 185, 690, 15, 157, 975, 111, 49, 511, 135, -96, 331, 696, 88, -27, 482, 78, -143, 647, 191, -179, 110, 164, 107, 22, 321, -487, -130, 564, -182, -153, 600, 181, -402, -57, 67, -327, 254, 168, -252, 9, 286, -473, -290, 597, 7, -249, 3, 78, -489, -239, 47, -492, -146, 165, -223, -423, 10, 114, -569, 340, -82, -513, -102, -32, -431, -323, 119, -289, -434, -55, 26, -494, -72, -309, -344, 6, 74, -314, -19, 185, -139, -408, 118, -350, -520, 39, 34, -410, 82, -280, -710, 70, 187, -399, -385, 295, -180, -195, 67, 39, -99, 109, 151, -423, 206, 220, 140, -290, 278, -51, 166, 81, -21, -512, 458, 124, 1, 268, 587, -161, 156, 154, -89, -279, 649, 227, -99, 393, 23, -211, 60, 235, 247, 95, 282, -111, -133, 94, -86, -12, 401, 296, -398, -19, 216, -126, -374, 412, -346, -125, 175, -162, -139, 228, 380]
2968C80p78P42k44k85L61J82l97j65M91l62k39M58J59n97L61L01q19K72N03m05
2988h1k34N10j60l05L53j17m02Q29k76m09M0N16n98J81N96n14n24N46k56m4J92
3009a57M01l39j72L21j97q6N03l91k70N94l81O9p3J67l48J28Q1m6m2J96p7K0P4
3032b5J62l77N59n5o23N05K83p20J77K57l39J48K39l97o3L15O5k95K05K95m88
3053a72J32N56q92J45L42j34q3M38k17l00L56R6m16j7M57m55M5N18k15l23K94
3074A55J54l01L82k14j19K84l8l11j88L22j37n9M41j06n77M56L08p70M15M24p31
3095b10k1N85n29R2N31l80k32P1M97p28J22L25k72O4J13k54k7N45l6m46L09j89
3117g0j47K95l5m08K83r6p1N2J57J50k02J58k23l11K45K56j70j37L88n10L29J68
$$ y = [380, -398, 344, 100, -185, 176, 358, -39, -204, 287, -75, -314, 144, 303, -294, 67, 368, -451, -179, 324, -81, -315, 195, 35, -270, 83, -34, -436, 393, 117, -292, -252, 264, -334, -153, 443, -71, -595, -49, -305, -349, -157, 244, -95, -267, 54, -143, -229, 274, -117, -387, 207, -174, -105, -178, -11, -359, -231, -150, -196, -238, -42, -119, -99, -25, 137, -240, 319, 264, -359, 146, 429, -291, -114, 143, -196, -48, 191, -206, -269, 46, 111, -184, 21, 316, -172, -40, 516, -376, -231, 111, -23, -106, 332, 115, -185, 171, 267, -149, -166, 291, -164, -119, 399, 184, -139, 155, 309, 8, 390, 176, 57, 341, 303, -8, -196, 126, -11, -70, 371, 265, -312, 144, 452, -318, 97, 521, -210, -231, 354, -175, -83, 448, 68, -164, -93, 404, -324, -202, 123, -149, -85, 28, -226, -253, 292, 256, -190, 119, -70, -217, 78, 43, -365, -82, -178, -249, -197, -40, 110, -92, 66, -157, -468, -223, 33, -137, -274, 114, -396, -67, 101]
3139A01m92K51J74jn03O19j1l46R3J90k91P0K60k17j23K46L2l03L96j21l54N4
3161b76N72m29l2K29l18k6L61k13Q9q7L91n84L05r2o0M01K21m47j6K61j40j84
3183g4L75l4n06L73j94n9o4K82K0l52L04k82P8N71rn37L66M20o58L6N66m43k55
3206g6K35j14P5j35L00j93O4P0j68moJ58m02N39l00l15M52j21k12K11K29j57j67
3229c7J89p5j97J87k46l3J62j31p4L30j37k5J47L9k35K42k48N8l46L15P9m23P01
3252B42r5k62j20N60p87L59J43k11J48J42k16j18K35j2k12m8J01j77M00L5n4j07
3274e4K92k70LJ31o2j52L01j61k65J79K70q7q8J00l02q5K10j07K9K17J0m81J29
3297b43L20j61Q4J42m58M26K08j79m16K22J14J02m2K2k53m57P44J6j68P0j62k28
$$ y = [101, -391, -140, 34, 33, -470, 149, 138, -208, -115, 75, -216, -146, 114, -103, -226, 20, 52, -251, 145, 24, -330, -276, 296, -133, -165, 64, -254, -280, 81, -132, -43, -130, 261, -323, -18, -110, -170, 231, 452, 5, -11, 250, 110, -74, 301, 267, -239, 134, -60, -119, -183, 99, 119, -233, 71, -211, -133, 438, 429, -108, 258, 678, 20, 56, 622, 179, -76, 159, 45, 120, -15, 285, 92, 156, 226, 58, 54, 48, 206, -196, 343, 43, -272, 180, 59, -153, 58, 287, 130, -37, 152, 77, -120, 67, -179, -212, -50, -181, -255, 75, -62, -87, 60, 99, -136, 106, -142, -84, -430, -115, -36, -459, 242, 147, -115, -235, 325, -462, -103, 40, -171, -23, 119, -97, -215, 20, 8, -204, -252, -151, -328, 72, 107, 53, -54, 238, -32, -29, 102, 40, -112, 189, 28, -237, -58, 212, 125, 37, 137, -165, -250, -40, -147, -118, 99, 109, -372, -243, 77, -84, 0, 142, -316, 110, 318, 139, -277, -55, 59, 161, 119, 141, -112, -569, 175, 191, 23, 93, -69, -297]
3319b97L16J10k32k3J61p5J94L02l80o1l6J01k31J14K92j30k5P4n28M09j13j82
3341b40L86J16m82M1K81k11R6j81N86o02K00K79m11j95M47N7k01J60j05j57K57
3362A21L1m29j1L86l38p2K75M2J95k73k12m8L71n6J10l11J66q7K25j28l50RN55
3385A71J19k88p5J93m70K23J03k17K86k8J63o42M72N9Q6l66L88j73K16k15j76
3406a71J75J17l43j47N01m4j56J31N8k86L81l5k08J59j43J78l78M46m24p1K68
3427HK9p9O0O7k59m3J96K4J95k81J9n2J60j66j25K53L36l24o9L37l24P9J82p5
3451A48l12L40J50n65J25J30k37l9N60m26l0O37n43J55j60K64l76J13J36l22j8
3472b70L51K8k15R1J25q7r1L42o00L6K97K57l37J43m24J27K01k0K6j28J05k25
$$ y = [-297, 19, 129, -103, -126, 35, -40, 154, 456, 76, 15, -21, 80, -151, -37, 255, 125, 100, 174, -354, 55, -58, -240, 146, 262, -220, -179, 102, -109, -13, -194, 392, -210, -10, 269, -142, -337, 110, 167, -34, 126, 21, -136, 121, 152, -277, -288, 98, -240, -312, -37, 5, 200, -73, -285, -333, 38, -18, 92, -219, -53, -140, 85, -43, -393, -384, 171, 290, 2, -73, 120, -350, -127, -24, -241, 45, 17, 180, -462, 10, 69, 155, -211, 177, 4, 220, 5, -171, 4, 121, -222, -369, 132, 88, -68, 63, 121, -165, 216, 181, -27, 132, -11, 167, -211, 235, -189, -260, 8, 37, -42, 18, 85, -174, -217, -21, 3, 198, -83, -64, -116, 44, -122, -247, 6, 342, 18, -51, 286, -38, 41, 223, 148, -164, 176, 326, -239, -114, 16, -221, -260, 300, -126, -156, 481, -62, 93, -67, 197, -179, -66, 70, -252, -270, 81, 109, -106, -15, 110, 23, -68, 274, -326, -290, 7, 264, -73, 70, -354, -227, -26, -46, -20, -148, -43, -268]
3494b68K28K33p40N47j22K04j39J41L3j20J33m48J74J60O0k42K15J80k54k5J60
3515A10n35L78J08K52m05J36Q8j84J38M8m02M32j57pj47L85j83k59L29k34J51
3536D2j43K55j08p3L86n45M39nj90k75L11N2k87L08K12k45K1L27l28j92N0J6j35
3559a07L15o5k69R8K23k65J1M16m78Q1J04j44lJ81j22j55J87k1Q0k93L23r8J01
3582A00r7j11k90P05m06j9L9K46q7K35l91l7Q4J98p7L8k9k29p2J35P7M1m66M68
3606E5k28J77K93K9l47O3N3j93K32n4j05K04j54j20M0J54j87l58O75k75Q7k31
3628a90K67j5J88m16J95K34j30l26K10J07n2k89M83r3p0Q5M9l64L60j34k50J5
3650a36J44O3J52q4l1k86K54L08o10L46L6Q0m41J56p1J78J15p0J95k98Q1j95K11
$$ y = [-268, -40, 193, -547, 0, -122, 82, -57, 84, 117, -3, 130, -318, -144, 16, 76, -166, 49, 229, -25, -50, 110, -425, -47, 61, 313, -92, 44, 132, -52, 86, 134, -268, 164, 7, 0, -147, 238, 55, -204, 125, -109, 42, -101, 154, 46, -27, 359, -186, 253, 248, 58, -217, 94, 146, -141, 167, 379, 134, 155, 482, 154, -38, 12, 28, -107, 208, 143, -126, -28, 195, -70, -59, 357, -121, -40, 64, -80, -83, 98, -24, -179, 8, -13, 67, -226, 97, -1, 100, 3, -108, -398, 307, -99, -118, -79, 167, 80, 315, -76, -113, -29, 169, 92, 130, 101, -128, -200, -65, 12, 53, -413, 55, -173, 4, 297, 326, -21, 42, 95, -98, 134, 80, -25, 179, 25, -95, -55, 99, -88, -446, 229, -46, 41, -190, 77, 62, 250, -166, 29, 263, 133, -193, 17, 124, 72, -217, 266, 173, 103, 188, 237, -127, 233, 99, -151, -136, 8, 71, 223, 139, 108, -178, 76, 384, -226, 120, 156, 236, -205, -49, -120, 58, 173, 103, 298, 0, 81, -114, 97]
3673I7k67j47O52k23k23J7j49L04K76k38K5k47J52p4m44M16K6L74l83K17Q2k67
3695b4l5J82j43O1J0l2j97OQ9J67O6k00K05n17K44q8K34J9q8K45l45q7q8L85j26
3720e7mk5L5j35K68j86J54n2J38m13O42j37m22m1L77o2k23j23L32k12L3J10k3
3743b6J39j89J1l1K41JP1m14Q8p9K01ok5j5j90L91j43r2J6o7K19j61K65O6k96
3768b5J84O3j49k04j73L34j60k0K61N6k98J05M3J01n3j86K94k42K88j40l02J22
3790a01N5J36q6M2N2O7j66j46L1L29k24M11l19q1k99K78K29k96K70j54N6j92K44
3813A36Lj62K00k76J70k94L36j75J31J67q9o2l0J64m53K51K63j68j07J60j12J87
3835B40m09k00P24l42kR2m7qj44J18r6j13n6M91l69O0m8j9K71J08l85O4N8N8j2
$$ y = [97, -170, -317, 335, 112, -111, -94, -243, 61, 337, 99, 124, -123, 29, -45, -489, -73, -47, 327, -56, 161, 243, -24, -59, 123, -20, 41, 51, 19, -178, -172, -83, 84, 150, -50, 155, -362, -118, -206, 28, 47, -41, 204, -141, -228, -316, 69, -57, -61, -86, -51, -186, 82, -104, 50, -2, 136, -277, 365, 228, -194, -235, 142, 80, -143, -266, 66, -146, -113, -3, -26, 113, -76, -65, -96, 145, 146, 217, -197, -109, -188, 13, 7, -18, -33, -223, 168, 25, -67, -51, -118, 101, -60, 205, 271, -25, 159, 222, 73, -131, -304, 30, -130, -150, 111, 167, -131, -26, 17, 118, 65, -121, 173, -69, 219, 79, -223, -101, -46, 90, 4, 46, 98, 165, -1, -147, -116, 213, -11, 400, 81, 0, -299, -21, 208, -88, 182, 28, 84, -108, 136, 139, -23, 177, -99, 71, -223, 113, -62, 69, 236, 147, 85, 55, 219, -234, 17, 280, 112, 5, 165, 53, 240, -169, -369, 355, 13, 11, 103, 56, 48, -96, 22, -74, -187, -243, 248, -121, -61, -109, -128, 143, 251, -134, -70, -12, 46, 34]
3860C4j03J8q3R9j97K88q5R2j51jj56K0o0L46j26j52K18J40l95L86O4k97j28L41
3884A12j49j2L34l51J05k03J21j47J30j72J09K97N6k93j73K75j48N4K54j07J92
3905B84K4m64J57L50j9o13L48M5l82K57L49N7k14M5k8k18j5M00l98J57n7l9j1
3928A5L25m4j87Jj63N8K83r7j45j03K66k40P3o8nJ93j16k43L18K36l82R6R8n2
3952A17j23M9J57l14J29J51j14k56K27j17J1L51l72J58k3L51o78L28r6K08n32
3973c88M74j51OO3n1k40J64K0R0N5p3J32k16L8j09J16J57j54J16k73L66k26Q8
3996Dj68O46m19k18j76p7M03l62M08k8J87k18J06Q1k85J27J67m89J86K49K70m57
4018f3L15r1j91J86n1J50j15j61J01p5k1n7K73k02k07M58l33J38k9J98K82n08
$$ y = [34, -69, -51, -134, -35, -232, 56, -29, 63, -88, -89, -245, -225, -285, 61, -65, -217, 1, 141, -254, 132, 196, -101, -229, 112, -37, -49, 285, -66, 39, -164, -43, -190, -60, -232, -123, 174, 230, -63, -236, 39, -109, -55, 199, 92, 284, 308, -156, 1, 351, 332, -281, 67, 112, -270, -13, 336, 393, 179, 224, 196, -22, -37, 363, -35, 122, 65, 26, 15, 340, 296, 109, 110, -53, 5, 288, 191, 46, -57, 209, -31, 42, -26, -31, 162, 46, -197, 121, 357, -25, 71, 169, 117, -6, 43, 200, -114, 15, 166, 52, -204, 23, -94, -83, 268, -104, 54, 31, 382, -296, 32, -64, 144, -388, 86, -65, -59, 4, -47, -287, -123, -103, -13, 42, -31, 101, -115, -77, -186, -70, 87, -67, 49, -224, 142, -84, 4, -164, 482, 63, -155, -331, -408, -5, -367, 41, 13, 200, -18, 88, 169, -116, 11, 178, -311, -125, 124, 394, -63, 252, 161, -30, 156, 105, 255, 140, -21, 80, 5, -16, -73, 200, -2, -209, 249, -84, 54, 25, 223, 505, -3]
4040cJ06k5J57k08K9Q4j50q5J71lJ20K58l90l9N33j61k95Q9j08O7J82r3j68k02
4064a34P4R1r3L08j64J83j62J03k80J98K21n24L56j14j31K29o9j17P2k3J69l33
4086a40J61j21j15K11k91L47p5K13j54m03M68j60N6o6j29J53j5L52n57N1Q8K79
4108A53l66K72o9j83K62j34j89K10n7l01K87J39l48N8m6M44l33K40k61K33l31
4129c20K61k39PN55l95k02N06m30R9M8M08l20L5L00m56L26j01j5j14K55k66n4
4151a12K4L4PJ69K9k75J36K89k59J75q8k38N6M67l82K9k00M95k27k43L87j83k8
4174F2L8m66M85j12K88j26k53K55P4l74M27j91K40j50K14p26M36p3m5K70P9m37
4196h5L52O2o35L29K4O6j56O3J16k42L68k53M9K46l85J00j74K14j90j02L36l33
$$ y = [-3, 103, 78, 235, 27, 56, 140, -10, -95, 76, 73, 193, 451, 61, 22, 555, 394, 99, 188, 80, 147, 329, 236, 68, -134, -60, 31, -62, 246, 82, 265, 103, 206, -74, 124, 345, -179, 177, 63, -68, 161, 92, -25, 47, 24, 193, -140, 21, -100, -215, -4, -295, 52, -23, 190, 36, -367, 101, -59, -3, -69, -198, -45, -60, 292, -265, -214, -126, 153, -213, 59, -10, -193, 69, -65, -254, -44, -101, -402, -115, 24, -324, -266, -312, 132, -201, 39, -222, 11, -320, -59, -298, -291, 264, -131, -333, 173, -257, -158, -110, 298, -22, 13, 313, -143, 183, 82, 67, -47, 208, -58, -112, -88, -54, -47, 122, 151, -124, 12, 301, 42, 217, 129, -109, -53, 414, 32, 61, -139, 356, 129, -114, 273, 90, 62, 100, -366, 119, 7, 295, 169, -84, 171, 245, -129, 298, 107, 347, 197, 411, -315, 121, 48, 3, 273, 352, -85, 267, 329, -306, 23, 47, 113, -43, 20, 136, -106, 262, 9, 58, 304, -81, 19, -155, 59, -131, -233, 103, -230]
4218b30K31J42j35o1k9OJ18j68k7qj03N5R9m4L72m12j88J25rj04N74M6o05k30
4242e85O55r3k14K89l10J0MK65k95K58nm54K44J34j94P0L17j06m70M40L74n22
4264a88J54N17o44J75L5k70J77J29r1J16LJ42k97K98ok1k65M95j41j31L30k70
4286B47j55L48m63R6J32K59l95j07K81j15k01K18P8qn6p9J84J0J84j61J11m3j39
4309B26j54R1j64J94k42M33m82K00O7j39K80j27l25j19J88K82k89L96j71k04K70
4330B11j87J45j98J96m08N1K66j35l33M80k87j97L44Nk4j88K70r1k4Q4j67m80
4352f67N18R4K5j1l09k95M66J71j40o9M42m10j77K74k9j94J77pj45l34N74o0J62
4375E6j74k3j28L09k31j18P7J31j18J34K45m4k80P4K9J79k40J46l03M52j61k60
$$ y = [-230, 1, 143, 8, -53, -82, -76, 42, -126, -153, -161, -264, -209, -110, -154, 218, -194, -382, -257, -266, -370, 204, 250, -355, -585, 70, -23, -237, 52, -258, -248, -244, 21, -274, -16, -21, -475, -231, -97, -291, -221, 96, -10, -480, -40, 334, -188, -34, 483, -161, 14, 49, -221, -44, 85, -6, 110, 113, 255, -42, 256, 250, 229, -36, 459, 318, 187, 517, 247, 92, 440, -23, 73, 205, 464, 69, -38, 243, 128, -73, 145, 223, 215, 159, 80, 264, 274, 458, 297, 408, 365, 226, 72, 163, -1, 193, -49, 384, -98, 102, 169, 30, 310, 183, -142, -261, -73, 209, -80, 316, 145, -59, 211, 24, 169, -29, 167, -241, -190, 76, -59, -392, 88, -199, -396, -52, -47, -71, -259, 11, -80, -104, -20, -187, -667, -149, -55, -30, -41, -350, -645, -179, -8, -148, -217, 225, -185, -362, -88, -117, -311, -134, -141, -286, -620, -46, -106, 56, -118, -141, -269, 40, -191, -309, -232, -101, -219, -85, 160, 116, -164, -90, -61, 118, -122, 24, -279, 173, 12, -248]
4397b48L42J3k00J59K2r5k01L64N3l66K68m4k84L50L30p30L90L65m82K46J54l50
4419E6nL05J03o05M48j1l00K44J9m29J95J78J71j95L69l49m0Mn6j97K81J06k38
4442E4k26L05q6j41L94j39p13O27J23m16N69k48k23J05K10j18j5J66L9p64N39
4463D2J35l07J90J45l26j07J42o0P0p3K05j98M3K2k89P9J95j3l2K61n40L08m3
4486a51M8p3J77j32j96O18l20k22K68L4l72JK73j71l58R01n69l5O4K49k47o5K28
4509e0k27J25L02l81l05N30No60P26J02o36J40L76k69L5M98m04q6K76n3l39N27
4531B32j69j33L2K48k47P8L35j73k58L31J0l79L39j75J10K13l04k1m3K05j7j05
4553A09K07J55n97K43M4p5J19L14l46r7K91m13M0J81m0l30M82N6q07O16K40k84
$$ y = [-248, 94, 107, -93, 66, 88, -7, -208, 156, 209, -157, 111, 67, -217, 133, 463, -267, 123, 488, 6, 252, 406, 56, 51, 356, 459, -146, 302, 291, -9, 235, 254, -175, 20, 198, 369, 174, 543, 194, 154, 158, 102, -95, 186, 292, 54, -172, 133, 47, -94, 300, 161, -552, 75, 198, -218, 351, 103, -120, -15, 195, 77, 62, 228, 267, -497, 42, 177, -130, 60, 205, -121, -228, -86, -146, -76, -149, 56, -142, -99, -77, -366, -287, -92, -105, -137, 124, -416, -108, -151, -103, -176, 1, -131, -327, 291, -29, -251, 17, 51, -321, -320, -47, -218, -576, 325, -244, -279, -215, 34, -213, -278, -50, -277, -152, 150, -231, -536, -6, -1, -661, 65, 167, -469, -329, 47, -222, -187, 311, -93, -179, 97, 44, -295, 232, 63, -70, -38, 210, -37, 41, 376, 203, -55, 276, 286, -93, 246, 71, 181, 394, 90, 69, 26, 231, 214, 109, 316, 471, -126, 117, 161, 86, 205, 519, 173, 76, 367, -46, -6, 175, 135, -195, 287, 343, -464, 152, 392, 108]
4575A08m8J21K0j72M9r3J22j44Kl8K83p3l08K16M8J39n12O07o10k85P71j22m19
4598c38J80K62n04K05L27l61k4M28m03k37L24k82J41J63J32k55oK41r6r7K13j94
4620a81m84Q65j27m12J33J52l06J93K2j15k31M17j14k17O89m25k45M19k31n81
4640g79Q23L2n44J74P67n54l10O02j49j00j22K94l66K20L29l00j03N54m70j62
4660a64O31l50l50J70K86k07L40j47m07M4L70n04L20N50o18j62M97m9l51J93K70
4681C62k15J31J73n50j20O11l20l8R2Qk44L85O5o43M17L42o65M11K62n17M9N34
4703E30k62m15M99k98k27L52j49l6j30J47j38J50K14Pl93L87j43n21M92J10n78
4724d02K32N29l22l93L14j02l82M95J36l89J25L52l63j42N31o64J68L41n61J39
$$ y = [108, 60, 181, 201, 29, 78, -15, 107, -37, -35, -73, 210, 137, -171, 45, 93, 232, -280, 327, -283, -568, 203, 81, -338, -158, 104, -400, -195, 132, -229, -253, 175, -228, -465, -141, -423, -282, -119, 13, -242, -248, -7, -103, -200, 13, -181, -665, 200, 73, -339, -206, -54, -360, -167, -145, -260, -491, -74, -188, -405, 284, -141, -386, 33, -198, -779, 44, 76, -468, -294, 473, -81, -391, 211, 62, -38, -160, 134, -232, -12, 317, 17, -86, 468, -2, -164, 467, 117, -233, -63, 223, 16, 356, 209, -198, -154, 216, -288, 32, 582, -36, -198, 299, 250, -101, 92, 362, 147, 278, 451, -99, -219, 392, 72, 34, 126, 134, -110, 275, 340, -303, 114, 456, -209, 202, 464, -53, -4, 530, 268, -147, 352, 54, -173, 179, 30, -6, -136, 11, -127, 23, 237, 244, -149, 238, 95, -426, 66, 176, -402, -170, 359, 37, -356, -42, -144, -526, -31, 105, -284, -159, 193, -170, -312, 219, -445, -277, 64, -497, -358]
4744c58M08Rl53K43L95p54J71K61k08k7L21l15k42N45k62m28N19L9k33j2L16k88
4766b53q3M83j6n82M81J12o27Q82k15m25L53j35N8k07L74l15k49N43o9l63N15
4787B62k01j83K34o9j7p5M89n56n8O90m64k3K76P2k74N2n6k29k29P71m26k85O18
4810C19Q9m52L05L1l09M97l17K07l20K68l34Q3M43k37n06N49K41n64J41L36n45
4831g5M06K82m63k07N13k83n6J82N3l62J27L42n06J94K87p07L76K94k44k37M29
4852C45L9o31K15L16o66L01N34n88L96l20j98J26M42k64m26O09j99l99L31M23
4872C86n05p9L69k53j86M59k93l11M96j46l79M30N4k94K12J51l18k4L61j13k16
4893a99J48J93l93L56Kj22j0K63k48o1L57k88k28J79L04l33J19M15o40J97L32
$$ y = [-358, 50, 59, -294, -51, 344, -410, -239, 22, -186, -213, 108, -207, -449, 96, -166, -594, -75, -36, -269, -281, 35, -253, -336, 147, 131, -451, 30, 142, -485, 397, 182, -243, 110, -25, 33, -174, 200, -115, -364, 179, 110, -253, 262, 61, -122, 112, 43, 26, -49, 440, -116, -174, 516, 52, 29, 305, 377, 103, 155, 99, -130, -359, 412, -14, -299, 319, 408, -44, 261, 292, -17, 480, 163, 370, 50, 318, -16, 67, 510, 273, -233, 316, 557, -7, 134, 470, -75, 331, 613, 150, -57, 456, 173, 117, 299, 352, -10, 117, 459, -47, 147, 434, -273, 103, 397, 153, -84, 345, 384, -247, -32, 284, -382, -81, 453, -135, 261, -59, -257, -131, 311, 47, -379, 230, 31, -368, -37, 386, -119, -198, 171, -82, -268, 191, -102, -413, 83, -63, -442, -12, 42, -252, -40, 111, -207, -231, 130, 17, -199, -51, 142, -251, 105, 107, -15, -25, 238, -10, -71, 286, -2, -230, -51, 253, -80, 39, 454, -186, 11, 343]
4914C43l02K2M13n22k01M61j25PL9j72o6J81K72p17K59O51j13m26J71M04n61J37
4936A55K1l93K92M21k99r8M36l07p6O42n80m02M26p8j18K31K53l90l09M98q7m12
4958a74N61k41l76N23j23k07J18J83o40L61J05l10k96Q13j82n45O89J4n49j9P41
4979D46p38P1L01n41L07N83l28k10L81j67n18K61N48o67j0M69m71l51P88m09k52
5000e07K20M54o07M38J08p23M41O6k88Q3L73n98m1L54J80l90M31K29n42%N32m09
5022a96r2O07m36j65N36o8n48K36K75l08j70O66n28r9N55m35j34N42m48o1J78
5043i3Q4k34M04R1l06k15O54n07j45P14l08q4K33M8n37K9O77o70O1L33l68L02
5065A63K21j30m06N64l0o85O19N41j197N49J00j77l71P35l67k23L67K50n31Q4
$$ y = [343, 41, 63, 476, -46, -247, 214, 89, 96, 135, -37, -103, 78, 350, -367, -108, 543, 430, 4, 175, 579, 18, 155, 176, -217, 75, 496, 197, 99, 535, 228, 152, 794, 214, -188, 238, 160, 42, 273, 526, 136, -173, 325, 238, -174, 387, 146, -230, 293, 170, -37, 81, 264, -376, -15, 90, -220, -516, 297, 115, -430, 259, 273, -276, -295, 446, -292, -221, 80, -461, -154, 429, 101, -109, 272, 105, -413, -152, 396, -271, -281, 188, -283, -634, 154, -255, -507, -287, 167, -440, -2, 106, -617, -176, -110, -398, -315, 58, -540, -581, -227, -47, -437, -6, 223, -319, -319, 213, -196, -288, 319, -117, -282, 254, 186, -362, -126, 149, -159, -329, 337, -191, -290, 265, -170, -304, 238, -210, -271, -93, -9, -243, 161, 252, -54, -269, 385, -122, -267, 447, 139, 55, 288, 336, -201, -172, 505, -165, -104, 229, -139, 163, 384, 254, -152, 412, 382, -303, 316, 857, -340, 209, 309, 132, -239, 496, 129, -94, 273, 523, -8, 76]
5085G6R7l58J81M41k86n05P25m08q5J47O9o36O72K57n55j08K3J9L37j03J96m83
5107b87K69L35o05J89J91l06j05N62n39n9L72l46r4M23k48m38L84K60l76L67J27
5128G6k97l56M13N5m18M96m7l56M43K2n74L08L58n11k9L99l1r6N50l73m12J70
5150b10K98n98J99M48m26N2Q5k23j91R03m01m63M27p1K15l1J95m19J37L51k64
5171A3l48O89l72l92Q56m73j92M55J44o00M24J53q3m98Q79m71l38O20l0m87L58
5192C07K24k32M1pl41Q0K64j79L1J62K26p49L32L35o26M18J6l29r7L09n3j29K31
5215B34L2p97O31K41m58J11O62q46L67N5j69l06P18o98j65N97J8m44Q4N43p00
5236b90J07K83j87m04O34o8l01j5L17l01pJ36k42K13J99k36k24M05k69l70P90
$$ y = [76, 173, -185, -4, 437, 151, -354, 371, -37, -122, 25, 94, -542, 130, 387, -168, -276, -253, -234, 103, 0, 196, -287, -18, 317, -288, -99, 92, -214, -319, 243, -296, -355, 17, -329, -423, 0, -248, -686, -302, -42, -418, -51, 76, -221, -577, -164, -109, -527, -31, -78, -434, 9, 31, -543, -235, 123, -388, -417, -18, -49, -145, 405, 32, -380, -210, 88, -510, -311, 137, -289, -237, -152, -375, -566, 337, -64, -527, -100, -171, 44, 13, 208, -211, -74, 277, 13, -335, 354, -18, -410, 446, -27, -219, 236, 380, -220, 204, 357, 274, -224, 655, 184, -154, 466, 436, -51, 307, 531, 299, 340, 333, -8, 72, 336, 157, 188, 350, 576, -173, 159, 494, -132, 286, 302, -27, -124, 185, 132, 3, 234, 266, -531, 100, 341, -117, -6, 656, -190, 177, 232, 63, -243, 475, -223, -388, 209, 227, -217, -133, 410, -290, -183, 100, -87, -491, 143, 75, -226, -241, 76, -225, -232, -96, -338, -125, 74, -162, -386, 19, -250, -620, 170]
5257A70l06l62J94K17l58J36M0r9O7K07j36QJ3M7l28J34M76o75N50K46p20J37
5279c42M79l91k79N56J6n28O44J38q11M09L91k41l8P1o3j16J14L94o36K75j69
5300a27L69q4J84k99j24O57m44k94N64k21j75O80k20n68R8M04m98K65K24Ol61
5321C6M93k06l40L4L56o47K63Q80r67K1N17l82j35N77j68k82N07k09m61L47q8
$$ y = [170, -136, -498, -304, -87, -445, -309, -269, -368, -301, -94, -230, -222, -209, -162, -490, -356, 120, -555, -5, 241, -479, -342, 137, -254, -533, 23, 39, -489, 155, 293, -518, -109, 282, 41, 3, 74, 11, -105, 9, 403, -233, 42, -127, 242, 158, 342, 43, -81, 576, 132, -162, 402, 181, 6, 686, 466, -102, -4, 400, -98, 167, 391, 397, 36, 529, 323, -17, 17, 373, -274, -11, 869, -98, -77, 440, 58, -77, 500, 332, 50, 557, 348, -113, 234, 146]
$$ [...]
8191E4
##END NTUPLES=NMR FID
##END=
