##TITLE=1H_EC-3189(31)
 CDCl3, 8 sc, 
 17.10.2019
##JCAMPDX= 6.0         $$ Bruker NMR JCAMP-DX V2.0
##DATA TYPE= NMR FID
##DATA CLASS= NTUPLES
##ORIGIN= UXNMR, Bruker Analytische Messtechnik GmbH
##OWNER= root
$$ XWIN-NMR		Version 3.5
$$ Thu Oct 17 15:06:23 2019 Russian Standard Time (UT+4h)  she@DPX200
##.OBSERVE FREQUENCY= 200.1315
##.OBSERVE NUCLEUS= ^1H
##.DELAY= (6, 6)
##.ACQUISITION MODE= SIMULTANEOUS
##.ACQUISITION SCHEME= undefined
##.AVERAGES= 8
##.DIGITISER RES= 18
##SPECTROMETER/DATA SYSTEM= spect
##.PULSE SEQUENCE= zg30
##.SOLVENT NAME= CDCl3
##.SHIFT REFERENCE= (INTERNAL, CDCl3, 0, 15.7039)
##AUDIT TRAIL= $$ (NUMBER, WHEN, WHO, WHERE, WHAT)
$$ ##TITLE= Audit trail, XWIN-NMR		Version 3.5
$$ ##JCAMPDX= 5.01
$$ ##ORIGIN= Bruker BioSpin GmbH
$$ ##OWNER= she
$$ F:/spectra/data/she/nmr/H-F/1/audita.txt
$$ ##AUDIT TRAIL=  $$ (NUMBER, WHEN, WHO, WHERE, WHAT)
(   1,<2019-10-17 15:05:21.48 +0400>,<she>,<DPX200>,
      <created by zg, POWCHK disabled, PULCHK disabled
       configuration hash MD5:
       00 E9 B6 7A A2 85 ED C7 34 08 36 98 17 FE 4E 26
       data hash MD5: 16K
       54 0C D7 9F 03 53 9C 64 30 95 74 95 14 F4 33 13>)
$$ ##END=
$$ 
$$ hash MD5
$$ 27 13 AA 52 9C 3F 77 B7 69 CC 3D C1 90 24 3B 09
##$RELAX= 
##$RELAX= 
##$RELAX= 
##$RELAX= 
##$RELAX= 
##$RELAX= 
$$ Bruker specific parameters
$$ --------------------------
##$DU= <F:/spectra>
##$EXPNO= 1
##$NAME= <H-F>
##$PROCNO= 1
##$TYPE= <nmr>
##$USER= <she>
##$AMP= (0..31)
100 100 100 100 100 100 100 100 100 100 100 100 100 100 100 100 100 100 
100 100 100 100 100 100 100 100 100 100 100 100 100 100 
##$AQSEQ= 0
##$AQ_mod= 1
##$AUNM= <au_zg>
##$AUTOPOS= <>
##$BF1= 200.13
##$BF2= 200.13
##$BF3= 200.13
##$BF4= 200.13
##$BF5= 200.13
##$BF6= 200.13
##$BF7= 200.13
##$BF8= 200.13
##$BYTORDA= 1
##$CFDGTYP= 0
##$CFRGTYP= 5
##$CHEMSTR= <none>
##$CNST= (0..31)
1 1 145 1 1 1 1 1 1 1 1 1 1 1 1 1 1 1 1 1 1 1 1 1 1 1 1 1 1 1 1 1 
##$CPDPRG= <>
##$CPDPRG1= <>
##$CPDPRG2= <>
##$CPDPRG3= <>
##$CPDPRG4= <mlev>
##$CPDPRG5= <mlev>
##$CPDPRG6= <mlev>
##$CPDPRG7= <mlev>
##$CPDPRG8= <mlev>
##$CPDPRGB= <>
##$CPDPRGT= <>
##$D= (0..31)
0 1.2 0 0 0 0 0 0 0 0.06 0 0.03 0 0 0 0 0.0002 0 0 0 0 0 0 0 0 0 0 0 0 
0 0 0 
##$DATE= 1571310320
##$DBL= (0..7)
120 120 120 120 120 120 120 120 
##$DBP= (0..7)
150 150 150 150 150 150 150 150 
##$DBP07= 0
##$DBPNAM0= <>
##$DBPNAM1= <>
##$DBPNAM2= <>
##$DBPNAM3= <>
##$DBPNAM4= <>
##$DBPNAM5= <>
##$DBPNAM6= <>
##$DBPNAM7= <>
##$DBPOAL= (0..7)
0.5 0.5 0.5 0.5 0.5 0.5 0.5 0.5 
##$DBPOFFS= (0..7)
0 0 0 0 0 0 0 0 
##$DE= 6
##$DECBNUC= <off>
##$DECIM= 24
##$DECNUC= <off>
##$DECSTAT= 4
##$DIGMOD= 1
##$DIGTYP= 9
##$DL= (0..7)
0 120 120 120 120 120 120 120 
##$DP= (0..7)
150 150 150 150 150 150 150 150 
##$DP07= 0
##$DPNAME0= <>
##$DPNAME1= <>
##$DPNAME2= <>
##$DPNAME3= <>
##$DPNAME4= <>
##$DPNAME5= <>
##$DPNAME6= <>
##$DPNAME7= <>
##$DPOAL= (0..7)
0.5 0.5 0.5 0.5 0.5 0.5 0.5 0.5 
##$DPOFFS= (0..7)
0 0 0 0 0 0 0 0 
##$DQDMODE= 0
##$DR= 18
##$DS= 0
##$DSLIST= <SSSSSSSSSSSSSSS>
$$ [...]
##$SUBNAM2= <"">
##$SUBNAM3= <"">
##$SUBNAM4= <"">
##$SUBNAM5= <"">
##$SUBNAM6= <"">
##$SUBNAM7= <"">
##$SUBNAM8= <"">
##$SUBNAM9= <"">
##$SW= 24.0689530833862
##$SWIBOX= (0..15)
0 0 2 0 0 0 0 0 0 0 0 0 0 0 0 0 
##$SW_h= 4816.95568400771
##$TD= 16384
##$TD0= 1
##$TE= 0
##$TE2= 300
##$TE3= 300
##$TEG= 300
##$TL= (0..7)
0 120 120 120 120 120 120 120 
##$TP= (0..7)
150 150 150 150 150 150 150 150 
##$TP07= 0
##$TPNAME0= <>
##$TPNAME1= <>
##$TPNAME2= <>
##$TPNAME3= <>
##$TPNAME4= <>
##$TPNAME5= <>
##$TPNAME6= <>
##$TPNAME7= <>
##$TPOAL= (0..7)
0.5 0.5 0.5 0.5 0.5 0.5 0.5 0.5 
##$TPOFFS= (0..7)
0 0 0 0 0 0 0 0 
##$TUNHIN= 0
##$TUNHOUT= 0
##$TUNXOUT= 0
##$USERA1= <user>
##$USERA2= <user>
##$USERA3= <user>
##$USERA4= <user>
##$USERA5= <user>
##$V9= 5
##$VALIST= <valist>
##$VCLIST= <CCCCCCCCCCCCCCC>
##$VD= 0
##$VDLIST= <DDDDDDDDDDDDDDD>
##$VPLIST= <PPPPPPPPPPPPPPP>
##$VTLIST= <TTTTTTTTTTTTTTT>
##$WBST= 1024
##$WBSW= 4
##$XGAIN= (0..3)
0 0 0 0 
##$XL= 0
##$YL= 0
##$YMAX_a= 190993
##$YMIN_a= -137278
##$ZGOPTNS= <>
##$ZL1= 120
##$ZL2= 120
##$ZL3= 120
##$ZL4= 120
##$ABSF1= 10
##$ABSF2= 0
##$ABSG= 5
##$ABSL= 3
##$ALPHA= 0
##$AQORDER= 0
##$ASSFAC= 0
##$ASSFACI= 0
##$ASSFACX= 0
##$ASSWID= 0
##$AUNMP= <proc_1d>
##$AZFE= 0.1
##$AZFW= 0.1
##$BCFW= 1
##$BC_mod= 2
##$BYTORDP= 1
##$COROFFS= 0
##$CY= 11.3945322036743
##$DATMOD= 1
##$DC= 2
##$DFILT= <>
##$DTYPP= 0
##$F1P= 20.1720416913024
##$F2P= 0.152960286110954
##$FCOR= 0.5
##$FTSIZE= 0
##$FT_mod= 4
##$GAMMA= 1
##$GB= 0.15
##$INTBC= 1
##$INTSCL= 1
##$ISEN= 128
##$LB= 0.24
##$LEV0= 0
##$LPBIN= 0
##$MAXI= 10000
##$MC2= 0
##$MEAN= 0
##$ME_mod= 0
##$MI= 1.114404
##$NCOEF= 0
##$NC_proc= 0
##$NLEV= 6
##$NOISF1= 3.799351
##$NOISF2= 2.8
##$NSP= 1
##$NTH_PI= 0
##$NZP= 0
##$OFFSET= 15.70392
##$PC= 1
##$PHC0= -9569.558
##$PHC1= 23.80089
##$PH_mod= 1
##$PKNL= yes
##$PPARMOD= 0
##$PSCAL= 0
##$PSIGN= 0
##$REVERSE= no
##$SF= 200.130013532006
##$SI= 16384
##$SIGF1= 3
##$SIGF2= 2
##$SINO= 400
##$SIOLD= 16384
##$SREGLST= <1H.CDCl3>
##$SSB= 0
##$STSI= 0
##$STSR= 0
##$SW_p= 3612.71676300578
##$SYMM= 0
##$S_DEV= 0
##$TDeff= 0
##$TDoff= 0
##$TI= <>
##$TILT= no
##$TM1= 0
##$TM2= 0
##$TOPLEV= 0
##$USERP1= <user>
##$USERP2= <user>
##$USERP3= <user>
##$USERP4= <user>
##$USERP5= <user>
##$WDW= 1
##$XDIM= 8192
##$YMAX_p= 0
##$YMIN_p= 0
$$ End of Bruker specific parameters
$$ ---------------------------------
##NTUPLES= NMR FID
##VAR_NAME=  TIME,          FID/REAL,        FID/IMAG
##SYMBOL=    X,             R,               I
##VAR_TYPE=  INDEPENDENT,   DEPENDENT,       DEPENDENT
##VAR_FORM=  AFFN,          ASDF,            ASDF
##VAR_DIM=   8192,          8192,            8192
##UNITS=     SECONDS,       ARBITRARY UNITS, ARBITRARY UNITS
##FACTOR=    0.0002076,     1,               1
##FIRST=     0,             0,               0
##LAST=      1.7004516,     0,               0
##MIN=       0,             -137278,         0
##MAX=       1.7004516,     190993,          0
$$ Real data points
##PAGE= N=1
##DATA TABLE= (X++(R..R)), XYDATA
0 0 0 0 0 0 0 0 8 -8 8 -8 9 -16 16 -24 25 -32 40 -48 56 -65 76 -89 104 -120 137 -156 178 -203 230 -258
30 -258 292 -328 368 -412 460 -513 570 -633 701 -779 862 -955 1057 -1171 1297 -1437 1598
47 1598 -1781 1988 -2233 2518 -2862 3282 -3812 4507 -5456 6841 -9061 13221 -23787 110185
61 110185 190993 87020 140063 116710 100548 124383 159840 134678 129879 91320 39646 37104
73 37104 67050 48241 53999 81072 62177 18165 10849 -3234 -2755 33605 42272 15810 34696
86 34696 43384 -3804 -17331 24626 33681 29364 46721 39914 17569 23694 16633 4502 37633
99 37633 57419 20217 7376 22017 845 -14568 5967 3536 -7735 4035 -16440 -55423
111 -55423 -38700 -20277 -49262 -46863 -15008 -34469 -65805 -55096 -51837 -57911 -37987 -29161 -38615
124 -38615 -25633 -22077 -48107 -44635 -16326 -14944 -8994 9994 -1221 -13480 638 -7825 -21391
137 -21391 10832 27401 -1421 -1023 17791 -6319 -24175 -5088 -2781 -7925 5573 -4151 -25292
150 -25292 -11963 -9557 -33335 -22086 2437 -12575 -18982 509 -7795 -18911 1297 2561 -8561
163 -8561 14861 27030 5422 11859 35407 23726 16144 33983 33455 27947 41862 37542 24808
176 24808 38624 39802 18386 25555 38552 19442 13890 28256 18136 7863 19298 8340 -7479
189 -7479 11150 14709 -7977 687 18890 205 -7126 10029 5001 -2071 14934 14863 5124 19527
203 19527 21360 3257 14301 30084 13967 12982 30432 21240 12358 25813 17156 1852 17365
216 17365 20731 489 6628 18341 -1709 -8965 3552 -5443 -12447 -792 -6967 -16981 -3454
229 -3454 -6596 -25325 -12836 459 -16509 -15476 1724 -8300 -14206 2383 -2488 -13352 3420
242 3420 6429 -9190 2209 13200 -4471 -5256 10222 444 -5725 7102 -66 -10838 3096
255 3096 1281 -16892 -7213 731 -16954 -16336 -3358 -14810 -20144 -6204 -13352 -23219 -9355 -10032
269 -10032 -24035 -10489 225 -16774 -15448 -1211 -10468 -13370 1637 -2807 -9949 4484 2440
282 2440 -11583 224 7455 -8302 -3218 10482 -3243 -9042 4284 -4058 -12769 2112 260
295 260 -14838 -4693 686 -16780 -13982 -1995 -12299 -13618 -646 -9104 -18290 -5477 -7561 -18590
309 -18590 -3118 3471 -12642 -8985 2039 -10564 -11972 3373 -1815 -7217 6351 961 -13071
322 -13071 -2394 2760 -9783 -1449 9484 -5169 -8559 1766 -7254 -13598 1503 -294 -10532
335 -10532 490 975 -16075 -11455 -1030 -10062 -7293 5511 -4614 -12758 -1599 -6773 -16038 -327
349 -327 5142 -7901 -2138 4697 -10405 -11339 1964 -3429 -5278 8328 1489 -10836 -1054 40
363 40 -11657 -1359 8964 -3582 -3643 5589 -6238 -11704 2695 517 -6233 6672 6010 -9889
377 -9889 -3750 3275 -7509 -3274 9557 -67 -4508 6173 -2026 -11022 2669 5436 -5452 3022
391 3022 9030 -5946 -5483 5543 -2458 -3507 9441 3644 -4845 6457 5026 -6993 3309 11428
405 11428 210 3541 13557 1995 -1627 11349 6572 434 12846 11947 -502 7787 12592 315
419 315 4196 14186 4329 2094 12579 4722 -2580 9323 8267 -2697 5872 9734 -2406 1720
433 1720 10449 403 -139 11075 3892 -1848 10581 8081 -1539 9232 13261 1137 5749 14270
447 14270 4102 4042 15171 8466 2367 12486 9006 -967 8222 10989 -967 4390 10696 -2015
461 -2015 -3366 6106 -2968 -7299 4745 1616 -9907 -1857 149 -11431 -5905 2493 -6422 -5882 3788
476 3788 -4555 -9041 1717 -935 -7835 4434 6139 -5508 -435 5381 -5604 -3314 7347 -288
490 -288 -4957 4749 -1096 -11234 -2506 -976 -11847 -5604 -240 -12429 -13463 -6311 -14423 -17431 -6185
505 -6185 -10327 -17749 -8976 -9631 -19829 -12480 -6063 -14237 -10152 -474 -9290 -12374 -1163 -4782 -10318
520 -10318 1564 3770 -5985 -244 4658 -5391 -3627 5345 -1750 -3339 5017 -1721 -9126 -745
534 -745 -2816 -11460 -3267 216 -11773 -9879 -2464 -12850 -14187 -2650 -7155 -13254 -2886 -3494 -13140
549 -13140 -5593 -55 -7027 -2443 6103 -1597 -2245 7236 2235 -1763 9457 8716 529 8052 10287
564 10287 -976 2449 9276 680 -237 8290 595 -7294 593 -1490 -10414 -3631 -417 -10332 -8198
579 -8198 -3097 -11989 -12169 -3238 -7934 -10752 -1203 -3940 -11092 -2830 297 -7972 -312 7317 -1518
594 -1518 -1341 8162 1326 -3392 7655 6731 -650 5969 7257 -3386 -810 3493 -4729 -3841 3337
609 3337 -4753 -9543 -2648 -8565 -16028 -6913 -5802 -14772 -9260 -4316 -14752 -14511 -5297 -10471 -12191
624 -12191 -1390 -2499 -8667 -1545 -328 -7303 -395 5557 -608 2975 9900 1718 -1000 7295 2978
639 2978 -2235 7863 8174 -2587 1789 3957 -7069 -6491 2086 -4575 -7604 559 -5097 -13175 -7311
654 -7311 -6979 -13651 -6677 -1642 -9291 -7777 -2163 -10056 -10156 412 -2141 -5071 4265 3205 -5951
669 -5951 -169 3584 -3587 731 9114 2079 -2070 3511 -2949 -9025 -1084 -399 -6871 -1994 -2863 -13987
685 -13987 -13313 -9344 -16595 -14642 -5198 -12038 -18506 -12326 -15905 -23798 -14607 -8231 -14829 -10980 -5596
700 -5596 -14876 -17128 -8764 -10281 -11059 -613 -544 -8450 -4851 -5558 -12736 -6697 969 -4095 -3223 1416
716 1416 -8600 -14898 -7501 -8808 -12909 -3539 -2255 -13326 -13055 -10889 -19254 -16768 -6060 -8669 -11225
731 -11225 -5105 -10167 -17262 -9723 -6548 -9591 -1258 4590 -3786 -3682 1851 -3910 -3781 8502 8080
746 8080 3320 9887 8733 -1226 2829 9260 4039 6800 13601 6123 510 5286 1740 -1410 7213
761 7213 8195 1137 4446 4470 -4149 -1164 6861 2506 2520 10627 5258 -1113 6132 6987 2154 9936 15465
778 15465 7775 8567 13264 6543 5934 14825 12486 9004 15790 12518 3622 7972 10158 3261 7514
793 7514 13414 4883 678 6097 186 -4466 3674 3824 -2454 2042 2454 -6112 -4783 1004 -3535 -2390
809 -2390 4893 304 -4157 1582 98 -5001 2026 4996 -1549 1922 6066 -1809 -2211 4455 -391
824 -391 -3083 4470 2049 -5326 -465 195 -7500 -4341 376 -6337 -7098 -1730 -7120 -10629 -3961 -5759
840 -5759 -10546 -4631 -3734 -10847 -7512 -2147 -8153 -6621 474 -4747 -7145 -215 -1716 -6386 633
855 633 2528 -3741 177 3527 -3517 -2361 3647 -1011 -2686 4269 890 -5023 506 515 -6118 -1137
871 -1137 3014 -3909 -2614 2575 -3888 -6538 1037 -970 -4306 2738 2527 -4341 -66 3370 -2611
886 -2611 -130 6687 2199 707 6898 3347 -908 5427 6105 961 5852 8523 1223 2628 7055
901 7055 1460 639 7529 4157 -640 5251 4174 -2625 1957 5161 -768 1459 5810 -158 -1689
916 -1689 4815 1699 -1332 5311 4674 -1342 3548 5698 -439 2311 7728 2316 1547 7388 3247 -332
932 -332 6306 5652 816 5306 6698 -379 2309 6288 681 910 6791 2573 -1105 4417 2499 -2663
948 -2663 2808 5076 -1110 1273 5095 -1848 -1622 5012 1364 -891 5414 3331 -2345 2540 3613
963 3613 -2201 2229 6735 388 375 5045 -186 -2271 4613 3478 -1085 3757 3546 -3441 -344 3995
979 3995 -1822 -409 5555 -8 -3009 1836 -319 -4606 2193 3239 -2666 157 2269 -4552 -3472
994 -3472 2659 -1075 -2220 3997 355 -4945 -465 -466 -5407 240 3784 -2305 -2134 1253 -4728 -5234
1010 -5234 1487 -149 -3196 2002 553 -6454 -2914 145 -4576 -1452 3827 -1852 -4675 86 -3674
1025 -3674 -6370 819 1514 -3444 -218 655 -6280 -4949 -161 -3959 -3328 3008 -1534 -6400 -1758 -2813
1041 -2813 -7298 -984 1773 -3837 -2383 372 -5873 -6078 365 -1636 -3607 2292 220 -5839 -2118
1056 -2118 501 -4398 -653 3868 -1414 -2322 1833 -2349 -4552 1716 1317 -3194 1604 1936 -5174 -2465
1072 -2465 1627 -3326 -2282 3315 -1518 -4663 600 -1487 -5464 -34 1628 -3773 -725 1836 -3853
1087 -3853 -2943 2715 -604 -1899 4079 1149 -3028 2281 2984 -1860 2244 5191 -671 136 4638 507
1103 507 -1302 4631 2749 -1446 3247 2719 -3175 302 3408 -1590 -264 3867 -1473 -2707 2196
1118 2196 -59 -3077 2631 2866 -2365 1049 3331 -1925 196 5716 1544 631 5835 2642 -789
1133 -789 4969 4592 741 4987 7347 1224 2453 6074 1204 782 5824 3729 -58 4060 2521 -2894
1149 -2894 1110 3678 -1468 516 4126 -802 -2317 2204 -507 -3082 3095 2459 -1934 1641 2747
1164 2747 -2195 648 4452 597 611 5471 1799 -646 4696 3292 -917 3796 4977 -666 881
1179 881 3797 -1476 -1589 3586 -202 -2928 1413 -648 -5157 -911 118 -5069 -2450 888 -4945
1194 -4945 -4818 -394 -3995 -5313 716 -694 -4612 -423 6 -4771 -1475 2336 -1982 -558 3831
1209 3831 -778 -2918 2012 -141 -3208 2373 2516 -2751 -284 1547 -4003 -3272 1188 -2729 -4197
1224 -4197 1258 -1713 -5971 -1628 -1535 -5969 -1928 1167 -3926 -3122 938 -3103 -3768 1817 260 -2024
1240 -2024 2802 2569 -2119 1319 3850 -469 1864 6324 1775 647 5112 2166 -929 4277 4530
1255 4530 -311 2596 3879 -1743 -600 3256 -652 -609 3849 128 -3116 1129 298 -3443 1569 3605
1271 3605 -1333 520 3679 -1071 -1354 3941 2573 648 6235 4673 -686 2629 4116 430 3682
1286 3682 7066 3085 1943 4923 1063 -1328 3853 3118 -91 3900 3669 -2746 -1580 1210 -2734
1301 -2734 -1415 3525 110 -2725 781 -1477 -4944 -372 1470 -1633 1042 3148 -2385 -2344 1680
1316 1680 -702 -842 4708 3017 -988 2027 1718 -3110 873 4098 -37 717 3861 -791 -4024 769
1332 769 -607 -3130 1732 1216 -3830 -2251 -980 -4792 -3341 1083 -1840 -2707 612 -1818 -5368 -737
1348 -737 189 -2820 940 2801 -1957 -1544 1792 -1412 -1662 3645 2099 -901 3114 1706 -3126 246
1364 246 2544 -825 308 3775 -1502 -2885 1106 -1488 -3628 986 930 -3550 -912 5 -4823 -3253
1380 -3253 655 -2718 -2608 1889 -1047 -3960 -367 -555 -3289 168 2261 -1858 -53 2621 -2036
1395 -2036 -1929 2042 -157 -1425 2758 1179 -3055 -12 831 -3622 -1421 1751 -2449 -2558 928 -2308
1411 -2308 -4901 -878 -1158 -4374 -714 -143 -4647 -2541 -7 -3730 -3289 1140 -1446 -3361 1058 -279
1427 -279 -3875 60 1336 -2648 -142 2424 -1564 -1451 2282 -1104 -2546 1722 672 -2482 1097
1442 1097 1021 -3373 -1383 1199 -2744 -1842 1771 -1812 -3026 960 -884 -3373 177 1044 -2753 -393
1458 -393 1941 -2185 -1325 2535 -473 -777 2856 1304 -1362 2133 2653 -1423 1593 3921 -59 682
1474 682 3791 -62 -609 3036 1074 -1271 2702 2288 -1770 563 2355 -1603 -471 3012 -503 -1279
1490 -1279 2251 141 -2212 1385 1385 -1826 1316 2385 -1423 -188 2816 -753 -1108 3428 1028 -1540
1506 -1540 2351 1578 -1735 1043 2699 -1358 29 2793 -1043 -1573 2026 -245 -2421 1227 497 -3065
1522 -3065 206 1025 -3084 -946 1806 -2061 -1871 1495 -1346 -2896 1002 226 -2804 435 1208 -2732
1538 -2732 -1096 1646 -1902 -1298 2254 -407 -2078 1622 423 -2961 584 1529 -1896 104 2138
1553 2138 -1416 -1467 1564 -930 -2430 1389 -3 -2453 300 1151 -2456 -508 1798 -2014 -996 2083
1569 2083 -647 -1821 1727 403 -1962 1054 2082 -1886 440 2344 -1066 -302 2660 -400 -1148
1584 -1148 2352 733 -1767 1565 1776 -1803 464 2294 -1210 -526 2205 -430 -1306 1899 391 -2146
1600 -2146 1796 1418 -1741 417 2188 -1605 -456 2501 -905 -1251 2213 217 -2167 1646 1053 -1936
1616 -1936 540 1798 -1798 -438 1983 -1015 -1453 1651 -167 -1985 1392 699 -2294 167 1476
1631 1476 -2284 -416 1966 -830 -1355 1804 -615 -2417 1011 636 -1884 1085 1466 -2139 -576 1379
1647 1379 -1409 -1568 2016 42 -1737 1604 548 -2404 464 1485 -1592 -13 2286 -1145 -1075 1727
1663 1727 -956 -1579 2356 1212 -1274 1357 1606 -1834 60 2450 -477 -10 3118 146 -1240 1737
1679 1737 1257 -1070 2089 2555 -864 429 2168 -785 -487 2447 532 -553 2477 958 -1655 1336
1695 1336 1554 -1358 966 2524 -533 -46 2440 -443 -1166 2557 1458 -934 2090 1505 -1449 157
1711 157 2281 -646 664 2593 212 -906 2321 221 -1400 1678 1846 -1479 451 1855 -1555
1726 -1555 -635 1893 -819 -1492 1681 -125 -2189 546 241 -2266 51 1432 -1767 -902 1474 -1516
1742 -1516 -1914 1188 -273 -2066 1108 532 -2412 -35 1107 -2084 -615 1214 -1356 -1749 1014 -684
1758 -684 -2235 756 158 -2511 -34 496 -2313 -933 816 -1741 -1944 929 -1078 -2649 717 -338
1774 -338 -2554 -21 347 -2406 -1154 1141 -1467 -1190 1350 -666 -1790 938 -221 -2109 534 1075
1790 1075 -1812 -269 1221 -1548 -768 1336 -917 -1376 1254 414 -1826 724 641 -2029 58 1345
1806 1345 -1145 -789 1708 -566 -1608 1462 255 -1490 1129 1581 -1355 577 1991 -953 5 2228
1822 2228 153 -413 2443 880 -979 1671 1706 -971 1159 2358 -350 373 2443 49 -167 2443
1838 2443 802 -473 1871 1334 -1058 893 1740 -386 444 2248 -204 -522 2295 663 -959 2103
1854 2103 1352 -1126 1216 1903 -761 262 2409 92 -413 2306 630 -1022 1691 1339 -874 1275
1870 1275 1525 -1060 61 1739 -1020 -768 1993 240 -1048 1352 609 -2068 303 1215 -1291 -258
1886 -258 1579 -834 -899 798 -880 -1516 1045 276 -1638 757 1053 -1918 -600 1241 -1502 -781 1484
1903 1484 -800 -1357 957 -82 -2100 350 800 -2022 -325 645 -1618 -1295 946 -1022 -1494 491
1919 491 -417 -2384 -213 202 -1865 80 1213 -1680 -1255 474 -1559 -1761 1399 244 -1739 442
1935 442 308 -2087 -452 933 -824 83 1558 -701 -1534 660 -513 -1439 1312 1558 -988 659
1951 659 904 -1914 -928 1540 34 -42 2051 300 -1453 555 451 -1190 980 2049 -320 210 1584
1968 1584 -1022 -1158 1631 875 0 1945 1120 -1125 295 1317 -717 652 2932 527 -175 1687
1984 1687 118 -1118 1798 1473 -267 1379 1577 -1291 -344 1514 -290 -117 2354 559 -827 1093
2000 1093 335 -1275 1249 2045 -623 581 1427 -1113 -877 1270 -94 -768 1748 751 -1561 173
2016 173 482 -1307 409 1902 -388 -617 1020 -888 -1717 793 90 -1192 1142 592 -1618 -699 281
2033 281 -1458 -893 1053 -438 -955 503 -768 -2318 33 393 -1387 -103 866 -1423 -1107 565
2049 565 -896 -1136 1211 76 -1558 628 203 -2076 -428 861 -1118 -571 1401 -897 -1782 1018
2065 1018 -166 -1323 666 930 -1618 -63 973 -1109 -372 975 -865 -805 1011 -142 -1232 841
2081 841 563 -1311 500 1161 -1236 -347 1230 -436 -647 1365 48 -1061 859 564 -1198 751
2097 751 1288 -727 112 1091 -672 -663 1387 -189 -801 1231 392 -1211 283 1296 -1329 -442 1566
2114 1566 -569 -651 1219 16 -836 1181 283 -952 274 772 -1043 -273 902 -778 -784 1153 -424
2131 -424 -1203 1115 301 -1228 764 915 -1116 -107 753 -752 -588 1339 -421 -984 645 332 -1324
2148 -1324 605 889 -1240 -25 1129 -982 -660 831 -602 -1055 1056 307 -946 491 556 -1403
2164 -1403 28 943 -804 -286 1266 -379 -808 1186 -27 -1212 816 918 -895 606 1074 -875
2180 -875 -553 1289 -396 -737 1160 197 -1265 757 704 -696 493 1086 -662 -110 1297 -359 -446
2197 -446 1394 287 -895 1206 497 -1097 400 730 -735 242 1227 -290 -487 1097 207 -749 1061
2214 1061 834 -803 685 1083 -855 -1 1097 -447 -588 1458 83 -914 923 455 -938 431
2230 431 1129 -917 -77 1163 -727 -862 1101 -59 -887 1099 158 -987 478 494 -964 -98 1178
2247 1178 -738 -832 1254 -887 -1111 757 -139 -1145 328 638 -986 -174 568 -1070 -609 1008 -492
2264 -492 -1110 592 -281 -1756 283 682 -1201 -133 801 -1173 -998 398 -711 -979 760 38 -1380
2281 -1380 15 308 -1717 -157 655 -926 -461 789 -602 -1359 412 -79 -1183 764 490 -1064
2297 -1064 128 498 -979 -15 868 -176 -538 860 66 -1156 439 561 -643 508 1116 -544 -381
2314 -381 938 -486 -535 1069 349 -740 892 724 -1131 464 948 -602 109 1621 -534 -234 1023
2331 1023 -151 -434 1111 958 -620 751 914 -792 63 1136 -41 -307 1410 59 -463 1152
2347 1152 576 -804 562 1079 -850 231 896 -377 -353 1029 -416 -726 982 137 -1124 378 529
2364 529 -908 -314 920 -596 -681 1184 -297 -918 675 -28 -899 486 370 -891 -109 402 -878
2381 -878 -554 592 -726 -1172 502 -274 -1199 288 187 -1659 -427 596 -1062 -841 768 -940 -1146
2398 -1146 127 -430 -1562 -49 116 -1465 -354 270 -1103 -527 716 -505 -807 463 -308 -1232 131
2415 131 244 -1031 204 830 -779 -393 632 -884 -979 664 -155 -1321 233 223 -1199 -262 484 -1423
2433 -1423 -461 551 -710 -666 599 -290 -1213 534 439 -1064 705 884 -753 -220 995 -208 -387
2450 -387 1268 19 -944 656 476 -977 456 1124 -712 44 942 -237 -277 1095 -274 -571 980
2467 980 427 -657 393 708 -1240 72 1239 -294 -24 1184 253 -393 1172 359 -450 650 862
2484 862 -492 183 1174 -152 -73 1304 -128 -539 944 557 -721 332 688 -801 96 713 -451
2501 -451 -477 889 -25 -664 801 114 -1206 376 263 -1417 -162 782 -948 -513 858 -196 -752
2518 -752 883 -49 -527 431 432 -970 -54 607 -643 -150 921 -347 -301 457 -7 -1207 319 636 -835
2537 -835 174 681 -1172 -429 675 -746 -750 466 -193 -1160 341 85 -1139 25 427 -646 -113 744
2555 744 -268 -489 723 -62 -496 753 738 -370 597 560 -430 219 997 -133 12 1069 194 -491 797
2574 797 387 -625 446 756 -619 220 632 -494 -256 774 127 -407 1237 491 -772 628 848
2591 848 -410 616 1306 -220 -319 1319 135 -219 1361 563 -139 1231 1273 -665 378 1026 -94
2608 -94 56 1114 143 24 740 231 -978 777 1044 -225 661 887 -519 -475 779 -368 -282 1028
2626 1028 481 -384 663 464 -824 475 995 -123 145 1023 -122 -696 1001 500 -602 800 625
2643 625 -454 154 788 -304 -486 1075 -441 -253 619 -208 -959 462 182 -975 261 676 -1049
2660 -1049 -394 729 -849 -730 514 -306 -1086 -14 176 -1146 -195 369 -909 -191 969 -531 -630
2677 -630 186 -374 -1092 363 228 -696 117 294 -954 -548 350 -486 -616 620 -560 -1146 513 -110
2695 -110 -1084 217 631 -569 -418 371 -271 -717 669 -1 -681 674 342 -794 274 667 -720 138
2713 138 1049 -544 -161 728 -76 -710 787 331 -795 408 475 -740 -74 652 -292 -294 750 -35 -532
2732 -532 786 424 -863 409 585 -463 432 871 -213 90 576 -266 -518 928 -21 -512 462 569
2750 569 -600 327 876 -371 68 1034 -141 -229 700 111 -770 385 309 -967 -10 582 -750 -212 772
2769 772 -630 -880 670 -162 -721 222 80 -708 262 541 -699 -710 566 -440 -881 696 -442 -910
2787 -910 99 15 -983 -227 578 -920 -709 577 -686 -953 409 -308 -1103 235 -192 -1287 -159 245
2805 245 -872 -566 -13 -640 -885 552 -441 -805 437 -308 -1030 3 372 -742 -382 154 -724 -749 340
2824 340 -367 -618 532 232 -789 307 359 -809 -125 552 -414 -452 798 84 -671 713 337 -607 290
2843 290 418 -705 205 638 -344 -271 530 -43 -478 831 303 -276 576 541 -665 287 690 -293 -94 697
2863 697 21 -517 520 207 -785 594 460 -349 -20 925 -461 273 741 -147 -477 1185 209 -483 350
2882 350 357 -644 293 557 -667 -70 605 -168 -293 757 286 -550 553 424 -687 394 508 -561
2900 -561 -134 674 -207 -299 536 71 -639 635 403 -667 253 605 -343 -433 353 -446 -446 964 -38 -686
2920 -686 653 -193 -653 509 833 -437 -54 576 -303 -221 669 192 -249 581 155 -598 291 443 -276
2939 -276 151 761 281 -377 913 -19 -207 459 557 -387 660 725 -270 91 783 -221 -94 964 281
2958 281 -295 692 267 -535 610 767 -66 88 668 -258 -199 689 179 -125 831 386 -115 502 713 -177
2978 -177 278 664 -44 -72 985 60 -379 1033 367 -265 904 795 -399 184 477 -388 -118 910 119
2997 119 -287 692 186 -437 504 541 -255 412 689 -482 -135 846 -325 -180 689 448 -419 500 434 -294
3017 -294 209 672 -242 -60 801 -70 -128 759 9 -439 940 641 -288 262 354 -288 -210 877 -151 -240
3037 -240 400 363 -298 452 173 -593 415 670 -516 -164 709 -147 36 807 366 -280 697 477 -506 138
3057 138 801 -242 191 729 234 -97 883 138 -378 821 335 -283 669 573 -373 84 775 -19 -419 764
3077 764 -274 -544 749 243 -219 150 329 -545 342 723 -89 -140 940 -1 -189 362 292 -532 400 694
3097 694 -188 172 686 -127 65 474 -46 -306 472 199 -486 594 394 -417 -111 445 -403 -291 757
3116 757 -311 -114 264 353 -304 172 334 -691 17 355 -141 92 528 -221 -491 509 -47 -772 354
3135 354 327 -527 -7 560 -499 -356 380 -483 -292 561 -356 -493 -54 -38 -685 159 266 -503 89 525
3155 525 -482 -494 322 -138 -523 335 135 -1021 29 202 -503 -330 379 -398 -819 303 156 -787 341
3174 341 205 -718 72 276 -656 -247 88 -477 -371 471 -280 -394 266 -54 -784 -243 312 -650 -123 751
3194 751 -156 -551 635 -219 -425 427 157 -655 115 370 -346 70 655 -257 -99 798 -118 -788 571
3213 571 230 -546 236 367 -474 46 304 -391 -424 477 -34 -165 498 119 -364 196 653 -541 455 848
3233 848 -351 -282 735 16 -232 693 266 -232 454 579 -411 156 594 -8 273 681 35 -380 411 201
3253 201 -331 338 675 -419 61 218 -73 -270 472 -144 -234 581 -132 -480 191 223 -769 197 539 -336
3273 -336 -312 423 -485 -203 242 -22 -751 575 235 -668 -101 200 -386 -186 727 -472 -399 252 -19 -517
3293 -517 482 79 -483 -11 121 -683 -24 235 -521 -422 70 144 -460 -9 -33 -932 -148 146 -769 -26 331
3314 331 -424 -392 490 -41 -434 223 303 -353 -116 405 -564 -14 517 -30 -56 217 108 -569 452 -17 -425
3335 -425 401 586 -282 14 818 -46 174 562 210 -95 444 431 -463 489 371 25 288 687 -72 177
3355 177 462 114 32 589 468 23 396 596 -85 423 412 -138 -185 879 454 -306 586 442 -27 491 400
3376 400 -67 132 640 -181 -177 544 -202 -208 483 103 -448 381 91 -159 325 348 -357 250 293 -157 -390 170
3398 170 -205 -677 326 489 -262 60 229 -442 -108 160 -113 -617 536 -25 -396 185 150 -631 115 140
3418 140 -361 -351 312 -356 -456 -77 -342 -455 110 -398 -190 -48 310 -380 -175 61 -350 -164 115 -158
3438 -158 -458 61 131 -384 -19 63 -380 -133 241 86 -385 459 -57 -210 50 139 -431 46 325 -380 447
3459 447 651 10 -232 375 -20 -454 32 136 -336 216 548 -11 124 570 -282 -295 304 216 -270 533 57
3480 57 -49 260 409 33 94 476 -23 -183 261 245 -322 275 242 -359 323 172 -534 -124 451 -268 -378
3501 -378 420 -262 -473 772 222 -300 256 378 -54 -85 243 -228 -307 334 119 -396 213 195 -464 284 176
3522 176 -575 -200 320 -308 -191 454 -382 -320 -58 -14 -690 201 4 -524 12 373 -510 -388 5 -497 -492
3543 -492 59 -140 -510 169 122 -307 -193 235 -644 -151 179 -403 -601 229 22 -598 0 70 -662 -280 -61
3564 -61 -672 -246 50 -420 -684 -73 -300 -488 325 -397 -845 -104 94 -685 -473 266 -574 -511 162 -406 -865
3585 -865 -103 -155 -429 -73 67 -591 -540 160 -560 -686 198 -163 -640 139 8 -518 -57 -221 -623 -139 307
3606 307 -522 -346 226 -339 -484 27 0 -788 -64 46 -671 -252 4 -300 -295 164 -137 -470 94 -51 -364
3627 -364 166 279 -346 -151 344 -404 -15 182 -287 -342 86 -5 -301 125 164 18 -19 159 -228 -180 306 70
3649 70 -533 348 -71 -117 134 290 -167 72 423 -3 86 355 176 -99 364 -123 -423 364 396 -332 21
3670 21 369 -286 -637 499 -595 -442 338 -161 -827 154 -29 -486 -10 46 -256 -308 181 -212 -247 162 -213
3691 -213 -498 175 109 -547 -161 186 -425 -368 357 -350 -593 344 -59 -525 177 -307 -608 -89 167 -631 -424
3712 -424 219 -393 -369 -162 -369 -552 -35 88 -463 -431 84 -270 -158 306 -291 -282 155 -110 -426 169 -56
3733 -56 -435 59 432 -186 -99 103 -95 -295 204 -517 -350 6 18 -380 -77 146 -271 -232 452 -302 -296 288
3755 288 -171 -302 322 273 -345 227 134 -322 109 484 -44 -119 476 -195 -376 590 78 -262 227 329 -241
3776 -241 318 328 -75 -207 315 32 -374 181 184 -469 215 88 -287 145 274 -241 -195 318 5 37 344 -158
3798 -158 -413 313 246 -114 -16 543 -338 -26 374 -259 -138 404 -28 -280 61 -47 -562 63 140 -342 -238
3819 -238 -34 -208 -244 482 -47 -192 58 214 -646 13 333 -326 -160 364 -232 -18 346 -212 -383 288
3839 288 -45 -389 72 437 -304 150 724 -265 -228 561 -204 -178 337 252 -364 279 147 -415 -114 385 -85
3860 -85 -364 103 -163 -344 407 12 -73 286 74 -356 -195 342 -347 -179 580 6 -235 459 -7 -165 555
3881 555 406 -350 70 561 -228 -137 370 -216 -454 341 45 -336 466 320 -669 -109 245 -115 -35 471 -39
3902 -39 -128 153 203 -401 -128 190 -542 126 191 -264 -185 120 -146 -257 86 -112 -146 42 501 -542 -50 320
3924 320 -262 -388 -20 -51 -560 92 -136 -744 -104 40 -423 -306 94 -232 -150 158 -116 111 315 -68 -510
3945 -510 -27 296 -506 97 119 -66 -34 498 -67 -329 301 -23 -103 124 425 -732 197 31 -213 -91 520
3966 520 -163 -641 146 -99 -289 195 393 -324 245 192 -304 14 338 -62 -72 337 306 -224 337 224 -406
3987 -406 200 396 -138 -211 510 55 -121 497 -34 -320 247 223 -88 57 58 -275 4 588 -199 -137 440 157
4009 157 -312 428 310 -359 280 204 -43 -25 474 -10 -46 641 327 -38 455 293 7 481 445 -117 274
4030 274 220 -374 125 147 -188 -364 93 -76 -271 438 144 -97 231 303 -458 -101 364 -26 -661 45 -225
4051 -225 -339 350 138 83 355 401 -197 -284 396 204 8 9 92 73 440 171 -144 346 346 -206 -320 530 -274
4074 -274 35 278 102 115 239 289 -232 11 259 -317 -152 204 -54 9 148 -154 -504 226 257 -204 122
4095 122 346 -104 -113 311 59 -190 314 188 -209 285 267 -492 197 572 -515 -39 485 -106 -33 645 -1
4116 -1 -45 437 205 -151 -98 357 110 93 340 151 23 133 95 -130 194 407 -297 324 428 -167 182 423
4138 423 -116 -85 606 22 -11 350 288 -143 451 312 -300 467 388 -197 111 670 166 -21 438 169 -133
4159 -133 518 360 -43 264 356 -26 -130 650 304 163 625 166 -215 497 294 -188 276 640 -197 152
4179 152 402 17 -147 441 257 -177 175 175 -280 299 183 -332 -19 491 132 -268 529 314 -291 307 543
4200 543 -438 182 335 -2 -230 394 -189 -191 273 105 -148 -106 216 -100 177 170 -186 -251 316 -170 -127 362
4222 362 -25 -399 414 269 -254 192 202 -46 217 407 146 6 456 332 -300 344 262 -146 113 617 -42
4243 -42 487 466 -305 5 186 -68 -321 470 342 -65 402 385 -167 163 577 92 61 575 55 -160 525
4264 525 449 -234 226 648 -8 311 455 149 208 312 267 -79 272 13 -241 434 144 -323 179 841 32
4285 32 176 153 22 -156 324 142 -354 272 157 -379 156 253 -111 -387 395 -281 -252 694 106 -70 449
4306 449 172 -226 -20 87 -465 -312 303 -41 -262 313 -118 -439 200 53 -548 -67 184 -516 -439 241
4326 241 -305 -12 10 -279 -493 -130 -10 -683 -45 165 -514 -412 146 -442 -206 245 -205 -58 147 92 -343
4347 -343 240 281 -408 -52 -14 -51 -557 325 -6 -502 133 256 -430 -279 118 -494 146 217 -20 -178 490
4368 490 -265 -284 303 179 -315 139 445 145 297 565 48 -110 506 116 -82 170 239 -90 114 410 -266
4389 -266 116 377 -164 -256 281 29 -264 520 308 -325 245 -36 -420 -92 451 134 -226 445 101 56 -94
4410 -94 121 -150 295 211 -434 239 517 -111 146 387 -8 -167 278 65 -171 141 -21 -303 160 179 -682
4431 -682 -82 -31 -277 -524 148 -105 -395 -172 -85 -466 103 -156 -20 -223 156 -377 -293 262 -154 -355 70
4452 70 199 -526 60 68 -567 -211 -28 -275 8 165 -60 -5 10 -14 -297 -131 206 -429 -348 165 -373 -378 137
4475 137 -117 -425 294 21 -252 282 83 -108 149 109 -203 -192 499 79 -296 407 50 -361 17 246 -210
4496 -210 -28 422 -72 -119 483 -221 -194 280 47 -261 158 235 -176 137 404 -288 -187 -166 -63 -280 293
4517 293 61 -177 89 338 -325 -51 518 -65 139 339 -145 -205 492 161 -187 95 550 49 4 206 -263
4538 -263 36 442 -242 -288 476 -237 -505 147 114 -160 107 323 -207 56 107 43 -104 342 -78 -326 252
4559 252 307 -412 55 451 -154 -84 528 -190 -211 479 -164 -56 452 71 -574 -5 184 -523 -287 290 -92
4580 -92 -351 246 -84 -359 450 107 -280 107 257 -248 -246 169 -117 -268 350 -182 -291 172 239 -380 150
4601 150 237 -316 -10 19 -302 -230 466 5 -421 367 181 -322 29 257 -107 -50 228 -287 -338 303 22 -385
4623 -385 239 -18 -461 163 282 -81 -129 149 -117 43 398 -400 -603 473 254 -308 159 273 -273 93
4643 93 366 -167 86 296 101 -56 318 26 -250 286 232 -182 66 325 -387 -303 48 -317 -425 104 -68
4664 -68 -128 26 267 -176 -94 409 2 102 336 -108 -427 337 -62 -171 371 54 -303 -41 -39 -691 -327 166
4686 166 -336 -467 52 -95 -48 506 -13 -253 -175 111 -322 -111 245 -309 -188 52 -144 -457 92 265 -342
4707 -342 90 418 -364 50 176 -58 181 467 -69 -184 127 193 -544 -79 136 -468 -187 -26 17 -128 -160
4728 -160 -95 -405 -146 -165 -652 70 72 -201 -2 392 -196 -255 382 108 -587 150 -304 -424 396 45 -150 -184
4750 -184 268 -2 23 520 -66 22 72 -64 -354 148 107 -300 78 200 -304 231 305 -30 -455 193 -190 47
4772 47 87 105 -289 104 149 -22 51 200 -33 -233 167 -13 -213 12 197 -115 91 69 -508 -146 88 -55
4794 -55 -290 188 -117 -501 34 -79 -584 324 210 -309 -361 25 -124 -573 202 -184 -207 -199 133 -336 -36 36
4816 36 -414 -139 86 -163 -391 -45 -97 -413 24 -99 -85 -245 -4 -275 -272 -188 -226 -219 -61 -237 -410 102 -28
4839 -28 -219 -43 227 -114 10 -20 -192 57 95 -139 -609 98 -87 -375 69 14 -453 -179 274 -14 -130
4860 -130 108 -351 -304 202 -176 83 -196 -30 -310 193 552 -285 -57 5 25 -160 118 218 -335 152 462
4881 462 32 -153 734 1 9 704 125 227 224 7 -5 273 155 -92 -86 342 -163 -57 693 -312 -243 361
4903 361 -63 -94 277 480 -424 187 103 158 32 261 25 -152 377 -366 -138 167 40 -310 120 411 -138
4924 -138 -175 125 -340 -4 285 -221 -258 -47 226 -604 188 -111 -289 -309 316 -11 -117 15 -73 -151 293 -97
4946 -97 -473 -19 228 -300 180 267 -252 -284 -51 -8 -364 131 344 -73 18 73 -204 -125 -183 63 -309 105 -229
4969 -229 -147 81 -146 -57 -152 64 -164 57 326 -151 -310 355 135 38 349 134 -380 140 139 125 4 373
4991 373 -197 -50 501 -278 217 408 25 -225 251 369 73 412 199 -227 226 264 -353 -72 148 142 121
5012 121 243 311 -148 -32 279 105 5 363 -182 118 133 -146 -123 221 146 -385 -25 274 -161 -273 373
5033 373 -86 -151 435 323 -70 164 -174 -336 63 234 -140 -314 224 -320 -138 160 123 -638 9 205 -424
5054 -424 -135 42 -322 -14 317 -475 -245 -130 -7 -36 -30 -57 -145 -144 162 -251 -125 233 -311 -80 235 168 -167
5077 -167 253 12 -457 33 177 -347 -198 -42 -106 -450 242 -56 -253 -120 109 -496 -120 412 -206 142
5097 142 26 -155 -481 38 -126 -169 188 171 -149 -1 36 -423 37 211 -248 -285 133 -180 -173 138 190 -456
5119 -456 169 160 -258 10 141 -78 140 267 -88 -117 174 -115 -15 109 238 -212 -15 342 -449 99 302
5140 302 -113 -224 349 168 62 268 -53 -721 -203 98 -302 75 11 -359 5 115 -215 -136 -173 199 -287
5161 -287 165 -57 -204 -137 382 -147 -60 188 187 -301 320 36 -439 151 133 -47 -90 154 16 -320 67 -33
5183 -33 -67 136 -77 -214 -96 -34 -224 -318 -71 -456 -404 262 -82 -341 -39 -285 32 -19 -112 -245 -327 307 -47
5206 -47 -43 -13 43 -214 239 -352 -402 261 38 -322 -164 72 -534 -283 168 -442 -175 135 -241 -43 -10 -194
5228 -194 -331 -198 334 -249 -181 414 -96 -188 115 -314 -274 413 28 -383 -133 300 -62 -160 195 32 -69
5249 -69 193 -74 22 124 213 -356 87 245 -69 -125 517 21 -253 213 -26 -38 284 127 68 59 163 -75 179
5272 179 95 -96 -22 234 110 -345 197 80 -129 218 -84 -101 -26 345 -436 -55 183 139 -356 314 331 -213
5294 -213 123 20 -8 -56 249 82 -243 359 112 -43 381 93 -133 237 7 -203 135 313 -194 -67 185
5315 185 305 -369 215 241 -280 108 -28 -194 100 189 -154 -46 306 -180 -553 107 -131 -413 -20 -85 -251
5336 -251 -89 -61 -47 -32 150 -334 -344 212 251 108 -140 -128 -205 -122 -12 -178 -167 -579 231 -187 -5 -49 -260
5359 -260 135 113 -180 -23 163 -279 -97 448 -214 -221 76 -227 -316 222 185 -191 -263 -14 -285 -151 211 -36
5381 -36 -73 -161 -56 -400 55 145 50 147 257 -20 99 166 47 -321 243 297 -345 12 356 -180 30 378 -333
5404 -333 8 292 -25 -388 283 -269 74 211 152 -369 384 156 -379 187 372 176 -179 217 210 -243 334
5425 334 -126 -121 500 -4 30 8 300 -46 26 92 -316 -79 116 358 -355 110 225 -280 353 50 -149 -53
5447 -53 496 -161 -96 74 158 15 210 -84 -110 3 96 -39 106 413 -2 -411 -181 -74 -261 -6 26 -449
5469 -449 -57 258 -76 -96 447 -233 -395 -65 -180 -371 -245 -132 -132 127 -104 -83 -40 137 -269 -299 93 -112
5491 -112 -121 623 292 -363 5 310 -178 -179 205 -216 -179 236 25 -346 310 266 -120 469 -23 -37 -241 279
5513 279 -166 -205 203 37 -299 177 18 190 214 109 -95 -158 319 -171 -5 301 40 66 41 -5 -249 170
5535 170 180 4 25 370 -10 -254 203 15 117 -32 254 -289 202 335 -219 50 127 -29 -256 -151 26
5556 26 -146 263 -83 -155 -198 110 -121 248 183 90 -141 189 -197 -65 99 72 -169 299 91 -120 13 -58
5578 -58 15 140 371 -128 36 336 58 -247 134 111 -259 -34 165 24 39 159 -3 49 316 -91 -39 47
5600 47 -68 -312 -121 210 -17 231 -38 -16 22 247 -214 -325 337 265 -225 133 244 -332 73 294 -149
5621 -149 -259 331 -53 -213 -42 40 46 21 106 -169 52 221 -126 -79 242 87 -102 289 26 -172 145 323
5643 323 -300 138 298 -180 149 176 -203 -99 166 135 5 -163 209 -173 80 94 -293 96 218 25 -65
5664 -65 -47 31 -295 236 74 -281 58 125 33 4 376 152 -297 184 -93 -125 150 28 -72 -247 52 -109
5686 -109 63 290 -311 -230 103 -39 -252 -71 75 -364 30 260 -54 17 397 -104 -129 231 -56 -157 184
5707 184 -55 -62 40 22 -192 -186 -84 63 -173 -14 -214 -80 -278 157 -221 -100 197 -196 -56 -46 -143 -188 -78
5730 -78 -83 -22 269 132 -320 147 -56 -325 17 388 -219 -319 88 -96 -102 -8 -36 -26 -97 154 -196 39 324
5753 324 -185 -176 85 23 -190 16 59 -475 9 -102 -154 105 18 -152 -234 180 -364 -188 125 191 -184 -69 273
5776 273 -337 -15 179 -144 45 214 -266 -281 269 -85 -136 99 317 -128 36 318 108 4 67 -97 0
5797 0 309 97 -288 110 334 -96 -25 51 24 -12 152 19 -164 34 -110 -269 -26 -239 -247 -106 15 -121 105
5820 105 130 -23 -82 318 81 -120 207 -28 -447 73 198 -112 -234 102 219 -120 -3 78 -265 236 13
5841 13 -202 -100 269 -307 20 -253 239 112 226 152 -378 -105 -177 -368 216 54 -133 -238 170 -285 -284 212
5863 212 285 -219 -37 230 -284 -176 -144 -231 -23 -51 -329 -194 402 161 46 104 230 -74 -236 233 -198 84
5885 84 100 -21 101 145 -134 -409 606 131 -309 1 108 -85 83 394 46 88 420 230 -412 110 314
5906 314 -313 152 55 -166 -163 51 -237 -54 396 82 -122 83 -120 -243 213 456 46 -63 233 -240 302
5927 302 30 -179 -321 130 131 47 78 -11 -65 36 346 -318 18 312 -194 74 338 30 -237 7 -178 -53
5949 -53 228 235 -346 88 183 -83 -84 244 -31 -232 51 121 -210 -25 -176 94 23 79 -20 -196 202 196 154 49
5973 49 120 -125 12 -123 -133 -185 173 -41 -32 157 28 -150 -155 363 -257 18 148 -201 -237 183 -340 -39 -5
5996 -5 118 -285 -8 404 -163 -41 397 -194 -53 71 -11 -95 51 201 -172 -42 82 -292 -66 174 -135
6017 -135 -73 187 -203 114 484 -131 120 124 9 -71 114 13 76 -145 292 -309 -314 169 -16 21 162 -202 -127
6040 -127 30 87 -145 -99 -75 -40 -32 322 -59 -173 349 65 20 -137 118 -83 -104 101 -292 -126 -15 -73 -239
6063 -239 -10 188 -121 53 -112 75 121 199 286 -82 103 -127 -167 182 150 -87 162 50 168 -51 -77 -287
6085 -287 -50 39 -203 -19 105 47 -162 -53 -49 -303 -203 17 -242 81 96 -216 43 66 -186 -269 93 313
6107 313 -411 216 26 -283 -28 156 -388 -182 -30 -222 -325 137 -33 -285 23 43 -95 -184 -56 -96 -39
6128 -39 160 -338 -115 148 98 55 284 221 -205 -195 379 32 -204 195 -296 -174 101 177 -28 282 25 -194
6150 -194 327 138 -119 44 23 -18 -275 116 223 -152 233 144 -6 35 108 -56 -208 13 -310 -70 280 9
6172 9 -145 110 43 -238 -27 230 -305 21 38 100 193 208 -80 -70 -5 42 -322 163 -26 86 148 26 155 -74
6196 -74 -181 -13 -8 135 236 -329 -41 -143 0 -128 52 -265 48 338 2 -142 19 191 -241 -2 49
6217 49 -248 -106 331 -13 -29 43 230 -267 192 -234 -168 231 -335 -89 57 379 -97 58 210 -123 -221 275
6239 275 3 -5 -114 102 -384 -63 168 -311 -61 44 50 -37 179 -158 -546 216 -243 62 -67 175 -219 -121
6261 -121 150 -63 -63 87 -211 173 -94 269 -40 206 112 -4 -49 289 152 -279 454 -1 -71 232 291 -607
6283 -607 196 97 -215 1 152 -112 74 -70 -70 -59 84 57 34 -31 295 10 -105 435 299 -76 74 113 139
6306 139 231 200 -24 275 193 121 20 68 238 97 33 -128 98 38 275 52 103 -134 -109 37 337 -39 -325
6329 -325 -153 148 -109 100 20 -285 -28 204 -160 -98 291 286 -130 86 -29 -105 134 6 -99 -48 136 -316
6351 -316 23 468 62 -427 1 -211 -61 218 -52 -176 53 156 -179 -98 -122 130 -361 33 -162 158 203
6372 203 370 -138 -52 65 -138 -43 88 150 132 264 24 -346 75 -81 -383 208 15 -157 -21 245 60
6393 60 -48 245 324 -149 159 149 -126 -298 250 -102 -29 243 -197 295 176 105 -79 198 -108 -35 186 36
6415 36 -61 91 236 42 -29 96 -365 -75 -27 -3 -102 215 485 -134 30 436 -207 -95 225 -69 -180 -191
6437 -191 57 -297 187 -68 -185 109 28 138 121 75 -102 -138 158 -231 -132 217 139 -55 312 245 -194 105
6459 105 190 -101 -266 285 -64 19 50 16 -126 418 -36 -72 -20 -117 -76 -68 82 -28 -165 -97 -79 -266 63 111
6483 111 -292 138 78 -40 92 40 138 76 -89 164 -276 147 118 -160 0 201 -201 -41 212 -161 2 221
6505 221 -18 -291 181 94 -351 -128 -52 7 39 -84 15 66 -37 198 -63 -63 -28 -262 75 159 -146 -230 195 -221
6529 -221 262 -71 -53 -232 105 148 77 167 55 -3 -92 328 -230 -135 98 95 -244 160 334 149 -61 -44 -169
6552 -169 17 49 -127 -399 133 13 -39 16 228 58 241 -63 10 19 80 180 -61 59 156 -16 116 324 -301
6575 -301 90 -283 -130 123 -35 -123 39 157 -146 -277 64 -104 -200 -61 12 -108 -252 231 69 -274 3
6596 3 118 -114 61 84 90 297 -100 -171 -131 -245 -292 -172 199 -84 -158 96 -156 68 22 -36 -59 -171 52 -145
6620 -145 156 128 90 -211 -125 -164 -99 201 0 -133 153 233 -23 72 27 -42 37 39 178 -207 -79 209 -249 30
6644 30 105 -8 -157 231 2 -79 200 -127 -69 295 75 25 -134 224 -117 -30 243 -362 -26 74 -69 123
6666 123 11 61 -162 -68 184 -175 -17 40 -12 -123 -56 112 -140 434 17 153 72 76 155 -17 95 -136 -111
6689 -111 24 -92 -353 196 -62 -224 187 78 203 -191 55 -39 -294 198 11 32 154 180 -279 -40 116
6710 116 -208 -120 298 -52 -385 168 -95 228 183 188 -359 172 66 -141 -10 -34 -61 -297 29 -335 82 14
6732 14 -20 -78 -110 100 -429 188 -90 -2 1 40 184 -36 36 -137 -350 -26 17 -102 -2 303 -136 -54 295 -12
6756 -12 135 49 -128 152 45 -1 96 -126 165 -119 144 306 -250 -282 142 -134 26 13 137 -91 -28 283
6778 283 78 20 69 -104 158 381 -39 -256 73 -87 -288 -27 23 -149 -94 -89 -17 -108 134 193 -6 79 48 110
6802 110 -155 10 148 82 320 173 -58 65 2 -147 -119 144 -95 197 6 -129 -74 89 140 -212 73 170
6824 170 -449 97 -213 -466 187 -61 -247 -88 165 198 -35 124 -109 -9 143 -121 114 -23 -38 -264 161
6845 161 128 -137 -155 509 54 5 229 410 -32 4 61 -18 -17 102 -113 77 -39 -253 -224 339 -136 -293 -35
6868 -35 44 -40 -182 106 -279 -61 -41 -421 -18 -188 -136 76 112 75 -56 -48 61 168 360 160 -57 -286 136
6891 136 5 40 112 25 -242 46 47 -152 10 -186 138 -246 238 -76 -372 -85 345 -136 -100 -133 -224 -44 45
6914 45 -263 10 217 -3 -59 78 33 -135 72 0 -130 59 -355 150 40 183 35 -162 424 69 -136
6935 -136 247 71 22 -128 305 20 -287 386 59 265 51 184 -201 150 134 -191 175 -38 90 38 411
6956 411 -28 -51 91 160 -201 225 298 -112 52 221 -337 -477 77 88 -104 50 35 -188 -183 184 -354 -4
6978 -4 178 -82 -104 128 -412 -162 64 129 -201 -212 92 -205 45 -112 299 135 401 -41 302 124 87 76
7000 76 -68 -162 -11 282 -124 -150 -112 1 -24 240 159 -62 64 153 -205 -61 -315 47 -63 62 312 -194
7022 -194 -98 169 -6 -170 106 119 2 -135 73 77 228 257 -278 14 198 0 194 272 -40 -394 158 145
7044 145 -99 -107 251 49 62 118 200 -34 -203 -231 -50 70 -299 125 14 276 142 199 180 35 80 -24 -312
7067 -312 -213 181 235 79 495 51 17 172 319 -49 308 -24 130 -3 318 172 -347 205 -197 -239 147
7088 147 14 -196 -182 80 -66 -148 -142 228 -170 140 163 -102 45 143 -207 50 169 136 -8 6 12 -41 -56 -75
7112 -75 -27 -40 113 -185 14 54 141 140 158 -223 -176 121 233 52 -12 -195 45 56 -39 -71 41 -51 78 23 53
7137 53 -178 -108 143 -281 135 -140 75 250 -285 162 76 156 155 169 -83 45 174 -205 40 85 -250 39 170
7160 170 210 -105 -172 339 226 99 -180 -130 -256 134 26 87 220 -3 -106 17 41 -264 99 43 42 199 165
7183 165 -90 20 425 -14 15 243 -79 161 77 179 121 28 -179 -218 95 -202 53 225 78 -38 3 23
7205 23 88 -114 295 237 78 146 10 79 -328 -17 311 -134 139 -11 -139 60 -86 -107 -258 -302 -554 -211
7227 -211 32 240 122 263 58 -216 -31 -1 -101 -169 400 -44 -293 203 19 -92 9 78 -211 10 171
7248 171 68 166 135 -109 -123 107 185 -189 56 57 -219 -35 380 -311 -84 99 -381 70 118 151 -142 -132 99
7271 99 -28 114 380 133 -39 126 42 211 -24 232 -139 88 -274 -234 -120 248 367 90 66 -534 -122
7292 -122 301 -107 -40 26 242 -307 -29 512 -152 7 256 -46 -216 -112 -127 -186 -147 116 -198 333 184 -80
7314 -80 -93 -53 -225 -168 215 170 -62 -35 -4 -284 32 -184 48 -166 351 -92 90 78 -113 -10 116 -4 -3
7337 -3 181 162 -264 320 25 -176 -78 211 37 -167 110 -188 153 -87 29 -207 98 141 -93 -1 -156 6
7359 6 -168 -6 -42 -364 81 98 -549 -137 299 65 -377 400 -94 154 220 -105 227 -145 6 -48 -52 51 -267
7382 -267 58 -95 -145 -106 256 189 -136 -25 -71 -147 -190 224 -325 227 -106 -230 -71 -39 326 40 -8 -35 -239
7405 -239 79 -25 -120 -101 92 -57 197 18 -296 -11 -168 78 -127 -185 170 -73 1 297 -399 279 179
7426 179 37 -7 -9 112 -25 194 66 -78 47 244 -151 25 378 -27 -26 137 -81 -204 250 -78 133 420
7448 420 -199 -140 182 177 -300 186 -65 24 -242 276 -18 -168 182 189 271 -190 100 -274 -266 -59 -13 77 274 -132
7472 -132 -197 67 44 -131 163 154 -108 -117 229 -71 67 178 66 -202 -27 192 -275 103 53 27 -299 261 -229
7495 -229 -56 111 -7 -196 2 -57 168 -53 25 14 -104 86 29 -126 241 183 67 232 -83 65 -142 -82
7517 -82 -97 16 347 -69 149 -112 -318 39 215 58 188 80 -58 -54 -57 282 157 -9 -38 271 212 36 101
7540 101 61 291 230 -14 -53 97 386 -362 140 -149 -142 340 211 84 274 225 -93 -231 192 144 54 113 74
7563 74 172 -94 41 -65 175 -45 -37 -346 94 35 504 51 -54 96 202 82 222 104 371 -476 273 -101
7585 -101 87 155 -119 10 77 64 -145 -319 223 146 -478 -121 26 -28 -195 -88 -60 -150 391 29 -285 127
7607 127 229 -126 -114 340 -320 -239 -163 -180 -100 -45 -8 -312 -36 -43 56 -334 -93 125 -102 32 -275 -488 -69
7630 -69 -116 -237 -152 -39 -76 60 217 226 -319 -154 143 -198 106 107 -174 -92 284 -77 52 -66 -362 80 -95
7653 -95 397 202 181 -134 -155 -167 -76 236 118 128 -44 252 292 74 225 -168 168 -57 -95 -26 -194 -104 68
7676 68 23 -39 -14 176 -380 -41 -77 71 414 101 8 313 -3 -32 4 211 -220 70 7 -200 -52 184 359
7699 359 -274 -194 -108 109 38 -70 -116 114 -374 -234 -72 -148 -79 -107 -356 71 -383 15 4 85 -51 297 -22
7722 -22 -10 -267 70 -80 58 187 -87 -152 208 13 -231 136 -7 35 -336 104 -216 118 20 9 9 76 -324
7745 -324 1 290 -47 -255 -290 -72 -222 -148 -166 -144 -198 -179 -115 82 -86 110 51 -159 -172 -80 171 -164 -115 19
7769 19 -203 -33 -395 -38 -231 -187 -27 -72 -299 133 103 -161 129 -170 -82 -150 261 -160 13 -25 30 -79 24
7792 24 26 -185 -62 335 17 49 235 -114 -190 231 273 223 46 -37 -10 -109 126 -170 42 291 57 -178 162
7815 162 -223 26 277 88 -75 47 43 42 -60 5 43 -43 41 206 -124 317 8 17 -196 -81 -37 0 43 1 -111
7840 -111 -26 -97 -67 105 -86 -186 -127 -124 -270 -80 187 32 95 82 -34 171 -118 54 -340 -319 -222 -190 39 263
7864 263 47 29 291 -21 -106 95 -88 124 41 6 -24 279 -44 -337 -177 130 -230 -131 235 167 272 134
7886 134 101 312 -200 -28 181 -100 -78 301 -104 137 -80 -54 321 46 -44 194 -48 7 -83 142 508 64
7908 64 297 -197 42 18 70 -327 119 107 -230 36 252 79 57 6 -10 -356 -19 -175 -86 -56 -44 -112 -82 226
7932 226 59 -92 -3 -105 -25 138 -82 -163 -46 -136 63 360 -163 -180 282 280 261 -164 0 0 -106 62 4 -293
7956 -293 113 395 35 -140 36 67 7 -252 196 -118 -141 133 -313 -59 178 -249 268 138 68 -290 85
7977 85 3 -286 94 93 12 -62 87 -67 -153 260 11 -154 92 222 -69 -27 -46 -364 65 87 -42 -208 -41
8000 -41 -338 -199 122 3 -13 58 -162 -55 283 155 17 -193 98 -228 -22 167 137 -124 12 -54 -445 -137
8022 -137 -64 -53 -1 292 -60 -198 413 32 -213 20 28 -359 -29 381 -3 -91 189 -250 32 -75 112 229
8044 229 -203 -106 -324 -168 66 144 -18 39 -121 -98 70 -40 -310 196 -94 50 73 25 65 25 -54 -65 -64 -71 -37
8069 -37 40 -39 -41 125 -275 128 -339 -31 44 -114 -187 31 32 -36 283 -104 -315 34 154 -73 139 -162 -12
8092 -12 -170 -170 -49 144 74 -161 -423 -34 257 -58 -73 -169 129 -170 -8 -1 -280 152 108 102 64 -117 63 -163
8116 -163 52 0 -153 -265 18 -205 207 56 36 -69 -118 171 323 -222 -126 80 216 64 -90 212 -96
8137 -96 -240 89 150 54 181 -16 195 -140 59 -173 176 97 117 -137 -115 -15 130 349 73 -127 -171 -61
8159 -61 97 142 -110 1 -113 -290 114 -3 44 -30 9 -270 49 -27 -6 -80 183 -136 569 158 -169 297 264
8182 264 -16 135 183 57 2 -170 129 51 169
8191A69
$$ Imaginary data points
##PAGE= N=2
##DATA TABLE= (X++(I..I)), XYDATA
0 0 0 0 0 0 0 0 0 0 0 0 0 8 -8 8 -8 8 -10 16 -16 18 -24 26 -32 34 -42 48 -56 60 -70 79 -90 98 -113 122
34 122 -138 154 -172 189 -211 234 -259 287 -317 350 -389 432 -480 535 -598 672 -760 867 -1002
53 -1002 1171 -1395 1711 -2182 2964 -4501 8651 -39287 -137278 -59239 -21633 -32155 1193 38775
67 38775 6351 -17188 -33302 -61234 -45139 1821 -7767 -22627 -7360 -31856 -82612 -82832 -73057
80 -73057 -71747 -46793 -45399 -86462 -89399 -79058 -117218 -129649 -79831 -65762 -88081 -83215 -85492
93 -85492 -106819 -95647 -80532 -82367 -53638 -30294 -63216 -76348 -44485 -43058 -51840 -22055 -10312
106 -10312 -25082 -16442 -20497 -47335 -25818 6808 -16165 -25537 3336 -13284 -50521 -36813 -20470
119 -20470 -30375 -21502 -14870 -34208 -35596 -30551 -51758 -49734 -17446 -14642 -23301 -11570 -19375 -34438
133 -34438 -16688 -8038 -15469 12479 34275 6181 391 27436 17053 1852 29046 43436 31981
146 31981 38281 35061 13773 23489 34318 13836 16504 39353 21751 1445 15099 9126 -10567
159 -10567 2135 6769 -11395 -1631 9237 -15861 -20000 3677 -5449 -20425 -2645 2879 -7321
172 -7321 3214 5889 -6319 5374 15058 -1770 3155 22836 9902 295 18199 14523 -319
185 -319 9554 6958 -9679 3184 11590 -13408 -14699 3366 -15086 -31793 -15815 -17060 -31342
198 -31342 -20860 -18643 -34859 -28189 -22108 -39059 -33039 -13543 -25863 -32951 -13132 -15507 -27888
211 -27888 -13435 -10829 -24423 -9223 3103 -14173 -11702 5172 -8503 -18521 -1573 -2786 -13803
224 -13803 -3281 -4705 -18469 -10157 -8025 -27591 -20893 -5248 -22448 -30200 -13184 -20337 -33535
237 -33535 -19494 -18593 -33227 -21157 -12452 -27466 -22041 -6300 -20002 -24656 -4598 -7486 -16534
250 -16534 -2236 -1420 -12539 11 5926 -10038 -3541 10427 -3602 -7927 8094 810 -9757
263 -9757 2747 668 -13661 -3556 716 -15104 -8341 3439 -13243 -19185 -3221 -8759 -17780
276 -17780 -4132 -4670 -15917 -5112 -1807 -15938 -7305 5656 -7302 -7202 9534 204 -9566 5762
290 5762 5271 -5409 7454 11506 -4250 1510 12143 -2816 -4745 10752 3433 -4464 6850 1881
304 1881 -11033 117 2988 -9772 -406 8413 -9363 -11128 3007 -5575 -11163 4005 2508 -7426
318 -7426 2701 2619 -11605 -2149 9354 -1611 535 13673 1616 -6332 6999 4427 -3706 10071
332 10071 12979 -1120 4863 9827 -5574 -3687 11916 4846 385 11606 3679 -8326 2667
345 2667 4033 -5960 5690 13641 -1618 -2198 7629 -3659 -7019 9042 7625 172 10266 7022
359 7022 -7352 1489 9252 -1153 4475 16903 4061 -1864 9156 2561 -4412 10343 12528 1266
373 1266 9126 11714 -4092 -599 12177 3954 2870 15608 7865 -1685 8751 7086 -3548 8656
387 8656 15875 2661 5482 13333 175 -2773 11370 7355 900 12129 8669 -3679 4755 8149
401 8149 -3977 2789 13343 1923 -1059 9842 1785 -5440 8080 7826 -2122 7516 10208 -2931
415 -2931 1882 11210 775 291 12592 5486 -1429 9063 5848 -4185 6410 9482 -3516 1294
429 1294 8208 -4050 -4447 5974 -2317 -8153 2542 -2102 -11510 -1539 -351 -12802 -6350 1553
443 1553 -10724 -11072 190 -7149 -11561 594 -2607 -11670 -1822 -422 -10586 -2993 4236 -6536
457 -6536 -4776 4529 -5160 -9577 2636 -1393 -9514 1440 1357 -12612 -7331 -1225 -12940 -11145 -867
472 -867 -9768 -14795 -5903 -11466 -19361 -8856 -7690 -17237 -8477 -3874 -16332 -14179 -4068 -11394 -12060
487 -12060 965 -3190 -10538 -179 -319 -9941 -1157 6086 -3535 -620 8137 -1943 -5605 4614
501 4614 392 -4865 5189 3859 -7035 -1450 1184 -10088 -5893 2531 -6111 -7916 1475 -5384
515 -5384 -12801 -1575 -1113 -9756 -553 4945 -6044 -2885 5974 -1222 -1513 10217 6615 2449 11635
530 11635 9291 1672 10175 13990 4699 10407 16348 5092 3302 12891 5169 -454 9925 7781
544 7781 -3538 2994 4507 -7332 -4376 3425 -5031 -6156 2480 -4891 -9673 -318 -2616 -8576 1639
559 1639 4141 -5341 40 6672 -2903 -260 10868 5304 1612 11566 8311 -523 7828 10826 1564
574 1564 6367 11696 1467 -241 6511 -911 -4732 3417 -47 -7652 -983 -2587 -12826 -7371 -2135
589 -2135 -10969 -8741 -100 -8469 -12310 -1905 -4556 -10550 373 3838 -4588 446 6079 -1926 -126
604 -126 9261 4950 3404 12240 7609 908 8264 7663 -390 6771 10965 105 1006 6677 -3158 -6896
620 -6896 2570 -596 -7755 230 -778 -10711 -6244 -2484 -9802 -6070 1904 -4257 -4844 2906 -2568
635 -2568 -6500 3866 4200 -1368 7691 11168 1284 3740 10868 3489 2889 13375 9096 2527 9052
650 9052 6511 -3285 2027 5230 -2543 -472 4416 -5351 -8585 -3097 -9208 -12424 -3210 -4511 -11481
665 -11481 -5877 -5237 -15136 -10727 -2479 -8366 -6434 3174 -2070 -7881 192 -421 -5245 3739 8980
680 8980 2241 4346 7265 -1543 -854 7296 3337 2197 10008 4754 -5497 -70 279 -7534 -881
695 -881 6459 -2730 -5204 244 -7487 -11471 -1741 150 -4075 3271 3837 -5538 -2454 2225 -1767 3820
711 3820 14333 9602 6691 12558 7524 2304 12793 17397 12641 18552 21206 9596 8190 14628
725 14628 10432 10879 20478 16948 8789 11903 9117 1296 7395 13252 7446 10064 14339 4801 995
740 995 8533 6050 4299 15279 15967 7095 10795 13166 5144 9136 19048 15298 13948 20682 14372
755 14372 8092 14359 15648 11317 17773 19532 9774 9548 12210 4712 5339 13561 8744 2837 8123
770 8123 3662 -5373 694 4172 -2341 671 5708 -2994 -5668 355 -3282 -5510 3874 3294 -2466
785 -2466 2259 2331 -5594 -1157 5801 234 1613 8637 1340 -4292 2522 971 -4359 3118 5541 -3126
801 -3126 -2088 602 -7762 -7704 -236 -4043 -6940 -871 -4969 -11849 -6660 -5222 -10899 -5460 -720 -7754
817 -7754 -7349 -1197 -6718 -8198 322 -1237 -5467 2395 2892 -4628 -327 4586 -1511 -32 7145 2020
833 2020 -1191 5001 2548 -2732 3760 4411 -2023 1657 4134 -3417 -1850 4564 -1182 -2992 4026
848 4026 139 -4858 1633 2770 -3028 2113 5870 -657 757 6633 1433 714 8883 6220 2726
863 2726 9508 8376 1595 6531 9990 3855 6148 11889 5617 3340 9411 4435 208 7319 7478
878 7478 1367 5665 6815 -1285 363 6201 526 411 6943 2560 -1716 4122 3246 -2516 3351 6571
894 6571 388 3162 7366 665 612 6916 3303 909 7601 6153 -58 4355 6108 -867 2496 7418
910 7418 1517 613 5580 467 -2764 3504 2438 -2869 1976 2664 -4383 -1403 2885 -3319 -2708 3817
926 3817 -1121 -4168 1708 161 -4606 1228 3123 -2967 -225 3375 -2983 -1911 4276 -336 -2443
941 -2443 4041 1820 -3968 1439 1858 -4127 120 3598 -2981 -3065 1879 -3302 -5031 1619 -632 -5302
957 -5302 179 -672 -7045 -2975 798 -4989 -3116 2593 -3292 -5993 -379 -2793 -6020 1016 1541 -4879
973 -4879 -1858 186 -6050 -4274 1889 -2403 -3526 1992 -2170 -7020 -1565 -1021 -5611 -461 1913
988 1913 -4844 -4288 -13 -5400 -5554 1229 -1142 -4691 484 -1309 -7476 -3209 233 -4480 -1827 3046
1004 3046 -3745 -5548 -954 -3838 -6081 1500 1192 -4422 -832 -618 -7135 -4191 1469 -2275 -1938 3103
1020 3103 -1824 -6164 -616 -928 -4530 1216 3400 -2694 -1123 1845 -4168 -3553 3551 875 -1298
1035 -1298 4113 889 -4953 -174 1819 -2796 1576 5699 -1106 -2068 2082 -2102 -3914 3250 2670
1050 2670 -1928 2371 1701 -4915 -1394 2908 -951 370 5551 179 -3074 2386 1005 -2253 3572
1065 3572 5366 -4 2353 4340 -1245 290 5688 2149 781 6259 2750 -2037 2714 3281 -1475
1080 -1475 2333 5354 -927 -349 3102 -1165 -2572 3813 1462 -2292 2539 1440 -3864 471 3697
1095 3697 -1589 243 5034 -214 -1699 4253 2072 -1059 4727 4880 -335 3061 4908 -114 1564
1110 1564 6251 1433 334 4953 1385 -1830 3600 2636 -1909 2082 3428 -3164 -1632 2503 -2582
1125 -2582 -2836 3051 -177 -3908 1112 -488 -4981 58 2276 -2687 -242 3173 -2065 -2534 2716
1140 2716 29 -2112 3796 3054 -2177 1744 2233 -2841 -108 4307 -925 -1550 2567 -1632 -4772 61
1156 61 -982 -5270 -673 -135 -5770 -4242 -1376 -6200 -5231 14 -3786 -5719 -564 -2918 -6662 -1552
1172 -1552 -573 -4967 -1539 1758 -3498 -3182 1775 -1958 -3215 2770 551 -3428 875 877 -3834 -456
1188 -456 2237 -3009 -2246 1518 -3482 -5204 -458 -2187 -5357 -501 -474 -6370 -3570 -1178 -6076 -4577
1204 -4577 477 -2911 -4267 640 -1803 -5079 221 764 -2804 1352 4075 -1139 402 3931 -217
1219 -217 -285 5609 3075 -404 4695 3411 -1773 1922 4027 -981 1154 4429 -651 -2583 2105 -314
1235 -314 -3177 1607 1211 -2992 443 1157 -3615 -1677 2654 -1327 -928 3810 215 -2184 2629 2593
1251 2593 -914 3585 4986 -155 1779 4707 -118 327 5318 2382 121 4205 1706 -3082 1022
1266 1022 1902 -2014 420 2935 -2806 -3538 203 -3674 -5371 243 -204 -4610 -801 -679 -6299 -3750
1282 -3750 221 -3226 -1932 2710 -1454 -3902 278 -852 -3601 1642 3209 -1520 392 2045 -3580
1297 -3580 -3174 1686 -858 -1753 2809 -279 -5178 -2162 -2372 -6022 -2277 807 -3756 -3914 -1416 -5731
1313 -5731 -7125 -1863 -2456 -4493 -304 -1052 -6286 -3342 -1095 -5021 -2040 2566 -965 -2606 1137
1328 1137 -1266 -4433 937 2228 -1343 1663 2977 -2868 -2428 1317 -1973 -1568 2626 -173 -3785
1343 -3785 -353 -1853 -5776 -1670 767 -3477 -2366 355 -4351 -5210 -386 -2213 -3801 1036 647
1358 647 -3839 -938 21 -4010 -1246 3040 -328 -644 2985 -698 -3137 1536 1173 -1707 1862 2830
1374 2830 -2463 -1350 1245 -3032 -3147 1793 -962 -3010 278 -1291 -5462 -1980 -382 -4106 -1264
1389 -1264 1205 -3355 -3227 55 -2951 -4005 753 245 -2874 1089 1617 -3269 -823 2195 -1362 -431
1405 -431 3507 317 -1787 2266 595 -2539 1350 1976 -1998 419 2186 -2485 -1980 1596 -1488 -2679
1421 -2679 1827 359 -3465 464 369 -3433 -715 2066 -1785 -902 2763 -975 -1650 2473 1159 -1331
1437 -1331 3081 3004 -1213 1941 3465 -348 673 4190 1034 135 3834 1558 -1374 2353 2304 -1405
1453 -1405 1421 3141 -1351 -550 2649 -1254 -1854 2675 705 -1595 2021 1105 -2785 534 2207 -1481
1469 -1481 138 3125 -253 -940 2745 418 -1496 2532 2426 -1135 1640 2691 -1405 -212 2384
1484 2384 -601 -1013 2824 65 -2227 1438 333 -2913 188 1288 -2892 -971 1072 -2579 -2616 1140
1500 1140 -1141 -3117 877 -275 -3353 -473 609 -2965 -1281 1457 -1909 -1562 1891 -1034 -2407
1515 -2407 1645 373 -2256 763 1306 -2271 -451 1605 -1668 -1213 1983 -692 -2547 1434 -298
1530 -298 -3044 474 1127 -2542 -94 1509 -2386 -1703 1727 -935 -2037 1983 597 -2024 906 1367
1546 1367 -2255 620 2529 -961 -535 2681 -123 -1233 2700 1026 -1558 1979 1765 -1738 592
1561 592 2167 -1477 -296 2557 -247 -1265 2443 241 -2023 1124 1315 -1852 1076 2161 -1541
1576 -1541 -737 2345 -835 -1069 2494 547 -1891 1591 1410 -2094 859 2221 -1409 -28 2520 -1190
1592 -1190 -731 2183 -266 -1782 1756 1047 -2090 691 1716 -1865 -803 2138 -1319 -1184 1714 -122
1608 -122 -2090 1201 681 -2505 444 1412 -2101 -305 1804 -1225 -1471 1749 -17 -1897 1397 656
1624 656 -1652 721 1433 -1972 -290 2059 -1300 -978 2168 -384 -1688 1427 207 -2034 887 2067
1640 2067 -1466 412 1940 -1404 -853 2342 -103 -1397 2129 1069 -2054 1223 1729 -1614 423
1655 423 2791 -528 -24 2341 -351 -1454 1772 811 -1300 1896 2266 -1456 395 1871 -1475 -256
1671 -256 2762 218 -1110 1905 404 -2022 1243 1721 -1112 756 2472 -1274 -1001 1874 -881 -1181
1687 -1181 2344 679 -1530 1305 971 -2186 -106 1658 -1339 -702 2077 -1230 -1912 1135 -637 -2463
1703 -2463 1316 852 -2297 -150 741 -2723 -1438 1253 -1234 -1576 1168 -726 -2754 502 208 -2336
1719 -2336 267 1301 -2221 -1019 909 -1603 -1680 1333 -710 -2259 1049 165 -2801 -350 601 -2087
1735 -2087 -854 1346 -1440 -1843 750 -1067 -2288 688 -277 -2430 -163 677 -2524 -808 1111 -1347
1751 -1347 -1210 1934 -762 -1905 1454 398 -1847 584 1370 -1538 248 2137 -982 -333 2136 39
1767 39 -1075 1491 583 -1340 1132 1560 -1532 325 1604 -1141 -575 1912 -211 -946 2036 703
1783 703 -1429 1088 1772 -1261 528 2137 -370 -2 2604 38 -405 2563 1172 -547 2148 1753
1799 1753 -991 953 2119 -283 639 2901 291 -409 2306 820 -1042 1799 1579 -876 1042 2299
1815 2299 -973 116 2221 -151 -558 2091 706 -1088 1379 1043 -1172 986 1758 -1082 125 2175
1831 2175 -317 -551 2055 377 -1097 1620 1118 -1182 858 1648 -1335 -43 1696 -893 -757 1575
1847 1575 -407 -1421 1213 340 -2112 377 1093 -2099 -655 1341 -1205 -1471 998 -631 -1973 592
1863 592 -74 -1947 266 704 -1951 -776 954 -1581 -1093 809 -946 -1624 992 -140 -1800 113
1879 113 212 -2126 -767 909 -1477 -1433 743 -1168 -2041 274 -670 -2234 242 314 -2106 -417 542
1896 542 -1993 -1177 961 -1131 -1410 1023 -293 -1899 312 614 -1798 -7 1091 -1531 -823 1169
1912 1169 -1067 -1097 1540 439 -1286 738 328 -1637 600 1622 -920 -111 1743 -916 -1264 1426
1928 1426 265 -1047 1574 1385 -1058 230 1341 -1238 83 2314 269 -394 1903 84 -1291
1943 -1291 1045 1106 -465 1966 2170 -487 109 1506 -718 -302 2525 1335 -246 1922 841 -1996
1959 -1996 522 1366 -490 1012 2241 -210 -807 876 -282 -1160 1792 1241 -736 1090 970 -1825
1975 -1825 -625 1068 -438 -58 1858 -158 -1403 573 -197 -1216 991 1267 -1168 -106 701 -1608
1991 -1608 -1372 906 -259 -699 1021 -208 -2244 -314 136 -1823 309 1285 -1250 -1406 676 -1290
2007 -1290 -2117 779 -112 -1408 518 -48 -2454 -790 408 -1710 -714 1361 -946 -1607 143 -896
2023 -896 -2231 480 891 -1080 238 486 -2093 -1266 1055 -1020 -938 1516 -46 -1625 274 -219 -1955
2040 -1955 114 1155 -1008 -518 1365 -873 -1383 955 -44 -976 1333 850 -1522 422 866 -1562
2056 -1562 -590 1511 -462 -520 1522 100 -1132 961 568 -924 554 1161 -812 -177 1349 -578
2072 -578 -783 1410 172 -696 1492 480 -1307 520 1060 -1120 312 1414 -665 -548 1476 313
2088 313 -956 1251 632 -1327 514 949 -1081 100 1189 -476 -713 1300 -19 -1105 924 430
2104 430 -843 664 533 -1316 214 1168 -750 -627 858 -351 -1214 915 -39 -1342 636 742 -1346
2121 -1346 -200 663 -902 -566 1042 -419 -1185 852 -97 -1316 521 448 -1249 61 721 -1016 -313
2138 -313 974 -622 -1124 906 338 -1256 606 591 -830 264 1207 -798 -324 1244 -519 -888 1041
2155 1041 -85 -977 927 976 -885 282 962 -1178 -228 1284 -288 -646 1367 20 -1173 863
2171 863 514 -1244 663 1020 -960 -9 1112 -480 -522 1246 123 -939 903 574 -903 344 681
2188 681 -842 -32 1471 -743 -433 1246 -207 -899 958 644 -1166 584 467 -1149 -298 1074 -539
2205 -539 -672 954 -615 -1309 715 424 -1048 478 600 -1329 -591 723 -801 -853 710 -354 -993
2222 -993 672 -217 -1496 320 227 -1434 -417 671 -879 -543 575 -925 -1206 661 120 -1303 167
2239 167 331 -1231 -392 636 -1196 -328 864 -596 -1204 706 -312 -1543 237 544 -1098 -171 434
2256 434 -1241 -788 650 -636 -957 548 -9 -1369 275 157 -1318 123 952 -676 -350 960 -624
2273 -624 -762 979 130 -816 1018 519 -1077 113 783 -835 -95 1460 -207 -833 915 -277 -1257
2290 -1257 678 629 -682 453 977 -1138 -382 1074 -352 -303 1422 211 -679 373 151 -1050 497
2307 497 1287 -647 302 1332 -314 -758 992 108 -632 1111 563 -911 476 899 -912 -70 1064
2324 1064 -509 -337 632 -241 -1033 717 347 -1026 458 686 -1211 -65 793 -1241 -500 930 -383
2341 -383 -559 957 37 -1200 98 647 -1109 -78 557 -1133 -484 609 -656 -1063 508 -157 -1179
2358 -1179 315 86 -1441 -90 424 -1338 -823 719 -752 -1260 533 -460 -1471 88 114 -1329 -345
2375 -345 625 -1109 -504 497 -633 -1024 554 -195 -1235 257 619 -1189 -129 572 -1262 -472 857
2392 857 -723 -997 842 -171 -1148 613 207 -1093 529 922 -909 -368 855 -482 -695 1077 231
2409 231 -960 926 348 -867 527 905 -793 -195 1253 -330 -262 1421 -36 -525 1135 939 -607
2426 -607 343 1145 -591 462 1112 -132 -266 1262 55 -797 1098 492 -643 635 1032 -820 150
2443 150 1292 -411 -352 1172 -401 -392 938 619 -653 541 828 -542 529 1166 -255 -73 1468
2460 1468 -56 -487 1025 696 -727 842 954 -609 49 1143 -235 -306 1142 -377 -636 752 -185
2477 -185 -1011 337 311 -1088 -216 771 -953 -490 882 -631 -818 729 -114 -1083 479 547 -935 247
2495 247 774 -454 -625 893 -562 -902 966 300 -981 207 214 -1132 -18 558 -772 -376 945
2512 945 -476 -736 731 -226 -1147 439 212 -1051 42 699 -1185 -412 745 -335 -577 855 28
2529 28 -911 448 626 -857 441 1016 -646 192 1274 -354 -674 875 -224 -687 1029 414 -681
2546 -681 282 663 -794 288 1228 -303 -412 1031 -25 -682 725 152 -775 513 694 -532 127
2563 127 877 -313 -224 1353 320 -311 954 381 -333 671 895 -250 389 1161 -381 56 1142 -28
2581 -28 -485 979 718 -657 831 661 -755 -122 840 -582 -453 1094 -296 -881 786 15 -1001
2598 -1001 413 585 -545 91 937 -675 -291 864 -160 -396 986 158 -736 357 255 -714 180
2615 180 669 -353 -225 712 -825 -682 360 -157 -1121 436 250 -1522 -295 133 -1482 -586 569
2632 569 -417 -935 375 -274 -1425 69 2 -1151 233 279 -948 -509 460 -861 -907 868 -109 -868
2650 -868 308 -103 -1268 78 217 -879 -322 586 -689 -1001 399 -561 -1161 288 161 -923 -43
2667 -43 219 -1106 -156 552 -601 -966 712 -349 -1293 444 351 -507 389 587 -872 -97 640 -793
2685 -793 -284 1053 190 -351 791 143 -1114 16 438 -422 177 912 -407 -252 643 -158 -571 1068
2703 1068 540 -534 534 510 -862 44 911 -363 -208 917 -55 -227 974 39 -431 672 540 -425
2721 -425 80 814 -305 -317 938 -54 -315 920 353 -786 539 450 -892 341 739 -604 -405 736
2739 736 -384 -1011 787 15 -1027 545 232 -931 228 522 -822 -191 636 -436 -744 621 -261
2756 -261 -1023 503 140 -1082 -146 197 -820 -170 788 -802 -695 559 -483 -1020 402 53 -970
2773 -970 24 454 -668 -341 793 -443 -694 700 -191 -728 351 63 -669 278 324 -775 -348 715
2791 715 -195 -348 863 -142 -266 769 368 -896 197 814 -851 299 947 -432 -217 1084 -41
2808 -41 -305 906 627 -144 670 858 -283 132 1030 37 -129 860 386 -227 1128 669 -184 862 922
2827 922 -437 573 1164 -132 175 1322 371 -318 1107 486 -150 834 764 -331 381 925 -182 580
2845 580 1051 307 177 1392 468 -654 733 810 -371 220 947 -389 -101 942 116 -408 771 420
2863 420 -539 694 517 -187 515 983 -390 11 1038 -222 -581 737 290 -558 939 516 -524 218
2881 218 588 -421 244 1212 -329 -259 646 -35 -684 723 460 -613 386 532 -426 -11 597 -53 -147
2900 -147 713 58 -660 1047 492 -376 318 667 -145 -182 831 -413 -44 731 192 -53 508 587 -352 596
2920 596 595 -267 79 1055 40 -20 888 161 -108 864 342 -288 425 640 -465 138 1028 327 103 1106
2940 1106 176 -122 757 386 -409 453 842 -232 398 718 68 -118 1066 71 -97 822 476 -330 641
2959 641 628 -220 120 897 -266 -104 841 -99 21 591 542 -487 278 409 -592 397 498 -299 175 697
2979 697 -294 -328 521 225 -759 279 614 -488 144 470 -345 -234 630 -181 -318 900 -56 -623 501
2998 501 261 -572 558 920 -189 63 500 3 -205 617 7 -511 446 414 -609 308 470 -364 -227
3017 -227 633 -258 -337 639 -224 -392 434 442 -743 530 954 -396 -353 749 -448 -220 1068 -173 -445
3036 -445 476 210 -575 190 436 -651 161 786 -332 -6 476 118 -206 632 210 -343 141 404 -462
3055 -462 -104 848 -548 -20 666 -243 -352 675 71 -645 455 717 -331 93 360 -269 -71 299 -79
3074 -79 -557 261 52 -451 489 -76 -707 -101 265 -513 -232 491 -529 -498 225 -144 -482 144 -51 -717
3094 -717 55 354 -723 -466 315 -212 -338 328 11 -527 312 156 -461 -120 412 -343 -102 534 -406 -618
3114 -618 397 -315 -661 25 78 -597 77 211 -545 -339 214 -213 -434 452 -540 -628 256 -216 -478 190
3134 190 427 -345 -206 359 -462 -247 494 -236 -447 423 82 -796 35 556 -593 -128 305 -221 -493 356
3154 356 -231 -715 97 149 -495 258 54 -657 -150 493 -369 -224 382 -200 -216 527 27 -521 416 410 -745
3175 -745 -197 284 -429 93 635 -24 -238 394 279 -362 230 616 -487 106 785 -55 -299 516 -269 -322
3195 -322 836 416 -189 476 506 -681 69 306 -396 -133 658 -189 -399 503 162 -355 468 933 -595
3214 -595 381 405 -320 -87 756 -380 -271 833 129 -328 687 405 -231 304 596 -184 169 618 -439
3233 -439 -630 299 68 -283 314 356 -457 -154 319 -293 -132 575 171 -181 328 57 -734 70 183 -355
3253 -355 -31 374 -534 -317 437 -431 -295 443 92 -625 324 -94 -868 183 303 -495 -205 364 -234 -638
3273 -638 378 -88 -889 202 -219 -786 174 258 -599 -66 333 -599 -346 472 138 -506 503 99 -430
3292 -430 136 336 -351 -136 499 -450 -362 577 -9 -252 580 151 -538 152 656 -292 68 673 -218 46
3312 46 472 -66 -315 548 82 -206 293 561 -416 -59 565 -133 -10 618 -89 -114 710 293 5 410 281
3333 281 -295 335 562 -111 97 638 -60 -298 571 563 -204 481 361 -635 128 310 -232 -181 772 32 -207
3354 -207 409 -35 -498 222 164 -411 -232 30 -700 -296 242 -399 -519 516 -38 -485 -174 -270 -349 -36 336
3375 336 -570 -404 206 -675 -626 41 -168 -614 -113 -128 -876 -158 -54 -813 -344 -188 -522 -471 23 6 -987
3396 -987 -114 -64 -821 -200 263 -768 -458 232 -525 -524 -17 -335 -716 -175 -37 -698 161 41 -688 -270 312
3417 312 -165 -400 437 -192 -661 263 -70 -625 204 34 -483 -350 336 -187 -229 579 -193 -328 278 338 -326
3438 -326 313 238 -343 111 321 -392 -277 495 -198 -535 217 150 -271 169 99 -462 -63 666 -195 -199 452 -87
3460 -87 -393 399 -9 -385 352 -48 -542 -134 490 -386 -298 416 85 -295 420 -255 -580 24 143 -592 -127
3481 -127 226 -605 -231 -66 -11 -171 150 19 -694 185 -60 -554 -7 53 -483 -448 159 -397 -519 -30 -177
3502 -177 -796 -28 16 -714 -336 -158 -471 -555 50 -491 -574 -52 -151 -589 -274 -272 -863 -286 87 -432 -391 94
3524 94 -543 -366 -85 -155 -468 -36 -455 -609 -9 310 -662 -360 191 -382 -370 -47 -458 -522 -241 -31 -444
3545 -444 -153 22 -318 -235 65 -486 -536 481 -405 -382 352 -253 -421 214 5 -424 -338 109 -470 -434 537
3566 537 -217 -466 84 99 -417 -233 203 -375 -235 243 -252 -153 206 -245 -458 260 -39 -573 -43 181 -230
3587 -230 99 263 -319 -405 447 -88 -414 203 101 -355 -141 146 -235 101 601 -242 -173 234 94 -292 536
3608 536 441 -342 336 378 -298 236 432 61 68 617 -301 -181 492 -29 -622 339 516 -221 194 580 -188
3629 -188 74 408 -41 -138 350 321 -458 185 322 -345 321 621 -224 -25 504 -116 -84 480 -22 -479 176
3650 176 77 -249 79 182 -292 102 317 12 -238 270 -261 -334 263 -35 -470 211 388 -357 -296 241 -339
3671 -339 -64 93 61 -343 241 -8 -291 41 -82 -450 -193 377 -512 -388 42 -62 -313 -29 -14 -596 147
3692 147 67 -457 -70 -36 -453 -121 159 -217 -270 380 53 -418 185 289 -433 322 580 -388 123 446 99
3713 99 -99 118 162 -451 -13 37 -277 54 511 -340 -207 591 -142 -317 463 -28 -224 483 407 -230 213
3734 213 551 -128 -58 659 65 -11 765 216 78 334 488 -15 246 393 -100 5 571 -62 -110 527 76
3755 76 -321 470 394 -211 222 76 -195 -115 265 40 55 783 26 -396 280 183 -269 81 456 -124 147 270
3777 270 -74 -260 559 109 -550 108 67 -348 -91 117 -250 -33 129 -86 -169 -139 57 -417 62 170 -375
3798 -375 284 90 -293 -234 182 -187 -245 168 -41 -703 270 180 -290 147 216 -253 122 539 -49 -84 338 21
3820 21 -149 136 90 -262 -54 102 -95 -143 392 -201 -97 494 -90 -301 395 328 -533 291 114 -437 -47
3841 -47 246 -56 72 566 2 13 214 100 -133 236 580 0 36 346 -125 -122 342 18 -153 272 147 -212
3863 -212 244 290 -238 -134 181 -390 -74 212 -363 -380 27 142 -56 243 451 -232 -189 239 -312 -125 389
3884 389 78 -441 275 48 -460 83 219 -254 -260 405 -497 -383 -9 -488 -259 379 -163 -251 -260 -211 -370 -187
3906 -187 89 -314 -257 499 -63 -183 157 308 -252 137 58 -564 -311 226 -295 -130 292 -324 -316 336 93
3927 93 -144 105 274 26 205 540 -285 65 404 -43 -112 452 -97 -356 61 339 -119 137 21 -413 105
3948 105 216 -142 -101 378 95 -336 368 349 -347 159 356 -261 143 617 -116 -266 393 28 48 375 334
3969 334 -230 423 469 39 198 361 -121 63 432 -97 -358 242 -37 -45 322 395 -266 127 397 181 51
3990 51 374 170 41 140 286 -241 476 404 -494 134 598 138 -156 246 -290 60 589 193 -425 281 225
4011 225 -155 -243 489 -152 -81 340 -325 -169 73 -363 -150 63 488 -251 38 237 -55 187 606 -44 -223
4032 -223 9 331 -251 116 303 -145 311 417 -136 -118 277 15 -58 326 178 -243 61 -98 -380 77 494
4053 494 -165 35 482 -120 -46 237 -104 -104 134 65 -433 180 101 -376 97 570 -7 -259 465 -24 -279 386
4075 386 225 -165 180 452 -146 -112 215 -282 -119 643 328 -282 420 72 -324 213 485 -138 140 218 42
4096 42 -36 243 240 -302 240 164 -365 -18 327 -157 17 484 72 -195 601 -156 -201 338 -21 -74 445 324
4118 324 74 191 434 -381 10 702 -46 -141 406 16 -261 32 228 -221 0 435 -50 -84 317 -113 -322
4139 -322 145 296 -169 278 278 -166 241 262 -296 -109 618 -143 -354 452 57 -395 187 -90 -184 70 243
4160 243 -354 -246 73 -288 -348 368 -74 -324 243 228 -533 -81 372 -355 -101 234 -356 -166 400 42 -461
4181 -461 -92 63 -318 -21 178 -296 -75 450 -383 -352 569 -16 -463 162 84 -606 -134 625 32 39 100 159
4203 159 -212 185 4 -205 109 75 -300 -183 204 -174 212 341 -255 -401 96 -164 -230 168 146 -347 -93
4224 -93 341 -388 -271 204 -209 -362 332 -241 -152 197 201 -288 90 82 -127 -76 149 -321 177 368 69 -277
4246 -277 381 212 -199 130 317 -474 -169 246 -290 -358 375 -295 -276 102 -105 -227 39 259 -465 -133 -56
4267 -56 -182 -20 261 -288 -304 188 -94 -183 10 -163 -368 44 79 -433 -247 64 -146 -136 210 -281 -17 95
4289 95 -25 -397 -48 74 -684 69 -17 -178 -601 -43 -344 -470 181 -40 -850 -372 -196 -172 -132 -5 -216
4310 -216 1 327 -56 -334 193 208 -554 257 211 -242 -22 234 -282 -481 372 -367 -284 88 152 -383 -145
4331 -145 319 -273 -14 442 -458 8 357 -292 -77 199 -112 -195 335 554 7 25 121 -239 44 408 -41
4352 -41 96 235 119 -127 458 428 -16 218 365 -330 -221 283 -91 -242 365 202 -284 286 424 -118 37
4373 37 284 -247 -243 176 213 -128 25 -140 -8 388 335 -477 212 499 -31 301 420 -367 -374 459 139 -6
4395 -6 -62 -18 -438 -146 274 -462 -358 273 -70 -625 116 -28 -514 -101 -16 -321 -346 -184 -720 -325 29 -163
4417 -163 -378 -49 -205 -479 -8 90 -148 -127 133 -125 -140 139 -478 -361 139 -176 -460 51 -129 -318 -43
4438 -43 66 -301 -58 289 -392 -84 185 -179 -696 518 -302 -335 -119 381 -290 -51 358 -27 16 293 17
4459 17 130 430 195 20 97 685 155 5 342 -3 -41 571 -126 -4 223 68 -260 266 663 -187 -355
4480 -355 258 100 79 433 -96 -355 441 200 -166 526 589 -180 147 424 146 92 696 -164 -26 545 188
4501 188 152 378 319 -297 227 433 -23 -110 429 10 -103 207 73 -202 170 133 -144 -274 419 -134 8
4522 8 341 -257 -309 271 -142 -302 17 -71 -284 143 118 -266 4 363 -3 -96 451 -6 -75 342 158 -135
4544 -135 -108 121 -113 -125 147 -329 -219 210 -247 -242 -13 89 -284 28 91 -363 22 355 -207 -217 129 -286
4566 -286 -160 200 266 -125 302 224 33 344 81 -53 -196 195 105 -311 241 156 -378 86 244 -521 -403
4587 -403 269 -154 -82 246 -497 -449 60 105 -481 -360 -130 -378 -431 15 -75 135 430 29 -178 193 89 -377
4609 -377 104 15 -295 341 352 -218 -174 302 -157 -445 -5 55 -3 129 129 -318 194 150 -401 -157 -147 -248 -231
4632 -231 556 -27 -399 -55 61 -162 -19 331 -182 -112 184 103 -210 352 -168 -283 -97 202 -37 151 129
4653 129 -393 0 -48 -365 11 74 -72 -638 205 -68 -288 -208 228 -599 -187 282 -144 -263 64 -10 -151
4674 -151 107 -70 -232 -57 -17 -44 -43 30 5 -104 202 163 -93 -60 89 -244 255 107 -502 -40 67 -219 -82
4697 -82 289 110 2 -198 -14 -248 86 165 -175 -125 126 -69 -357 475 -233 -44 265 -180 -147 294 292 -160
4719 -160 72 378 -285 -205 400 -79 -348 213 80 45 356 211 -244 -134 279 -282 81 466 -50 -341 469
4740 469 201 -78 83 40 -135 328 -11 16 -192 329 -1 56 182 -106 -75 181 63 -474 -19 373 -240
4761 -240 39 359 -115 2 311 -18 -148 44 -148 -110 -46 192 -148 -207 256 170 -175 351 -64 -364 151
4782 151 259 -185 74 301 4 -162 214 -179 -181 138 45 -601 108 72 -308 252 -30 -496 -149 499 -148
4803 -148 -209 261 -170 -160 121 231 31 117 97 -552 -43 82 -230 59 145 -23 -184 428 275 -265 171 324
4825 324 -171 12 209 157 199 407 175 -67 179 -61 -17 447 179 -194 285 511 58 -94 186 -191 -5
4846 -5 536 281 -295 390 154 -60 127 350 280 136 366 174 -172 339 -297 -169 394 287 -127 457 547
4867 547 39 -100 591 92 6 477 180 -70 336 416 -342 347 234 -129 -8 97 -11 -47 157 18 -102
4888 -102 134 187 -139 4 585 157 148 449 0 -274 391 -125 -376 162 91 -544 -8 -91 -469 -109 106 -281
4910 -281 -94 29 -154 -512 -13 57 -328 2 11 -616 -175 -15 -267 -389 316 -9 -281 204 -65 -152 -51
4931 -51 62 -247 -37 243 -255 -310 475 10 -586 222 230 -428 6 281 -74 -297 295 -498 -157 278 16
4952 16 -210 300 197 -154 365 -2 104 64 367 119 -102 157 -21 -72 287 188 -101 166 452 -130 113
4973 113 284 -363 -126 448 -224 -9 629 -102 -31 156 358 -208 32 111 -194 277 -53 80 -140 242 -25
4994 -25 -37 136 58 -337 14 85 57 179 2 193 67 406 43 14 324 40 -159 -6 -98 95 -209 350
5016 350 14 -275 -59 26 -313 156 152 -499 28 295 -415 -251 -210 -246 -16 42 -172 -474 -1 -194 -441 -52
5038 -52 6 -258 -197 13 -478 -198 212 -337 -452 470 -7 -392 236 117 -143 -166 162 -116 -85 260 -204 -63
5060 -63 168 -123 -538 -63 249 -382 -154 229 128 -168 326 224 -260 238 101 -94 114 99 -42 -47 74
5081 74 -32 -112 -59 -84 -289 147 310 -144 -62 390 -183 17 363 -362 -12 290 -49 -217 178 -111 -219 127
5103 127 220 -13 -148 105 -39 236 434 250 88 196 -128 78 236 510 -399 -171 210 -70 12 319 -357
5124 -357 -327 363 186 -52 61 76 -207 16 79 -349 -180 74 -81 -119 272 206 -326 122 43 -262 488 186
5146 186 -465 112 69 -69 -263 61 -53 -155 -104 -35 -354 -160 193 -20 -255 197 -145 -91 32 -39 -397 -25
5168 -25 -196 -593 -343 -113 -218 -150 74 -285 -370 55 -37 -310 115 -246 -448 139 17 -346 105 213 -259
5189 -259 -130 236 -98 -247 -14 -18 -251 118 137 -135 -371 373 -308 -395 -3 -91 -381 173 131 50 16 73 -236
5212 -236 -13 -38 -332 118 266 -242 -234 238 108 -218 191 225 -185 105 247 -339 -236 370 80 15 285 -94
5234 -94 140 280 26 18 -138 237 -77 -28 306 -292 -23 265 -41 85 322 313 -237 257 248 -102 -254 295 173
5257 173 55 461 54 -114 153 304 -203 349 156 217 -59 58 -180 -360 72 -116 -236 -61 -71 -196 3
5278 3 -8 -23 -119 58 93 -137 288 -352 -344 250 253 -112 43 76 -5 76 440 -319 -379 373 -85 -447 32 -19 -166
5303 -166 96 266 -214 -50 226 -140 -181 -151 35 -237 182 -41 -233 19 7 -43 20 -21 -301 -78 326 -143
5325 -143 170 258 100 -308 -205 57 -248 -139 95 -95 15 77 -252 -100 173 -79 -110 305 144 53 140 349
5347 349 25 82 -33 -101 -301 233 -78 -149 253 16 -196 143 637 -180 135 168 36 5 535 97 -160 183
5369 183 228 -101 328 241 -308 -45 173 27 -13 369 58 -81 180 311 26 120 187 -187 -177 58 -121 -178
5391 -178 198 195 -291 -78 203 -189 191 155 -210 54 157 60 -107 190 -91 -288 -12 -28 96 148 172 -213
5413 -213 184 201 -153 -292 -7 162 -107 -67 -11 -322 39 83 -185 366 311 -591 -305 168 -152 -450 89 -44
5435 -44 19 156 -27 -330 -240 -93 -236 -3 283 -263 -268 92 -110 5 102 -109 -297 0 142 -268 -87 284
5457 284 -222 -136 135 -207 -268 -134 116 -174 -315 114 -152 79 -95 -43 -261 328 -70 -438 214 145 -158
5478 -158 -23 224 -274 34 423 -98 26 2 165 -9 369 -62 -92 -142 -241 -71 -151 297 -136 14 69 -122
5500 -122 -255 1 -35 -652 -68 181 7 -11 146 -320 -208 -131 -238 -210 243 134 -310 -2 270 -171 332
5521 332 88 -66 261 96 35 -90 392 -42 -10 -43 -81 -50 -390 215 35 30 -73 231 -186 -115 -153 -290 319
5544 319 158 -236 146 200 -293 -282 134 -128 -184 -3 -65 -154 120 -32 -313 -15 404 -302 -247 225 -254 2
5566 2 100 129 -194 81 -80 -135 22 158 -249 106 196 -12 -207 275 -403 -264 188 151 -234 85 84 -170 -76
5589 -76 369 -65 -224 170 -283 -252 -131 81 -334 405 235 -177 74 76 -26 -125 199 43 -389 14 -120 -121
5611 -121 285 352 -186 77 -43 171 56 420 69 -226 406 441 -151 -59 69 -232 -85 -85 37 -115 129 -191
5633 -191 -24 -90 -39 -237 47 56 -285 -96 94 -182 117 -122 -61 389 307 -91 -19 -207 133 42 -35 394 -165
5656 -165 -444 81 -181 -72 105 138 -194 311 -105 -540 -89 250 -231 -29 323 -115 -301 -6 140 -208
5676 -208 -57 -117 24 -146 155 -278 -132 289 -45 -136 82 -257 -187 -44 91 -166 139 51 117 -31 268 -86
5698 -86 -454 343 -258 -345 137 210 -233 106 335 107 103 131 -121 54 109 -146 -47 150 68 -140 120 48 -326
5721 -326 -133 -60 -31 21 207 -69 -35 306 37 -234 -38 209 -132 84 113 -210 225 504 -88 -214 29 268
5743 268 -63 147 175 -149 180 259 -98 -30 288 -148 15 316 62 -58 12 107 -151 -5 273 -455 -231 346
5765 346 -53 -62 338 -54 -132 -37 91 -174 -350 334 330 -77 33 -157 -145 56 -2 -263 -1 276 -198 144 253
5788 253 -14 -118 166 -80 -29 214 -53 152 313 131 -185 77 319 -64 105 -88 184 -445 252 -235
5808 -235 -422 61 287 -302 -17 242 -471 186 351 -3 -112 271 -111 -456 166 -86 -279 91 0 -26 -179
5829 -179 182 -149 -240 -34 89 -646 126 154 -190 -37 94 -74 -104 644 -58 -91 384 166 196 256 -171 -15
5851 -15 152 58 -165 -103 240 89 -23 482 -18 -195 156 212 -152 90 161 -313 -18 279 -218 67 389 -205
5873 -205 -94 202 188 -125 31 -54 -121 -1 14 -81 -283 128 -205 -99 131 51 41 264 -123 -53 69 -21 117
5896 117 -350 132 -131 22 80 107 12 86 260 -339 -138 -20 2 35 -97 34 -228 -21 42 -52 152 84 -453
5919 -453 238 101 -283 -279 433 187 -302 123 53 -290 69 -106 -25 -339 259 -327 -334 -45 -348 93 55 -296
5941 -296 -185 3 -177 -4 -102 -110 -84 59 279 -277 -82 -48 163 -272 -83 -43 -238 118 3 -160 -148 192
5963 192 -100 -81 576 -93 -263 60 -153 -306 68 459 -187 -74 99 60 -203 141 -327 17 239 45 -194
5984 -194 30 252 -279 -82 341 -157 -118 -5 -66 -229 76 150 -63 150 25 -121 -98 22 -147 -134 50 338
6006 338 -189 317 76 4 -124 -14 -365 -125 198 -244 125 208 154 -282 72 56 -329 -68 181 -350 3
6027 3 183 -93 105 362 -181 -223 356 342 -137 141 95 -88 23 54 7 26 104 -334 67 -103 -58 -190 211
6050 211 87 -253 -213 13 -291 -56 -15 -159 -179 252 -160 -141 209 80 -280 -315 -21 -525 -17 -61 -170 -99
6072 -99 40 191 -675 248 31 -586 176 -50 -41 1 119 -138 59 -32 18 -157 -51 -276 -424 -32 -151 -17
6094 -17 104 66 109 -39 204 -246 -111 120 -164 -133 186 87 -287 -371 20 184 259 387 -56 -247 98 88 -155
6117 -155 -232 63 -112 -258 176 -77 -152 58 79 87 151 -104 -224 -144 300 -231 85 277 -239 -53 159 -233
6139 -233 -214 138 154 -128 207 -109 14 7 149 -193 98 169 -146 64 80 -38 -167 383 -9 -157 35 -8
6161 -8 126 -157 -2 -83 35 385 -37 90 159 -179 48 96 356 -87 142 -29 -232 -377 197 58 -127 324
6183 324 179 -242 -8 57 -102 -5 27 -64 -236 112 227 -44 32 77 -191 61 161 -140 -28 28 -526 -46
6205 -46 131 -131 -48 285 102 -195 37 206 117 215 71 -55 -211 18 -98 -208 -198 70 -51 -4 235 -264
6227 -264 137 -64 125 -152 176 208 6 60 44 54 -94 332 -275 146 271 -157 88 317 -267 -394 282
6248 282 -50 -467 119 74 102 -52 28 -101 396 352 -151 -144 447 9 -298 -16 293 -7 -33 130 -166 58
6270 58 393 -82 -348 318 29 -190 485 68 -73 121 8 197 429 344 -40 58 25 23 -312 211 -76 -405
6292 -405 -161 492 -186 365 79 -138 17 42 -35 -216 113 155 -50 269 -4 -222 13 69 -99 -225 20
6313 20 -196 -175 197 223 -56 13 45 -32 -285 184 -156 94 124 -268 -175 207 -24 -226 66 85 -307 -366 172
6336 172 -132 -369 137 -250 -151 90 -125 -282 -87 167 28 81 -74 20 151 173 30 -225 -91 -94 -45 56
6358 56 131 -382 219 220 -150 -40 247 -7 -148 100 -68 -344 10 26 8 -160 161 -47 -367 207 -176 -285
6380 -285 138 203 -291 -19 146 0 170 148 -199 19 345 -47 -40 444 33 -49 302 258 130 269 -169 -149
6402 -149 193 205 28 -146 60 -79 -190 -92 27 -178 102 -110 -124 -101 300 -14 -287 87 -44 28 123 260
6424 260 -297 63 79 61 176 96 47 115 180 -66 36 86 -110 130 -64 166 -86 -13 131 -96 -2 62 164
6447 164 -24 99 235 -64 -12 154 -178 113 -222 -19 -66 -3 -2 -191 246 -123 -297 72 321 -13 12 -43
6469 -43 17 -112 -279 65 -147 -216 -57 18 0 84 -151 308 221 -86 37 -39 -119 -204 64 -269 -406 -99 -128 -25
6493 -25 180 40 159 -113 21 261 210 43 150 -70 10 34 -106 50 190 226 96 320 -109 -92 256 -101
6515 -101 -240 17 -136 -285 142 51 -293 50 -17 -120 -330 -154 120 -250 252 35 -43 -55 118 -146 -142 223
6537 223 -183 -223 220 108 -283 122 104 -440 6 -53 -302 -301 -123 -118 -344 25 -227 -226 49 143 -278 -88 108
6560 108 -579 73 -115 -270 45 -262 -210 -219 153 55 4 38 -34 -152 -87 40 -256 -102 219 9 55 302 93
6583 93 -25 83 346 -261 -139 261 -161 -208 167 -114 -199 202 -133 -96 59 264 -289 32 282 -246 143
6604 143 209 73 141 153 -292 -268 259 40 -172 237 44 -244 78 262 205 -200 110 -185 -345 176 264 -122
6626 -122 218 60 12 38 309 176 -38 314 120 -73 118 296 5 9 63 139 -79 -116 -107 -7 50 -183 87
6649 87 58 121 -80 3 121 -40 -278 70 91 -322 248 -25 80 185 114 -98 164 -36 -79 -43 -108 -176 -273 371
6673 371 -54 231 85 271 112 8 10 -104 32 340 -264 -78 -169 121 -314 -148 -96 -199 -129 -272 -531 -90
6695 -90 -57 151 53 186 119 -275 -88 -113 -386 24 237 -56 13 -45 -173 -295 78 -35 86 6 50 -67 -61 142
6719 142 -189 -55 13 -41 -227 -199 -167 113 134 -50 -327 -137 242 33 133 109 -377 -88 -192 -41 115 -9
6741 -9 88 -68 87 -106 131 102 -209 78 19 -58 -46 74 98 306 53 184 -143 -219 433 308 38 84 89 -113
6765 -113 -111 -76 -113 -125 283 -74 -400 -19 -147 26 -20 196 68 -159 18 221 -25 382 -16 56 17 319 -161
6788 -161 93 66 -21 -286 -135 24 -60 89 -311 -250 -69 -51 -78 170 -20 -45 -210 -52 25 31 52 117 -308 -49
6812 -49 -111 133 243 -52 -68 -30 206 -151 -172 50 170 71 134 224 -498 101 270 -245 -3 -277 -160 17 -194
6835 -194 135 -302 -202 87 10 -14 95 14 147 81 -323 -58 66 31 -190 56 96 -13 174 16 -194 208
6857 208 303 176 -133 -51 21 -333 -333 -88 -106 -48 33 -120 119 -5 12 43 454 -354 -111 27 80 -87 152 178
6881 178 -80 44 158 39 128 -46 -133 346 191 202 -54 204 74 142 -78 338 -95 322 209 169 -134 -96
6903 -96 149 -122 166 177 149 -38 188 -173 -76 10 -76 -177 104 -15 25 205 54 170 -20 -58 -340 111 103
6926 103 -173 -127 130 109 -67 350 24 -46 75 156 -66 -70 77 89 182 -141 223 -192 -209 246 -204 140 -458
6949 -458 -334 -85 98 -122 -40 -13 31 130 -29 -66 -77 -34 61 -2 -295 326 -176 -104 161 66 -108 83 151 -2
6973 -2 176 137 -277 -12 150 -137 103 60 198 180 133 -263 -291 -19 -136 -295 -28 179 -92 -138 -53 -133 26
6996 26 46 -161 -106 -206 22 -282 -112 233 25 -83 363 336 -6 201 36 -109 -115 113 -271 -117 191 86
7018 86 67 55 24 -206 -48 16 -72 68 182 170 89 166 -63 93 96 55 -343 76 47 -39 190 109 -199 47 398
7043 398 84 -137 220 -54 -177 230 84 -478 340 296 27 -244 212 -76 -168 97 34 -42 -29 -145 -139 115
7065 115 -123 72 -149 84 -90 -181 -127 -39 -101 5 367 -42 429 -117 -111 246 0 -302 -134 113 -31 -238
7087 -238 -32 -111 -42 -119 -166 -89 47 -210 -162 -6 125 -97 -52 87 -106 -185 88 159 -62 91 2 -201 90
7110 90 283 -78 23 52 48 -182 101 -33 4 237 70 -152 58 87 -187 88 165 -13 109 -93 116 -57
7132 -57 104 170 33 -18 -26 -163 -30 67 150 60 157 59 -219 126 -8 -20 150 68 -19 39 132 -274 40 -118 13
7157 13 -5 319 23 -36 -92 58 47 -177 533 -221 111 275 60 -107 -27 -135 -96 -77 266 -249 -148 319 78
7180 78 43 89 217 95 260 7 -233 -125 49 -333 151 -65 -84 177 308 16 -50 67 51 -400 95 27
7202 27 -179 101 -85 -32 14 217 -73 -317 -114 11 -319 305 365 -186 -34 -95 -75 103 210 8 94 43 88
7225 88 -126 72 217 -204 16 64 -212 -362 9 108 -286 97 114 4 227 -97 -72 272 -66 -200 -283 274
7247 274 -294 53 214 142 -171 -49 27 -244 -76 -253 4 112 -28 30 -277 189 -227 -230 132 -183 -63 -66
7269 -66 -206 -188 27 -186 -204 -119 142 -4 -238 32 -61 -200 33 253 -66 -115 70 -119 -123 235 -80 41 208
7292 208 168 -117 -53 77 -189 22 1 142 -108 200 105 -48 295 -326 -294 152 385 -294 100 206 55 118
7314 118 -14 -219 -60 -106 -247 42 51 124 202 5 5 -161 -45 250 -59 133 210 -226 -152 -55 -152 -20 -214 -267
7338 -267 -67 -341 -277 170 45 124 31 -246 480 -19 14 151 161 -27 -3 -32 -322 90 203 -10 -193 97
7360 97 68 8 31 13 -183 188 83 -271 -290 111 29 170 300 23 -193 110 118 99 -86 16 -97 -348 109
7383 109 227 32 -147 299 -24 -136 128 -8 292 283 -94 -155 226 -62 9 7 130 -201 -198 176 -69 1 21
7406 21 -220 64 242 19 -90 221 369 147 62 -30 -171 -142 14 -101 35 -108 99 -185 93 -62 -184
7427 -184 -47 214 -397 111 100 30 -34 277 -120 8 109 -20 -214 166 13 164 136 43 29 13 77 -125 38
7450 38 75 212 -387 245 -56 -257 -21 133 -208 -215 -91 117 79 107 75 318 102 -168 -54 33 290 -109 155
7473 155 210 50 -98 158 -198 -137 503 -94 -180 203 84 -268 35 63 -241 -46 87 29 -91 115 95 249
7495 249 -35 151 -314 172 127 -157 116 394 221 -125 485 84 -130 245 -150 -31 189 35 -280 105
7515 105 -41 -98 69 60 -100 114 -194 -119 -142 -253 425 157 218 -47 -257 -255 -50 -102 -151 249 253 -404 144 27
7539 27 -222 151 154 69 22 464 -178 36 -31 185 -48 -99 -76 0 114 413 -103 461 251 -139 -75 -5 -271 -39
7563 -39 -46 183 -250 47 38 -187 -227 -155 123 -196 178 207 -42 -76 -58 260 15 -8 -101 29 280 -281 -89 -187
7587 -187 -211 92 119 -156 -87 -26 47 -75 37 120 -269 -128 -210 -151 61 68 189 -313 10 139 42 -185 2 -31
7611 -31 -17 -242 -45 -126 141 109 -115 -39 174 -216 114 -54 -47 -101 166 -58 -173 180 -36 -6 -145 201 -138
7634 -138 -27 107 -318 -92 159 298 -120 116 -147 -106 113 193 105 -124 -106 -163 11 48 351 -257 -208 51
7656 51 10 -22 111 -164 -183 172 158 5 392 34 -225 195 -71 -126 -37 61 -170 164 61 -97 -181 244 -105
7679 -105 -177 -204 50 -272 -239 153 -257 25 -60 -97 42 -68 83 208 -86 56 -270 -143 -55 73 -133 86
7701 86 -484 73 -277 -294 -205 68 -153 -221 -217 -31 30 135 -82 102 -177 -201 58 231 406 -70 -170 -50 95
7724 95 -204 186 74 144 -199 182 3 19 210 -48 77 -33 182 -45 -86 272 -173 -190 140 366 -122 -101
7746 -101 -147 -176 -80 -6 -99 284 181 -69 215 210 -147 -75 357 -55 -309 273 40 -2 194 129 242 -33 399
7769 399 138 126 242 61 -42 153 79 85 169 350 -19 -304 300 400 260 5 -23 -49 142 64 238 288 154
7792 154 39 246 21 108 -159 282 22 -163 -3 231 10 -39 1 -90 79 240 -15 62 181 99 172 -6
7814 -6 124 -13 186 138 -39 -170 34 -1 -168 67 -159 -26 44 100 -285 273 290 88 -143 98 83 -313 -225
7837 -225 63 -95 -66 -127 -349 -100 241 27 230 305 -77 139 241 -70 -135 -100 -174 32 -157 64 16 -46 -176
7860 -176 -33 -141 -78 -104 196 -136 -151 11 9 -11 -565 -97 33 -283 70 144 46 97 132 299 -248 -194 156 -179
7884 -179 40 -9 -102 8 337 15 101 217 -3 -330 -189 97 98 91 192 -195 -60 40 -51 222 72 -28 -128
7907 -128 -17 76 22 -24 224 -20 -238 147 -23 -273 -278 63 -149 8 239 -363 -11 83 -93 101 28 69 -35
7930 -35 -35 30 75 20 -24 -4 101 71 -12 55 -149 -92 -69 80 59 140 -68 -178 -617 183 63 96 -93 404 -362
7955 -362 -5 -252 26 13 156 -140 45 119 -251 -193 -244 29 -219 106 53 305 -9 -102 -102 10 -87 40 -285
7978 -285 96 -159 -144 111 254 -39 63 188 129 59 -208 30 158 -22 -162 -176 -71 84 -93 -74 -79 -50 242
8001 242 5 24 51 -31 92 -45 -253 121 -252 -82 189 108 152 301 197 -35 14 -71 -300 -300 -112 10 3 377
8025 377 -240 23 99 76 -2 -364 -102 194 222 -116 10 -3 255 -17 -49 18 55 210 -191 186 -242 191 92
8048 92 -210 -96 63 219 5 132 -1 -105 161 182 -28 -55 49 -101 31 19 -136 -275 224 29 56 256
8070 256 14 -146 -23 -126 -223 -121 43 238 -174 -289 -98 -126 46 339 -270 51 -34 108 -16 -158 63
8091 63 72 96 16 273 117 22 -439 7 383 -157 -89 150 91 -88 274 -85 -165 -129 77 -290 50 -54 -26 108
8115 108 232 -208 285 41 29 90 115 36 -58 24 -11 86 -41 50 144 90 172 28 48 174 -157 -347 -11 263
8139 263 63 94 -49 -106 -31 -318 3 123 -202 90 -34 85 184 -59 324 84 -115 148 -64 -77 -157 260
8161 260 -123 25 229 140 -19 -40 281 -239 -49 2 171 -156 231 37 -114 103 -182 33 -18 5 -269 -262
8183 -262 -53 -74 -167 -343 -160 51 -91 -422
8191d22
##END NTUPLES=NMR FID
##END=
