##TITLE=1H_EC-3189(26)
 CDCl3, 8 sc, 
 29.4.2019
##JCAMPDX= 6.0         $$ Bruker NMR JCAMP-DX V2.0
##DATA TYPE= NMR FID
##DATA CLASS= NTUPLES
##ORIGIN= UXNMR, Bruker Analytische Messtechnik GmbH
##OWNER= root
$$ XWIN-NMR		Version 3.5
$$ Mon Apr 29 14:01:37 2019 Russian Standard Time (UT+4h)  she@DPX200
##.OBSERVE FREQUENCY= 200.1315
##.OBSERVE NUCLEUS= ^1H
##.DELAY= (6, 6)
##.ACQUISITION MODE= SIMULTANEOUS
##.ACQUISITION SCHEME= undefined
##.AVERAGES= 8
##.DIGITISER RES= 18
##SPECTROMETER/DATA SYSTEM= spect
##.PULSE SEQUENCE= zg30
##.SOLVENT NAME= CDCl3
##.SHIFT REFERENCE= (INTERNAL, CDCl3, 0, 15.7039)
##AUDIT TRAIL= $$ (NUMBER, WHEN, WHO, WHERE, WHAT)
$$ ##TITLE= Audit trail, XWIN-NMR		Version 3.5
$$ ##JCAMPDX= 5.01
$$ ##ORIGIN= Bruker BioSpin GmbH
$$ ##OWNER= she
$$ F:/spectra/data/she/nmr/H-F/1/audita.txt
$$ ##AUDIT TRAIL=  $$ (NUMBER, WHEN, WHO, WHERE, WHAT)
(   1,<2019-04-29 14:00:29.53 +0400>,<she>,<DPX200>,
      <created by zg, POWCHK disabled, PULCHK disabled
       configuration hash MD5:
       00 E9 B6 7A A2 85 ED C7 34 08 36 98 17 FE 4E 26
       data hash MD5: 16K
       5F DA 09 40 1F 10 53 C9 C5 F9 84 2E 0B 03 AA 06>)
$$ ##END=
$$ 
$$ hash MD5
$$ D2 3B 22 95 0F BC 38 77 DA 2D 23 3C D7 AC 00 68
##$RELAX= 
##$RELAX= 
##$RELAX= 
##$RELAX= 
##$RELAX= 
##$RELAX= 
$$ Bruker specific parameters
$$ --------------------------
##$DU= <F:/spectra>
##$EXPNO= 1
##$NAME= <H-F>
##$PROCNO= 1
##$TYPE= <nmr>
##$USER= <she>
##$AMP= (0..31)
100 100 100 100 100 100 100 100 100 100 100 100 100 100 100 100 100 100 
100 100 100 100 100 100 100 100 100 100 100 100 100 100 
##$AQSEQ= 0
##$AQ_mod= 1
##$AUNM= <au_zg>
##$AUTOPOS= <>
##$BF1= 200.13
##$BF2= 200.13
##$BF3= 200.13
##$BF4= 200.13
##$BF5= 200.13
##$BF6= 200.13
##$BF7= 200.13
##$BF8= 200.13
##$BYTORDA= 1
##$CFDGTYP= 0
##$CFRGTYP= 5
##$CHEMSTR= <none>
##$CNST= (0..31)
1 1 145 1 1 1 1 1 1 1 1 1 1 1 1 1 1 1 1 1 1 1 1 1 1 1 1 1 1 1 1 1 
##$CPDPRG= <>
##$CPDPRG1= <>
##$CPDPRG2= <>
##$CPDPRG3= <>
##$CPDPRG4= <mlev>
##$CPDPRG5= <mlev>
##$CPDPRG6= <mlev>
##$CPDPRG7= <mlev>
##$CPDPRG8= <mlev>
##$CPDPRGB= <>
##$CPDPRGT= <>
##$D= (0..31)
0 1.2 0 0 0 0 0 0 0 0 0 0.03 0 0 0 0 0 0 0 0 0 0 0 0 0 0 0 0 0 0 0 0 
##$DATE= 1556532029
##$DBL= (0..7)
120 120 120 120 120 120 120 120 
##$DBP= (0..7)
150 150 150 150 150 150 150 150 
##$DBP07= 0
##$DBPNAM0= <>
##$DBPNAM1= <>
##$DBPNAM2= <>
##$DBPNAM3= <>
##$DBPNAM4= <>
##$DBPNAM5= <>
##$DBPNAM6= <>
##$DBPNAM7= <>
##$DBPOAL= (0..7)
0.5 0.5 0.5 0.5 0.5 0.5 0.5 0.5 
##$DBPOFFS= (0..7)
0 0 0 0 0 0 0 0 
##$DE= 6
##$DECBNUC= <off>
##$DECIM= 24
##$DECNUC= <off>
##$DECSTAT= 4
##$DIGMOD= 1
##$DIGTYP= 9
##$DL= (0..7)
0 120 120 120 120 120 120 120 
##$DP= (0..7)
150 150 150 150 150 150 150 150 
##$DP07= 0
##$DPNAME0= <>
##$DPNAME1= <>
##$DPNAME2= <>
##$DPNAME3= <>
##$DPNAME4= <>
##$DPNAME5= <>
##$DPNAME6= <>
##$DPNAME7= <>
##$DPOAL= (0..7)
0.5 0.5 0.5 0.5 0.5 0.5 0.5 0.5 
##$DPOFFS= (0..7)
0 0 0 0 0 0 0 0 
##$DQDMODE= 0
##$DR= 18
##$DS= 0
##$DSLIST= <SSSSSSSSSSSSSSS>
##$DSPFIRM= 0
$$ [...]
##$SUBNAM2= <"">
##$SUBNAM3= <"">
##$SUBNAM4= <"">
##$SUBNAM5= <"">
##$SUBNAM6= <"">
##$SUBNAM7= <"">
##$SUBNAM8= <"">
##$SUBNAM9= <"">
##$SW= 24.9337058887773
##$SWIBOX= (0..15)
0 0 2 0 0 0 0 0 0 0 0 0 0 0 0 0 
##$SW_h= 4990.01996007984
##$TD= 16384
##$TD0= 1
##$TE= 0
##$TE2= 300
##$TE3= 300
##$TEG= 300
##$TL= (0..7)
0 120 120 120 120 120 120 120 
##$TP= (0..7)
150 150 150 150 150 150 150 150 
##$TP07= 0
##$TPNAME0= <>
##$TPNAME1= <>
##$TPNAME2= <>
##$TPNAME3= <>
##$TPNAME4= <>
##$TPNAME5= <>
##$TPNAME6= <>
##$TPNAME7= <>
##$TPOAL= (0..7)
0.5 0.5 0.5 0.5 0.5 0.5 0.5 0.5 
##$TPOFFS= (0..7)
0 0 0 0 0 0 0 0 
##$TUNHIN= 0
##$TUNHOUT= 0
##$TUNXOUT= 0
##$USERA1= <user>
##$USERA2= <user>
##$USERA3= <user>
##$USERA4= <user>
##$USERA5= <user>
##$V9= 5
##$VALIST= <valist>
##$VCLIST= <CCCCCCCCCCCCCCC>
##$VD= 0
##$VDLIST= <DDDDDDDDDDDDDDD>
##$VPLIST= <PPPPPPPPPPPPPPP>
##$VTLIST= <TTTTTTTTTTTTTTT>
##$WBST= 1024
##$WBSW= 4
##$XGAIN= (0..3)
0 0 0 0 
##$XL= 0
##$YL= 0
##$YMAX_a= 106541
##$YMIN_a= -96120
##$ZGOPTNS= <>
##$ZL1= 120
##$ZL2= 120
##$ZL3= 120
##$ZL4= 120
##$ABSF1= 10
##$ABSF2= 0
##$ABSG= 5
##$ABSL= 3
##$ALPHA= 0
##$AQORDER= 0
##$ASSFAC= 0
##$ASSFACI= 0
##$ASSFACX= 0
##$ASSWID= 0
##$AUNMP= <proc_1d>
##$AZFE= 0.1
##$AZFW= 0.1
##$BCFW= 1
##$BC_mod= 2
##$BYTORDP= 1
##$COROFFS= 0
##$CY= 11.3945322036743
##$DATMOD= 1
##$DC= 2
##$DFILT= <>
##$DTYPP= 0
##$F1P= 18.9103706918063
##$F2P= -1.10871071338519
##$FCOR= 0.5
##$FTSIZE= 0
##$FT_mod= 4
##$GAMMA= 1
##$GB= 0.15
##$INTBC= 1
##$INTSCL= 1
##$ISEN= 128
##$LB= 0.24
##$LEV0= 0
##$LPBIN= 0
##$MAXI= 10000
##$MC2= 0
##$MEAN= 0
##$ME_mod= 0
##$MI= 1.114404
##$NCOEF= 0
##$NC_proc= 0
##$NLEV= 6
##$NOISF1= 3.799351
##$NOISF2= 2.8
##$NSP= 1
##$NTH_PI= 0
##$NZP= 0
##$OFFSET= 15.70392
##$PC= 1
##$PHC0= -8857.473
##$PHC1= 23.20026
##$PH_mod= 1
##$PKNL= yes
##$PPARMOD= 0
##$PSCAL= 0
##$PSIGN= 0
##$REVERSE= no
##$SF= 200.130013532006
##$SI= 16384
##$SIGF1= 3
##$SIGF2= 2
##$SINO= 400
##$SIOLD= 16384
##$SREGLST= <1H.CDCl3>
##$SSB= 0
##$STSI= 0
##$STSR= 0
##$SW_p= 3612.71676300578
##$SYMM= 0
##$S_DEV= 0
##$TDeff= 0
##$TDoff= 0
##$TI= <>
##$TILT= no
##$TM1= 0
##$TM2= 0
##$TOPLEV= 0
##$USERP1= <user>
##$USERP2= <user>
##$USERP3= <user>
##$USERP4= <user>
##$USERP5= <user>
##$WDW= 1
##$XDIM= 8192
##$YMAX_p= 0
##$YMIN_p= 0
$$ End of Bruker specific parameters
$$ ---------------------------------
##NTUPLES= NMR FID
##VAR_NAME=  TIME,          FID/REAL,        FID/IMAG
##SYMBOL=    X,             R,               I
##VAR_TYPE=  INDEPENDENT,   DEPENDENT,       DEPENDENT
##VAR_FORM=  AFFN,          ASDF,            ASDF
##VAR_DIM=   8192,          8192,            8192
##UNITS=     SECONDS,       ARBITRARY UNITS, ARBITRARY UNITS
##FACTOR=    0.0002004,     1,               1
##FIRST=     0,             0,               0
##LAST=      1.6414764,     0,               0
##MIN=       0,             -96120,          0
##MAX=       1.6414764,     106541,          0
$$ Real data points
##PAGE= N=1
##DATA TABLE= (X++(R..R)), XYDATA
0@%%%%%%%%Qj6J6j6J6k4L2l4M2n3O1p2Q8j03J18j36J55j78K05k31K61k97L36l78
$$ 0 0 0 0 0 0 0 0 0 8 -8 8 -8 8 -16 16 -18 24 -29 32 -40 48 -55 63 -73 82 -96 109 -122 139 -158 178 -200
32b00M25m74N29n91O56p30Q11q99R98j106J224j355J501j664J847k056K294k567
$$ -200 225 -249 280 -311 345 -385 426 -473 525 -581 643 -712 789 -875 972 -1084 1210 -1357
50a357K889l271L735m314N056o051P467r658J3537k2521Q5736L5293p5241J6484
$$ -1357 1532 -1739 1996 -2318 2738 -3313 4154 -5504 8033 -14488 71248 106541 31300 47784
64D7784P122J7318L534J508k1070m182j0174j4792r622J0899j03L503K117k0186
$$ 47784 54906 72224 75758 77266 56196 52014 41840 27048 17426 28325 28222 31725 33842 13656
78A3656l5983J082K1110N694n517j995j4806j1888P415M546r609N570J1387m438
$$ 13656 -22327 -21245 -135 5559 42 -1953 -16759 -28647 -21232 -16686 -26295 -20725 -9338 -13776
92a3776p394K398p533n419J5624J3019o792l131J381r812j194J5992K727q746
$$ -13776 -21170 -18772 -26305 -31724 -16100 -3081 -9873 -13004 -11623 -21435 -22629 -6637 -3910 -12656
106a2656N231M540j0910l435O679k820n03R499k437j1221L008J706r885L498J3238
$$ -12656 -7425 -2885 -13795 -17230 -10551 -13371 -13874 -4375 -6812 -18033 -15025 -13319 -23204 -19706 -6468
121f468o218r818P565K251j1198L119Q913l273o82O980m012n351Q444L51n949
$$ -6468 -12686 -22504 -14939 -12688 -23886 -20767 -11854 -15127 -15809 -8829 -12841 -18192 -9748 -9397 -15346
136a5346Q261Q680q869j979R755l703o711J0363N057q346K136O725o513l584Q436
$$ -15346 -7085 1595 -7274 -9253 502 -3201 -9912 451 5508 -2838 -702 6023 -490 -4074 4362
151D362k157n514P481K771r831J038O386p173k733J0725j469q760M891M138q948
$$ 4362 2205 -3309 4172 6943 -2888 -1850 4536 -2637 -5370 5355 3886 -4874 17 4155 -4793
166d793Q99Q292m236k890Q358j450q346N099M146o358L507Q871o804o221Q779
$$ -4793 -3894 4398 162 -2728 5630 4180 -4166 933 5079 -1279 2228 11099 4295 -1926 6853
181F853P80q156M701O797p058j836O720m249n947O456J143o270M470K892r665
$$ 6853 7633 -523 4178 10975 3917 2081 8801 4552 -1395 5061 6204 -66 4404 7296 -2369
196b369j199Q305l830o667P728J290r661K529O291p544l123Q398j671n365M657
$$ -2369 -3568 4737 907 -5760 1968 3258 -6403 -3874 2417 -5127 -8250 148 -1523 -6888 -2231
211b231Q71p385L077O637o201j810P856k549p312O585L177q523K010Q258n101
$$ -2231 -1360 -8745 -5668 969 -5232 -7042 814 -1735 -9047 -2462 715 -7808 -5798 2460 -2641
226b641m693O321j599o348N865L362p607J352O381o552l905P248o21p615N842
$$ -2641 -7334 -1013 -2612 -8960 -3095 267 -7340 -5988 393 -6159 -10064 -2816 -3437 -11052 -5210
241e210N670q931j537P192l601m033O921J063o796L830M157o894M25P309l759
$$ -5210 460 -8471 -10008 -2816 -6417 -10450 -3529 -2466 -9262 -5432 -1275 -8169 -7744 -435 -4194
256d194l838Q377O95q827L451O470n881p81Q209k947o074N831J963o492K581N526
$$ -4194 -8032 345 1040 -7787 -4336 2134 -3747 -4528 3681 734 -5340 491 2454 -4038 -1457 4069
272D069n371p20P247m410o156O581L147o523K240N846o768l011P903n96o367N230
$$ 4069 -1302 -2022 5225 815 -5341 1240 4387 -2136 104 5950 -818 -3829 4074 3478 -2889 2341
288B341L439o334J233N393n447k277Q531o71n950M696K732q115J988Q410m324
$$ 2341 5780 -554 679 6072 625 -1652 6879 6208 258 4954 7686 -429 1559 9969 5645
303E645m296O710L7o323M013L155o172O80P545m278m478N223l74o671N163N002
$$ 5645 1349 8059 8096 1773 5786 8941 2769 3449 10994 6716 2238 7461 7087 416 5579 10581
319A0581o914k063P321m055m744O009J062o309K933M850o713k175O028k548l922
$$ 10581 3667 1604 8925 4870 126 6135 7197 888 3821 8671 1958 -217 5811 3263 -659
334f59O267Q79p804K067N736o405j973P399k165n718M694K170p093Q89N478m206
$$ -659 5608 6487 -1317 750 6486 81 -1892 5507 3342 -2376 2318 4488 -2605 -1716 3762 -444
350d44k285O066k578o386N187K452o547J371O117n452l604N803l81o662M276L653
$$ -444 -2729 3337 759 -5627 -440 2012 -4535 -3164 2953 -2499 -6103 -300 -681 -7343 -3067 586
366E86n845J66M916m282l693O273N8n778L993L295p330k16P222l847m098O369
$$ 586 -5259 -5093 -177 -4459 -8152 -1879 -1821 -7599 -3606 -311 -7641 -7857 -635 -4482 -8580 -2211
382b211Q22o848K917M485n727q83O516k218m315N373K56o662L373N544n356q25
$$ -2211 -1389 -8237 -5320 -835 -6562 -7445 -929 -3147 -7462 -2089 -1833 -8495 -5122 422 -4934 -5759
398e759N995k147n733N696K484n913J865N703m234k359N494j600m544N430K976
$$ -5759 236 -1911 -7644 -1948 536 -5377 -3512 2191 -2043 -4402 1092 -508 -5052 378 3354
413C354o061J732M902n028j891P249q45n656M383L426n903J59N512l013k568N960
$$ 3354 -2707 -975 3927 -1101 -2992 4257 3412 -2244 2139 5565 -338 -179 5333 2320 -248 5712
429E712N23o044L210K967n548J412O162l830l862N391N51n914L486L878n332l54
$$ 5712 6235 191 3401 6368 820 2232 8394 4564 702 6093 6644 730 4216 8094 2762 2408
445B408N713k792m699M929J254n263K964L423n851q77N796k206m265M746J091
$$ 2408 8121 5329 630 5559 6813 1550 4514 7937 2086 1209 7005 4799 534 5280 6371
460F371o304J739M991n202k514N531r58m475L868R36o273J572N070m677j960M775
$$ 6371 67 1806 6797 1595 -919 4612 3654 -821 3047 3983 -2290 -718 4352 -325 -2285 2490
476B490j715n337M807J875o712R04N241l461l307M450j051n053M048K931n699
$$ 2490 775 -4562 245 2120 -4592 -3688 1553 -1908 -5215 -765 -1816 -6869 -2821 110 -5589
491e589K3M825m035k458N525p83n510L257L734n499r47N012k634l087N121M74
$$ -5589 -5566 -741 -4776 -7234 -1709 -2492 -8002 -4745 -1011 -6510 -7457 -2445 -5079 -8166 -3045 -2571
507b571n688K450L407m317m51M972k528l967N694P67n837K244M467m155p99N289
$$ -2571 -8259 -5809 -2402 -6719 -7170 -2198 -4726 -8693 -2999 -2232 -8069 -5825 -1358 -5513 -6312 -1023
523a023j735m368M673J812m746J837M124l708r14N145j811l887N042K058n270
$$ -1023 -2758 -7126 -2453 -641 -5387 -3550 574 -3134 -4048 1097 -714 -4601 441 2499 -2771
538b771J342N277m233k407N942n45m236L230K474m557Q84M074l396j927N646l16
$$ -2771 -1429 3848 -385 -2792 3150 2605 -1631 1599 4073 -484 400 4474 1078 -849 4797 4481
554D481n187L360K823m939M33N774l619k948M982M10m924K700L440m436P8M882
$$ 4481 -706 2654 5477 538 971 6745 3126 178 5160 5570 646 3346 6786 2350 2428 7310
570G310k903l490M961M86m705K947L352n028j352N979k628m079M638Q05m768J662
$$ 7310 4407 917 5878 6364 1659 4606 7958 2930 1578 7557 4929 850 5488 6293 1525 3187
586C187L590m971j573M884j547l820L888N93n189J377L977l979k616N135m93n216
$$ 3187 6777 1806 233 5117 3570 -250 3638 4231 -958 419 4396 417 -2199 2936 2443 -2773
602b773L211J795m690P93M060l119k390M016j018m292L645K495n074N43M138l340
$$ -2773 438 2233 -2457 -1664 2396 -723 -3113 903 -115 -4407 -762 1733 -3341 -2798 1340 -2000
618b000l003M575k14m463L040K927m962j076M493k424k949M805j4n251K375L171
$$ -2000 -5003 -428 -642 -5105 -2065 862 -4100 -5176 -683 -3107 -6056 -1251 -1265 -6516 -4141 -970
634i70m714l53M566k115l540M349J005n294J504M140l695r95M564j813l406L934
$$ -970 -5684 -6037 -1471 -3586 -7126 -2777 -1772 -7066 -5562 -1422 -5117 -6112 -1548 -3361 -6767 -2833
650b833J230m377J758M247l841j163M741j146m425M231K511m482R59L661l079
$$ -2833 -1603 -5980 -4222 25 -3816 -4979 -238 -1384 -5809 -1578 933 -3549 -2590 1071 -2008
665b008j714M607n70l727L325K030m303R70L732l585j544M861J28m646K883K692
$$ -2008 -3722 885 315 -3412 -87 1943 -2360 -1390 2342 -1243 -2787 2074 2202 -2444 439 3131
681C131m270M76M059k332k623M139Q06m259K182K799l873L28M777k577l104M155
$$ 3131 -1139 -663 3396 1064 -1559 2580 3386 -873 1309 4108 235 563 5340 2763 -341 3814
697C814O77m311K491L188l600q91M433j434l782L806R04l918J935K836m110j341
$$ 3814 4491 180 2671 5859 2259 1368 5801 4367 585 4391 5295 1377 3312 6148 2038 697
713F97M258r56l708L505J399m976J145L626l664j640M222p54l863K747J341m346
$$ 697 4955 3999 291 3796 5195 219 1364 4990 1326 -314 3908 3154 -709 2038 3379 -967
729i67R08L926l144k140M053r49l886L229J571m243M71M338k919l234M095l07
$$ -967 -59 3867 723 -1417 2636 1687 -2199 1030 2601 -1642 -1171 3167 248 -2986 1109 802
745H02m325K947K520m331l94L361k414k633L438J47m154K398K570m441j131M420
$$ 802 -3523 -576 1944 -2387 -2781 580 -1834 -4467 -1029 -882 -5036 -2638 -68 -4509 -5640 -1220
761a220k048l067L998L49m426J578L140l804r01M463j666l056L989P03m433J485
$$ -1220 -3268 -6335 -2337 -1988 -6414 -4836 -1696 -5500 -6401 -1938 -3604 -6660 -2671 -1968 -6401 -4916
777d916L756k719j447M100q47l359L347J572l439Q30L777k915j509M089j393k922
$$ -4916 -1160 -3879 -5326 -1226 -2073 -5432 -2085 -513 -3952 -3122 655 -2260 -3769 320 -1073 -3995
793c995L442K506m301M18L498k198k199M135j30l928L450K365l720k18L955k475
$$ -3995 -553 1953 -2348 -1930 1568 -630 -2829 1306 1176 -2752 698 3063 -657 -875 3080 605
809F05j489M351N0m130K257L165l689L19L711k249k034M067P58m400J846K935
$$ 605 -884 3467 3517 -613 1644 4809 1120 1439 5150 2901 867 4934 5692 1292 3138 6073
825F073l095k1L590k132l066L631J287l937J464K943l294j037L653j703l281K999
$$ 6073 2978 2957 6547 4415 1349 4980 6267 2330 3794 6737 3443 2406 6059 4356 1075 4074
841D074J421l726J151K327l381r41L927q76l481K954M72l323O08L187l383j920
$$ 4074 5495 1769 2920 5247 1866 925 4852 3976 495 3449 3921 598 1206 4393 1010 -910
857i10M372k16m258K113J674l821L34M049k948k455L658p43l445K373J786m121
$$ -910 3462 3246 -1012 1101 2775 -1046 -712 3337 389 -2066 1592 849 -2596 -223 1563 -2558
873b558m2L709k437k391K765O3l229K011K090l771q73L582j763k645L253M77l794
$$ -2558 -2600 1109 -1328 -3719 -954 -891 -4120 -2109 -19 -3790 -4663 -1081 -2844 -5489 -2236 -1759 -5553
890e553J878K664l371r84L950j469k732L252R66l761J113L339l260r86L788r46
$$ -5553 -3675 -1011 -4382 -5366 -1416 -2885 -5617 -2365 -1399 -5160 -4047 -708 -3968 -4954 -1166 -2112
906b112l004L087J279m274J697L311k770j293L661o64l273K856K265l885N13L779
$$ -2112 -5116 -2029 -750 -5024 -3327 -16 -2786 -4079 -418 -1082 -4355 -1499 766 -3119 -2606 1173
922A173k552j982L749p9l382K809J882l286K98L662k210j827L571N56l481K044
$$ 1173 -1379 -3361 388 309 -3073 -264 1618 -1668 -1370 2292 82 -1745 1826 2382 -1099 945
938I45K629l139q28L963j469j976L355L00l240J325K888l039k37L347j416k492
$$ 945 3574 435 -393 3570 2101 125 3480 3780 540 1865 4753 1714 1477 4824 3408 916
954I16L191N96l550J166L167k730j312L514j263k975L050J220l898J281L016l487
$$ 916 4107 4703 1153 2319 5486 2756 1444 4958 3695 720 3770 4990 1092 2373 5389 1902
970A902j099L660j143k825K511J402l901M39L120k415j857L555n01l265K110J678
$$ 1902 803 4463 3320 495 3006 4408 507 946 4066 1651 -206 3349 2848 -417 1693 3371
986C371l655L87K822k278j765L159k42l841K282J956l680l0L535k467k242K718
$$ 3371 -284 103 2925 647 -1118 2041 1799 -2042 240 2196 -1484 -1514 2021 -446 -2688 30
1002C0M71l452J588K240l394m65L191j937k362L040O89l783J573K908l954p50
$$ 30 501 -2951 -1363 877 -2517 -2982 209 -1728 -4090 -1050 -361 -4144 -2571 337 -3617 -4367
1018d367L697j171l002L163J063l332M62K789k672j116L443r89k374K339J452
$$ -4367 -670 -1841 -4843 -1680 -617 -3949 -3487 -698 -3370 -4486 -1043 -2032 -4406 -2067 -615
1033f15l910P49L445k587j261L394n23k900K264J377l311Q65K895j940j473L135
$$ -615 -4525 -3776 -331 -2918 -4179 -785 -1308 -4208 -1944 -567 -3878 -3013 -118 -2058 -3531 -396
1049c96Q5k910K205J982l099O3L527k203j971L474J84k866K152K096l279m13L345
$$ -396 -311 -3221 -1016 966 -2133 -2070 1457 -746 -2717 757 941 -1925 227 2323 -956 -1369 1976
1066A976j494j742L370M21l452J625K651l051l62L189j178k249K941Q41l380J312
$$ 1976 482 -1260 2110 2531 -921 704 3355 304 -58 3131 1953 -296 2645 3486 106 1418
1082A418K623k592q06L359j288k469K709J249l382R77K949k726j423L462o53k772
$$ 1418 4041 1449 643 4002 2714 245 2954 4203 821 1798 4747 2021 598 4060 3407 635
1098F35K323J606l430M65K895k538j678L251l36l051K085J456l106l2L214k602
$$ 635 2958 4564 1134 1599 4494 1956 278 3529 3193 142 2227 3683 577 545 3759 1157
1114A157j678L112o1l340J611K092l311k94L130j744k090K772K78l436J809J431
$$ 1157 -521 2591 2530 -810 801 2893 -418 -712 2418 674 -1416 1356 1634 -1802 7 1438
1130A438k947k6L029j662k732K970J98k888J069K385k880j047L051j088k862K601
$$ 1438 -1509 -1535 1494 -168 -2900 70 268 -2620 -1551 834 -2046 -3093 -42 -1130 -3992 -1391
1146a391Q95l039J131K389l057j095L320o14l191K358J450l182M72K893k339j516
$$ -1391 -496 -3535 -2404 -15 -3072 -4167 -847 -1461 -4652 -2294 -844 -4026 -3554 -661 -3000 -4516
1162d516L361o00k659K213J566l297O75K693j959j505L382l21l079K426K194l113
$$ -4516 -1155 -1755 -4414 -2201 -635 -3932 -3257 -564 -2523 -4028 -646 -967 -4046 -1620 574 -2539
1178b539l01K850j370j648K748K11l192K313J950k677k27K865j334k089L064R18
$$ -2539 -2840 10 -1360 -3008 -260 -49 -3241 -928 1022 -1655 -1882 983 -351 -2440 624 1542
1194A542l483J262K891k692q13L431j159k400K995J380l727J415K607k441q12
$$ 1542 -1941 -679 2212 -480 -1293 2138 979 -1421 1574 2954 -773 642 3249 808 -4
1209dL224p03k398K603J207l153J257K106k035j203L245n36k896K297J452l275
$$ -4 3220 2517 119 2722 3929 776 2033 4139 2104 901 4146 3610 714 3011 4463 1188
1225A188O88K655k081j530K838l69l015K202J528k868j45L038k026j851K665J16
$$ 1188 1876 4531 2450 920 3758 3389 374 2576 4104 1236 1091 4129 2103 252 2917 3033
1241C033l114J655J449k754j08K657j703j571K848n61k836J069K845l011n01K519
$$ 3033 -81 1574 3023 269 161 2818 1115 -456 2392 1831 -1005 64 2909 -102 -603 1916
1257A916j139k743L153L11l346J284K167k689j186L122j345k003K185O77l035
$$ 1916 777 -1966 1187 1498 -1848 -564 1603 -1086 -2272 850 -495 -2498 -313 364 -2671
1272b671O58K164k499r23K775q50k550K275Q56k677K35K844k433j115L144o95
$$ -2671 -2013 151 -2348 -3271 -496 -1346 -3896 -1621 -765 -3442 -3207 -363 -2796 -3911 -767 -1462
1288a462k756K139J177k622M87K712j940j529L022k08k832J593K061k495m9L217
$$ -1462 -4218 -2079 -902 -3524 -3037 -325 -2265 -3794 -772 -980 -3812 -2219 -158 -2653 -2702 515
1304E15j767j941K802M54l032J687K083k800m7K757j019k217K953J35k713J532
$$ 515 -1252 -3193 -391 63 -2969 -1282 801 -1999 -2046 711 -308 -2525 428 563 -2150 -618
1320f18K378l199l7L115r88k044K363O51k702J438K605k686q74L035p44k233K550
$$ -618 1760 -1439 -1476 1639 651 -1393 970 1621 -1081 357 2962 276 -598 2437 1693 -540 2010
1337B010J462l181O57K778j956j543L128l63k960K575J064k855O28K702j691j753
$$ 2010 3472 291 948 3726 1770 227 3355 2992 32 2607 3671 816 1444 4146 2455 702
1353G02K866m23k879J971J863l124J22K338j331j534K539l21k560J523J686k966
$$ 702 3568 3145 266 2237 4100 976 1098 3436 2105 571 3110 2789 229 1752 3438 472
1369D72j3K590j618k038K927K12l193J497J920k876k9K624j480k022K414N8k775
$$ 472 459 3049 1431 -607 2320 2532 -661 836 2756 -120 -149 2475 995 -1027 1387 1445 -1330
1386a330J258J853k354r56K947j223k467K144Q85l117O97K609k656j171K966n54
$$ -1330 -72 1781 -573 -1529 1418 195 -2272 -128 757 -2360 -1663 946 -1710 -2881 85 -469
1402d69l035K179J390k819L51K270k209j584L271l40k760K141R08k647M42K649
$$ -469 -3504 -1325 65 -2754 -2403 -133 -2342 -3926 -655 -995 -3755 -1614 -706 -3353 -2911 -262
1418b62k107j592K804m7k376J667J381k695L58K772j656k233K889J30k614J813
$$ -262 -2369 -3961 -1157 -1204 -3580 -1913 -532 -3227 -2869 -97 -1753 -3986 -1097 -967 -3581 -1768
1434a768J804k714j83L065j404j817K492L24k300J200K400k769n51L112j205k275
$$ -1768 36 -2678 -2861 204 -1200 -3017 -525 -201 -2501 -1301 1099 -1670 -2221 891 -314 -2589
1450b589K796N95k286R61K172j958j264K966l49k465K500J201k810O80K486k163
$$ -2589 207 802 -1484 -523 1649 -309 -1573 1393 1044 -1421 1079 2280 -530 150 2636 473
1466D73r28K831l82k095J838J140k599M00K787j646j517K722j58k816K006J377
$$ 473 -455 2376 1994 -101 1737 2877 278 678 3465 1819 302 3024 2866 50 2056 3433
1482C433k287J7K486j703j828L013l53k608J866J487k491o1K311j436j874K729
$$ 3433 1146 1163 3649 1946 118 3131 2778 170 2036 3523 1032 971 3282 1846 -28 2701
1498B701Q6k635J210J904k432m37K493j412j791K045P95l226Q46K429k409q44
$$ 2701 2787 152 1362 3266 834 397 2890 1478 -313 1732 2527 -699 147 2576 167 -677
1514f77K516j006k250J985Q72k812N54K398k175r36K183n85k548J999J143k824
$$ -677 1839 833 -1417 568 1440 -1372 -818 1580 -595 -1531 652 67 -2481 -482 661 -2163
1530b163N73K311j961j479K080K61k665J732J124k582L32K294j792j605K608n0
$$ -2163 -1590 721 -1240 -2719 -639 -378 -3043 -1311 -187 -2769 -2437 -143 -1935 -3540 -932 -982
1546i82k497J587J565k457k23K690j748j758K918M51k986J359J788k351k6K382
$$ -982 -3479 -1892 -327 -2784 -3007 -317 -2065 -3823 -905 -454 -3440 -2081 -293 -2644 -2670 -288
1562b88j003k275K839M37k667R90K036j887o12K664q50k154K250R98k504Q77J968
$$ -288 -1291 -3566 -727 -290 -2957 -1967 69 -1818 -2430 234 -616 -2770 -520 478 -2026 -1149 819
1579H19k012o87K814p35k104K330Q31k134N82K115j734r52K663j21k368J506J266
$$ 819 -1193 -1880 934 199 -1905 425 1256 -878 -296 1819 85 -867 1796 1675 -693 813 2079
1596B079k023J88K398j234j418K117ok367K325J028k509J36K443j045j454K005
$$ 2079 56 244 2642 1408 -10 2107 2101 -266 2059 3087 578 714 3157 2112 658 2663
1612B663Q7k608J536J696k067o22K256q18j553K270K50k579J105J904k271p13
$$ 2663 2750 142 1678 3374 1307 685 2941 2123 570 2840 3090 511 1616 3520 1249 536
1628E36K118m96k148K331J85k448P27J726j892j109K844j074k005J656O44k248
$$ 536 2654 2158 10 2341 2526 78 805 2531 639 -470 2374 1300 -705 951 1595 -653
1644f53L17K184j797j247K444p51k066J783Q69k114o8K034k025j176K364N5k577
$$ -653 -336 1848 51 -1196 1248 497 -1569 214 1083 -1031 -1099 935 -1090 -2266 98 153 -2424
1661b424J351J284k359N16J742j631j228K355j99k464J401J338k101j90K360j294
$$ -2424 -1073 211 -2148 -1632 110 -1521 -2749 -394 -593 -3057 -1656 -318 -2419 -2609 -249 -1543
1677a543j517K070J75k777J861J424k277j02K104q44j943J895P57k416J240J838
$$ -1543 -3060 -990 -815 -3592 -1731 -307 -2584 -2686 -582 -1426 -3369 -1474 -717 -3133 -1893 -55
1693e5j792r81K259n94j710J912O60k204J131J939j876q33K371k95k156J688J225
$$ -55 -1847 -2828 -569 -1163 -2873 -961 -301 -2505 -1374 565 -1311 -2144 227 -68 -2224 -536 689
1710F89k096N46K035j610n89K104j69k112J741J172k142K99K201j367r77K337
$$ 689 -1407 -861 1174 -436 -1025 1079 910 -1202 539 1711 -431 -132 2069 702 -275 2062
1726B062l10k227J893R93k035J57K554j592j216K417l35k358J617J274k037j37
$$ 2062 1752 -475 1418 2411 376 533 3087 1495 279 2696 2361 3 1620 2894 857 720
1742G20K279j048j562K010L70k204J277J113j677k64K052o93k234K059M62k087
$$ 720 2999 1951 389 2399 2769 565 1842 2955 1278 1014 3066 2373 139 2198 2660 573
1758E73O26J651k007n53K160n89j869J500Q89k581P40J748j665j363J961l08k042
$$ 573 1199 2850 843 290 2450 1861 -8 1492 2381 -200 540 2288 623 -740 1221 913 -1129
1775a129J857P02k401M48K023j675r90K193p11j936J446P18k018j73K260j525
$$ -1129 728 1430 -971 -523 1500 -175 -1165 1028 317 -1619 -173 545 -1473 -1646 614 -911
1791i11j160J957L2k383J214J238j994j66J912j042j288J990P2k480J472J531
$$ -911 -2071 -114 -82 -2465 -1251 -13 -2007 -2173 -261 -1303 -2591 -601 -529 -3009 -1537 -6
1807fk254l73K238p69k247K307N32k395J005J583j825r8K085j124j789K144Q37
$$ -6 -2260 -2633 -395 -1164 -3411 -1104 -572 -2967 -1962 -379 -2204 -2302 -217 -1341 -3130 -986 -149
1824a49k211N32K062j924l96K083n22j671J529J089k068N22J679j225q76K125
$$ -149 -2360 -1828 234 -1690 -2086 -3 -525 -2196 -667 422 -1646 -1124 555 -670 -1546 579
1840E79o52j425J570R83k197P67J667j606j124K598n15j511J364J265j669r5K427
$$ 579 -73 -1498 72 1055 -1142 -375 1292 -314 -1438 1160 645 -866 498 1763 94 -1 2426
1857B426j524j304K236J30k346J529J292k052j8K376j349j228J633O59k154J257
$$ 2426 902 -402 1834 1964 -382 1147 2439 387 369 2745 1396 168 1801 2460 306 1563
1873A563J168j765m16K252j147j396K283j21k024Q93J528j999l24J761o79j646
$$ 1563 2731 966 550 2802 1655 259 2542 2421 397 1290 2818 819 495 2256 1577 -69
1889f9J970M39k037N66J369j239j131K098o44j893J583R06k254K75J927j756n57
$$ -69 1901 2340 303 869 2238 999 -132 1966 1322 -571 1012 1918 -336 -61 1866 110 -447
1906d47J855o61j870J292J048k131o8J430j004j097J798l5k137J411J037j905
$$ -447 1408 747 -1123 169 1217 -914 -982 448 -556 -1653 145 110 -2027 -616 421 -1484
1922a484j21K112j806p80J789k32j846J076J246k146P8J906j020j725J995M90
$$ -1484 -1605 507 -1299 -2079 -290 -522 -2368 -1292 -46 -2192 -2114 -208 -1228 -2953 -958 -468
1938d68k185Q00J435j692m40J985q54j415J704N86k132J036J513j819k89K079
$$ -468 -2653 -1853 -418 -2110 -2550 -565 -1419 -2834 -1130 -544 -2676 -1640 -127 -1946 -2235 -156
1954a56j125j185J840M89j959O59J845j755n83J928j08j878J877J89j171L12J912
$$ -156 -1281 -2466 -626 -137 -2096 -1437 408 -1347 -1930 -2 -110 -1988 -111 78 -1093 -781 1131
1971A131j823m81J825l24j785J635J389k276M37J412q46j038K124m7j515R95J308
$$ 1131 -692 -1173 652 328 -1457 178 1567 -709 -272 1140 294 -744 1380 1333 -182 813 2121
1988B121j908qJ693p80j265J951K65k081J207J342j758l26K214r30j551K039j23
$$ 2121 213 205 1898 1118 -147 1804 2069 -12 1195 2537 779 453 2667 1737 186 2225 2102
2005B102j762R91J236j720k36K002r07j494J491R03k435P35J751j899j65J546
$$ 2102 340 1331 2567 847 611 2613 1706 212 1703 2606 171 906 2657 758 593 2139
2021B139l90k044J637O02j699K60J512j360p65J656m56j599J501N77j741K52J314
$$ 2139 1749 -295 1342 1944 245 505 2017 657 -108 1548 1092 -507 994 1571 -170 82 1396
2038A396j607o49J501l67j635J193J271k567R0J975j403o85J467p2j813P39J209
$$ 1396 -211 -860 641 274 -1361 -168 1103 -1464 -1374 601 -802 -1487 -20 -92 -1905 -1166 43
2055D3j859J77J115r39p27J553j11j571M56J209j406j85J971o74j526J681J40
$$ 43 -1816 -1639 -524 -1463 -2190 -637 -748 -2319 -1863 -654 -2060 -2245 -274 -948 -2474 -793 -653
2072f53k168J329J051j122p12J909p76j378J515O39j942N09K015j836k95J753
$$ -653 -2821 -1492 -441 -1563 -2275 -366 -1142 -2520 -1005 -366 -2308 -1799 216 -1620 -1915 -162
2088a62l76j664J672M64j556L18J628r19q01J655pj787J431O80j635P02J677j178
$$ -162 -538 -2202 -530 -66 -1622 -1304 324 -595 -1396 259 252 -1535 -104 576 -1059 -357 1320 142
2106A42j322K127K6j558J193R57j763J01J953j114r50J330N74j609R92J107j765
$$ 142 -1180 947 973 -585 608 1565 -198 -97 1856 742 -208 1122 1696 87 1079 2186 421
2123D21p0K068j033j157J613L30j918J164Q69j353l37J809q42j361J407N50j399
$$ 421 351 2419 1386 229 1842 2172 254 1418 2287 934 597 2406 1564 203 1610 2160 761
2140G61M77J488j920m4J335m60j272Q10J137j736J19J576j432p80J571k97j578
$$ 761 1238 2726 806 762 2097 1637 365 1175 2312 576 695 2271 839 59 1630 1333 -245
2157b45J270R63k176K37J694j476m75J163j03j442P62J119k036q7J758j229p40
$$ -245 1025 1988 -188 49 1743 267 -208 955 852 -590 172 1291 -745 -832 926 -303 -1043
2174a043J232J74j869P79J193j664O5J245p41j256J773o1j879R36R29j195n02
$$ -1043 189 363 -1506 -727 466 -1198 -1133 112 -629 -1885 -112 -173 -2052 -1116 -187 -1382 -1884
2191a884J763r06j618J879R0j365O66O87j077n30J797q79j076J334N10j666P30
$$ -1884 -121 -1027 -2645 -766 -676 -2041 -1375 -688 -1765 -2295 -498 -1377 -2453 -1119 -609 -2275 -1545
2208a545J449j437o77J798m26j605J337Q43j460J83J477j328l87J717k96j617
$$ -1545 -96 -1533 -2210 -412 -838 -2443 -1106 -263 -1723 -1540 -63 -1391 -1778 -61 -357 -1974
2224a974J350J003j740M21J905j440p28J635J44j596R56J058j405N9J428p92q62
$$ -1974 -624 379 -1361 -940 965 -475 -1203 432 576 -1020 -64 994 -411 -352 1076 284 -578
2241e78J421K81j420R99J047j359k26J489m81j176J552J82j632R39J265j565j01
$$ -578 843 1124 -296 703 1750 391 165 1654 1173 -3 1549 1731 99 1038 2303 738 637
2258F37J581p21r95J178L31j573O05J277j277o06J557l50j350J470K80j503K12
$$ 637 2218 1497 502 1680 2011 438 1043 2320 1043 437 1994 1644 294 1764 2044 541 753
2275G53J492j107o60J656o06j485J120P48j736J16J764j278p83J405l63j255J169
$$ 753 2245 1138 478 2134 1528 43 1163 1911 175 291 2055 777 -6 1399 1036 -219 950
2292I50M47j902M56J425j129q45J295k83j215M31J240j750K7J518j168j027J512
$$ 950 1397 -505 -49 1376 247 -598 697 414 -801 -370 870 -880 -853 665 -503 -1530 -18
2309a8l9j301N13J186j443m45J585j020o90J037J50j269J71J432j461l98J627
$$ -18 -57 -1358 -845 341 -1102 -1547 38 -982 -1672 -635 -485 -1754 -1583 -151 -1612 -2010 -383
2326c83q86n86R16J30j117J13J498j121q12J722l84j449J165O76j726N52J455
$$ -383 -1269 -1855 -939 -809 -1926 -1813 -315 -1436 -2248 -526 -910 -2359 -1194 -518 -2244 -1692 -237
2343b37q60p44J554k87j462J408L98j405L35J563j023o24J331k09j093J083Q03
$$ -237 -1097 -1841 -287 -574 -2036 -628 -230 -1635 -1300 263 -760 -1384 -53 -262 -1355 -272 531
2360E31j512K52J474r27n66J486J85j734J094J271j673k51J837r69o07J074N04
$$ 531 -981 -729 745 -182 -748 738 923 -811 283 1554 -119 -370 1467 498 -109 965 1469
2377A469j441O06J245j361k53J764q80j207J446M17j183J65J496j487j24J449
$$ 1469 28 634 1879 518 265 2029 1149 -58 1388 1805 622 787 2283 796 672 2121
2393B121j64j760J404O49j741M78J164j363l47J456k06j146R36N15j611Q8J518
$$ 2121 1957 197 1601 2250 509 987 2151 788 441 1897 1691 545 1481 1996 385 473 1991
2410A991j195n42J281k49j270J282K71j573K52J183r00r50J477k61j414Q49R73
$$ 1991 796 254 1535 1286 16 1298 1569 -4 248 1431 531 -419 1058 797 -617 232 1205
2427A205j654o3J454r04r35J227K09j632Q04O37j282n4J405q81j086J300o1j276
$$ 1205 -449 -512 942 38 -897 330 539 -1093 -289 348 -934 -988 417 -464 -1550 -250 -311 -1587
2445a587P76Q24j652K33J269q94j119J372K03j325P72R95j417l25J337o08q81
$$ -1587 -811 13 -1639 -1406 -137 -1031 -2150 -778 -575 -1900 -1128 -133 -1550 -1875 -538 -1146 -2027
2462b027J095M39j593N51J402j563m58J751n93q16P76O05j347L78J434r83q57
$$ -2027 -932 -493 -2086 -1535 -133 -1696 -2154 -403 -996 -1812 -1036 -431 -1778 -1400 34 -949 -1806
2479a806J448J34j486R03R46j095MJ388q55q05J589j00j114P05R54j203o4J754
$$ -1806 -358 -224 -1710 -807 139 -956 -952 436 -419 -1224 365 265 -849 -144 810 -393 -457 1297
2497A297j185n54J552M5j748J144Q28j229m71J508n45j002J647o0j089P29J097
$$ 1297 112 -442 1110 1155 -593 551 1379 150 -321 1187 642 -360 1287 1227 138 867 1964
2514A964j494jJ159m25j012J006M17j065M36Q51q37p39J658l62j364J050N11j326
$$ 1964 470 469 1628 1203 191 1197 1614 549 985 1836 999 260 1918 1556 192 1242 1753 427
2532D27M24J421j175q06J243O9j182P87O40j312k40J079p36p77J438l43j172R93
$$ 427 851 2272 1097 291 1534 1603 421 1208 1848 536 296 1375 639 -138 1300 957 -215 778
2550G78N93j499l77J619p00j020J313pj578R07Q79j542j76J475q79j188J541j29
$$ 778 1371 -128 -505 1114 414 -606 707 700 -878 29 908 -634 -810 665 -214 -1402 139 10
2568A0j274O08Q47j203k46J302p00j432J440J64j237M16J442j758j85J691o19
$$ 10 -1264 -656 191 -1012 -1258 44 -656 -2088 -648 -484 -1721 -1305 137 -1621 -1806 -115 -734
2585g34j002Q83M32j225K19J165r65p13J062J69r43O76N87j289L82J188j113p62
$$ -734 -1736 -853 -421 -1646 -1427 -262 -1227 -1940 -878 -709 -1652 -976 -389 -1678 -1296 -108 -1221 -1983
2603a983J568K9j438J285M18j052j31J593q68q83J256K73j580J073Q57j058j43
$$ -1983 -415 -386 -1824 -539 -121 -1173 -1304 289 -579 -1462 -206 67 -1513 -440 417 -641 -784
2620g84J227n55q28J584k41j271J151Q49j376j19J421l88j264J373L48j094N71
$$ -784 443 -112 -940 644 403 -868 283 1132 -244 -363 1058 670 -594 779 1127 33 604
2637F04Q15j164j29J416n21p07J010K42j618P76J086j241Q0R37l10j224R88P83
$$ 604 1419 255 126 1542 1021 314 1324 1566 -52 724 1810 569 649 1586 1276 52 1040 1823
2655A823j302J11J047p19q33J713m64j028R65M27j463N39Q20r44m64J166K64j846
$$ 1823 521 632 1679 960 127 1840 1376 348 1313 1740 277 816 1636 692 228 1394 1658 -188
2673a88J092O84j499j42J569j051j137J588r2j196Q29M94j031l57J310o05j270
$$ -188 904 1588 89 -53 1516 465 -672 916 824 -372 457 951 -80 -437 873 268 -1002
2690a002J405j9j492P77O85j110l64J484q80j008J246M12j573N48J213j228p22
$$ -1002 403 384 -1108 -331 354 -756 -1120 364 -516 -1524 -278 134 -1439 -891 322 -906 -1628
2707a628J276k99j108J231M45j612P29Q37j053m52J443n74j130R10R36j682M27
$$ -1628 -352 -651 -1759 -528 -83 -1695 -966 -129 -1182 -1634 -191 -765 -1895 -985 -49 -1731 -1304
2724a304J008r25o53J490j38j348J100O07j129k17J070r2r44J379R7j095M65J005
$$ -1304 -296 -1221 -1874 -384 -522 -1870 -770 -163 -1292 -1509 -439 -531 -1475 -96 1 -1094 -629 376
2742C76j217k94J520q68p72J348J99j259O37J079j285O2J192n22q44J353k02q46
$$ 376 -841 -1135 385 -483 -1255 93 292 -967 -330 749 -536 -474 718 196 -648 705 503 -343
2760c43K01J347j363J87J323n09j115J196K59j267K31J646j161r2J173n23j151
$$ -343 -142 1205 -158 29 1352 843 -272 924 1183 -84 147 1793 632 540 1713 1190 39
2777C9J352L57j392K87J224r38m86J147o2j499J048P06j390J28J618j065r51J380
$$ 39 1391 1748 356 643 1867 929 443 1590 1528 29 1077 1783 393 521 2139 1074 123 1503
2795A503p3j359N95P63j054P6J187o79j114J107j0j176N85J103j245l78J158o67
$$ 1503 1430 71 666 1429 375 451 1638 959 -155 952 942 -234 351 1454 209 -169 989 322
2813C22r08J326j06j250O66Q70j308n66J268m62r36J274J17j497O60P76r27n35
$$ 322 -586 740 634 -616 50 920 -388 -954 314 -148 -1084 190 307 -1190 -530 246 -681 -1216
2831a216J276n75q90O89Q35j646N72Q73j035m88J534o80r86R49N57j115J50J408
$$ -1216 60 -515 -1405 -716 119 -1527 -955 -82 -1117 -1605 -71 -751 -1737 -788 -231 -1346 -1196 212
2849B12j279m28R89k49j311J438L50j122kJ260r87n56J324k63r18O88P37r84K36
$$ 212 -1067 -1495 -506 -755 -2066 -628 -278 -1400 -1402 -142 -1129 -1685 -361 -624 -1542 -854 -117 -1101 -865
2868h65J125r36p74J536j93q99Q00O19j091j62J379o94q76J047K26o03O48O85
$$ -865 260 -676 -1450 86 -107 -1006 -206 413 -678 -840 539 -155 -1031 16 242 -361 287 972
2886I72j360n6J382o04q12J183J69j111P50M69q64m10J763m71j060J325L86j465
$$ 972 -388 -444 938 334 -478 705 874 -237 513 982 118 -292 1471 1000 -60 1265 1651 186
2904A86K27J309r20n87J398j60j391J045K00q83K84J189j196l59R23m3r76J104
$$ 186 413 1722 802 215 1613 1453 62 1107 1307 424 708 1897 701 342 1265 1222 246 1350
2922A350M01j615L32R27j029m09J334k15j107Q96N31j266q7J149o96n76J107L4
$$ 1350 1751 136 468 1395 366 -43 1291 1076 -31 865 1396 130 43 1192 496 -80 1027 1061
2940A061j345N28O40j036j34J121n61j172J496j08j344M58Q86q46l79J114m05
$$ 1061 -284 244 884 -152 -286 835 274 -898 598 490 -854 -396 490 -356 -735 379 -26
2957b6j353J140O75j451J87J033j050k28J175l22j405R57L80j092M14J151j362
$$ -26 -1379 -239 436 -1015 -828 205 -845 -1073 102 -220 -1625 -668 -288 -1380 -966 185 -1177
2974a177k92Q69J55j362J166L62j034J4J296r80n29J227j63j108R58O69j158j02
$$ -1177 -1469 -600 -445 -1807 -641 -279 -1313 -1299 -3 -983 -1512 -285 -448 -1556 -598 71 -1087 -1189
2992a189R39l20r46J277R5j014M20R68j121j11J149o77o27J216K74r77N88N68
$$ -1189 -250 -570 -1516 -239 -144 -1158 -738 230 -891 -1002 147 -530 -1157 59 333 -644 -56 512
3010E12j000j93J038j66r43J191O2j069N31R71r95j05J029l4j167J242K45j365
$$ 512 -488 -681 357 191 -752 439 501 -568 -37 934 -61 -166 863 829 -338 904 1149 -216
3028b16P19R47j061m70J297l08j002J062M91j526O95O79n45m04J127l30q15P04
$$ -216 503 1450 389 -81 1216 908 -94 968 1459 -67 628 1307 762 358 1485 1155 340 1044
3046A044K99j153K57J133q24o20J259j09j285J151M31j410K54P71l69r66J166
$$ 1044 1343 190 447 1580 756 136 1395 1286 1 1152 1583 173 427 1198 829 -137 1029
3063A029R5j087N59Q14j255j71J228o79j019P54K26j266J104M76q74k91R99m19
$$ 1029 1124 37 596 1410 155 -16 1212 533 -486 268 494 -772 332 808 -66 -357 642 223
3081B23q05P15L8p82j55R53r00n17J111j72r21R66J82j536P31R84j094j85Q68
$$ 223 -582 133 171 -611 -766 187 -713 -1230 -119 -291 -1212 -246 -64 -1600 -869 115 -979 -1164 -296
3100b96j04q30N73N04j277M9J230p68m97J014j19r36P83J13o68L8R93n20r03J345
$$ -296 -400 -1230 -657 -153 -1430 -1381 -151 -919 -1416 -402 -521 -1457 -674 -561 -1229 -1191 -198 -718 -1621 -276
3120b76o28p14O22Q73r42M5Q34o57o51J332R6j056N35R79r50k45J549p56j018
$$ -276 -904 -1618 -996 -123 -1065 -1020 -186 -843 -1494 -162 -66 -1122 -587 392 -558 -803 746 -10 -1028
3139a028J317Kr99O57M98q27k79J345o38n51R11K69j025L41J041n37n50J286n64
$$ -1028 289 291 -708 -51 447 -380 -659 686 48 -503 408 677 -348 -7 1034 497 -53 1233 669
3158F69n28O59M11j004R8P78n93o11J691l44j093N80N03q73M2Q46k18r56J081
$$ 669 141 800 1211 207 305 1083 490 -121 1570 1226 133 713 1216 343 385 1231 1013 57 1138
3177A138Q9j296R97N41q82m71J390n75o63Q26J02j063O21N01o34m66J069q52q58
$$ 1138 1227 -69 928 1469 587 116 1506 931 268 1094 1196 133 754 1255 621 155 1224 372 -486
3196d86J013M00j008L49J099j398p30J561l30j237R47N66j194K25J090j311k92
$$ -486 527 927 -81 268 1367 -31 -761 800 470 -767 180 746 -448 -223 867 -444 -736
3213g36J133l61q48O49N89j306K07J061j091l97R50k39j007J166l1r43J68J041
$$ -736 397 36 -812 -163 426 -880 -673 388 -703 -1100 -150 -389 -1396 -230 -261 -1204 -1036 5
3231Eq56l05J023k96j076Q09O66j168J10Q44n93m54P54j19r66P75J020j375o1
$$ 5 -851 -1156 -133 -429 -1505 -696 -30 -1198 -1088 -244 -837 -1291 -537 -656 -1622 -847 173 -1202 -1263
3250a263J059n01r20R65N38r82L30Q64r18q0J199p17o15R14J66j067N94P74p52
$$ -1263 -204 -705 -1625 -660 -122 -1104 -774 90 -828 -908 291 -426 -1041 -127 39 -1028 -434 340 -412
3269d12j7R50k34j245J320j03r58O29O76q21o3J057m5j107J086O10j560M44R54
$$ -412 -429 521 287 -958 362 259 -699 -70 606 -215 -278 779 734 -373 713 1323 -237 207 1161
3288A161p96l86J007J23j024M78O03p78Q3R61o92o31J151n8j129O68O29o24m88
$$ 1161 365 -21 986 1109 85 563 1166 388 471 1432 740 109 1260 1202 73 741 1370 746 258
3307B58J037n30o51Q71K35j083O49N49r45J6J165r47n41J050L84j537L69O06m98
$$ 258 1295 765 114 985 1220 137 786 1335 390 406 1571 624 83 1133 1517 -20 349 955 457
3326D57l44R71n61l43L53Q2q35L74M08o06n13R06l90l79L91O26j200M71O75r19
$$ 457 113 1084 523 180 533 615 -220 154 562 -44 -557 349 -41 -420 -29 597 -603 -132 543 -376
3346c76k06P45l05j123R53L44r87M69O65p90m52R20l24q37R20J80p77k00J216
$$ -376 -582 163 -142 -1265 -312 32 -955 -486 179 -611 -1063 -143 -467 -1304 -384 -204 -981 -1181 35
3365C5r60k34Q38m6j042P39N80j090J22P06m60o21J010K31r13j16J273r76k00
$$ 35 -925 -1159 -321 -367 -1409 -670 -90 -1180 -1058 -352 -812 -1433 -423 -192 -1105 -1221 52 -924 -1124
3384a124J279q91n05R56L57j095M14R17j167N1J093n42p97R41O37j437M77R92
$$ -1124 155 -736 -1241 -285 72 -1023 -609 308 -859 -808 285 -257 -1054 -113 524 -913 -436 556
3402E56p34k50P76Q4j331J180M56j059J20R84j007k71J341m98l61O63Q9n50Q5
$$ 556 -178 -428 348 432 -899 281 737 -322 -202 782 -225 -496 845 347 -14 649 738 188 273
3421B73P84n32n20J014kr74P44J04r55L14Q56j10q20J050q3p24N47J94r91L5J047
$$ 273 1057 525 5 1019 1017 43 787 891 -64 250 1106 996 176 1226 1143 419 966 1160 169 204 1251
3442A251k75j201R90K76j075M61P14q08j93J089n36m88N79M41j285L87N97q27
$$ 1251 976 -225 765 1041 -34 427 1141 333 140 1229 693 205 784 1225 -60 327 924 97
3460I7m5O08j10j103R23M52j255P0Q91q10k86J154l52r99P30N15j118M94O84r39
$$ 97 52 660 550 -553 370 822 -433 -363 528 -282 -568 586 234 -765 -35 480 -638 -144 540 -399
3480c99l68J011n19n75L65O70j200J97N84l65n27P65J93j171P11O25j098Q3R61
$$ -399 -767 244 -275 -850 -485 185 -1015 -818 -234 -599 -1126 -361 -168 -1339 -628 -3 -1101 -1018 -57
3499e7p12k71J26O88r61M58M83p87K63O37o10p04J120K73r92L47Q89q93o13J307
$$ -57 -769 -1040 -914 -226 -1187 -729 -246 -1033 -770 -133 -743 -1447 -327 -54 -1046 -699 190 -703 -1316 -9
3519in35m91O36L95o72K69O39q23l57J262j51r61R05O28j198J44J250q18l62M15
$$ -9 -544 -1035 -399 -4 -676 -407 232 -591 -948 314 163 -798 107 735 -463 -319 931 113 -249 166
3539A66J86o73N85L68o32J72Q10n74p76J019R4r02O89L45n39k34O97L1o65R81
$$ 166 352 -321 264 632 0 172 982 408 -368 651 745 -157 532 877 338 104 801 832 167 1148
3559A148k17n47L76O00p73l37J228p78p57P25N76j116L01O98q27j8Q84m30q28
$$ 1148 931 384 760 1360 587 250 1478 700 -57 668 1244 128 429 1127 300 282 1166 736 -92
3578i2J434m18o68O4P79q23l32P81j25r20J007j91p74P03N87q34o35R87j94p05
$$ -92 1342 924 256 320 1099 276 -56 725 600 -320 687 496 -278 425 1012 178 -457 530 336 -369
3598c69P16K97q33k24R53o79m05O62k2q75N54L78q68j4R11p27o23J043P8r96M90
$$ -369 347 644 -189 -413 540 -139 -544 118 96 -779 -225 153 -715 -729 182 -545 -1168 -125 -47 -1043 -553
3619e53J68m36PQ32n03q52J067j64o99J78N70p25j51R80l65o52Q45K51r27M00
$$ -553 -385 -821 -814 18 -485 -1337 -270 -434 -1133 -955 -385 -1110 -1261 -281 -646 -1298 -453 -202 -1129 -729
3639g29O10n70l42Q78j82p72N44K87q04J93P69l63m58R20l97o97R71L18p91j9
$$ -729 -119 -689 -1031 -153 -335 -1107 -563 -276 -1080 -887 -118 -481 -939 -19 -416 -1113 -142 176 -615 -634
3659f34Q72o60l17J328m24n84M37N95r12J14Q87p10l64P57J5n58K37O35q40K69
$$ -634 238 -422 -739 589 165 -419 18 613 -299 -185 702 -8 -372 385 400 -158 79 714 -126 143
3679A43P80n79m74J083l03o60O34N19q24m1Q56o17l21P72K81j257N75Q47r52j3
$$ 143 923 344 -130 953 650 -10 624 1143 319 278 1134 517 196 968 1249 -8 567 1414 462 449
3699D49N25j83n33R60k05p76J06Q08r97M3O36O6p47K11K84q10O93N51q86k95Q93
$$ 449 974 791 258 1218 1013 237 343 1151 154 197 833 899 152 363 647 -163 530 1081 195 -100 793
3720G93m53n90O42J33n38J52O04r88J3K87j83n38N75N93j004J43R45j038m44R61
$$ 793 340 -250 392 525 -13 139 743 -245 -232 55 -128 -666 -91 502 -502 -359 586 -452 -896 65
3740F5O3r29K56P94r32q1R07n96n88J181J16j297M44P93j064k08J141o97o09J047
$$ 65 128 -801 -545 249 -683 -764 143 -453 -1041 140 256 -1041 -597 196 -868 -1076 65 -632 -1241 -194
3760a94k55n67K15O66o21k14N48j14o93P64J92o76K9R58o71k23M55J20n64N35
$$ -194 -449 -1016 -801 -135 -756 -970 -422 -536 -1229 -465 -273 -949 -920 38 -633 -856 -401 -281 -845 -310
3780c10J51q02L78R20q12k07Q59k88q56O67O19n56j00M90k26o00J221j00r53Q22
$$ -310 -159 -961 -583 337 -475 -682 177 -111 -967 -300 319 -237 -337 153 -73 -673 548 448 -505 317
3800C17M44r55K05N48l21l05N91J63q94N19O24m78l64N83j35m74O13M04r31K45
$$ 317 761 -194 11 559 238 -67 524 687 -207 312 936 458 94 677 542 68 681 1085 154 399
3820C99P82o83l15J051m98o19P20K08q48L43N73m72l07P12j86j026Q99L33p55
$$ 399 1181 498 183 1234 736 117 837 1045 197 540 1113 641 334 1046 860 -166 733 1066 311
3839C11J95N67p59l68P66J6r02Q63o0o15J22M65k70n06N79p1o48M53J43p14jQ85
$$ 311 506 1073 314 -54 712 728 -174 689 629 14 136 601 331 -175 404 333 -315 138 281 -433 -434 451
3861D51l27o97O92l8o56O05K51r41K91O11m63n54N84J54q48K39M23m42l05J014
$$ 451 124 -573 119 81 -575 30 281 -660 -369 242 -221 -775 -191 -37 -885 -646 -223 -665 -970 44
3881D4k45j102J072Q9q52Q7O73l07l58P14l07o52L70P45r00Q3Q77j005J93O12
$$ 44 -201 -1303 -231 -142 -994 -907 -234 -541 -899 -185 -492 -1144 -774 -29 -929 -846 31 -974 -781 -169
3901a69k60m92O00L23j145L32N28n26p5J030l48o26N19L59n42j30P64l62l48P91
$$ -169 -429 -921 -321 2 -1143 -811 -283 -809 -884 146 -202 -828 -309 50 -492 -622 142 -220 -568 223
3921B23p3j009N69O19n43j12J045m00m66Q15l75n72O54L64q14j46R01k12n51O20
$$ 223 150 -859 -290 329 -214 -326 719 319 -147 668 293 -279 375 739 -75 -221 680 468 -83 537
3941E37M95j033K07Q01p85mQ81l67n62O72J33j078N83Q36q58k95O96k16m49M54
$$ 537 1032 -1 206 1007 222 218 1099 732 170 842 975 -103 480 1316 458 163 859 643 194 648
3961F48L02o64J02O32o39l18R86j06q28R43l24o18L37L88o53l06N34N4o59L10
$$ 648 950 286 388 1020 381 63 1049 943 115 1058 734 116 453 841 188 -118 416 470 -189 121
3981A21L75p14N80J21l76m35Q56j91n90K39L2l81n02J277m62o00P40p2p13K58
$$ 121 496 -218 362 483 107 -328 528 337 -253 -14 18 -363 -865 412 -50 -650 90 18 -695 -437
4001d37M20o13j63P99n56l05P59j40p73O55O56j077r0O99k55l82L83Q3l39O0M45
$$ -437 -17 -630 -793 6 -550 -855 -96 -236 -1009 -354 302 -775 -865 -166 -421 -803 -420 -337 -676 -616 -171
4022a71m80l32Q31k41n88P74J55p09Q2M02m48m77J120k20o05N63P1l43k75Q37
$$ -171 -651 -983 -152 -393 -981 -207 -52 -761 -679 -277 -725 -1202 -82 -302 -907 -344 -273 -616 -891 -54
4042e4l39k08P53k30r02P60L04l92J06M19k18l75P63j29n89L33Q54j179J03P11
$$ -54 -393 -601 152 -78 -980 -220 84 -308 -202 217 -1 -376 387 258 -331 2 856 -323 -220 491
4062D91j87k43N12Rq80J36J052r22L19O20k61p42J147j13p61K16N73o65l83J215
$$ 491 304 61 573 582 -298 -162 890 -32 287 907 646 -96 1051 938 177 393 966 301 -82 1133
4082A133l71p08R20j11o49J91O77m94m92J068n71l32L92L0o73K83Q21r80J3N36
$$ 1133 762 54 974 863 214 405 1082 588 96 1164 593 261 653 683 10 293 1114 134 147 683
4102F83k95l50M50L63n71j55N33m85k61L94O1r17N35L90n86NM83m72l75P24r4
$$ 683 388 38 488 851 280 125 658 173 -88 306 367 -550 -15 375 -211 -206 277 -195 -570 154 60
4123F0k86j16M85n51l07R98m33l83M23M6p15M47M82r20j0O86k94n04M65Jm43K03
$$ 60 -226 -342 143 -408 -715 283 -150 -533 -110 -64 -779 -332 150 -770 -780 -94 -388 -892 -427 -426 -869 -666
4145f66N33n86j89P29m26l05M95L13r69O86L00q33J1P63Q0j016O66L50m85O8N82
$$ -666 -133 -719 -908 -179 -605 -910 -415 -102 -1071 -385 -85 -918 -907 -144 -64 -1080 -414 -64 -549 -481 101
4166A01l69o68R27l3o60N58K19q40o8J064n27m84P16O5o18N80N54r78K37M81l08
$$ 101 -268 -936 -9 -42 -702 -144 75 -765 -833 231 -296 -780 -64 1 -617 -37 517 -461 -224 257 -51
4187e1k99N43K11o04J12N56m21N2Q36n20n40L81N83j105P02L93n37r9M12p0n12
$$ -51 -350 193 404 -200 -88 468 47 99 935 415 -125 256 839 -266 436 829 292 193 605 535 23
4208B3M79J20o62K24P42l77j62O18m49m47L65L54p52L49N54o30j29P82l04o60
$$ 23 502 622 -40 184 926 549 387 1005 556 109 474 828 76 425 979 349 220 1002 698 38
4228C8K31N32q24M98K50m13l18N08J07o45N66j19l99n3O10n29jL40l65k37K57
$$ 38 269 801 -23 475 725 312 -6 502 609 -36 530 411 12 -41 569 40 39 379 14 -223 34
4249C4M88q31j10P20n08m78J015J24j163M55M26q14K8N09k00l69M94L57r38M46
$$ 34 522 -309 -419 301 -207 -685 330 454 -709 -254 172 -642 -614 -105 -305 -674 -180 177 -761 -315
4269c15N20r69Q3O45J74j030O09l1q13O81N52j080M3J018m54m49L73J79o07K87
$$ -315 205 -764 -681 -36 138 -892 -283 -314 -1127 -446 106 -974 -931 87 -367 -816 -443 -264 -871 -584
4289e84L37l22m1O58j76r17M30M66o88M35N08m03m92O15K84q97N97K13m99M11
$$ -584 -247 -569 -610 48 -128 -1045 -615 -149 -837 -402 106 -297 -789 -174 110 -787 -190 23 -476 -65
4309f5N09p37j83Q74k58n80N05M95m42k18P20m27l41N63J58p68L57O41p08j7O78
$$ -65 444 -293 -476 398 140 -440 65 560 118 -100 620 193 -148 415 573 -195 162 803 95 78 756
4330G56k55l80K84L52r00L41P73q79j25R52l86o58R78J8o66j0J047q40k67R24
$$ 756 501 121 405 757 -143 198 971 92 -33 919 533 -125 853 871 205 195 1242 402 135 1059
4350A059n94n50J056K6q49M66L57n01k79N86k95p12M47R32j061p2R31o52m4L07
$$ 1059 465 -85 971 997 148 614 971 470 191 777 482 -230 217 1149 88 16 947 295 251 558
4370E58m09j53M6N31p93J32O70m29m89P70k97p03K06N03k95l88O38k29l95M73
$$ 558 149 -4 42 573 -220 -88 582 153 -336 434 137 -566 -360 143 -152 -540 98 -131 -526 -53
4390e3L18r66L88K52m65O6L87k2p14M67J48p37K93P59n17n11Q20l37o12O52O2
$$ -53 265 -701 -313 -61 -526 -460 -73 -95 -809 -342 -194 -931 -638 121 -396 -907 -87 -424 -1036 -384 -322
4411c22o22L11N13m64k19N95j54m14L59O81q62j05N23k53m43Q02o0m10L88K11
$$ -322 -944 -633 -120 -584 -803 -208 -362 -776 -417 264 -598 -703 -180 -433 -876 -74 -134 -544 -156 55
4431E5o66j05P94o40j87P32K00r13O23L88p06K9Q92m26l85R53k98m84M75L29r30
$$ 55 -611 -716 78 -562 -749 -17 183 -730 -107 281 -425 -396 496 70 -315 638 340 -144 331 660 -270
4452b70Q6J076o23m35M61J51r03O20M66m58%R74q40j65N17Kn13J99O32l38k77
$$ -270 -184 892 269 -166 295 446 -457 163 629 171 171 1145 305 140 657 659 146 345 977 639 362
4473C62O93m13n56N98n9k73p9N35m71J25M36j4q64O07K9p21K63N39l42m02L59
$$ 362 1055 642 86 684 625 352 273 808 337 462 898 884 20 627 656 -65 198 737 395 -7 352
4494C52K64q45M40M15j93l93O06o34k81L65N33j013N67L00m57j54M30l91m84M88
$$ 352 616 -229 211 626 433 40 646 12 -269 96 629 -384 183 483 26 -128 302 -89 -573 -85
4514h5M16q08j5O41m31j38N51q3q82Q34p3p20M12J38n0j57N53m93l26P38j58q76
$$ -85 331 -477 -492 149 -282 -420 131 48 -834 0 -73 -793 -381 -243 -293 -450 103 -390 -716 22 -136 -1012
4536a012M17M97l01j13K21q9o25N56J50k36Q6L59n13k36O81j55l65L76M10r46
$$ -1012 -595 -98 -399 -512 -291 -380 -1005 -449 -299 -535 -449 -90 -603 -839 -158 -313 -678 -302 108 -838
4556h38K75P22m84m96O17L31r56L69L63l93L77R2k09l69M96L46m17P5O1l86J05
$$ -838 -563 159 -325 -821 -204 127 -829 -460 -97 -490 -113 -21 -230 -599 -103 243 -174 -99 -38 -424 -319
4577c19R79n52n1N9M31j170R03N41o55J62L53j76o41N55K52p44K16K53l75k79
$$ -319 660 108 57 116 547 -623 280 821 166 328 681 505 -136 419 671 -73 143 396 21 -258
4597b58O88M15q36N23K15o38K84J47m35J94N04j0r69J014j15o97J5P18o60k32
$$ -258 430 845 9 532 747 109 393 540 105 299 803 793 -176 838 723 26 41 759 99 -133
4617a33O70K68r84N43O56q74J03N87m62m02M41K18m12j04L59l74k95O36j92n35
$$ -133 537 805 -179 364 1020 146 249 836 374 -28 413 631 219 115 474 100 -195 441 249 -286
4637b86M76P9n82K67K56l48k8N73n29l13L13K63o17M80K27n94j7M87m61l69O50
$$ -286 190 269 -313 -46 210 -138 -166 407 -122 -435 -122 141 -476 4 231 -363 -380 107 -354 -723 -73
4658g3J46o40R4N74m07l20M92q1n17L06n0q2k82O41k64l64Q68k11q37N77O9M4
$$ -73 73 -567 -473 101 -306 -626 -134 -215 -732 -426 -476 -558 -840 -199 -463 -827 41 -170 -1007 -430 -361 -317
4680c17p4K35p3o16P56j6p27P06K8n70L48L68l00l06P81j6q15K22N77l60QN55
$$ -317 -391 -156 -229 -845 -89 -105 -832 -126 -98 -668 -320 48 -252 -558 223 207 -608 -386 191 -169 -161 394
4702C94l79k81M55k4l94K64J05R5p1J2N9n25L10M81p88N31M29k99m35M04O0m80
$$ 394 15 -266 189 165 -229 35 140 235 164 176 235 -290 20 501 -287 244 673 374 -61 343 403 -77
4724g7L42M91o04lO31m32l50P40J72q36M30k5k68Q0O99o53J03K57Kn27L80R7p31
$$ -77 265 756 152 149 780 348 -2 738 910 74 504 479 211 291 990 337 440 697 699 172 552 649 -82
4747h2L20P97n28m23N37l5o87N94J03p32M13K59k08p82Q41J63p86J46P98j160
$$ -82 238 1035 507 84 621 586 -101 493 596 -136 277 536 328 -454 387 550 -236 -90 708 -452
4767d52M10L00K5r15O19M43q13P1K74j64m81R75p9p59N42J93o60k4K71L6n17P74
$$ -452 -42 258 283 -632 -13 430 -383 -312 -38 -202 -683 292 213 -546 -4 189 -471 -495 -224 -188 -705 69
4789F9m22k65L54L73j011M28M45o9o40O93m1p29M08M02m48j98O89q71O5M99om67
$$ 69 -353 -618 -264 109 -902 -474 -29 -98 -738 -45 -86 -815 -407 -5 -453 -651 38 -833 -768 -269 -275 -742
4811g42N03L70j009L37M05n6o48O75K08k85L51K05o28k18L24L30m50M15J17o52
$$ -742 -239 131 -878 -541 -136 -192 -840 -165 43 -242 109 314 -314 -532 -208 122 -328 87 204 -448
4831d48N11L61l81k10M50k60m47P41k95j13J33O31p97K26N70n49mK67L88r48M11
$$ -448 63 424 43 -167 283 23 -424 317 22 -91 42 673 -124 102 672 123 119 386 774 -174 237
4852B37L27m44L54L59l58q19R41n2l44J77L98m44k32K91K49n77L72nl89m2J038
$$ 237 564 120 474 833 475 -344 597 545 201 378 776 332 100 391 640 63 435 430 41 -1 1037
4873A037n40o54Q79k3q14M66K29l88j60M64rn71L87K26k99J4L34m73m8L24k04
$$ 1037 497 -157 722 699 -115 351 580 192 32 496 487 -84 303 529 230 244 578 105 57 381 177
4894A77n31P79l07j10N0K08p04K39L53l02l32M17K31p92M48N73n39m42O75o5o93
$$ 177 -354 425 118 8 58 266 -438 -199 154 -148 -480 -63 168 -624 -176 397 -142 -584 91 26 -667
4915f67N90Q3o00oN19m30q7L55j3m76M16K73o99%N50p5n22N34L1m17M03K21m22
$$ -667 -77 6 -594 -600 -81 -511 -598 -243 -256 -732 -316 -43 -742 -742 -192 -267 -789 -255 -224 -641 -238 -17 -439
4938d39n3N58n31j44L57K16o67K99M78l58q1N21m78m75R79l63m47O16M70n94l21
$$ -439 -492 66 -465 -609 -252 -36 -703 -404 74 -284 -365 156 -322 -797 182 -181 -628 -12 458 -136 -457
4959d57R23r83K30M26l7n59L80M41n06j13R11l28q06Q81k75j93M87N7k76l4L12
$$ -457 466 -517 -287 139 102 -457 -77 364 -142 -255 656 328 -478 403 128 -65 422 479 203 169 481
4980D81j36l98O06J80o11K4N88n30j95O18j84n41M29J59l08o4R11m81o95P47l58
$$ 481 345 -53 553 733 122 146 734 204 9 627 443 -98 331 490 182 118 1029 548 -147 600 242
5001B42k21K94K27k19J1N14m01m24M32K48m85j16L86p08L93J60o3l34M22P8o97
$$ 242 21 315 542 323 334 848 447 23 455 703 218 102 488 -220 173 333 270 -64 358 436 -261
5022b61L27M02p91K80K69k1p04Q82p0p55K80L74r8o86O35j82k76R9N12o39K95
$$ -261 66 468 -323 -43 226 205 -499 383 313 -442 -162 212 114 -572 63 -119 -395 -296 216 -423 -128
5043a28L21n89j88K14K48l52K10J66l76j46L85j5l68M38J58o11L64o0j15k98O23
$$ -128 193 -396 -584 -370 -122 -474 -264 -98 -474 -620 -235 -250 -618 -180 -22 -633 -269 -329 -444 -742 -119
5064a19n73J2K73N6m33N04J55m26K23L92n51kL84j24k94M40m1k45p4O96k62l32
$$ -119 -692 -680 -407 -351 -784 -280 -125 -551 -328 64 -487 -489 -105 -229 -523 -83 -124 -369 -443 253 -9 -341
5086c41L56k31P5P6K46m44jM84j70n51O51J48l81NN56n43o5Q90l69l85L00K16
$$ -341 15 -216 -141 -65 181 -263 -264 220 50 -501 150 298 -83 -78 478 -65 -130 760 391 6 306 522
5108E22k00L1K31m4o34L81j6j62N16J54n27J36M11n18j41M18o6m10N48j30l48
$$ 522 322 353 584 540 -94 287 271 109 625 779 252 388 799 281 140 558 492 82 630 500 152
5129A52k54O98Pl13M21k10n83Q64m39k07k40O13j63m04N49k8n20J9L46q5k30L17
$$ 152 -102 596 603 290 711 501 -82 782 343 136 -104 509 346 -58 491 463 -57 -38 308 223 -7 310
5151C10k44k61N37m2n59N13J98m79k4M13k74m15L67J61m26r8K70j12m52N17k42
$$ 310 66 -195 342 300 -259 254 452 -27 -51 362 88 -327 40 201 -225 -323 -53 -165 -617 -100 -342
5172c42j89M51L31n91q6M60m95n7O27l1p87N71p3l61J29M95n65k44O72k13m38
$$ -342 -531 -80 251 -340 -426 34 -461 -518 109 78 -709 -138 -211 -572 -443 52 -513 -757 -85 -298 -736
5193g36L53L95n38J46q3K03n59P09J4k94J29L35n65J21M25l00r6J68j54k16P03
$$ -736 -383 12 -526 -380 -463 -260 -819 -110 -96 -390 -261 74 -491 -370 55 -245 -341 -173 -327 -543 160
5214A60L3p12R8N16j20m78O63J23p23M40K25j06k65K15J92m27J77L24m10J40M55
$$ 160 193 -519 -421 95 -25 -503 160 283 -440 0 225 119 -146 69 261 -166 11 335 -75 65 520
5235E20m91j09O80m56k85M70M48p78J16P16o66P0L53j51j96O9L90o15K76J00j25
$$ 520 29 -80 600 144 -141 329 777 -1 115 831 165 235 588 437 241 310 700 85 361 461 336
5256C36k3N43l55o04L94L57m00N9M64m74K2K83j17m29J14L74m79R7lM0q2pL28
$$ 336 313 856 501 -103 291 648 248 307 771 297 319 602 485 56 170 544 65 162 159 199 117 110 438
5279D38p80N16M04n57j21J92R6l48K24J88m88J49L49l50k75M96j56k39J85J64
$$ 438 -342 174 578 21 -100 92 188 -160 64 252 -236 -87 262 -88 -363 133 -23 -262 -77 87
5299H7o23K35L29k87j76P09o26l65M08K12k42o0K52j68l55P27k89m27M01j4l11
$$ 87 -536 -301 28 -259 -435 274 -352 -717 -309 -97 -339 -399 -147 -315 -670 57 -232 -659 -258 -272 -583
5320e83J07L40k15n72N32J29n13L61L31o24J69M64l53l9N01m02j60K33K1J86l93
$$ -583 -476 -136 -351 -923 -391 -262 -775 -414 -83 -707 -538 -74 -427 -466 35 -367 -527 -294 -273 -87 -480
5341d80N25l29m04Q60j24l20K00J11j89k30P22j18n92M79J70m50J22L64l55j35
$$ -480 45 -284 -688 172 48 -272 -72 39 -150 -380 342 224 -368 111 281 -169 -47 317 -38 -173
5361a73N36M8n83K93L97n03J6P39j70l75L75l14j53O3L04k58M62j03l13MM4K00
$$ -173 363 411 -172 121 518 15 31 770 600 225 600 286 133 196 500 242 704 601 288 292 336 536
5383E36o05M72M35n34K00K46l39k78O83k73m97K99J61J3n10N78m32l54N41j4k37
$$ 536 -69 403 838 304 504 750 411 133 816 543 46 345 506 519 9 587 155 -199 342 328 91
5404I1oM80m52rM58n52j45L57J27n17J07N13m70k8L59l00l26K25L80o36L82M15
$$ 91 85 565 113 104 562 10 -135 222 349 -168 -61 452 -18 -46 313 13 -313 -88 292 -344 38 453
5426D53q74L72L17n05l95N46J85m62J90K02r5l38M95K4p86K32N02m77k93J018
$$ 453 -421 -49 268 -237 -632 -86 99 -363 -173 29 -66 -404 91 115 -671 -439 63 -414 -707 311
5446C11k47p08L59k28k20J13M46l62k47Q42k25m47O55l5l36R0J4k57L15L41j10
$$ 311 64 -644 -285 -513 -733 -620 -174 -536 -783 59 -166 -613 42 7 -329 -239 -225 -482 -167 174 64
5467F4o30M23K42n25J34K83n11K60M49j92l89L44L78q53L43Q56r58J09K18j3m96
$$ 64 -566 -143 99 -426 -292 -9 -520 -260 189 -3 -392 -48 330 -523 -180 676 -282 -173 45 32 -464
5488d64R70j83l64J11L90m06q3L38l29J78l4M65o44K65J01j21j98O45j49n82M76
$$ -464 506 323 -41 70 460 54 -29 309 -20 158 124 589 -55 210 311 190 -8 637 488 -94 382
5509C82N3m83N19M0j43k34N58J1n43J97J76k72k86P97n52j97L04J35n24j7O61
$$ 382 435 -48 471 511 368 134 692 703 160 357 533 261 -25 772 220 23 327 462 -62 -79 582
5530E82m29J0M40l26k23J05P2l69K84J12k78J61J99j70n00M70M75q11K06K76k91
$$ 582 153 163 603 277 54 159 231 -138 146 258 -20 141 340 170 -330 140 615 -196 10 286 -5
5551ej54M31j72n61M94M1m62k7N34p6m53K27j07j96M03J83o02N55K4m32m19P15
$$ -5 -159 272 100 -461 33 74 -388 -415 119 43 -410 -183 -290 -486 -83 100 -502 53 77 -355 -774 -59
5573e9j82l55J55M14p42L87L26m37j16M59j16k64L28J8m47J34O12l64Q7J26k75
$$ -59 -241 -596 -441 -27 -769 -382 -56 -493 -609 -150 -266 -530 -202 -184 -631 -497 115 -249 -162 -36 -311
5594c11r8J63L96n63J40M14k27p02Q87L89q03M7O13o94n5P09l81j46O1Q7k09L54
$$ -311 -409 -246 150 -413 -273 141 -86 -788 99 488 -315 -268 345 -349 -404 305 -76 -222 -161 -74 -283 71
5616G1L91n33k34Q40k88j72J22N3j75j00O32n21K09J23M5l82L33K65o59Q7L22
$$ 71 462 -71 -305 535 247 75 197 250 75 -25 607 86 295 418 463 81 414 679 20 107 429
5637D29o2m33M45j72k25J20M13l13P0M85p77J18N68m51j68L32%r7k27K51j39j89
$$ 429 367 -66 379 207 -18 102 515 202 272 757 -20 98 666 215 47 379 379 282 55 306 167 -22
5659b2N40j69k21K57K99m15m94P57m39k50N29j91k41j00J80M1n9Q6j2j51L18j17
$$ -22 518 349 128 385 684 269 -225 532 93 -157 372 181 -60 -160 20 61 2 88 76 -75 243 126
5681A26k22j8M44m05l48O50m49k30J9O89o83L05K69j89m85N69j36q31N75O11n34
$$ 126 -96 -114 330 -75 -423 227 -222 -452 -433 256 -427 -122 147 -42 -527 42 -94 -925 -350 261 -273
5702b73j0L2j2n02N02J79m59L52N4j32o5K84k30n69M98M55j028P60M35n83k60
$$ -273 -283 -251 -263 -765 -263 -84 -543 -191 -137 -269 -334 -50 -280 -849 -351 104 -924 -164 271 -312 -572
5723e72K32K64k92N76j63n40L26J28j19m85L17K25k70L28K17l73K09L18l16m79
$$ -572 -340 -76 -368 208 45 -495 -169 -41 -160 -645 -328 -103 -373 -45 172 -201 8 326 10 -469
5743d69Q94k02m13K64K51n28J08K96r0J40L7On68N67L41l79k65L29k14k98O45
$$ -469 425 223 -190 74 325 -203 -95 201 111 251 288 294 -274 293 634 255 -10 319 105 -193 452
5764D52O0m77k6M83k89K9L76m50J7L63Q2o36J59M98m04k38O93m41k48L96J75l82
$$ 452 512 35 9 492 203 232 608 158 175 538 620 -16 143 641 237 -1 692 251 3 399 574 192
5786A92J69J25l90k41Q17k00k10K48j67m04J89L59j45n81P55k81n20Q04n09k97
$$ 192 361 486 96 -145 672 472 262 510 343 -61 128 487 342 -239 516 235 -285 519 10 -287
5806b87K84K20n06L0J99J05n81L58L39k51P9L36o36PM33k85j51l9L79l13J82J35
$$ -287 -3 217 -289 -259 -60 45 -536 -178 161 -90 -11 325 -311 -304 129 -156 -307 -346 33 -280 -98 37
5828C7l71j34N27j7l30K33J19l67l54M94k40m91P67nm95J87M55l82P7K20m56O7
$$ 37 -334 -468 59 42 -288 -55 64 -303 -657 -163 -403 -894 -127 -132 -627 -440 15 -367 -290 -70 -526 -459
5850d59K40K01l14j60L84k25p6L84k18j33M01j16l93J23L06j19m8M56k37l46P5
$$ -459 -219 -18 -332 -492 -108 -333 -409 -25 -243 -376 25 -91 -484 -361 -55 -174 -222 234 -3 -349 -274
5871b74M64m97R3L00k20J84j96L49l14N36q2o8q3L52l18j31L31j66m52K24M71
$$ -274 190 -307 -214 86 -134 50 -146 203 -111 425 343 275 192 544 226 95 426 260 -192 32 503
5892E03j93J05K50l04m46M54J59n93M3O92n31O9J6K06l13M56j12l46J8L89o75
$$ 503 310 415 665 361 -85 369 528 -65 -22 670 139 208 224 430 117 573 461 115 133 522 -153
5913a53M5O81m13j31L20j9m86L63L04l28O9K27m20n9P9K67j92R7j5j60Q5K94m19
$$ -153 -108 573 160 29 349 330 -156 207 511 183 252 479 59 0 79 346 154 251 236 76 161 455 36
5936C6l19M16l7j24j46L85k28m10N14k87r2M98j78l41O0J38j53n7M60k90l89J48
$$ 36 -283 133 96 -28 -174 211 -17 -427 87 -200 -292 206 28 -313 -253 -115 -268 -325 135 -155 -544 -396
5958c96M62n05O4M33m33l01L38K22n12K20N83q37K11K96N6o59L84K28k87K49J79
$$ -396 66 -439 -375 58 -375 -676 -338 -116 -628 -408 175 -662 -451 -155 -99 -758 -374 -146 -433 -184 -5
5979en12M8N70j59l53J42K7l7P1K49n40J42O08l60k18K60K65o27J51L73m20M0
$$ -5 -517 -469 101 -58 -411 -269 -242 -279 -208 41 -499 -357 251 -109 -327 -67 198 -429 -278 95 -325 -285
6001b85L44k48J16J77Q5k23L79l7k87M2J36k26k9L22M0n21N00l6j74r9K07k1r
$$ -285 59 -189 -73 104 189 -34 345 308 21 63 199 -27 -56 266 306 -215 285 249 75 -24 183 162 153
6024A53J62Q2j25k4J71l1j81K39L58q82O72j31j18J0K9j9n85O06K11n54K62J18
$$ 153 315 397 272 248 419 388 207 446 804 -78 594 463 345 355 384 365 -220 386 597 43 305 423
6046D23k84j56N28k13k11K61M37p02n0N90n95r5N10l01j86M05k58j65J85J60l28
$$ 423 139 -17 511 298 87 348 785 83 33 623 28 -67 443 142 -44 361 103 -62 123 283 -45
6067d5O8k66K95l39L25J07m21L13L6n73K36M65j10n25P2K28j42o6O98o46k89L96
$$ -45 23 -243 52 -287 38 145 -276 37 73 -500 -264 201 91 -434 -362 -134 -276 -342 356 -290 -579 -183
6089a83K2k35K87J5k69J7M78m88j82N10k00k62N6M08j47q9K11k01m99J044n45
$$ -183 -161 -396 -109 -94 -363 -346 132 -356 -538 -28 -228 -490 -434 -26 -173 -262 -51 -252 -751 293 -252
6110b52j38L13l0m9j55M50j43m43M55O2m01L67k96R3P6L77k99o26P37N6m47j46
$$ -252 -390 -77 -107 -156 -311 139 -4 -447 8 70 -331 36 -260 -167 -91 286 -13 -639 98 154 -293 -439
6132d39P17m10j40Q35l51n48N84K65q75L76J79j73j1R7K19j59OP1m2Q0k3r1j10
$$ -439 278 -132 -272 563 212 -336 248 513 -362 14 193 20 9 106 325 166 172 243 201 281 258 167 57
6155E7M26K10o79J19L14k14J06L22j88l41N52m8l61J48K29l84J75o8m0q33J129
$$ 57 483 693 14 133 447 233 339 661 473 132 684 636 275 423 652 268 443 375 335 -498 631
6176F31l53n3k82P73o61l31N92K27p11M40J31m95J97L52k61o00K12M31m50L07
$$ 631 278 225 -57 716 55 -276 316 543 -168 272 403 -92 105 457 196 -404 -192 239 -211 96
6196I6N8p9l26N99l12k96L16j39m50M96Q0l65K53J37k1n77O26rq21K22N03k57
$$ 96 154 75 -251 348 36 -260 56 -83 -533 -37 43 -322 -69 68 47 -530 96 87 -734 -512 -9 -266
6218b66j12M95j15n37O32j85l04l7K93l04J81K62j81l35M18Kl83K24qj53L31l27
$$ -266 -378 117 2 -535 97 -88 -392 -429 -136 -440 -259 3 -178 -513 -95 -93 -476 -252 -260 -413 -82 -409
6240d09M26l78M68j66j05j67L49r2j99M38q7l34J95L6j82J07J01qj15K65ln38
$$ -409 17 -361 107 -59 -164 -331 18 -74 -273 165 78 -256 -61 -25 -207 -100 1 -7 -122 143 140 -398
6262c98M28L1M6m26R21k33m40K93N1l22L83j29l54M45oR5m60M90k15k10N31K1
$$ -398 30 61 107 -319 602 369 -71 222 273 -49 334 205 -149 296 290 385 -75 415 200 -10 521 542
6284E42l61l74P37k31j64M16n18r2N08K8j84l24M93j33j10J8K57k42k15K69J42
$$ 542 181 -193 544 313 149 565 47 -45 463 491 307 -17 476 343 233 251 508 266 51 320 462
6305D62p04O08k26J52Q7K27m20q5MJ3k1K18R0l49J89m3p5k98L67p8k23P3N15q24
$$ 462 -242 366 140 292 379 606 186 101 105 118 97 315 405 56 245 202 127 -171 196 118 -105 -32 483 -341
6329c41J84K05j47O1J18k16LL0K06o59L96J21j61k6pJ20l01K82p8j62p3N59o43
$$ -341 -157 48 -99 -38 80 -136 -133 -103 103 -556 -160 -39 -200 -226 -233 -113 -414 -132 -210 -372 -445 114 -529
6352e29O7J76K13m06M29Ok65j61M88k22m90Q87j33k28k7r4j42J53J53j56j78r4
$$ -529 -462 -286 -73 -479 -50 -44 -309 -470 18 -204 -694 193 60 -168 -195 -289 -431 -278 -125 -281 -459 -553
6374e53L51m08L14L92n64R8N92j47m93P87l68l03K56J5J0k65L53q3j92L45n0l37
$$ -553 -202 -610 -296 96 -468 -370 222 75 -418 369 1 -302 -46 -31 -21 -286 67 -16 -208 137 87 -250
6396b50K01M26l81k80M64j17j19K08K23n45J08M65m76J3N90j07n31O33o80J95
$$ -250 -49 377 -4 -284 180 63 -56 152 375 -170 -62 403 -73 -60 530 423 -108 525 -155 40
6416D0L08L7l29K3O3J49L1K16l23J51m1K4P1m54M66k06L3JN57q25K39J62k54l65
$$ 40 348 385 56 79 142 291 322 538 215 366 325 349 420 -34 432 226 259 260 817 -8 231 393 139 -226
6440b26L49J70l6q0J18k52j79N52o60%L76L40n40J23N59r45L18K71p0o51O79q9
$$ -226 123 293 257 177 295 43 -136 416 -244 -244 132 472 -68 55 614 -331 -13 258 188 -463 216 127
6462A27l95M66L27n34k20J99j70Ok5J76l54L58J02j01q8L4p8o9K56l23L4k33O80
$$ 127 -268 198 525 -9 -229 -30 -200 -194 -219 -43 -397 -39 63 -38 -126 -92 -170 -239 17 -306 -272 -505 175
6485A75n62N9J51L00n28J43M04p73M08J99m9l54M32m72Q9K02L67o20M9L77o47
$$ 175 -387 -328 -177 123 -405 -262 142 -631 -223 -24 -73 -427 5 -467 -378 -176 191 -429 -380 -3 -650
6506f50P6N37P1k13K7L90j76k95M15l36j32M00k09j27o5N54m64N2K04J42m36N77
$$ -650 -574 -37 34 -179 -152 238 62 -233 182 -154 -286 114 -95 -222 -287 267 -197 -145 59 201 -235 342
6528C42jl18K93J76n61r3K15J01l32N89M8m03J93K73o05j57N43M9l80K10J66j98
$$ 342 341 23 316 492 -69 -162 53 154 -178 411 459 56 249 522 -83 -240 303 352 -28 182 348 150
6550A50J34o6j33K87J63n15k95N74K85k5k65K6k88j6M25j47j31P3k6k87K82mr4
$$ 150 284 218 85 372 535 20 -275 299 584 559 294 320 32 16 441 294 163 236 210 -77 205 201 107
6573A07l49O61m38J69j67K1j07J87K60l12m8J70Qk69j43N20k68l23M35k23L23
$$ 107 -242 419 -19 150 -17 4 -103 84 344 32 -16 154 162 -107 -250 270 2 -321 114 -109 214
6594B14l96J78k16J50M51k91l19K54j93m54M83J84k33k5J46n55J76K65L19p09
$$ 214 -182 -4 -220 -70 381 90 -229 25 -168 -622 -139 45 -188 -213 -67 -622 -446 -181 138 -571
6614e71N75j7l08r2L14J65l63J98Lk40Q2K3o9R4M16n62l03M48N11p55J33pJ17
$$ -571 4 -13 -321 -413 -99 66 -297 -99 -96 -336 -254 -231 -300 -206 210 -352 -655 -207 304 -451 -318 -325 -208
6637b08J86Mj43k13K32O0k17L37L44p32K84K63K43n30J92j37k45L39J61m9j91
$$ -208 -22 -18 -161 -374 -142 -82 -299 38 382 -350 -66 197 440 -90 102 -35 -280 59 220 171 -20
6658b0K56o0r0Q9m41J62L29J60n91O6N97j87n22P81j01l74P2K18m26R9M31l52
$$ -20 236 176 86 175 -266 -104 225 385 -206 -140 457 270 -252 529 428 54 126 344 -82 17 448 96
6680I6j76L08P1j84K5N74o85jJ87K72k48j9K92o16m3O92m76J13R6k36j19N27%
$$ 96 -80 228 299 115 140 714 29 28 215 487 239 220 512 -104 -147 545 69 182 278 42 -77 450 450
6703D50l28j05M08j51o00M86K46m00J30J06k69k57K66o6J48L04k48k12l0J86l40
$$ 450 122 17 425 274 -326 160 406 6 136 242 -27 -284 -18 -84 64 368 120 -92 -122 64 -276
6724b76Q6n1K58m16L50K01m07K81Ml09M9O6j80L3j05L82n04L12L43l38j93J33
$$ -276 -190 -241 17 -399 -49 152 -255 26 30 -279 -230 -164 -344 -311 -416 -34 -538 -226 117 -221 -414 -281
6746b81N2j15nN15m61J27N8j00l02M76K6n1K9P4l55j73K11K63m64P06k80l93K08
$$ -281 -229 -344 -349 166 -295 -168 -110 -210 -512 -36 -10 -61 -32 42 -313 -486 -275 -12 -476 230 -50 -443 -235
6769b35j20l3K66M3J2k84M84J38o89J38P04m03k51K37O9j04J48m2k78J18M06Q1
$$ -235 -355 -388 -122 -79 -67 -351 133 271 -418 -280 424 21 -230 7 76 -28 120 78 -200 -82 324 405
6791D05k90J56M6l73N9J99j19R4L43l76M5k88L86m29K41K07j72k30O64k50k0K9
$$ 405 115 271 317 -56 3 202 83 177 520 144 189 -99 287 -142 99 306 134 -96 568 318 298 327
6813C27J81l98N5N37m99J9K3K81l32L02k49k89o3N94o32L73M13o40j0L32J43n82
$$ 327 508 110 165 702 203 222 245 526 194 496 247 -42 -105 489 -143 230 643 3 -7 325 468 -114
6835a14K61J64o61L18L37l54Q1L37j24k87L04l46R7k43L33n0j57L1J06l62L80
$$ -114 147 311 -350 -32 305 -49 32 369 245 -42 262 -84 13 -230 103 53 -104 -73 33 -329 51
6856E1j7m75J53K90p5r4Q8J06l08j16L89j97j44Q6K14k22n5Q9l22J68M54j31l05
$$ 51 34 -441 -288 2 -73 -167 -79 27 -281 -397 -8 -205 -349 -263 -49 -271 -326 -237 -559 -391 63 -68 -373
6879c73L90n03K3N12o7k34mJ34p1k15L71k90j59L83J0o5k46K32Q1j68L03j91R8
$$ -373 17 -486 -463 49 -18 -252 -256 -122 -193 -408 -37 -327 -486 -103 -93 -158 -404 -172 -91 -259 44 -147 -49
6902d9L3M1l35K79J5r8j73M24Q3o19J15M96j20n25N08j34j07N67j60n17L74L99
$$ -49 -16 25 -310 -31 -16 -114 -287 137 220 -399 -284 212 92 -433 75 -59 -166 401 241 -276 98 497
6924D97j020N52J86l24L9K70K2j79J38p0J02k20M01Qj87n3J65j33j7J71R6n19
$$ 497 -523 29 215 -109 -70 200 222 43 181 111 213 -7 394 402 215 162 327 194 177 348 444 -75
6946g5N01j18n05K17K92j35j10K44j81k8K60l19r8J39Q3R0j00K11j89k38L83k37
$$ -75 426 308 -197 20 312 177 67 311 130 102 362 43 -55 84 167 257 157 368 179 -59 324 87
6968H7J8q0M11q41M86K5J40J31l1l26k06K54n8n5m83M28J02k03K32P6m78K25Q3
$$ 87 105 25 436 -405 81 106 246 377 346 20 -186 68 10 -45 -528 -100 2 -201 31 107 -371 -146 -63
6991f3j01K1J08N56o95J21j49k89L38K94l10l08M72j45j70K44K73m81K41j27J2
$$ -63 -164 -143 -35 521 -174 -53 -202 -491 -153 141 -169 -477 -5 -150 -320 -76 197 -284 -43 -170 -158
7012a58j86K17J19k31qK41l11M8L76m63j54N92j92l81K74L32m11k0L21p5j50Q1
$$ -158 -344 -127 -8 -239 -247 -6 -317 -269 107 -356 -510 82 -110 -491 -217 115 -296 -316 5 -70 -220 -139
7034a39L7j89j9L10q1l72M34p1j65L54rl33K66R3j6l95M30K5j19O4r6K46k48L63
$$ -139 -102 -291 -310 0 -81 -453 -19 -90 -255 99 90 -243 23 116 100 -295 135 160 41 105 9 255 7 370
7058C70k92j72K00J57j00J29N76p42n7N8K59q0k4L8l36J25J73j17J08L16m17J49
$$ 370 78 -94 106 263 163 292 868 126 69 127 386 306 282 320 -16 109 282 165 273 589 172 321
7080C21%j9k81MK89l84J09K59j62k3J56K88p11L14J36j65j54K46m08Q5J19K43
$$ 321 321 302 21 25 314 -70 39 298 136 113 269 557 -154 160 296 131 -23 223 -185 -100 19 262
7102B62j73j50L31k09l05P77k63j91j95K15l80k84M48J5J5P0l24K1L94j50k33
$$ 262 89 -61 270 61 -244 533 270 79 -116 99 -281 -565 -117 -102 -87 -17 -341 -320 74 -76 -309
7123c09J75O26o32q9K99k89k37N24o3j98q6J42r5P8K62j89j38l7K20l49J63J32
$$ -309 -134 492 -140 -229 70 -219 -456 68 5 -193 -279 -137 -232 -154 108 -81 -219 -256 -36 -385 -222 -90
7145i0K5j46J40J0o29M61J85q5k06N46l53M3N6j9k92M36R7l18p0J42J55l81J98
$$ -90 -65 -211 -71 -61 -690 -229 -44 -129 -335 211 -142 -99 -43 -62 -354 82 179 -139 -209 -67 88 -293 -95
7168i5l1j47J61K72j15j73J12l9j44J80L5l03K08J93r4M7J97k51j77L95J42m84
$$ -95 -126 -273 -112 160 45 -128 -16 -55 -199 -19 16 -287 -79 114 20 67 264 13 -164 231 373 -111
7190a11kL44j81LJ51R8k28K3Q2l18N08J49j01n95O14jl09qM34l65m90P73m30l10
$$ -111 -113 231 50 53 204 302 74 97 179 -139 369 518 417 -178 436 435 126 118 552 187 -303 470 40 -270
7214b70Q36k42n66L85J9K44n13O67n19K57q8M5k61J3L1n0o0M25k48j53L60k50
$$ -270 566 324 -242 143 162 406 -107 560 41 298 210 255 -6 7 38 -12 -72 353 105 -48 312 62
7236F2j24N19j70m63N3M14j44l57K06K37n54L03K15l09r2K29J2m45M70Lk55j73
$$ 62 -62 457 287 -176 -123 291 147 -210 -4 233 -321 -18 197 -112 -204 25 37 -408 62 65 -190 -363
7258c63M57l83k6M03k29k95R4J49j20K39rl04j20N89j12l31K17K3k78r8L28R4
$$ -363 94 -289 -315 88 -141 -436 -342 -193 -313 -74 -83 -387 -507 82 -30 -361 -144 -121 -399 -497 -169 -75
7280g5k12L45k70l05M20J35m86P0O58j80m33J52OJ03J48O0j80n87O95J42n45K82
$$ -75 -287 58 -212 -517 -97 38 -448 -378 280 100 -333 -181 -175 -72 76 136 -44 -631 64 206 -339 -57
7302e7J06k22J20L2l24L48J3j95J33r6M33K62o44M36q7M4k19J60k54nL26j23n5
$$ -57 49 -173 -53 -21 -345 3 16 -179 -46 -142 291 553 -91 345 258 302 83 243 -11 -16 310 187 132
7325A32M55m09j19j7K52n2m11M91l8j81L18j37l52K94J65k16k33L54J1m62O99
$$ 132 587 178 59 42 294 242 -169 322 284 103 421 284 -68 226 391 175 -58 296 307 -155 544
7346E44r9o84L37J79l98N01J83m63l28M98j83r9J93J49k10j26K93k90j8K42K5
$$ 544 445 -239 98 277 -121 380 563 100 -228 270 87 -12 181 330 120 -6 287 -3 -21 221 246
7367B46n94N44R7j09r8L61m92l87O60k32r3k80K30j47K82L9K63l00j36N0n02N65
$$ 246 -348 196 293 184 86 447 -45 -432 228 -4 -97 -377 -147 -294 -12 27 290 -10 -146 -96 -598 -33
7389c3P0j91J37j69M0j97K63n3l09rK04n7k22M18m3k63L92rk95M0L78m22p9L76
$$ -33 37 -154 -17 -186 -146 -343 -80 -133 -442 -451 -247 -304 -526 -108 -151 -414 -22 -31 -326 -286 92 -330 -409 -33
7413c3l59N6K86P2m97M37K61l78j63N51n92j6M26j57m46K43L47m57J78ML25m03
$$ -33 -392 -336 -50 22 -475 -38 223 -155 -318 233 -359 -375 51 -106 -552 -309 38 -419 -241 -237 88 -315
7435c15O43l14l13K45M6J3l9L58k07m39K29L69j71j69L37rr7j55j15j11M40J85
$$ -315 328 14 -299 -54 -8 5 -34 324 117 -322 -93 276 105 -64 273 264 167 12 -103 -214 226 411
7457D11k86q8K62j62m0K85M6l97K52L85n52l29N83O8j34j81R1k68oL34k41k4M19
$$ 411 125 37 299 137 97 382 428 31 283 668 116 -213 370 438 304 123 214 -54 -60 274 33 9 428
7480D28J14o37J80N8Jj67K84j72l21M37j20j6J76j74j18J43j9k06K66k21l0J33
$$ 428 542 -95 85 143 144 -23 261 89 -232 205 85 69 245 71 -47 96 77 -129 137 -84 -114 19
7502A9j05M31m20P4%j85j67K99j83K47l6K9j53J90q2l02K89L5N6l86M30j36k24
$$ 19 -86 345 -75 -1 -1 -186 -353 -54 -237 10 -26 3 -150 40 -42 -344 -55 -20 36 -350 80 -56 -280
7525b80L59m3m49m8M93j90j92j77K92N7l11N21k43m04N43m9l29J60M41r6j83K66
$$ -280 79 36 -413 -461 32 -158 -350 -527 -235 -178 -489 32 -211 -615 -72 -121 -450 -290 151 55 -128 138
7547A38j12o08L12K28n51K76K72j5k18M93m19k63K72K2M3n1L98l69k06P01l37
$$ 138 26 -582 -270 -42 -593 -317 -45 -60 -278 215 -204 -467 -195 -173 -130 -181 217 -152 -358 343 6
7568Fj6Q5j25pk9L28J13m38M01k76j01j2O21k56m35L76k56j05K98L64k77j4K40
$$ 6 -10 75 -50 -57 -86 242 355 -83 318 42 -59 -71 550 294 -141 235 -21 -126 172 536 259 245 485
7591D85p19L28lQ8l59M81l1j1n1J55k57m63O41N0M8l65n3Q9J00N8M1m13J22L79
$$ 485 -234 94 91 179 -180 301 270 259 208 363 106 -357 284 334 382 17 -36 53 153 211 252 -161 -39 340
7615C40P8l68R5L5o1J11j00l11N45k85k36J79K78m07J99J77l80j9K02j7k11J76
$$ 340 418 50 145 180 119 230 130 -181 364 79 -157 22 300 -107 92 269 -111 -130 72 55 -156 20
7637B0K56k71J2J30k42r2K40J6m47K49L2q5L9J06P7j92J02o1k41K55L64l41j67
$$ 20 276 5 17 147 -95 -187 53 69 -378 -129 -97 -182 -143 -37 40 -152 -50 -111 -352 -97 267 -74 -241
7660b41M16n61K41K1K55l22J14K44m15m9M16k52l03J80J19j94K86J21l03k78M73
$$ -241 175 -386 -145 -124 131 -191 -77 167 -248 -297 119 -133 -436 -256 -137 -331 -45 76 -227 -505 -32
7681c2m4r5K72k68k5K37Rj84L1k04M35m27K03L32l73J48j95J17k04L73K19n41
$$ -32 -76 -171 101 -167 -192 45 54 -130 -99 -303 132 -295 -92 240 -133 15 -180 -63 -267 106 325 -216
7703b16N26j94n9j15K48j57p3j42L56k55L18J37m51K16l2J05j63J68K65n47M0
$$ -216 310 116 57 -58 190 33 -40 -182 174 -81 237 374 -77 139 107 212 49 217 482 -65 -25
7724b5N50n92nK68O3j85L54q7j74l8K72k20r3J25l1m3K69Kk97M4j1n4j21K15N9
$$ -25 525 -67 -72 196 259 74 428 341 167 129 401 181 88 213 182 139 408 410 113 157 146 92 -29 186 245
7749B45m98M66j5j31m2J67m12L13J49p7n70K29M77m61J11k88K11j12O4N18l97
$$ 245 -253 213 198 67 25 192 -220 93 242 165 -405 -176 301 -160 -49 -337 -126 -238 -174 344 -53
7770e3O8k31J10R3J90k67k58M53j50k38J30r4J93M0M8J06n98P46m80J63k45L68
$$ -53 15 -216 -106 -13 177 -90 -348 105 -45 -283 -153 -247 -54 -14 34 140 -458 288 -192 -29 -274 94
7792I4r8l83M80j42L1L5m9m45L22K28l04j99L31L69n58M68j9m62K61p3J89m12
$$ 94 -4 -387 93 -49 -18 17 -32 -477 -155 73 -231 -430 -99 270 -288 180 161 -301 -40 -113 76 -336
7814c36K05L1l57M60p8j62J49O4r2k22K02K15k37K93J00l04P1M2j40n9N77m22
$$ -336 -131 -100 -457 3 -75 -237 -88 -24 -116 -338 -136 79 -158 135 235 -69 2 44 -96 -155 422 0
7836@j56K77K48n50J73K87n55K10O32k57k97J51l3M1k6M77l74n33P48l19k17K06
$$ 0 -156 121 369 -181 -8 279 -276 -66 566 309 12 163 130 171 145 622 248 -285 463 144 -73 133
7858A33o9J15j74K36q1J5j37J9J52j42L49n39r1N04Q0j66j37K33k56J71Q5j77
$$ 133 64 179 5 241 160 175 38 57 209 67 416 -123 -214 290 370 204 67 300 44 215 300 123
7880A23pM07n68L64j16K81l27k0J11j36J5Q4j65k33J94l10M88j41J52l03k11J36
$$ 123 116 523 -45 319 203 484 157 137 248 112 127 211 46 -187 7 -303 185 44 196 -107 -318 -182
7902a82K66m49K72K81k49j08J35j88j2J63j8l56K93K5o4r9N43l32k45K88k58k11
$$ -182 84 -365 -93 188 -61 -169 -34 -222 -234 -71 -89 -445 -152 -127 -191 -290 253 -79 -324 -36 -294 -505
7924e05K67o5J10oM18o00O6N7J08Q5l76K41J73k26N42k60m53R4K15p3L6J90j12
$$ -505 -238 -303 -193 -199 219 -381 -315 -258 -150 -65 -441 -200 -27 -253 289 29 -424 -330 -115 -188 -152 38 -74
7947g4j92J55L43l63K52k52L11j83L2J31k72K66k00M8k93L55m87K59K12P7l11
$$ -74 -266 -111 232 -131 121 -131 180 -3 29 160 -112 154 -46 2 -291 64 -423 -164 48 125 -186
7968a86L69m7k27L6M93m31P4m3J80m49N29Jl57K9M33m12J27K13q4j37J6J63l10
$$ -186 183 136 -91 -55 438 7 81 38 218 -231 298 299 -58 -29 404 -8 119 332 248 111 127 290 -20
7991b0L2R2n2J76k69L50l74K61L2o00M42L44r7q2J27k58Q3r9J89j66k52N94l41
$$ -20 12 104 52 228 -41 309 -65 196 228 -372 70 414 317 235 362 104 187 88 277 111 -141 453 112
8014A12J92j74j82r6J38M34l55l4j5r8j47L31k75m9Q6K94k13j38O8J35l68M45
$$ 112 304 130 -52 -148 -10 424 69 35 20 -78 -225 106 -169 -218 -132 162 -51 -189 -121 14 -354 91
8036I1k7m48L21p2k59l0L28j89L75k78M38o09K49K08p5q0R9j93j09K10k57K01
$$ 91 64 -384 -63 -135 -394 -424 -96 -285 90 -188 250 -359 -110 98 23 -57 42 -151 -260 -50 -307 -106
8058a06J80q0l18N0Q2J84j55K09j21k84L39L6j93K40m1o0j82l1K00K9k95N36k31
$$ -106 74 -6 -324 -274 -192 -8 -163 46 -75 -359 -20 16 -177 63 22 -38 -220 -251 -51 -22 -317 219 -12
8081a2m53K67M57j24j37P1j18K1K90k21k98M68j6l11L16j45m7n3K72j84k62L33
$$ -12 -465 -198 259 135 -2 69 -49 -28 262 41 -257 211 195 -116 200 55 8 -45 227 43 -219 114
8103A14J41q1K99k41l4l10n7O13k59O1J70n72K73K96k91k05L67j16L3O6M2m49
$$ 114 255 174 473 232 198 -112 -169 444 185 246 416 -156 117 413 122 -83 284 168 201 267 309 -140
8125a40J34L55m6m00K77k47j20O27j66m75K20L38l3l94L04O4j99l2Q5l11L64n2
$$ -140 -6 349 303 -97 180 -67 -187 440 274 -201 19 357 324 -70 234 298 99 67 152 -159 205 153
8147A53j80L53p22M86k94L21j58j32J43K86n53M05m5n7k04J60n6k88L88k79M81
$$ 153 -27 326 -396 90 -204 117 -41 -173 -30 256 -297 108 63 6 -198 -38 -94 -382 6 -273 208
8168B08m30l2J04o6j23N12l82K5J80l8l87O00l27j56L35O5m9n14M21L7j20p7K98
$$ 208 -222 -254 -150 -216 -339 173 -209 -184 -4 -42 -429 171 -156 -312 23 88 39 -475 -54 -17 -137 -214 84
8191H4
$$ Imaginary data points
##PAGE= N=2
##DATA TABLE= (X++(I..I)), XYDATA
0@%%%%%%%%%%%%qJ6j6J6j6J6k4L2l2L6m4N0n8O6p4Q6r8J10j24J40j58J76j96K19
$$ 0 0 0 0 0 0 0 0 0 0 0 0 0 -8 8 -8 8 -8 8 -16 16 -16 20 -24 26 -32 34 -40 46 -52 58 -66 74 -84 92 -104 115
36A15k43K69k98L30l66M06m49M97n51O10o79P58q44R46j068J212j388J612j902
$$ 115 -128 141 -157 173 -193 213 -236 261 -290 320 -359 399 -445 501 -567 645 -743 869 -1033
55a033K295k868L775n438R496l5696o6651L6620L3353J2959l253n769j9041l927
$$ -1033 1262 -1606 2169 -3269 6227 -29469 -96120 -59500 -26147 -13188 -16441 -22210 -41251 -45178
69d5178K597l347J346J7578N337m182k750j4711k1937J2478L1611M051j5061o707
$$ -45178 -42581 -45928 -44582 -27004 -21667 -25849 -28599 -43310 -65247 -52769 -21158 -17107 -32168 -38875
83c8875q501p424J1637R815q602J054J0506o950j1100L231N53k098J4406J1843
$$ -38875 -47376 -54800 -43163 -33348 -41950 -40896 -30390 -37340 -48440 -45209 -44656 -46754 -32348 -20505
97b0505j0919q507M846j600J389J7167N248j0587L176Q481o253j833J1794L525
$$ -20505 -31424 -39931 -35085 -36685 -35296 -18129 -12881 -23468 -20292 -11811 -18064 -19897 -8103 -4578
111d578j151Q574l5j0529L666Q373n049K138J2981n294j2404O512N614r909Q48
$$ -4578 -5729 2845 2810 -7719 -4053 4320 -729 1409 14390 9096 -3308 3204 8818 -1091 -243
126b43J0189l958n403M469l310o616O004K473p194M015P547r321n640R649n70
$$ -243 9946 5988 585 5054 1744 -4872 1132 3605 -3589 426 7973 -1348 -6988 2661 2091
141B091p912P431P214r049j112P894l803m643Q379J763o479N244M381r022j003
$$ 2091 -5821 1610 8824 -225 -1337 6557 2754 -1889 6490 8253 1774 7018 11399 2377 1374
156A374Q521m230m029Q934J57j0868K549O368q165j832Q390l116p128O294j86
$$ 1374 9895 5665 1636 10570 10727 -141 2408 8776 611 -1221 7169 4053 -3075 3219 3033
171C033r043K596O085o165q21P690n787q171P961L609q642K294Q002o273m403
$$ 3033 -6010 -3414 2671 -3494 -4315 3375 -2412 -10583 -2622 987 -7655 -5361 2641 -3632 -8035
186h035P465j635o014N823M037o304J757M524p531k158R597j473q388O271L800
$$ -8035 -570 -2205 -8219 -2396 1641 -4663 -2906 1618 -5913 -8071 1526 53 -8335 -2064 1736
201A736r297L84P342n230n054Q323M98q117L207L418o955Q47P800m718m560P594
$$ 1736 -7561 -7177 165 -5065 -10119 -1796 -1298 -9415 -6208 -2790 -9745 -8898 -1098 -5816 -10376 -2782
217b782k83q006N809N378p346M7R367l106o697O924J641o295N178N321o267q92
$$ -2782 -3065 -11071 -5262 116 -7230 -7183 2184 -922 -7619 -695 946 -5349 -171 5150 -1117 -2009
233b009P432m162m852P842J364p303L568O696p787l776Q514j276n895N781K326
$$ -2009 5423 1261 -3591 4251 5615 -1688 1880 8576 789 -2987 5527 4251 -1644 4137 6463
248F463p762J573N417n435j802P400k071n903O433K332q883J787P976m220l350
$$ 6463 -1299 274 5691 256 -1546 5854 3783 -2120 4313 6645 -2238 -451 7525 3305 -45
263d5P226r35p031M676M709o269Q62O616m480l360O894j543o764N685M945p080
$$ -45 7181 6246 -785 3891 8600 2331 3193 9809 5329 1969 8863 7320 556 6241 11186 4106
279D106m81O636n081n199P763J265p212K916M703o544j609O115l799m407P395
$$ 4106 3625 10261 5180 -19 7744 9009 1797 4713 9416 2872 1263 7378 3579 -828 6567
294F567Q35p527K048M457o594q31Q203k831p028N489K322o962J562N230n335j255
$$ 6567 7402 -125 1923 6380 -214 -1045 7158 4327 -2701 2788 5110 -1852 -290 4940 -395 -1650
310a650P008l022o669M753K250o021K615O017p287l659O961r17o556M477L417
$$ -1650 5358 2336 -4333 420 2670 -3351 -736 5281 -2006 -5665 1296 379 -6177 -1700 1717
325A717o722R88N446n477l989O377K66n861M306K229p813P48O717m315l560O836
$$ 1717 -5005 -4017 1429 -4048 -8037 -1660 -1394 -7255 -2949 -720 -8533 -7785 -1068 -5383 -8943 -2107
341b107o3p128L612M148o339l78O372k208m223N051j2o406M325M473n566n84O633
$$ -2107 -2170 -9298 -5686 -1538 -7877 -8255 -1883 -4091 -8314 -3263 -3275 -9681 -5356 -883 -6449 -7033 -400
358d00l638n030O244J913o352K592N426n143j850O009k436m399N881J724n705
$$ -400 -4038 -9068 -2824 -911 -7263 -4671 755 -4388 -6238 -229 -2665 -7064 -1183 541 -5164
373e164K388M720n489j927P760j613n321N425K572o706J398N808l835k668O756
$$ -5164 -2776 1944 -3545 -5472 2288 675 -4646 779 3351 -3355 -1957 3851 16 -2652 4104
388D104o46n381M145K647o165K009O143m201l283O291o74o356M825M320o343k00
$$ 4104 3458 -1923 2222 4869 -1296 713 6856 2655 -628 5663 4989 -1367 3458 7778 1435 1235
404A235O807l417m358N403K9m964L891L895n941q81N912l393l689O512P37p004
$$ 1235 8042 4625 267 5670 5699 735 4626 8521 2580 1699 7611 4218 529 7041 7778 774
420G74K904M468n274j955N764j596m599M806R81o301J505M210m220j166N823l248
$$ 774 3678 8146 2872 917 6681 5085 486 5292 6273 -28 1477 5687 1467 301 6124 2876
436B876n217M754J731o152J283M820m474k554N256j642n571M476K375n562O84
$$ 2876 -2341 2413 4144 -2008 -725 4095 -379 -2933 2323 681 -4890 -414 1961 -3601 -2917
451b917M437m591k945O075q43n066L355K788o189J76N659l975l287N284N28n580
$$ -2917 1520 -3071 -6016 59 -784 -5850 -2495 293 -5896 -5720 -61 -4036 -7323 -2039 -1511 -7091
467g091K523K998n350J36N835l694l422M889P7n517L324M242n527r36O024k307
$$ -7091 -4568 -1570 -6920 -6784 -949 -4643 -8065 -3176 -3099 -8616 -5292 -1050 -6577 -7513 -1489 -3796
483c796m383M520R55m752K893M439n343q13M925j560l510M982J217n266J972M893
$$ -3796 -8179 -3659 -2704 -7456 -4563 -124 -5467 -6280 -1355 -2915 -6425 -1443 -226 -5492 -3520 1373
499A373m093k369N982r01l711M563J938n576Q74N344l130j953N395j209m566M642
$$ 1373 -2720 -5089 893 -8 -3719 844 2782 -2794 -1920 3424 294 -1659 3736 2527 -2039 2603
515B603K347n539N82O011l210k741M984m04n042L434L727m680J06M712k831k633
$$ 2603 4950 -589 -7 6004 2794 53 5037 4633 -409 3025 6752 2072 2178 6890 4059 1426
531A426N109m69m804L882L106n038o70N728l097l422M881J011n085J800L624m530
$$ 1426 6535 6066 1262 5144 8250 3212 2542 8270 5173 1751 6632 7643 2558 4358 7982 3452
547C452p78M710k322l495M475P65n891K140L640m491j467N339k401m777M169J668
$$ 3452 2674 7384 5062 1567 6042 6807 916 3056 6696 2205 738 6077 3676 -1101 3068 4736
563D736n319P27M118l945j540M301k020m507M034J814m925R09M035m301k560N249
$$ 4736 -583 144 4262 317 -1223 3078 1058 -3449 585 2399 -2526 -1617 2418 -1883 -4443 806
579H06n57n052L207K614m748k1M077l090k447M761n99m464L058K190n326L48N383
$$ 806 249 -4803 -1596 1018 -3730 -3751 326 -2764 -5211 -450 -1049 -5513 -2455 -265 -5591 -5243 140
596A40k987l567M690K45n104J973L190m064l95M311j682l762L583Q04m191K385
$$ 140 -2847 -6414 -1724 -1479 -6583 -4610 -1420 -5484 -5879 -1568 -3250 -7012 -3429 -2625 -6816 -4431
612d431L672m335j301N311j743l704M523R37m152J693L795l694j558N096q96l382
$$ -4431 -759 -5094 -6395 -1084 -2827 -6531 -2008 -1071 -5223 -3530 265 -3429 -4987 109 -787 -4169
628d169L796J493m333R60M744l728j872N091p65l950L780J875m871L80N211k932
$$ -4169 -373 1120 -3213 -2253 2491 -1237 -3109 1982 1217 -2733 1047 2922 -1949 -1569 3642 710
644G10k426M253n78l968L046L133m736K16M565k574k514M485l02m532L476L547
$$ 710 -1716 2537 1959 -2009 1037 4170 -566 -350 4215 1641 -873 3612 3310 -1222 2254 5801
660E801m318k63M321k477k758M304J090m390K037L238l872q37M456j965l362M522
$$ 5801 1483 1220 5541 3064 306 4610 5700 1310 3347 6585 2713 1876 6332 4367 1005 5527
676E527J261n490J794L221l710j345M602j641l767L008J675m521Q99L377l339
$$ 5527 6788 1298 3092 6313 2603 1258 5860 4219 452 3460 5135 614 1513 4890 1551
691A551j726M720j356m729L015K229m186N83L815l272k369M485o90l825K683K303
$$ 1551 -175 4545 3189 -1540 1475 3704 -482 101 3916 644 -1725 2760 2070 -1755 928 3231
707C231m173K81L864l423k391M633k96m474K458K391m582k03L878k319l399M148
$$ 3231 -942 -661 3203 -220 -2611 2022 1726 -2748 -290 2101 -2481 -2684 1194 -1125 -4524 -376
723c76M99m492J559K221l719j88M062k008l392L711M61m729J843L547l779q56
$$ -376 123 -4369 -2810 -589 -4308 -4496 -434 -2442 -5834 -2123 -1662 -6391 -4548 -1001 -4780 -5636
739e636M561j747l453L520J074l964K136L676l379j887M305q06l341L683J626
$$ -5636 -1075 -2822 -6275 -2755 -1681 -5645 -3509 167 -3212 -5099 -794 -1600 -4941 -1258 368
754C68m248J350L711l470j638M561m30l110K486J850l784N67L987k716j878M012
$$ 368 -3880 -2530 1181 -2289 -3927 634 204 -2906 -420 1430 -2354 -1787 2200 -516 -2394 1618
770A618P5l861L023J822m017O13M584k413k546M022L06m155K862K702l250J33
$$ 1618 1693 -2168 855 2677 -1340 -727 3857 1444 -1102 2920 3226 -929 1933 4635 1385 1518
786A518L828j784k587L784N56l959K705L309m500n08L935j459k805L292R78m040
$$ 1518 5346 3562 975 4759 5315 1356 4061 7370 2870 2362 6297 4838 2033 5325 6303 2263
802B263K027L027l572j657L565q93k921L226P46m353R09L630l236j774L425n59
$$ 2263 4290 7317 3745 2088 5653 4760 1839 5065 5811 1458 2367 5997 2761 987 4412 3853
818C853l970L114J328l981J81L573k545j666L144j098l583K881K023m423M01L374
$$ 3853 -117 2997 4325 344 525 4098 1553 -113 3031 1933 -1650 1231 3254 -1169 -768 2606
834B606k603k421L964l77m297K285K292l481o34L356k629k478L987j55m253K056
$$ 2606 3 -2418 1546 1169 -3128 -843 1449 -2032 -2666 690 -1939 -4417 -430 -585 -4838 -2782
850b782K573l939m62L647j792l032L617R36m372J241K591l182m67L993j529l062
$$ -2782 -209 -4148 -4610 -963 -2755 -5787 -2170 -1234 -5606 -4365 -1774 -4956 -5423 -1430 -2959 -6021
866f021K784J328l283R08L334l417r11M297j147l526L262J807l870J026L402k857
$$ -6021 -3237 -1909 -5192 -4284 -950 -4367 -5278 -981 -2128 -5654 -2392 -585 -4455 -3429 -27 -2884
882b884j575L910k58l615K856K093l926J048L464k700j865M094L89l975K928J748
$$ -2884 -4459 -549 -807 -4422 -1566 527 -3399 -2351 1113 -1587 -3452 642 1031 -2944 -16 1732
898A732l829R44L794k225j816L323L14l566K201K855l733J33M394j858k560L409
$$ 1732 -2097 -1153 2641 416 -1400 1923 2237 -1329 872 3727 -6 127 4521 2663 103 3512
914C512N87l858K474K545k996m38L139j142l036L723P51l585J688K511l177j192
$$ 3512 4099 241 2715 5260 2264 1826 4965 3823 787 4510 5261 1676 3364 5875 2698 1506
930A506L568j505k780L391R36l877J079K627k702j657L774r51l105K484J274l565
$$ 1506 5074 3569 789 4180 5116 1239 2318 4945 2243 586 4360 3409 304 2788 4062 497
946D97O08L039k505j739L530q35l566K934J003l567N53L413k355k689L438n74
$$ 497 1105 4144 1639 -100 3430 2595 -971 1963 2966 -601 -48 3365 1010 -1679 1759 1185
962A185l504K562J744l780J64K874j984k165K853L64l796K112K228l705p89L530
$$ 1185 -2319 243 1987 -1793 -1629 1245 -739 -2904 -51 313 -3483 -1371 857 -2848 -3637 -107
978a07k076k055K822O48l877J836K356l276o26L733j827k618L429L10l701J496
$$ -107 -2183 -4238 -1416 -768 -4645 -2809 -453 -3729 -4355 -622 -2449 -5067 -1638 -1328 -5029 -3533
994c533K880k825j090L742j107l190L004J130l369Q40L270k796r30L212q03k900
$$ -3533 -653 -3478 -4568 -826 -1933 -5123 -2119 -989 -4358 -3518 -248 -3044 -3974 -762 -1565 -4465
1010d465K529J527k619J54L209k405j705L750j99k887K137J945l291N63L154j787
$$ -4465 -1936 -409 -3028 -2874 335 -2070 -3775 -25 -224 -3111 -974 971 -2320 -1757 1397 -390
1026c90k077L780J18l338K103K187l276J2L697j873j959K882P03l183J194K797
$$ -390 -2467 1313 1431 -1907 196 2383 -893 -881 2816 943 -1016 1866 2569 -614 580 3377
1042C377k747o08L722j507k369K558J132k749Q39L253l103j137L733j153k986
$$ 3377 630 22 3744 2237 -132 2426 3558 809 1648 4901 1798 661 4394 3241 255
1057B55K986R70l197Q80K841k873j163L042l48k391K205J053l452N74K821k175
$$ 255 3241 4211 1014 1894 4735 1862 699 3741 3393 1002 3207 4260 808 1382 4203 2028
1073B028j757L412p05k970K246J508l556L33L060j836k193K642J66l325J665J854
$$ 2028 271 3683 2978 8 2254 3762 206 539 3599 1763 -430 2212 2378 -947 718 2572
1089B572l022m96L098j641k470L037K10l668J525K674l414o18L297j831k268K761
$$ 2572 -450 -946 2152 511 -1959 1078 1288 -2380 -855 1819 -1595 -2213 1084 -747 -3015 -254
1105b54M34l204J468K254l069r53K759r43k373K573O51l169R41K157k212j472
$$ -254 180 -3024 -1556 698 -2371 -3324 -565 -1508 -3881 -1308 -657 -3826 -2885 -728 -2940 -4412
1121d412L316n51l083K531J157l200P36K816k494j281L542r17l038K358J916l041
$$ -4412 -1096 -1647 -4730 -2199 -1042 -4242 -3506 -690 -3184 -4465 -923 -1840 -4878 -2520 -604 -3645
1137c645M44L167k164j539L092k60k907K099J743k895K68L160k218j457L222J21
$$ -3645 -3201 -34 -2198 -3737 -645 -905 -3812 -1713 30 -2865 -2597 563 -1655 -3112 110 231
1153B31k772J571K197k827j49L491j648k241K918N92k949J619K163k745k00L199
$$ 231 -2541 -970 1227 -1600 -1749 1742 94 -2147 771 1363 -1586 33 2196 -549 -749 2450
1169B450q52k679K635R77l011J391K524k236j009K955q27k328K691Q35k679J009
$$ 2450 1598 -1081 1554 2531 -480 911 3435 1199 190 3145 2318 -10 2681 3516 837 1846
1185A846K447k440j213L292o96k379K131J405l048L37K669j796j815L029m28k305
$$ 1846 4293 1853 640 3932 3236 857 2988 4393 1345 1682 4351 2555 740 3769 3341 1036
1201A036J392J562k968P3K727j659j637K533l90l063J874K002l210m95L410j846
$$ 1036 2428 3990 1022 1095 3822 2163 526 3059 2669 -394 1480 3482 272 -223 3187 1341
1217A341k408L028K62l063J351K096k983n18K844j533k537K769Q72l560J050K423
$$ 1341 -1067 1961 2223 -840 511 2607 -376 -894 1950 417 -2120 649 1521 -2039 -989 1434
1233A434k930q19K955j152l029K917P82l201Q26J868k220j278K947q71k657K563
$$ 1434 -1496 -2315 640 -512 -3541 -624 158 -3043 -2217 -349 -2569 -3847 -900 -1771 -4428 -1865
1249a865R53l099O36K617k302j206K791J71l145K138J801l469P90K673j967j376
$$ -1865 -912 -4011 -3375 -758 -3060 -4266 -1475 -1304 -4449 -2311 -510 -3979 -3189 -516 -2483 -3859
1265c859K827k71k408J812J639k613J82K661j492j840K938J8k452J413K388k948
$$ -3859 -1032 -1303 -3711 -1899 -260 -2873 -2691 -30 -1522 -3362 -424 -406 -2858 -1445 943 -2005
1281b005m02L111j241j728K710M96l272J385K420k532m62L087p72k507K957J015
$$ -2005 -2407 704 -537 -2265 445 941 -2331 -946 1474 -1058 -1520 1567 795 -1712 1245 2260
1297B260l057J036K092k075m93L294j035k619K752J092l020Q90K637k298j061
$$ 2260 -797 239 2331 256 -237 3057 2022 -597 2155 3247 227 1117 3754 1456 395
1312C95L388p33k447J773J311k844R62K575k529j712L301l58k580J890J379k706
$$ 395 3783 3050 603 2376 3687 843 1805 4380 1851 139 3440 3082 502 2392 3771 1065
1328A065J11K834k286j723K869o4l078J779J785l303P0L046j665j904K392L57
$$ 1065 1176 4010 1724 1 2870 2806 -272 1507 3292 -11 59 3105 1440 -464 1928 2285
1344B285l166J663J475k418m15K714j460k441K478L42k890J468K379k899r55K636
$$ 2285 -881 782 2257 -161 -576 2138 678 -1763 715 1057 -1833 -365 2014 -885 -1840 796
1360G96r24k460K159Q81k783M52K559k176j371K427n48k557K167J052l073N87
$$ 796 -128 -2588 -429 452 -2331 -1879 680 -1496 -2867 -440 -988 -3545 -1378 -326 -3399 -2812
1376b812K949k372j622K977m46k597K015J417l200O65K477j823j232K821k89k950
$$ -2812 137 -2235 -3857 -880 -1326 -3923 -1908 -491 -3691 -3026 -549 -2372 -3604 -783 -1072 -4022
1392d022J875J599k392r6K623j526j866K879N5k602J564K028k438l8K606j659
$$ -4022 -2147 -548 -2940 -3036 -413 -1939 -3805 -926 -871 -3473 -1909 119 -2319 -2357 249 -1410
1408a410j642K759M26k722J208K357k686j84K827j018k226K611N91k437J011K215
$$ -1410 -3052 -293 133 -2589 -1381 976 -1710 -1894 933 -85 -2311 300 891 -1546 -535 1680
1424A680k322j67K709o83k469K669Q16k555P67K727k091j256K970m26k670K289
$$ 1680 -642 -809 1900 1217 -1252 1417 2233 -322 445 3172 1081 -175 2795 2369 -301 1988
1440A988J060k627Q54K229j456j830L008l18k445J673J308k506LK682j400j769
$$ 1988 3048 421 1275 3504 2048 218 3226 2908 463 2136 3444 938 941 3623 2223 454
1456D54K420J75k960K023J415k758J0K227j097j788K662o3k600Q92K252k561o33
$$ 454 2874 3049 89 2112 3527 769 779 3006 1909 121 2783 2720 120 1012 3264 703 70
1473G0K525q50k267K173P60l170P91K469k659n52K656r74k297K261N81l007O85
$$ 70 2595 1745 -522 1651 2411 -759 32 2501 -158 -710 1946 972 -1325 936 1517 -1490 -805
1490h05K364k479j375K866q32k350J942J140k750L42K532k285j157K545m48k521
$$ -805 1559 -920 -2295 571 -261 -2611 -669 471 -2279 -1937 595 -1690 -2847 -302 -750 -3271
1506c271J658J570k906P2K764j784j741L061J79l213J689J578k780K51K614j533
$$ -3271 -1613 -43 -2949 -2877 -113 -1897 -3638 -577 -398 -3611 -1922 -344 -3124 -2873 -259 -1792
1522a792j401K294J45k597J313J984k768K01K270j170j689K408L02k372R14K389
$$ -1792 -3193 -899 -754 -3351 -2038 -54 -2822 -2621 -351 -1521 -3210 -802 -500 -2872 -1958 431
1538D31k448l22K517j052j660K180J094k845J017K182j839r49K734p15j921J989
$$ 431 -2017 -2339 178 -874 -2534 -354 740 -2105 -1088 1094 -745 -1694 1040 325 -1596 393
1554C93J287k704N05K551j600j311K605l97k330K026J327k000K03K060j494j335
$$ 393 1680 -1024 -519 2032 432 -879 1726 1329 -1001 1025 2352 352 555 2615 1121 -214
1570b14K569J89k840K009J535k247j56K471j638j437K902k37k394J171J798k437
$$ -214 2355 2544 -296 1713 3248 1001 845 3316 1678 241 3143 2906 512 1683 3481 1044
1586A044J68K164j395j598K441L72k767J041J730k060o73K671j422j613K114K81
$$ 1044 1212 3376 1981 383 2824 3196 429 1470 3200 1140 467 3138 1716 103 2217 2498
1602B498k282Q62J651j956j038K554j077k011J924R67k640L39K520k588j046K586
$$ 2498 216 1078 2729 773 -265 2289 1212 -799 1125 2092 -548 -209 2311 -277 -1323 1263
1618A263o28k171J644J064k964P32K199k083j210K138Mk624J501J376k572M78
$$ 1263 635 -1536 108 1172 -1792 -1060 1139 -944 -2154 -16 -12 -2636 -1135 241 -2331 -1853
1634a853J795j458j027J790q4k338J669J442k318l77K374j775j182K253J37k298
$$ -1853 -58 -1516 -2543 -753 -837 -3175 -1506 -64 -2382 -2759 -385 -2160 -3342 -1089 -952 -3250
1650c250J477J264j978l79K591j205j702K070N37k340Q86J957k275j55J982p23
$$ -3250 -1773 -509 -2487 -2866 -275 -1480 -3182 -1112 -575 -2915 -2029 -72 -2347 -2502 -520 -1243
1666a243j839K150R43k347Q38J790j389r10K380n13k167K259J057k460Q60J950
$$ -1243 -3082 -932 11 -2336 -1498 292 -1097 -2007 373 -140 -2307 -48 1009 -1451 -591 1359
1682A359j789q48K466l71j943J639J308j732J95K120k049n26K421j91k315J548
$$ 1359 -430 -1278 1188 817 -1126 513 1821 89 284 2404 355 -171 2250 2059 -256 1292
1698A292J231k128l9K521j568j163K229J25k279J424J707k183k66J808q68j394
$$ 1292 2523 395 356 2877 1309 146 2375 2500 221 1645 3352 1169 903 2711 1843 449
1714D49K050L02k184P49J951k172k90K193r04j847J806M97k077O35J721j734r03
$$ 449 2499 2801 617 1366 3317 1145 855 3048 2144 297 2103 2600 523 1158 2879 1145 242
1731B42K249r40k045K033N39k205J35K158j833r23K138n47k190J764J066k775
$$ 242 2491 1551 -494 1539 2078 -127 8 2166 333 -590 1548 1001 -1189 575 1641 -1134
1747a134M35J944j639p00J848p43k077J346J424k355R5J833j385j167K240n30
$$ -1134 -699 1245 -394 -1094 754 11 -2066 -720 704 -1651 -1556 277 -1108 -2275 -35 -565
1763e65j820J392R76k319M3K213j369j534K312K9k174J021J497k029k71J758o92
$$ -565 -2385 -993 -17 -2336 -2293 -80 -1449 -2983 -671 -642 -2816 -1795 -298 -2327 -2598 -840 -1532
1780a532j493K007M66k108P93J777k135p80K496n91k038K201O63k148Q28J791
$$ -1532 -3025 -1018 -552 -2660 -1867 -90 -2225 -3005 -509 -1100 -3138 -937 -274 -2422 -1594 197
1796A97j663j156K424l82j534J618J021k109P01J720j509r66K291n12j650J521
$$ 197 -1466 -2622 -198 -580 -2114 -496 525 -1584 -883 837 -672 -1638 653 141 -1509 12
1812A2J080k179O27J923j137j296K445l43j776J349J343k029K61K050j489j027
$$ 12 1092 -1087 -460 1463 326 -970 1475 1132 -644 705 2048 19 280 2330 841 -186
1828a86K212%j967J213J400j808k56K127j218j400K081J95j995J243J231j933
$$ -186 2026 2026 59 1272 2672 864 608 2735 1517 117 2198 2393 398 1641 2872 939
1844I39p00K390p49j822K098N09k581Q53J763j597o63K224j157j417J746N01k175
$$ 939 239 2629 1880 58 2156 2665 84 937 2700 1103 440 2664 1507 90 1836 2337 162
1861A62O26J650j753j067K286n00k005J523N91k107J27K075j425j042K156o07
$$ 162 788 2438 685 -382 1904 1404 -601 922 1513 -594 -467 1608 183 -859 1297 690
1877F90j750R15R45j851K66J575j926m86J659j46j767J206R61j995n3J656j099
$$ 690 -1060 -145 800 -1051 -785 790 -1136 -1622 37 -109 -1876 -670 291 -1704 -1757 -101 -1200
1894a200j321J974K44k239J373J373k400m00K567j329j127J429L23j821R37J580
$$ -1200 -2521 -547 -303 -2542 -1169 204 -2196 -2596 -29 -1358 -2485 -1056 -733 -2554 -1617 -37
1910c7k197l26K212j048j162J262Q45j941P93J446j860k55K051n45j533J571M15
$$ -37 -2234 -2560 -348 -1396 -2558 -1296 -451 -2392 -1599 -153 -2013 -2268 -217 -762 -2295 -724 -309
1927c09j587M76J853j496r39K191k50j821J493J139j682r2J782j223j056K398
$$ -309 -1896 -1420 433 -1063 -2002 189 -61 -1882 -389 750 -932 -1024 758 -465 -1521 877
1943H77l51j793J664J105k001N85J587j125j159K221q4j650J038J269j825j80
$$ 877 526 -1267 397 1502 -499 86 1673 548 -611 1610 1526 -124 914 2183 358 178
1959A78K277j176j168J846M3j789J054J219j458l66J962j114j044J340O71j890
$$ 178 2455 1279 111 1957 2000 211 1265 2484 1026 660 2622 1508 464 1804 2475 585
1975E85P89J312j728m95J864l10j957J670O41k020L65J626j438j008K349o17j861
$$ 585 1374 2686 958 463 2327 2017 60 1730 2371 351 716 2342 904 -104 2245 1628 -233
1992b33J602P15j981M37J601j873p41J893k95j732J239P49k100O36J585k053o54
$$ -233 1369 2084 103 540 2141 268 -473 1420 1125 -607 632 1381 -719 -83 1502 -551 -1205
2009a205J834j75j737J213N89j726q8J916j388j116J860K00k287R70J002j510
$$ -1205 629 454 -1283 -70 519 -1207 -1295 621 -767 -1883 -23 177 -2110 -1140 -138 -1648
2025a648j56J607n90j516J584L61j973P39J447j704l71J786o39j630J854K00j819
$$ -1648 -1804 -197 -787 -2303 -719 -358 -2331 -1592 -145 -1849 -2220 -434 -1073 -2703 -849 -649 -2468
2042b468L91J547j365k02J587n96j734J932M31j701O30J489j246p44K130p81j488
$$ -2468 -2077 -530 -1895 -2097 -510 -1106 -2840 -908 -477 -2178 -1548 -59 -1305 -2049 81 -700 -2188
2059b188J756N19j826M79J805j089r64J927j57j412J180J015j879N68J344r40
$$ -2188 -432 87 -1739 -1260 545 -544 -1508 419 262 -1150 30 1045 -834 -266 1078 138
2075A38j193J795L69j712J466R14j899M9J819r94r05J741O1j442R14J277j608
$$ 138 -1055 740 1109 -603 863 1777 -122 -73 1746 752 -153 1588 1649 207 1121 2398 790
2092G90k35J810q65j438J720L23j681O30J534j861j4J845j203r05J239N85j737
$$ 790 555 2365 1500 62 1782 2105 424 1054 2588 727 713 2558 1355 450 1689 2274 537
2109E37J40K030j721l44J306k43j664J267O36j631K52J674j801p22K303p05j667
$$ 537 677 2707 986 642 1948 1705 41 1308 1944 313 565 2239 438 -284 2019 1314 -353
2126c53J301P60k028RJ864j166j336J791J09j982J250P35k033N02J367j298j265
$$ -353 948 1708 -320 -311 1553 387 -949 842 951 -1031 219 954 -1079 -577 790 -508 -1773
2143a773K005Lj600N49J225k168R1J841j201j087J397J87j572R83R55j567j78
$$ -1773 232 235 -1365 -816 409 -1759 -1668 173 -1028 -2115 -718 -531 -2103 -1120 -165 -1732 -1910
2160a910J685p36j303J550m2j605Q67J185j657l57J700k46j550J268P71j558O8
$$ -1910 -225 -961 -2264 -714 -756 -2361 -1494 -309 -1966 -2323 -623 -869 -2419 -1151 -380 -1938 -1870
2177a870J586j320n97J658m47j353J576N80j549M07J448j080p99J604j98j265
$$ -1870 -284 -1604 -2201 -543 -990 -2343 -767 -187 -1736 -1329 119 -961 -1760 -156 -354 -1619
2193a619J004R53j368L7J935j065q63J658m15j387J494Q50j357o5J433m98j187
$$ -1619 -615 338 -1030 -993 942 -123 -986 672 257 -1130 364 1214 -143 -208 1225 727 -460
2210d60J567J40j530J051J309j685k66J624p62q70J317M60j744Q19J304j546j23
$$ -460 1107 1247 -283 768 2077 392 126 1750 988 118 1435 1895 151 970 2274 728 605
2227F05J587m21j432J294N48j999Q19J368j630p6J503o25j247J183O45j751N12
$$ 605 2192 1771 339 1633 2181 182 1001 2369 739 663 2166 1541 294 1477 2122 371 883
2244H83J313j367n82J479k20j462R80Q71j511J88J206j458n36J535j47j574R17
$$ 883 2196 829 247 1726 1506 44 1024 1895 384 572 1778 320 -216 1319 1172 -402 515
2261E15N61j513M20J554j165j269J385o5j350M79J343j937n3J539j023j255J999
$$ 515 1076 -437 -17 1537 372 -897 488 423 -927 -448 895 -1042 -1095 444 -579 -1834 165
2278A65l71j879J011J130j489r7J710j029j325J315J28j264N59J052j030j022
$$ 165 -206 -2085 -1074 56 -1433 -1530 180 -849 -2174 -859 -731 -1995 -1436 -384 -1414 -2436
2294b436J895o89r27J396K13j588L04J315r38n88J509l88j228J168Q50j850K27
$$ -2436 -541 -1230 -2157 -761 -548 -2136 -1832 -517 -1455 -2043 -534 -922 -2150 -982 -132 -1982 -1755
2311a755J676j128q35J674J01j763J272Q93j464N89Q68p57o85J380k26r57Q37
$$ -1755 -79 -1207 -2042 -368 -267 -2030 -758 135 -1329 -740 128 -629 -1314 66 -160 -1117 -280
2328b80J136j577M6J563p41q64J494K63j688R05O84j065J49J539r07j001J755
$$ -280 856 -721 -675 888 147 -717 777 1040 -648 257 941 -124 25 1564 657 -344 1411
$$ [...]
8191a77
##END NTUPLES=NMR FID
##END=
