##TITLE=1H_EC-3189(1)
 CDCl3, 8 sc, 
 10.4.2019
##JCAMPDX= 6.0         $$ Bruker NMR JCAMP-DX V2.0
##DATA TYPE= NMR FID
##DATA CLASS= NTUPLES
##ORIGIN= UXNMR, Bruker Analytische Messtechnik GmbH
##OWNER= root
$$ XWIN-NMR		Version 3.5
$$ Wed Apr 10 14:14:14 2019 Russian Standard Time (UT+4h)  she@DPX200
##.OBSERVE FREQUENCY= 200.1315
##.OBSERVE NUCLEUS= ^1H
##.DELAY= (6, 6)
##.ACQUISITION MODE= SIMULTANEOUS
##.ACQUISITION SCHEME= undefined
##.AVERAGES= 8
##.DIGITISER RES= 18
##SPECTROMETER/DATA SYSTEM= spect
##.PULSE SEQUENCE= zg30
##.SOLVENT NAME= CDCl3
##.SHIFT REFERENCE= (INTERNAL, CDCl3, 0, 15.7039)
##AUDIT TRAIL= $$ (NUMBER, WHEN, WHO, WHERE, WHAT)
$$ ##TITLE= Audit trail, XWIN-NMR		Version 3.5
$$ ##JCAMPDX= 5.01
$$ ##ORIGIN= Bruker BioSpin GmbH
$$ ##OWNER= she
$$ F:/spectra/data/she/nmr/H-F/1/audita.txt
$$ ##AUDIT TRAIL=  $$ (NUMBER, WHEN, WHO, WHERE, WHAT)
(   1,<2019-04-10 14:12:56.76 +0400>,<she>,<DPX200>,
      <created by zg, POWCHK disabled, PULCHK disabled
       configuration hash MD5:
       00 E9 B6 7A A2 85 ED C7 34 08 36 98 17 FE 4E 26
       data hash MD5: 16K
       31 0A 45 F9 15 DC E0 2C 90 77 31 18 57 18 19 98>)
$$ ##END=
$$ 
$$ hash MD5
$$ 10 9D 9A 51 7F AC 20 8A A9 22 D4 EE D8 94 CD 93
##$RELAX= 
##$RELAX= 
##$RELAX= 
##$RELAX= 
##$RELAX= 
##$RELAX= 
$$ Bruker specific parameters
$$ --------------------------
##$DU= <F:/spectra>
##$EXPNO= 1
##$NAME= <H-F>
##$PROCNO= 1
##$TYPE= <nmr>
##$USER= <she>
##$AMP= (0..31)
100 100 100 100 100 100 100 100 100 100 100 100 100 100 100 100 100 100 
100 100 100 100 100 100 100 100 100 100 100 100 100 100 
##$AQSEQ= 0
##$AQ_mod= 1
##$AUNM= <au_zg>
##$AUTOPOS= <>
##$BF1= 200.13
##$BF2= 200.13
##$BF3= 200.13
##$BF4= 200.13
##$BF5= 200.13
##$BF6= 200.13
##$BF7= 200.13
##$BF8= 200.13
##$BYTORDA= 1
##$CFDGTYP= 0
##$CFRGTYP= 5
##$CHEMSTR= <none>
##$CNST= (0..31)
1 1 145 1 1 1 1 1 1 1 1 1 1 1 1 1 1 1 1 1 1 1 1 1 1 1 1 1 1 1 1 1 
##$CPDPRG= <>
##$CPDPRG1= <>
##$CPDPRG2= <>
##$CPDPRG3= <>
##$CPDPRG4= <mlev>
##$CPDPRG5= <mlev>
##$CPDPRG6= <mlev>
##$CPDPRG7= <mlev>
##$CPDPRG8= <mlev>
##$CPDPRGB= <>
##$CPDPRGT= <>
##$D= (0..31)
0 1.2 0 0 0 0 0 0 0 0 0 0.03 0 0 0 0 0 0 0 0 0 0 0 0 0 0 0 0 0 0 0 0 
##$DATE= 1554891176
##$DBL= (0..7)
120 120 120 120 120 120 120 120 
##$DBP= (0..7)
150 150 150 150 150 150 150 150 
##$DBP07= 0
##$DBPNAM0= <>
##$DBPNAM1= <>
##$DBPNAM2= <>
##$DBPNAM3= <>
##$DBPNAM4= <>
##$DBPNAM5= <>
##$DBPNAM6= <>
##$DBPNAM7= <>
##$DBPOAL= (0..7)
0.5 0.5 0.5 0.5 0.5 0.5 0.5 0.5 
##$DBPOFFS= (0..7)
0 0 0 0 0 0 0 0 
##$DE= 6
##$DECBNUC= <off>
##$DECIM= 24
##$DECNUC= <off>
##$DECSTAT= 4
##$DIGMOD= 1
##$DIGTYP= 9
##$DL= (0..7)
0 120 120 120 120 120 120 120 
##$DP= (0..7)
150 150 150 150 150 150 150 150 
##$DP07= 0
##$DPNAME0= <>
##$DPNAME1= <>
##$DPNAME2= <>
##$DPNAME3= <>
##$DPNAME4= <>
##$DPNAME5= <>
##$DPNAME6= <>
##$DPNAME7= <>
##$DPOAL= (0..7)
0.5 0.5 0.5 0.5 0.5 0.5 0.5 0.5 
##$DPOFFS= (0..7)
0 0 0 0 0 0 0 0 
##$DQDMODE= 0
##$DR= 18
##$DS= 0
##$DSLIST= <SSSSSSSSSSSSSSS>
##$DSPFIRM= 0
$$ [...]
##$SUBNAM2= <"">
##$SUBNAM3= <"">
##$SUBNAM4= <"">
##$SUBNAM5= <"">
##$SUBNAM6= <"">
##$SUBNAM7= <"">
##$SUBNAM8= <"">
##$SUBNAM9= <"">
##$SW= 24.9337058887773
##$SWIBOX= (0..15)
0 0 2 0 0 0 0 0 0 0 0 0 0 0 0 0 
##$SW_h= 4990.01996007984
##$TD= 16384
##$TD0= 1
##$TE= 0
##$TE2= 300
##$TE3= 300
##$TEG= 300
##$TL= (0..7)
0 120 120 120 120 120 120 120 
##$TP= (0..7)
150 150 150 150 150 150 150 150 
##$TP07= 0
##$TPNAME0= <>
##$TPNAME1= <>
##$TPNAME2= <>
##$TPNAME3= <>
##$TPNAME4= <>
##$TPNAME5= <>
##$TPNAME6= <>
##$TPNAME7= <>
##$TPOAL= (0..7)
0.5 0.5 0.5 0.5 0.5 0.5 0.5 0.5 
##$TPOFFS= (0..7)
0 0 0 0 0 0 0 0 
##$TUNHIN= 0
##$TUNHOUT= 0
##$TUNXOUT= 0
##$USERA1= <user>
##$USERA2= <user>
##$USERA3= <user>
##$USERA4= <user>
##$USERA5= <user>
##$V9= 5
##$VALIST= <valist>
##$VCLIST= <CCCCCCCCCCCCCCC>
##$VD= 0
##$VDLIST= <DDDDDDDDDDDDDDD>
##$VPLIST= <PPPPPPPPPPPPPPP>
##$VTLIST= <TTTTTTTTTTTTTTT>
##$WBST= 1024
##$WBSW= 4
##$XGAIN= (0..3)
0 0 0 0 
##$XL= 0
##$YL= 0
##$YMAX_a= 249121
##$YMIN_a= -245727
##$ZGOPTNS= <>
##$ZL1= 120
##$ZL2= 120
##$ZL3= 120
##$ZL4= 120
##$ABSF1= 10
##$ABSF2= 0
##$ABSG= 5
##$ABSL= 3
##$ALPHA= 0
##$AQORDER= 0
##$ASSFAC= 0
##$ASSFACI= 0
##$ASSFACX= 0
##$ASSWID= 0
##$AUNMP= <proc_1d>
##$AZFE= 0.1
##$AZFW= 0.1
##$BCFW= 1
##$BC_mod= 2
##$BYTORDP= 1
##$COROFFS= 0
##$CY= 11.3945322036743
##$DATMOD= 1
##$DC= 2
##$DFILT= <>
##$DTYPP= 0
##$F1P= 18.9103706918063
##$F2P= -1.10871071338519
##$FCOR= 0.5
##$FTSIZE= 0
##$FT_mod= 4
##$GAMMA= 1
##$GB= 0.15
##$INTBC= 1
##$INTSCL= 1
##$ISEN= 128
##$LB= 0.24
##$LEV0= 0
##$LPBIN= 0
##$MAXI= 10000
##$MC2= 0
##$MEAN= 0
##$ME_mod= 0
##$MI= 1.114404
##$NCOEF= 0
##$NC_proc= 0
##$NLEV= 6
##$NOISF1= 3.799351
##$NOISF2= 2.8
##$NSP= 1
##$NTH_PI= 0
##$NZP= 0
##$OFFSET= 15.70392
##$PC= 1
##$PHC0= -8857.648
##$PHC1= 20.80026
##$PH_mod= 1
##$PKNL= yes
##$PPARMOD= 0
##$PSCAL= 0
##$PSIGN= 0
##$REVERSE= no
##$SF= 200.130013532006
##$SI= 16384
##$SIGF1= 3
##$SIGF2= 2
##$SINO= 400
##$SIOLD= 16384
##$SREGLST= <1H.CDCl3>
##$SSB= 0
##$STSI= 0
##$STSR= 0
##$SW_p= 3612.71676300578
##$SYMM= 0
##$S_DEV= 0
##$TDeff= 0
##$TDoff= 0
##$TI= <>
##$TILT= no
##$TM1= 0
##$TM2= 0
##$TOPLEV= 0
##$USERP1= <user>
##$USERP2= <user>
##$USERP3= <user>
##$USERP4= <user>
##$USERP5= <user>
##$WDW= 1
##$XDIM= 8192
##$YMAX_p= 0
##$YMIN_p= 0
$$ End of Bruker specific parameters
$$ ---------------------------------
##NTUPLES= NMR FID
##VAR_NAME=  TIME,          FID/REAL,        FID/IMAG
##SYMBOL=    X,             R,               I
##VAR_TYPE=  INDEPENDENT,   DEPENDENT,       DEPENDENT
##VAR_FORM=  AFFN,          ASDF,            ASDF
##VAR_DIM=   8192,          8192,            8192
##UNITS=     SECONDS,       ARBITRARY UNITS, ARBITRARY UNITS
##FACTOR=    0.0002004,     1,               1
##FIRST=     0,             0,               0
##LAST=      1.6414764,     0,               0
##MIN=       0,             -245727,         0
##MAX=       1.6414764,     249121,          0
$$ Real data points
##PAGE= N=1
##DATA TABLE= (X++(R..R)), XYDATA
$$ [...]
$$ plain form
2398 1237 960 1278 1801 1309 -782 150 2433 1283 -119 65 246 134 1175 1320 -743 -721 817 815
2416 815 265 143 -710 -1130 757 1473 -621 -1205 -95 -228 -481 232 -253 -1708 -772 424 -465 -1281
2434 -1281 -652 -1380 -1251 309 -174 -2127 -1522 -658 -1230 -1083 -567 -1424 -2328 -796 -154 -2054 -2176 -1053
2452 -1053 -1217 -1148 -681 -1244 -2251 -813 -129 -1405 -1279 -866 -1606 -1359 141 -602 -1942 -1182 -340 -999
2470 -999 -594 556 -1182 -1566 270 226 -637 -616 16 -853 -417 231 269 -783 492 432 -290 666 948 -102
2490 -102 -98 1022 1000 228 1221 1213 -21 1365 1903 598 466 1513 1296 733 1666 1319 95 1174 2284
2509 2284 1199 555 1502 1020 984 1682 1713 389 499 1620 1359 930 1610 917 236 1419 1942 665 157
2528 157 1005 740 449 1605 1028 -228 585 1352 586 194 810 -10 -54 1070 530 -871 -379 448 144
$$ packed form
2398A237k77L18N23m92k091R32K283j150j402J84J81j12J041J45k063K2J538k
2416H15n50j22q53m20J887P16k094n84J110j33k53P13m85j455R36J196q89q16
2434a281O29p28J29J560m83j953O05Q64n72J47N16q57r04J532O42j900j22J123
2452a053j64O9M67n63j007J438O84j276J26M13p40K47J500p43j340P60Q42o59
2470i99M05J150j738l84J836m4q63K1O32q69M36O48L8j052J275o0p22R56K82j050
2490a02MJ120k2p72R93qj234J386N38j305j32J047k17n63R33l47j224J079J110
2509B284j085o44R47m82l6O98L1j324J10J121k61m29O80o93o81J183N23j277n08
2528A57Q48k65k91J156n77j256Q13P67p66l92O16q20m4J124n40j401M92Q27l04
$$ plain form
2547 144 -353 135 -841 -1498 259 498 -1079 -1076 -589 -899 -358 66 -1258 -2385 -833 98 -558 -994 -766
2566 -766 -1795 -1517 179 -881 -2496 -1822 -423 -1020 -696 -577 -2202 -2145 -314 -227 -1833 -1288 -1025 -1212
2584 -1212 -386 -208 -1520 -2272 -356 -56 -1038 -1188 -799 -1379 -798 862 -523 -1984 -954 -180 -710 38
2602 38 -16 -1393 -730 707 546 -1063 -214 -102 -356 511 1136 -774 -712 840 1259 149 347 342 -324 949
2622 949 1868 402 -491 756 1263 754 1193 1126 -300 639 1942 1125 -42 785 801 230 1592 1704 133
2641 133 -209 1566 1485 699 996 743 258 1435 1951 362 325 1076 1152 727 1143 977 -57 509 1754
2660 1754 764 191 1015 27 -43 1108 884 -377 -154 541 315 130 514 -431 -337 743 781 -584 -603 634
2680 634 -285 -652 375 -393 -1446 -677 378 -399 -658 -295 -1073 -1187 -102 -73 -1581 -599 -470 -1399 -864
$$ packed form
2547A44m97M88r76o57J757K39j577LM87l10N41M24j324j127J552R31o56m36K28
2566g66j029K78J696j060j615O74J399n97L24J19j625N7J831Q7j606N45K63j87
2584a212Q26J78j312p52J916L00r82j50L89n80N81J660j385j461J030P74n30P48
2602C8n4j377O63J437j61j609Q49J12k54Q67O25j910O2J552M19j110J98no66J273
2622I49R19j466q93J247N07n09M39o7j426R39J303q17j167Q27J6n71J362J12j571
2641A33l42J775q1p86K97k53m85J177N16j589l7P51P6m25M16j66j034N66J245
2660A754r90n73Q24r88p0J151k24j261K23O95k26j85L84r45R4J080L8j365j9J237
2680F34r19l67J027p68j053P69J055p77k59L63p78j14J085K9j508R82J29r29N35
$$ plain form
2699 -864 167 -1232 -1956 -404 -543 -1492 -1030 -458 -1485 -1188 -498 -791 -1242 -537 -654 -1441 -394 -664
2717 -664 -1986 -1497 -13 -354 -1561 -760 -157 -1138 -680 376 -557 -979 -384 -247 -413 306 -18 -1290
2735 -1290 -293 873 -102 -681 239 168 -555 723 985 -513 -539 1202 972 146 325 250 145 1160 1475
2754 1475 309 167 1110 539 381 1651 982 -499 730 2123 968 143 1269 973 721 1542 1646
2771 1646 112 472 1600 1334 1070 1062 391 419 1651 1998 122 -106 1118 494 589 1382 1154 -558 578
2790 578 1554 1090 371 697 269 677 1403 623 -748 157 1084 -26 -263 548 -765 -458 1314 1272 -1136
2809 -1136 -1201 8 -198 11 436 -913 -1505 -293 -70 -932 -726 -222 -1994 -734 926 -625 -2108
2826 -2108 -955 305 -1096 -979 -319 -1504 -1709 -377 -310 -1552 -1211 -1214 -980 -221 -197 -1842 -1997 -12
$$ packed form
2699h64J031j399p24J552j39r49M62N72j027K97O90k93m51P05j17p87J047k70
2717f64j322M89J484l41j207Q01O03r81M58J056r33m22N95J37j66P19l24j272
2735a290R97J166r75n79R20p1p23J278K62j498k6J741k30q26J79p5j05J015L15
2754A475j166j42R43n71j58J270o69j481J229J393j155q25J126k96k52Q21J04
2771A646j534L60J128k66k64qo71K8J232L47j876k28J224o24R5P93k28j712J136
2790E78R76m64p19L26m28M08P26p80j371R05R27j110k37Q11j313L07J772m2k408
2809a136o5J209k06K09M25j349n92J212K23q62K06N04j772J260J660j551j483
2826b108J153J260j401J17O60j185k05J332O7j242L41lK34P59K4j645j55J985
$$ plain form
2844 -12 -832 -1481 -608 -631 -1923 -1250 201 -460 -1804 -794 -138 -827 -490 -816 -1492 -98 212 -621 -915
2863 -915 249 -114 -797 312 980 -1183 -1179 907 824 -186 247 197 -455 508 928 248 390 704 130 270
2883 270 1224 1156 -642 840 1747 289 -13 1381 970 150 903 1649 484 496 1784 1212 811 1117 581
2902 581 262 1442 1716 341 400 1502 543 350 2005 1411 -338 240 1214 769 386 806 480 322 787
2921 787 461 -18 808 339 -297 187 796 -550 -771 661 974 -611 -173 199 -537 -803 784 292 -932
2940 -932 -854 -417 -473 16 135 -1018 -1280 419 -502 -1314 -465 -238 -1563 -971 145 -942 -1771 -754 -400
2959 -400 -948 -933 -749 -1408 -1132 -44 -1087 -1516 -725 -1131 -1292 46 -94 -1989 -1855 -305 -158 -876 -831
2978 -831 -704 -1382 -699 7 -753 -911 -386 -730 -550 45 -352 -1244 -67 946 -644 -1212 -55 -186 -402
$$ packed form
2844a2q20o49Q73k3j292O73J451o61j344J010O56o89L37l26o76J394L10q33k94
2863i15J164l63o83J109O68k163MK086q3j010M33n0o52R63M20o80J42L14n74J40
2883B70R54o8j798J482R07j458l02J394m11q20P53P46j165J2J288n72m01L06n36
2902E81l19J180K74j375N9J102r59j93J655n94j749N78R74m45l83M20l26j58M65
2921G87l26m79Q26m69o36M84O09j346k21J432L13j585M38L72p36k66J587m92j224
2940i32P8M37n6M89J19j153k62J699r21q12Q49K27j325N92J116j087q29J017L54
2959d00n48J5J84o59K76J088j043m29P91m06j61J338j40j895J34J550J47p18M5
2978h31J27o78O83P06p60j58N25l44J80N95l97q92J177J013j590n68J157j31k16
$$ plain form
2997 -402 358 289 -1315 -796 639 787 -141 203 -453 -356 939 1107 -364 269 940 14 155 1508 637
3016 637 -582 489 1442 300 201 806 925 700 1038 884 -406 148 1139 711 1085 1294 -125 101 1992
3035 1992 1714 -207 -79 1249 634 520 1163 373 -213 866 1357 383 503 713 78 446 1147 278 -761
3054 -761 251 814 219 110 550 -108 -352 725 536 -706 -526 78 -350 39 184 -787 -1252 -21 107
3073 107 -858 -244 -628 -1167 -551 426 -798 -1510 -381 73 -1005 -664 -344 -1324 -1067 29 -670 -1347 -749
3092 -749 -1168 -1233 -419 13 -1466 -1296 -504 -837 -1434 -350 -608 -1533 -1060 -421 -828 -1306 -702 -589 -1113 -506
3112 -506 -523 -1189 -681 259 -683 -964 -87 -277 -747 39 460 -690 -860 229 -42 -623 385 175 -437
3131 -437 160 623 -345 56 396 -172 108 1155 719 -559 221 791 149 443 910 212 -199 761 838 372
$$ packed form
2997d02P60o9j604N19J435J48r28L44o56R7J295J68j471O33O71r26J41J353q71
3016F37j219J071R53j142r9O05J19k25L38j54j290N54R91m28L74K09j419K26J891
3035A992k78j921J28J328o15j14O43p90n86J079M91r74J20K10o35L68P01q69j039
3054g61J012N63n95j09M40o58k44J077j89j242J80O04m28L89J45r71m65J231J28
3073A07r65O14l84n39O16R77j224p12J129M54j078L41L20r80K57J096o99o77N98
3092g49m19o5Q14M32j479J70P92l33n97J084k58r25M73O39m07m78O04J13n24O07
3112e06j7o66N08R40r42k81Q77j90m70P86M21j150j70J089k71n81J008k10o12
3131d37N97M63r68M01L40n68K80J047m36j278P80N70o42K94M67o98m11R60P7m66
$$ plain form
3151 372 535 850 237 702 1402 536 203 1186 1508 261 814 1024 185 397 1877 1050 -368 628 1071
3170 1071 545 520 1208 96 116 1267 1134 197 603 265 -122 683 1151 248 -325 637 830 -16 314 438
3190 438 -451 -514 880 -69 -540 46 279 -414 278 123 -596 -798 551 78 -686 -390 -29 -1044 61
3209 61 449 -803 -1037 -582 -539 -717 -277 -436 -1385 -734 149 -977 -1343 -564 -1020 -1187 -426 -281 -1581 -1158
3229 -1158 -272 -643 -789 -410 -750 -1011 -8 -88 -1238 -1237 -336 -659 -624 -225 -774 -1260 -592 376 -715 -842
3249 -842 -91 -571 -310 209 -69 -1069 -392 411 31 -168 509 -104 -290 902 607 -606 -349 570 -33
3268 -33 322 848 98 -464 559 1157 -120 305 881 148 491 1296 783 -84 845 1142 782 875 1173 442
3288 442 462 1454 974 156 717 1016 871 883 1264 200 185 1216 1030 285 737 757 256 702 1046 355 -391
$$ packed form
3151C72J63L15o13M65P00q66l33R83L22j247N53K10q39K12J480q27j418R96M43
3170A071n26k5O88j112K0J151j33r37M06l38l87Q05M68r03n73R62J93q46L30J24
3190D38q89o3J394r49m71N86K33o93O92j55p19k02J349m73p64K96L61j015J105
3209F1L88j252k34M55M3j78M40j59r49O51Q83j126l66P79m56j67P61J45j300M23
3229a158Q86l71j46L79l40k61J003q0j150JR01l23L5L99n49m86O68R68j091j27
3249h42P51m80K61N19k78j000O77Q03l80j99O77o13j86J192k95j213K57R19o03
3268c3L55N26p50n62J023N98j277M25N76p33L43Q05n13q67R29K97l60R3K98p31
3288D42K0R92m80q18N61K99j45J2L81j064j5J031j86p45M52K0n01M46L44o91p46
$$ plain form
3309 -391 476 909 41 770 440 -211 124 1006 354 -348 262 292 -335 383 591 -185 -247 325 245 -892 428
3330 428 100 -876 -561 21 -517 -827 254 -374 -1117 -134 -109 -1065 -992 -177 -821 -995 -330 -782 -993 -416
3350 -416 20 -1194 -1180 -369 -731 -1349 -481 -466 -1323 -841 -49 -995 -802 -465 -902 -1149 20 -430 -1103 -935
3370 -935 98 -850 -423 -140 -706 -951 127 -15 -676 -594 114 -677 -415 463 -564 -542 88 392 -105 -127
3390 -127 174 -173 -53 707 370 -488 3 941 346 469 1045 102 -124 1171 895 282 578 870 429 691
3410 691 1674 541 158 845 818 754 733 850 192 630 1433 925 -22 655 803 823 1016 989 366 469 1169
3431 1169 1114 284 938 790 -234 826 1029 -70 -294 973 780 12 189 413 -413 207 1001 396 -80
3450 -80 -32 115 -20 569 58 -777 -452 480 -10 -659 13 -328 -689 -300 146 -637 -684 63 -584 -644 -288
$$ packed form
3309c91Q67M33q68P29l30o51L35Q82o52p02O10L0o27P18K08p76o2N72q0j137J320
3330D28l28r76L15N82n38l10J081o28p43R83K5r56P3Q15o44j74O65m52k11N77
3350d16M36j214J4Q11l62o18Q68J5q57M82P92r46J93L37m37k47J169m50o73J68
3370i35J033r48M27K83n66k45J078j42o61Q2P08p91K62Q78j027K2O30L04m97k2
3390a27L01l47J20P60l37q58M91R38n95J23N76r43k26J295k76o13K96K92m41K62
3410F91R83j133l83O87k7o4k1J17o58M38Q03n08r47O77J48K0J93k7o23J03P00
3431A169n5q30O54j48j024J060K03j099k24J267j93p68J77K24q26O20P94o05m76
3450h0M8J47j35N89n11q35L25R32m90o49O72l41l61L89M46p83m7P47o47o0L56
$$ plain form
3471 -288 -797 -793 -210 -130 -1082 -1018 -480 -512 -755 -162 -612 -1408 -1048 -17 -83 -906 -610 -860 -1157 -84 -521
3492 -521 -1074 -735 -665 -772 -662 -19 -963 -1143 -17 43 -1091 -961 202 -145 -637 323 -41 -931 -538 -155
3512 -155 26 -45 -46 -599 -436 467 321 -553 -41 549 -209 -102 955 329 -319 431 854 215 142 756 17
3533 17 576 1222 14 450 1025 443 372 956 1079 164 121 1383 1179 148 696 730 372 825 1234 376
3553 376 11 690 724 452 912 920 -55 825 876 342 -242 850 736 -52 726 760 67 -57 916 494 -206
3574 -206 87 408 -56 772 730 -297 -459 103 -188 -559 625 299 -1051 -297 421 -267 -571 -19 -385
3593 -385 -413 -60 85 -688 -421 -36 -799 -581 -251 -637 -1250 353 -156 -1014 -985 58 -419 -898 111 -495
3613 -495 -1170 -1139 -425 -400 -697 -629 -1061 -797 53 -700 -1066 -599 142 -876 -868 -14 -596 -1111 29 69 -564
$$ packed form
3471b88n09MN83Q0r52O4N38l2k43N93m50p96L60J031o6q23K96k50k97J073m37
3492e21n53L39P0j07J10O43r44j80J126O0j134J30J163l47m92R60l64q90L93L83
3512a55J81p1jn53J63R03j46q74N12N90p58J07J057o26o48P50M23o39p3O14p39
3533A7N59O46j208M36N75n82p1N84J23r15m3J262k04j031N48L4l58M53M09q58
3553C76l65O79L4k72M60Qr75Q80N1n34n84J092j14p88P78L4o93j24R73m22p00
3574b06K93L21m64Q28m2j027j62N62k91l71J184l26j350P54P18o88l04N52l66
3593c85k8L53J45p73K67L85p63K18L30l86o13J603n09q58K9J043m77m79J009o06
3613d95o75L1P14K5k97O8m32K64Q50p53l66M67P41j018QQ54n82n15J140M0o33
$$ plain form
3634 -564 -839 -103 -300 10 -23 -466 -676 -370 33 -330 389 106 -905 -532 984 239 -476 -68 430 352
3654 352 208 606 -90 -82 951 531 29 431 585 239 493 937 66 -112 1279 1179 289 349 989 -74
3674 -74 329 1272 823 44 483 647 438 943 796 387 347 1277 676 109 990 773 -135 499 1230 297 -257
3695 -257 1108 1007 24 274 536 -37 449 660 154 -110 371 -47 -30 1059 194 -739 -121 451 -36 -287
3715 -287 161 51 -311 -163 110 -311 -701 -4 -278 -578 -352 -701 -936 -467 65 -547 -717 -278 -634 -601
3735 -601 122 -345 -1111 -902 -451 -798 -718 -526 -899 -878 -296 -536 -1303 -503 -314 -948 -829 -51 -775 -1227 -174
3756 -174 14 -1001 -561 -111 -561 -463 145 -261 -659 -394 -33 -517 222 160 -591 -529 422 -55 -429 -6 337
3777 337 -226 -222 368 47 -169 297 469 -145 489 466 147 469 987 539 57 621 979 528 594 699 219
$$ packed form
3634e64k75P36j97L10l3m43k10L06M03l63P19k83j011L73J516p45p15M08M98p8
3654C52j44L98o96QJ033m20n02M02J54l46K54M44q71j78J391j00q90O0O40j063
3674g4M03R43m49p79M39J64k09N05j47m09m0R30o01n67Q81k17r08O34P31r33n54
3695b57J365j01r83K50K62n73M86K11n06k64M81m18J7J089q65r33O18N72m87k51
3715b87M48j10l62J48K73m21l90O97k74l00K26l49k35M69N32o12j70M39l56L3
3735f01P23m67p66K09M51l47Q0J92l73K1N82k40p67Q00J89o34J19P78p24m52J053
3756a74J88j015M40M50m50R8O08m06l98K65L61m84P39o2p51O2R51m77l74M23L43
3777C37n63MN90l21k16M66J72o14O34k3l19L22N18m48m82N64L58m51O6J05m80
$$ plain form
3798 219 375 1214 866 206 794 798 455 728 1073 586 604 748 336 283 1122 874 -80 571 1367 325 529
3819 529 954 185 73 614 708 156 59 878 511 45 420 20 185 420 462 -287 -274 395 -104 -16 334 82
3841 82 -392 -135 302 -47 -545 160 -326 -484 30 -359 -653 -386 -16 -886 -535 -16 -679 -749 -230 -48 -893
3862 -893 -550 -85 -766 -495 -131 -760 -1023 -370 -63 -717 -490 -120 -798 -614 -213 -237 -1017 -600 -213 -551
3882 -551 -1 -414 -845 -889 -132 -271 -604 -520 -430 -746 -77 256 -416 -588 -117 215 -710 -308 -251 -427 -132
3903 -132 661 -158 -454 -132 33 -165 136 306 -165 -57 741 193 -279 303 211 -27 550 1031 6 -272
3923 -272 652 641 148 784 891 332 471 1023 633 74 463 482 387 917 763 -182 300 672 702 460 997
3944 997 229 35 762 754 78 -211 609 501 269 654 320 62 249 885 286 -124 712 64 -356 490 490
$$ packed form
3798B19J56Q39l48o60N88Ml43K73L45m87J8J44m12n3Q39k48r54O51P96j042K04
3819E29M25p69j12N41R4n52r7Q19l67m66L75m00J65K35M2p49J3O69m99Q8L50k52
3841H2m74K57M37l49m98P05m86j58N14l89k94K67L70q70L51N19o63p0N19J82q45
3862h93L43M65o81K71L64o29k63O53L07o54K27L70o78J84M01k4p80M17L87l38
3882e51N50m13m31m4P57j39l33Q4R0l16O69L33o72j72M71L32r25M02N7j76K95
3903a32P93q19k96L22J65j98L01J70m71J08P98n48m72N82r2k38N77M81j025k78
3923b72R24j1m93O36J07n59J39N52l90n59L89J9r5N30j54r45M82L72L0k42N37
3944I97p68j94P27qo76k89Q20j08k32L85l34k58J87O36n99m10Q36o48m20Q46%
$$ plain form
3965 490 -448 120 537 188 15 82 -181 -392 409 194 -575 -399 -5 -634 -38 418 -232 -785 -165 -4
3985 -4 -456 35 -219 -523 -775 -240 39 -822 -621 -497 -921 -408 -199 -739 -894 33 -299 -539 -476 47 -866
4006 -866 -76 70 -511 -985 -329 -96 -693 -295 -411 -646 -441 129 -152 -857 -124 -498 -514 120 143 -445 -559
4027 -559 -75 -23 -203 -89 5 -612 -98 271 -297 -275 -15 121 -82 433 347 -317 196 763 -70 239 506
4048 506 281 -11 607 998 299 302 582 583 68 564 242 271 681 795 337 140 542 789 323 1110 431 83
4070 83 610 715 439 445 605 128 282 571 671 182 515 391 129 260 571 329 64 571 701 -81 372
4091 372 530 379 311 791 -163 -196 5 529 -166 -185 125 -328 -371 283 -131 -338 -84 66 -184 -233 64 -593
4113 -593 -505 79 280 -781 -718 -363 -511 -416 -90 -526 -770 -401 -344 -698 -488 -143 -783 -951 -21 -463 -987
$$ packed form
3965D90r38N68M17l49j73O7k63k11Q01k15p69J76L94o29N96M56o50n53O20J61
3985dm52M91k54l04k52N35K79q61K01J24m24N13K09n40j55R27l32k40O3N23r13
4006h66P90J46n81m74O56K33n97L98j16k35K05N70k81p05P33l74j6O34K3n88j14
4027e59M84N2j80J14R4o17N14L69n68K2K60J36k03N15q6o64N13N67q33L09K67
4048E06k25k92O18L91o99LK80Jn15M96l22K9M10J14m58j97M02K47m66P87o79l48
4070H3N27J05k76OJ60m77J54K89J00m89L33j24k62J31L11k42k65N07J30p82M53
4091C72J58j51o8M80r54l3K01N24o95j9L10m53m3O54m14k07K54J50k50m9K97o57
4113e93Q8N84K01j061O3L55j48R5L26m36k44L69N7l54K10L45o40j68R30m42n24
$$ plain form
4134 -987 -367 -267 -720 -489 -367 -892 -953 -457 -220 -806 -527 -136 -453 -205 -127 -813 -496 -70 -241 -733 83
4155 83 -120 -845 -248 342 -190 -486 132 -136 -508 293 -79 -293 -227 372 -158 130 536 -93 -385 392 593
4176 593 -26 -94 423 401 36 366 520 53 146 701 616 355 509 350 142 991 795 248 405 841 306
4197 306 468 633 657 0 901 788 423 521 911 442 303 731 452 174 369 640 -36 255 672 39 -112
4218 -112 785 634 -41 98 484 253 99 265 167 -466 164 307 131 333 164 -286 -267 263 -120 -261 161
4239 161 111 -550 -3 -97 -620 -599 24 50 -650 -610 -94 -267 -42 -141 -790 -771 -66 -644 -798 -217 -436 -1043
4261 -1043 -341 209 -570 -583 40 -167 -537 -540 -468 -586 -467 -371 -523 -518 -306 -280 -626 -120 -48 -786 -263 113 28
4284 28 -629 63 47 -463 -171 245 -333 -207 -45 -91 -26 306 13 -572 373 831 -89 -82 349 130 8 648
$$ packed form
4134i87O20J00m53K31J22n25o1M96K37n86K79L91l17K48P8o86L17M26j71m92Q16
4155H3k03p25N97N90n32k96O18k68l72Q01l72k14O6N99n30K88M06o29k92P77K01
4176E93o19o8N17k2l65L30J54m67R3N55q5k61J54j59k08Q49j96n47J57M36n35
4197C06J62J65K4o57R01j13l65R8L90m69j39M28k79k78J95K71o76K91M17o33j51
4218a12Q97j51o75J39L86k31j54J66r8o33O30J43j76K02j69m50J9N30l83j41M22
4239A61n0o61N47r4n23K1O23K6p00M0N16j73K25r9o49J9P05n78j54N81k19o07
4261a043P02N50p79j3O23k07l70lP2j18J19R6j52NK12K6l46N06P2p38N23L76q5
4284B8o57O92j6n10K92M16n78J26J62m6O5L32k93n85R45M58r20PM31k19j22O40
$$ plain form
4306 648 367 -116 98 523 47 280 416 523 225 387 651 64 666 994 129 394 763 639 -265 356
4326 356 842 345 315 961 124 291 435 199 -4 -42 606 91 468 428 263 -12 795 524 33 93 636
4347 636 82 -80 574 126 -144 203 248 129 188 436 -266 118 485 33 -248 149 52 -667 -267 -93 -413
4368 -413 -754 198 -23 -398 -416 -293 -34 2 -5 -313 -1023 -275 -273 -624 -1 -468 -693 -710 -281 -834 -980 -345
4390 -345 -147 -640 -472 22 -444 -911 -227 -356 -811 -316 -672 -809 -119 -158 -697 -643 -338 -224 -754 -128 93
4411 93 -730 -334 167 -157 -306 297 -220 -378 -42 188 -296 122 221 -226 -398 853 -202 -228 210 647
4431 647 -243 14 284 -61 -167 450 241 201 222 830 254 37 698 -3 182 554 547 68 545 791 115
4452 115 356 465 424 136 819 537 394 466 730 227 340 802 219 202 870 461 552 579 353 101 -135 734
$$ packed form
4306F48k81m83K14M25m76K33J36J07k98J62K64n87O02L28q65K65L69j24r04O21
4326C56M86m97l0O46q37J67J44k36k03l8O48n15L77m0j65k75Q07k71m91O0N43
4347F36n54j62O54m48k70L47M5j19N9K48p02L84L67m52k81L97r7p19M00J74l20
4368d13l41R52k21l75j8J23K59L6pl08p10P48Kl51O23m67k25j7M29n53j46O35
4390c45J98m93J68M94m66m67O84j29m55M95l56j37O90l9n39N4L05J14n30O26K21
4411I3q23L96N01l24j49O03n17j58L36K30m84M18R9m47j72J251j055k6M38M37
4431F47q90K57K70l45j06O17k09m0K1O08n76k17O61p01J85L72pm79M77K46o76
4452A15K41J09m1k88O83k82j43P2K64n03J13M62n83j7O68m09R1K7k26k52k36Q69
$$ plain form
4474 734 560 -147 526 653 -43 389 622 -156 -100 550 396 43 331 419 -243 -71 437 -395 -174 26 -197
4495 -197 -863 46 59 -374 -340 528 22 -659 -362 -162 -440 -9 78 -283 -313 129 -321 -377 -445 -246 -644 -491
4517 -491 -146 -652 -518 -11 -198 -820 -151 122 -783 -439 23 -627 -477 -99 -565 -344 -464 176 -699 -539
4537 -539 275 -187 -602 -111 82 -380 -356 -76 -480 -173 -227 -107 -438 328 37 -402 301 255 -159 -345 339
4558 339 -152 -393 521 637 -298 30 520 403 362 256 -49 -115 551 683 81 535 740 103 182 909 463
4579 463 121 742 698 252 298 723 261 455 820 363 -44 641 574 358 210 619 299 370 690 396 38
4600 38 367 412 23 288 737 13 -390 139 359 6 294 430 -123 -176 204 -182 -469 97 25 -413 -134
4621 -134 288 -356 -454 280 -466 -503 111 163 -503 -232 -71 -96 -418 197 -510 -619 -190 -156 -974 -214 -284 -421
$$ packed form
4474G34j74p07O73J27o96M32K33p78N6O50j54l53K88Q8o62J72N08q32K21K00k23
4495a97o66R09J3m33L4Q68n06o81K97K00k78M31Q7l61l0M42m50n6o8J99l98J53
4517d91L45n06J34N07j87o22O69K73r05L44M62o50J50L78m66K21j20O40q75J60
4537e39Q14m62m15M91J93m62K4K80m04L07n4J20l31P66k91m39P03m6m14j86O84
4558C39m91k41R14J16r35L28M90j17m1j06l05o6O66J32o02M54K05o37P9P27m46
4579D63l42O21m4m46M6M25m62J94L65m57m07O85o7k16j48M09l20P1L20k94l58
4600C8L29M5l89K65M49p24m03N29K20l53K88J36n53n3L80l86k87N66p2m38K79
4621a34M22o44r8P34p46l7O14N2o66K71J61k5l22O15p07j09M29L4q18P60p0j37
$$ plain form
4643 -421 -673 -164 -205 -637 -375 55 -840 -534 -206 -577 -732 -10 -278 -567 -518 -240 -661 -407 127 -295 -191
4664 -191 26 -37 -607 -277 -121 -128 -327 302 -43 -75 -22 -59 -447 127 46 -411 -214 38 -323 -374 350 208 -216
4687 -216 -253 61 -20 114 820 193 -207 497 466 -212 129 235 185 -149 524 470 74 284 667 7 36 479
4709 479 116 -277 456 419 -28 285 458 256 356 829 83 129 584 628 376 119 388 293 90 730 172
4730 172 -218 257 324 217 335 251 -158 -70 295 171 -182 69 64 -342 226 355 -31 -539 363 -106 -338 283
4752 283 157 -419 -159 203 -208 -348 115 -78 -327 -13 -65 -950 -512 45 -341 -364 14 -255 -396 -76 -219
4773 -219 -527 -566 -209 -594 -685 291 49 -667 -201 4 -540 -307 -160 -678 -744 42 -174 -702 -153 -52 -498
4794 -498 -351 -51 -29 -497 -153 -158 -268 -307 71 -523 -136 337 -208 -329 -3 269 -256 -228 235 -272 -282 317
$$ packed form
4643d21k52N09m1m32K62M30q95L06L28l71j55P22k68k89M9K78m21K54N34m22J04
4664a91K17o3n70L30J56pj99O29l45l2N3l7l88N74q1m57J97K52l61n1P24j42m24
4687b16l7L14q1J34P06o27m00P04l1o78L41J06n0l34O73n4l96K10L83o60K9M43
4709D79l63l93P33l7m47L13J73k02J00M73p46M6M55M4k52k57K69r5k03O40n58
4730A72l90M75O7j07J18q4m09Q8L65j24l53K51nm06N68J29l86n08R02m69k32O21
4752B83j26n76K60L62m11j40M63j93k49L14n2q85M38N57l86k3L78k69j41L20j43
4773b19l08l9L57l85r1R76k42p16M66K05n44K33J47n18o6P86k16n28N49J01m46
4794d98J47L00K2m68L44nj10l9L78n94L87M73n45j21L26K72n25K8M63n07j0N99
$$ plain form
4816 317 257 64 -35 -13 -209 -72 364 330 -27 577 255 -243 192 460 101 202 420 280 56 322 564
4837 564 269 317 541 116 226 344 532 262 299 373 -79 192 664 -101 -31 645 536 -122 242 504 197
4858 197 31 297 365 19 236 373 -113 112 361 207 -156 624 143 -278 183 145 23 109 194 -153 -159 593
4880 593 171 -150 68 84 -129 -73 -79 -327 -234 -77 -102 -325 224 -30 -581 -166 112 -330 -435 12 -434 -700
4902 -700 -213 -219 -49 -573 17 -455 -711 1 -520 -663 -245 -185 -768 -530 -134 -319 -449 240 -362 -546 98
4923 98 -180 -240 -588 -28 -461 -311 60 -62 -194 -35 259 -318 -214 96 -393 -32 140 438 -421 -49 157
4944 157 56 29 176 17 -213 241 405 -270 364 448 -220 62 492 -28 24 475 178 204 156 396 135 76
4966 76 283 344 -22 390 382 -20 570 630 153 217 713 459 -163 483 419 55 325 719 376 -27 467 720
$$ packed form
4816C17o0j93r9K2j96J37M36l4l57O04l22m98M35K68l59J01K18j40k24K66K42
4837E64k95M8K24m25J10J18J88k70L7P4m52K71M72p65P0O76j09o58L64K62l07
4858A97j66K66O8l46K17J37m86K25K49j54l63P80m81m21M61l8j22Q6Q5l47oP52
4880E93m22l21K18J6k13N6ok48R3J57k5k23N49k54n51M15K78m42j05M47m46k66
4902g00M87oJ70n24N90m72k56P12n21j43M18O0n83K38L96j85j30O89o02j84O44
4923I8k78o0l48N60m33J50L71j22j32J59K94n77J04L10m89L61J72K98q59L72K06
4944A57j01k7J47j59k30M54J64o75O34Q4o68K82M30n20N2M51k97K6m8K40k61n9
4966G6K07O1l66M12qm02N90O0m77O4M96k54o22O46o4l64K70L94l43m03M94K53
$$ plain form
4988 720 -18 295 443 -30 243 277 332 -84 631 304 -62 152 564 -125 -206 601 147 -150 46 118 -186
5009 -186 310 320 199 -72 -49 -127 -598 176 80 -334 -238 245 -241 -267 250 -52 -486 -128 60 -363 -406 -81
5031 -81 -227 -494 -307 -249 -367 -280 -437 -619 -423 189 -326 -349 153 166 -633 -512 89 -137 -265 249 -289 -694
5053 -694 -90 -63 -504 21 101 -256 -304 252 -294 -354 -172 177 -512 -84 190 -4 -158 110 -162 -350 88
5074 88 561 314 237 361 -76 -62 72 124 -116 79 251 -77 60 679 249 170 306 189 239 90 236 220
5096 220 154 661 -71 348 678 514 -169 283 612 323 184 471 578 131 216 526 72 94 397 164 243
5117 243 401 106 216 368 209 54 212 153 271 122 689 315 33 106 13 -104 19 458 -35 21 -59 -291
5139 -291 -79 201 -18 -307 -267 106 -280 -160 213 -16 -297 -86 282 -141 -395 85 -476 -426 2 6 -684
$$ packed form
4988G20p38L13J48m73K73L4N5m16P15l27l66K14M12o89q1Q07m54k97J96P2l04
5009a86M96J0j21k71K3p8m71P74r6m14R6M83m86k6N17l02m34L58J88m23m3L25
5031h1j46k67J87N8j18Q7j57j82J96O12n15k3N02J3p99J21O01k26j28N14n38m05
5053f94O04K7m41N25Q0l57m8N56n46o0J82L49o89M28K74j94j54K68k72j88M38
5074H8M73k47p7J24m37J4J34N2k40J95J72l28J37O19m30p9J36j17N0j49J46j6
5096B20o6N07p32M19L30j64o83M52L29k89j39K87J07m47Q5L10m54K2L03k33P9
5117B43J58k95J10J52j59j55J58n9J18j49N67l74k82P3r3j17J23M39m93N6q0k32
5139b91K12K80k19k89M0L73l86J20L73k29k81K11L68m23k54M80n61N0M28Mo90
$$ plain form
5160 -684 -152 -37 -504 -554 -176 -394 -710 -18 -146 -536 -385 -72 -179 -678 -33 -69 -480 -31 -218 -307 -217
5181 -217 -195 -485 -466 -135 -162 -317 -77 179 -556 -485 -132 -294 -409 195 73 -3 -60 -189 -127 86 -115 -30 54
5204 54 -181 184 -61 -138 490 88 -368 261 -135 98 448 407 -125 216 201 39 -108 545 564 -58 191 151
5226 151 -4 401 401 -14 62 726 285 167 376 376 125 161 731 156 175 434 265 48 442 685 -59 372
5248 372 647 80 230 261 135 -27 359 459 35 -93 547 255 12 20 294 -242 93 441 -4 -126 -42
5269 -42 -160 -155 252 346 -375 -330 123 -440 -60 69 -35 -545 -214 36 -233 -45 -104 -129 11 168 -160 -696
5291 -696 -114 87 -260 -370 -55 -346 -717 -131 -334 -416 -31 150 -305 -487 -25 -504 -719 -233 -232 -449 -76
5312 -76 -58 -270 -231 134 -493 -611 -105 -138 -223 -239 6 -397 -239 122 12 -219 44 106 -213 -162 239 16 -134
$$ packed form
5160f84N32J15m67n0L78k18l16O92j28l90J51L13j07m99O45l6m11M49j87q9R0
5181b17K2k90J9L31k7j55K40K56p35P1L53j62j15O04j22p6n7j29O2K13k01Q5Q4
5204E4k35L65k45p7O28m02m56O29l96K33L50m1n32L41j5j62j47O53J9o22K49m0
5226A51j55M05%m15P6O64m41j18K09%k51L6N70n75J9K59j69k17L94K43p44M31
5248C72K75n67J50L1j26j62L86J00m24j28O40k92k43QK74n36L35L48m45j22Q4
5269d2j18NM07R4p21M5M53n63L80J29j04n10L31K50k69J88n9k5J40J57l28n36
5291f96N82K01l47j10L15k91l71N86k03q2L85J81m55j82M62m79k15M86Jk17L73
5312g6J8k12L9L65o27j18N06l3q5j6K45m03J58L61j10k31K63O2l19N1M01k23j50
$$ plain form
5335 -134 487 23 -258 106 247 -176 65 203 -183 -307 508 168 131 224 530 -69 266 233 49 134 351
5356 351 104 221 127 435 277 145 483 119 198 412 404 5 62 376 167 76 472 91 131 352 247 -26
5378 -26 409 618 259 307 522 139 -350 132 85 -209 267 208 315 -27 468 67 -113 191 20 -68 16 306
5400 306 -261 46 311 -134 -152 -496 120 -26 -87 -142 -335 -332 -113 103 -680 -182 -198 -317 -353 168 -27 -240
5422 -240 -113 -277 -485 -387 -503 -156 -430 -101 -199 -256 -113 -232 -584 -417 23 -470 -507 -68 -130 -437 -5 -225
5444 -225 -453 -470 227 -142 -400 -240 -412 -108 221 104 -466 -33 357 -64 232 128 -134 -301 61 53 -127
5465 -127 -258 346 10 242 427 -49 -134 263 362 147 212 443 180 -89 280 60 115 483 412 -159 64 581
5487 581 96 70 365 272 -68 217 381 433 188 115 303 -120 531 566 -55 251 318 22 165 646 231 -288
$$ packed form
5335a34O21m64k81L64J41m23K41J38l86j24Q15l40l7R3L06n99L35l3j84Q5K17
5356C51k47J17r4L08j58j32L38l64P9K14ql99N7L14k09r1L96l81M0K21j05k73
5378b6M35K09l59M8K15l83m89M82m7k94M76n9J07l42M95m01j80L04j71q8Q4K90
5400C06n67L07K65m45j8l44O16j46o1n5j93LK19K16p83M98j6j19l6N21j95k13
5422b40J27j64k08R8j16L47k74L29r8n7J43j19l52J67M40m93l7M39o2l07M32k20
5444b25k28j7O97l69k58J60j72L04L29j17n70M33L90m21K96j04k62j67L62qj80
5465a27j31O04l36K32J85m76q5L97R9k15O5K31k63k69L69k20N5L68p1n71K23N17
5487E81m85k6K95r3l40K85J64N2k45p3J88m23O51L5o21L06O7k96J43M81m15n19
$$ plain form
5509 -288 297 608 40 159 426 -177 -110 375 32 19 149 520 51 130 353 68 -59 398 44 -421 69
5530 69 342 -234 -126 141 -139 -256 76 275 -294 -289 128 -294 -357 -27 -222 -522 -222 389 -501 -395 226
5551 226 -586 -552 90 59 -668 -462 -278 -440 -304 -28 -281 -184 -122 -634 -484 -211 5 -445 -270 -205 -92 -246
5573 -246 -138 -14 -712 -264 67 -248 -71 -19 -255 -372 84 -328 -424 -156 174 -464 53 302 -401 -251 200
5594 200 64 -181 34 303 281 32 287 156 -87 161 111 54 111 601 -373 56 461 638 376 206 198 90
5616 90 164 339 414 229 291 399 -41 156 326 125 285 379 321 157 413 230 -70 358 551 -544 190 362
5638 362 66 16 90 289 142 469 117 19 165 262 -23 -250 8 157 -162 291 245 -16 -90 -71 111 -571
5660 -571 -105 103 -229 178 -71 -39 -242 -36 -168 -172 -234 -150 -440 -61 319 -405 -549 -306 -224 -241 -31 -18 -426
$$ packed form
5509b88N85L11n68J19K67o03O7M85l43j3J30L71m69P9K23k85j27M57l54m65M90
5530F9K73n76J08K67k80j17L32J99n69NM17m22o3L30j95l00L00O11q90J06O21
5551B26q12L4O42l1p27K06J84j62J36K76k53R7O2n12J50K73K16m50J75O5J13j54
5573b46J08J24o98M48L31l15J77N2k36j17M56m12r6K68L30o38N17K49p03J50M51
5594B00j36k45K15K69k2k49K55j31k43K48n0n7N7M90r74M29M05J77k62j70qj08
5616I0P4J75P5j85O2J08m40J97J70k01J60R4n8j64K56j83l00M28J93j095P34J72
5638C62k96n0P4J99j47L27l52r8J46R7k85k27K58J49l19M53m6k61p4J9J82o82
5660e71M66K08l32M07k49L2k03K06j32mo2Q4k90L79L80p24j44K43Q2j7K10J3m08
$$ plain form
5683 -426 -346 81 -219 -299 -25 -326 -546 -181 -39 -855 -204 16 -274 -285 -91 66 -464 18 -178 -331 -214
5704 -214 -158 -93 -78 -54 -2 -402 -102 22 -13 -147 68 -19 -199 -123 -112 -532 -183 153 -89 -65 11 -91 -227 -93
5728 -93 251 -259 18 89 -25 -231 401 329 203 108 390 -23 -33 209 91 204 265 130 -104 212 208 392 271
5751 271 244 72 337 474 360 -58 80 321 -248 226 472 271 147 23 571 74 -141 398 349 -177 310
5772 310 153 118 517 275 85 -216 214 217 -98 263 151 -47 -80 135 -340 219 189 36 -50 179 0 -427
5794 -427 127 136 -192 -314 14 -242 -291 390 -48 -290 -130 116 -115 -493 29 -120 -291 -133 -199 -479 -428 -295
5816 -295 -338 -159 -60 -282 -442 -340 -147 -416 -199 76 -700 -313 386 -156 -663 46 -153 -93 -282 -26 -128
5837 -128 -538 -169 -284 -334 52 44 -396 15 -115 -183 -228 186 68 -387 157 161 -137 260 42 46 -91 187 178 -144
$$ packed form
5683d26Q0M27l00q0K74l01k20L65J42q16O51K20k90j1J94J57n30M82j96j53J17
5704b14N6O5J5K4N2m00L00J24l5j34K15q7j80P6J1m20L49L36k42K4P6j02j36J34
5728i3L44n10K77P1j14k06O32p2j26r5K82m13j0K42j18J13O1j35k34L16mJ84j21
5751B71k7j72K65J37j14m18J38K41n69M74K46k01j24j24N48m97k15N39m9n26M87
5772C10j57l5L99k42j90l01M30Ll15L61j12j98l3K15m75N59l0j53q6K29j79m27
5794d27N54Rl28j22L28k56m9O81m38k42J60K46k31l78N22j49j71J58o6k80N1J33
5816b95m3J79R9k22j60J02J93k69K17K75p76L87O99n42n07P09j99O0j89K56j02
5837a28m10L69j15n0L86qm40M11j30o8m5M14j18m55N44Mk98L97k18Mj37K78rl22
$$ plain form
5861 -144 94 458 -96 -391 551 -164 84 131 259 136 352 573 -83 342 168 220 147 375 138 273 268 522
5883 522 134 178 56 343 -95 341 232 252 530 514 125 219 446 247 330 10 57 28 123 433 -51 44 565
5906 565 -17 55 57 172 -265 -7 96 -48 -26 347 -134 -578 -147 316 -147 -465 88 134 -132 264 80 -227
5928 -227 -153 -31 -154 -616 -233 37 -126 -42 -64 -480 -494 -8 68 -222 -194 8 -149 104 225 -585 -473 112
5950 112 -196 -294 -120 125 -361 -201 -24 -413 -54 27 -349 -373 -199 -157 -665 -37 -159 -484 -224 -123 24
5971 24 -261 -15 -50 -341 -128 310 27 -264 131 74 -39 63 114 -196 -79 241 -281 -114 233 172 -249 493
5993 493 103 78 -20 298 391 -147 30 362 -79 529 645 -156 217 229 -57 -200 417 272 -284 194 517
6014 517 106 115 395 276 -47 95 -27 241 104 190 -193 148 364 -171 262 588 213 108 348 562 -224
$$ packed form
5861a44K38L64n54k95R42p15K48M7J28j23K16K21o56M25j74N2p3K28k37J35nK54
5883E22l88M4j22K87m38M36j09K0K78j6l89R4K27j99Q3l20M7k9R5L10m84R5N21
5906E65n82P2KJ15m37K58J03j44K2L73m81m44M31M63m63l18N53M6k66L96j84l07
5928b27P4J22j23m62L83K70j63Q4k2m16j4M86P6k90K8K02j57K53J21q10J12N85
5950A12l08r8J74K45m86J60J77l89L59Q1l76k4J74M2n08O28j22l25K60J01J47
5971B4k85K46l5k91K13M38k83k91L95n7j13J02N1l10J17L20n22J67L47o1m21P42
5993D93l90k5r8L18R3n38J77L32m41O08J16q01L73J2k86j43O17j45n56M78L23
6014E17m11RK80j19l23J42j22K68j37Q6l83L41K16n35M33L26l75j05K40K14p86
$$ plain form
6035 -224 -209 336 195 155 213 46 -249 -31 79 -44 -244 301 -381 -149 39 20 -411 128 81 -252 -224 183
6057 183 40 -46 183 183 -170 -403 -207 -125 -138 105 8 -405 102 -14 -347 -422 172 -293 -500 -111 -183 -358 -215
6080 -215 -401 -269 -130 179 -135 -284 -185 -94 -376 -309 -34 -376 -190 176 -66 -352 -7 -47 106 -270 7
6101 7 -214 -351 264 -77 -108 -230 253 -291 -140 63 -410 -108 311 22 10 137 -48 110 153 211 339 -406
6123 -406 579 173 -116 201 3 128 -57 486 -77 -110 -66 128 -6 235 430 2 5 499 95 1 286 568
6145 568 -99 138 646 -53 -211 130 356 -89 240 10 271 242 397 122 482 -29 318 30 233 66
6165 66 -153 134 415 0 -328 140 240 -129 -92 153 -66 286 179 46 -325 6 -31 -461 108 124 -195
6186 -195 121 114 34 -565 -274 8 -161 93 93 -409 -340 -90 181 -58 138 -84 -281 -195 10 -507 -621 -171
$$ packed form
6035b24J5N45j41m0N8j67k95K18J10j23k00N45o82K32J88j9m31N39m7l33K8M07
6057A83j43q6K29%l53k33J96Q2j3K43r7m13N07j16l33p5N94m65k07L89p2j75J43
6080b15j86J32J39L09l14j49R9R1k82O7K75l42J86L66k42k86L45m0J53l76K77
6101Gk21j37O15l41l1j22M83n44J51K03m73L02M19k89j2J27j85J58M3N8J28p45
6123d06R85m06k89L17j98J25j85N43n63l3M4J94j34K41J95m28LM94m04r4K85K82
6145E68o67K37N08o99j58L41K26m45L29k30K61k9J55k75L60n11L47k88K03j67
6165F6k19K87K81m15l28M68J00l69L7K45k19L52j07j33l71L31l7m30N69J6l19
6186a95L16pq0n99K91K82j69K54%n02O9K50K71k39J96k22j97Q6K05n17j14M50
$$ plain form
6208 -171 34 -349 25 -369 -152 -243 264 -370 -269 97 -49 -259 -32 -431 -465 -75 211 -170 -449 5 -125
6229 -125 -238 116 162 -429 -52 -139 -136 -269 -99 78 -474 -13 188 -249 -332 275 -75 106 -4 121 -170 -6
6251 -6 501 160 89 322 190 -125 42 -36 67 197 640 -234 218 312 -106 -248 275 511 -25 247 160 326
6273 326 52 111 281 -18 253 156 175 13 181 97 -95 136 60 -18 32 260 267 -213 213 26 223 197 -75
6296 -75 -151 -35 -24 60 -91 183 0 -76 444 33 -246 -22 -35 79 28 -48 -36 -299 108 86 -335 -89 62
6319 62 11 -99 48 -109 -465 135 -63 -237 -151 178 -32 -200 -72 -426 -422 -353 -96 -479 83 -258 -337 -359 -194
6342 -194 -20 -381 -239 16 -198 -394 8 -26 -595 -318 -8 -393 -25 419 -271 15 -270 4 -144 -272
6362 -272 87 -291 -73 132 -302 38 36 -119 -466 266 289 -90 -17 102 -192 -279 333 256 -46 -5 189 -185
$$ packed form
6208a71K05l83L74l94K17r1N07o34J01L66j46k10K27l99l4L90K86l81k79M54j30
6229a25j13L54M6n91L77q7Lj33J70J77n52M61K01m37q3O07l50J81j10J25k91J64
6251fN07l41p1K33j32l15J67p8J03J30M43q74M52R4m18j42N23K36n36K72q7J66
6273C26k74N9J70k99K71r7J9j62J68q4j92K31p6p8N0K28Pm80M26j87J97k6k72
6296g5p6J16J1Q4j51K74j83p6N20m11k79K24j3J14n1p6J2k63M07k2m21K46J51
6319F2n1j10J47j57l56O00j98j74Q6L29k10j68J28l54MO9K57l83N62l41p9k2J65
6342a94J74l61J42K55k14j96M02l4n69K77L10l85L68M44o90K86k85K74j48j28
6362b72L59l78K18K05m34L40kj55l47P32K3l79P3J19k94q7O12p7l02M1J94l74
$$ plain form
6384 -185 240 253 -9 -361 179 428 148 54 358 -139 -109 195 106 -3 534 349 194 16 428 90 147 397
6406 397 -88 105 23 181 142 174 449 -15 -228 98 -60 -135 368 241 210 86 564 -46 20 366 187 -37
6428 -37 -31 -73 177 56 392 108 127 168 -56 -242 -196 128 -236 -200 302 -315 -219 70 -55 -185 -133 184 -391
6451 -391 -448 121 -234 -230 -171 -232 -247 -68 240 -430 20 -2 -352 -427 -73 -95 -524 -4 89 -483 -226 103 -312
6474 -312 -524 -206 -113 -368 -427 -207 -312 -274 -80 -465 -138 -233 204 -279 60 125 -431 73 -4 -179 -31 243
6496 243 153 -160 29 184 -107 -123 249 146 -218 -116 23 -179 132 243 13 -231 -110 -9 -281 43 518
6517 518 165 -111 45 -77 -3 244 317 -200 -129 240 309 252 189 186 29 337 119 -273 164 258 74 143 350
6540 350 -17 -223 202 183 -39 29 484 190 85 -9 206 -93 155 99 -110 -161 161 21 3 219 108 -25
$$ packed form
6384a85M25J3k62l52N40K49k80r4L04m97L0L04q9j09N37j85j55j78M12l38N7K50
6406C97m85J93q2J58l9L2K75m64k13L26j58p5N03j27l1j24M78o10O6L46j79k24
6428c7Om2K50j21L36k84J9M1k24j86M6L24l64L6N02o17R6K89j25j30N2L17n75
6451c91n7N69l55MN9o1j5J79L08o70M50k2l50p5L54k2m29N20R3n72K57L29m15
6474c12k12L18R3k55n9K20j05L8J94l85L27r5M37m83L39O5n56N04p7j75J48K74
6496B43r0l13J89J55k91j6L72j03l64J02J39k02L11J11k30k44J21J01k72L24M75
6517E18l53k76J56j22P4K47P3n17P1L69O9n7o3lj57L08k18l92M37R4j84O9K07
6540C50l67k06M25j9k22O8M55k94j05r4K15k99K48n6k09n1L22j40j8K16j11j33
$$ plain form
6562 -25 217 377 -96 -243 355 78 -368 74 61 -104 144 195 -108 147 86 -211 -281 -168 192 -145 -68 26
6584 26 -196 -47 -26 -242 -218 169 131 84 -304 226 -60 -71 -109 -56 -415 180 140 -362 -6 -251 88 -497 32
6607 32 -198 -122 -286 -415 -445 -34 -309 -463 -547 14 -8 -193 30 -218 85 -133 677 -166 -432 155 55 -395
6629 -395 -98 351 28 125 241 7 58 163 350 205 15 229 -122 73 305 667 -162 149 -235 18 85
6650 85 338 243 -20 -21 378 -59 -20 443 -2 243 354 122 235 506 90 33 180 271 -100 19 480 188
6672 188 -49 270 -95 184 450 141 -253 242 172 275 129 148 371 39 214 144 93 -44 218 -1 183
6693 183 -62 319 -142 -108 -172 -245 -69 -41 34 143 8 -334 -175 24 161 -249 -152 50 -395 13 10 -263 -411
6716 -411 -309 45 -369 -184 -16 -262 -250 -381 -164 -400 -157 -24 -349 -374 -285 -257 -397 144 71 -441 -86 63
$$ packed form
6562b5K42J60m73j47N98k77m46M42j3j65K48N1l03K55o1k97p0J13L60l37P7R4
6584B6k22J49K1k16K4L87l8m7l88N30k86j1l8N3l59N95m0n02L56k45L39n85N29
6607C2k30P6j64j29l0M11k75j54q4N61k2j85K23k48L03k18Q10q43k66N87j00m50
6629c95K97M49l23R7J16k34N1J05J87j45j90K14l51J95K32L62q29L11l84K53O7
6650H5K53r5k63jL99m37L9M63m45K45J11k32J13K71m16n7J47R1l71J19M61k92
6672A88k37L19l65K79K66l09l94M95p0J03j46J9K23l32J75p0n1j37K62k19J84
6693A83k45L81m61L4o4p3J76K8P5J09j35l42J59J99J37m10R7K02m45M08lk73j48
6716d11J02L54m14J85J68k46J2j31K17k36K43J33l25k5Q9K8j40N41p3n12L55J49
$$ plain form
6738 63 101 -131 -24 -143 -27 -91 -145 -101 -259 192 35 14 76 32 -288 -24 -59 -149 -166 42 -172 -155 25 382
6762 382 61 83 145 -114 -87 -104 -14 117 321 23 -169 -387 392 -83 57 288 -254 -180 276 453 138 132 200
6785 200 -124 -151 296 311 -192 227 260 213 89 137 -53 79 291 325 -112 82 284 217 123 174 62 -24 314
6808 314 223 -134 63 147 36 -86 268 191 -69 -86 -125 -277 -312 104 -140 270 229 -154 -310 -166 -54 -11 -54
6831 -54 206 -104 -94 -64 -173 -233 -155 34 -297 -26 -92 21 -118 138 213 -161 -43 13 -365 -465 -158 -167 -118 -48
6855 -48 -62 -558 -22 -139 -83 -65 -55 -75 -404 -170 -72 -220 157 -41 -235 122 61 62 -197 82 -19 -294 -286 7
6879 7 -56 -306 103 -19 -286 168 278 -298 -86 -20 -122 -142 102 -341 30 166 1 -51 -83 30 200 -157
6901 -157 421 203 -137 107 312 -84 201 592 244 -272 173 175 -82 441 273 72 97 186 -21 74 199 154
$$ packed form
6738F3L8k32J07j19J16o4n4M4j58M51j57k1O2m4l20K64l5r0j7K08k14J7J80L57
6762C82l21K2O2k59K7j7R0J31K04k98j92k18P79m75J40K31n42P4M56J77l15oO8
6785B00l24k7M47J5n03M19L3m7j24M8j90J32K12L4m37J94K02o7r4N1j12q6L38
6808C14r1l57J97Q4j11j22L54p7k60j7l9j52l5M16k44M10m1l83j56J44J12M3m3
6831e4K60l10J0L0j09o0P8J89l31K71o6J13j39K56P5l74J18N6l78j00L07rM9P0
6855d8j4m96N36j17N6J8J0k0l29K34R8j48L77j98j94L57o1Jk59K79j01k75QK93
6879Go3k50M09j22k67M54J10n76K12O6j02k0K44m43L71J36j65n2l2J13J70l57
6901a57N78k18l40K44K05l96K85L91l48n16M45Kk57N23j68k01K5Q9k07R5J25m5
$$ plain form
6923 154 -120 370 382 -67 -175 16 418 -67 201 173 -374 240 506 176 -30 418 280 18 103 283 -102
6944 -102 174 319 133 -95 64 335 -105 -238 -177 -45 28 194 -370 104 -86 -200 -131 141 245 -333 -309
6965 -309 277 -174 -290 -234 -118 -142 126 142 -414 -6 26 -27 -223 -120 103 -256 5 200 -9 -100 90 -96
6987 -96 -286 -138 72 -10 -105 255 3 -262 -59 27 -275 62 -183 -436 8 -127 120 -530 18 -127 -236
7008 -236 -254 -103 10 -446 342 19 -23 -58 221 -169 43 -20 64 -57 107 96 -75 -24 -120 -62 71 166 86 -142
7032 -142 136 -189 -311 208 536 -128 319 313 -80 56 300 25 35 608 262 -468 -194 312 189 -293 218
7053 218 92 -389 12 261 156 -119 156 31 103 223 298 -164 305 215 26 44 85 151 149 63 -142 -189 86
7076 86 54 86 43 66 95 -12 -269 130 -287 -138 44 -50 162 175 44 47 -108 241 -109 -80 70 100 -290 153
$$ packed form
6923A54k74M90J2m49j08J91M02m85K68k8n47O14K66l30k06M48j38k62Q5J80l85
6944a02K76J45j86k28J59K71m40j33O1J32P3J66n64M74j90j14O9K72J04n78K4
6965c09N86m51j16N6J16k4K68J6n56M08L2n3j96J03K23l59K61J95k09r1J90j86
6987i6j90J48K10q2r5L60k52k65K03Q6l02L37k45k53M44j35K47o50N48j45j09
7008b36j8J51J13m56P88l23m2l5K79l90K12o3Q4j21J64j1j71N1r6N8J33R5q0k28
7032a42K78l25j22N19L28o64M47ol93J36K44k75J0N73l46p30K74N06j23m82N11
7053B18j26m81M01K49j05k75K75j25P2J20P5m62M69r0j89J8M1O6kq6k05m7K75
7076H6l2L2m3K3K9j07k57L99m17J49J82r4K12J3j31Lj55L49l50K9J50L0l90M43
$$ plain form
7100 153 -22 -305 -162 -28 -277 -135 -187 -111 -57 97 -363 -273 9 153 -152 -189 94 -357 45 101 -95 -46
7122 -46 -381 -45 -184 -356 -229 -68 -464 -123 -181 -324 -95 -92 -286 100 61 -31 -127 -28 31 -8 -141 -172 103 -138
7146 -138 -90 -101 -29 -135 224 -381 109 303 -289 -118 -106 225 -41 -137 409 -68 22 328 -19 -167 153 -145
7168 -145 52 194 120 189 -24 -29 0 -118 222 306 -155 176 295 -5 -141 423 195 -252 322 290 -154 176
7190 176 70 -11 92 -99 -55 -105 13 171 -122 -119 281 201 -325 -29 375 -273 160 223 -362 157 369 83
7212 83 0 411 233 -17 -24 106 199 -178 80 -14 29 -247 -40 -48 -67 -150 -444 -2 390 161 -328 -208 -16 -91
7236 -91 166 89 -257 -485 223 284 -392 -206 -76 -420 -78 15 -191 -266 -86 54 -71 -225 250 -238 75 5
7258 5 -838 6 64 123 10 -214 -245 -88 -609 170 81 -143 -89 -65 -34 153 -21 -322 -28 -18 44 -28 -104 -82 50
$$ packed form
7100A53j75k83J43J34k49J42n2P6N4J54m60R0K82J44l05l7K83m51M02N6j96M9
7122d6l35L36j39j72J27J61l96L41n8j43K29Lj94L86l9r2r6R9N9l9j33l1K75k41
7146a38M8j1P2j06L59o05M90J94n92J71J2L31k66r6N46m77R0L06l47j48L20k98
7168a45J97J42p4O9k13nK9j18L40Q4m61L31J19l00j36N64k28m47N74l2m44L30
7190A76j06q1J03j91M4n0J18J58k93LM00q0n26K96M04o48M33O3n85N19K12k86
7212H3q3M11j78k50pJ30R3l77K58r4M3k76K07qj9q3k94M42L92k29m89J20J92p5
7236i1K57p7l46k28P08O1o76J86J30l44L42R3k06p5J80J40j25j54M75m88L13p0
7258Eq43Q44N8N9j13k24l1J57n21P79q9k24N4K4L1J87j74l01K94J0O2p2p6K2J32
$$ plain form
7283 50 72 -133 -106 -134 191 197 -166 342 300 -67 18 110 35 -103 225 41 74 290 124 -196 -42 690 146 20
7307 20 -206 173 100 200 355 114 -136 306 432 1 420 80 179 -26 238 -78 -184 -110 367 183 343
7328 343 51 -149 143 81 78 -84 59 21 -138 170 56 -243 39 310 59 -214 119 -2 -440 164 99 -70
7350 -70 46 448 -231 -132 90 -62 -333 245 153 -402 -79 -95 156 -208 -80 -14 -344 -70 81 -121 -157 -272
7372 -272 -12 119 -1 -214 -121 -8 -244 -379 -51 168 -345 -170 136 -54 -273 -220 150 -166 -318 -206 -148
7393 -148 -208 56 -273 -59 -23 -166 -170 82 88 -29 -14 119 -203 -129 230 8 24 112 -100 -52 -361 -110 30 16
7417 16 28 126 164 67 210 195 -48 -111 376 78 253 274 4 77 467 336 97 99 65 -72 295 289 378 254 306
7442 306 387 -133 -65 557 135 -42 382 -233 322 78 74 35 356 158 51 335 385 -57 -281 280 104 -4
$$ packed form
7283E0K2k05K7k8L25Ol63N08m2l67Q5R2p5j38L28j84L3K16j66l20J54P32n44j26
7307B0k26L79p3J00J55k41k50M42J26m31M19l40R9k05K64l16j06P4M77j84J60
7328C43k92k00K92o2lj62J43l8j59L08j14k99K82K71k51k73L33j21m38O04o5j69
7350g0J16M02o79R9K22j52k71N78r2n55L23j6K51l64J28O6l30K74J51k02l6j15
7372b72K60J31j20k13R3J13k36j35L28K19n13J75L06j90k19N3L70l16j52J12N8
7393a48o0K64l29K14L6j43mK52Oj17J5J33l22P4L59k22J6Q8k12M8l09K51J40j4
7417A6J2R8L8r7J43j5k43o3M87k98J75K1k70P3L90j31k39Kl4j37L67oQ9j24N2
7442C06Q1n20O8O22m22j77M24o15N55k44ml9L21j98j07K84N0m42k24N61j76j08
$$ plain form
7464 -4 84 274 -223 28 241 198 -257 153 85 -17 217 223 -149 -319 276 18 -148 120 -142 -106 -29 -127 -167 -70
7488 -70 227 180 -168 151 34 -144 -50 30 114 65 -143 57 -494 -21 23 -35 -102 -76 -265 -185 1 -28 -327 -182
7512 -182 -439 -587 -114 -24 -315 -206 62 226 -70 -267 134 -95 81 83 -64 -272 92 150 -123 -21 121
7533 121 -89 -465 -62 85 40 -85 39 -399 -50 208 47 -275 106 14 -553 260 207 -191 -2 110 151
7554 151 244 211 283 43 -44 -164 28 142 194 93 -262 119 184 -297 155 -131 178 -177 427 -24 115 30
7576 30 144 -155 -85 164 258 -87 9 171 -150 219 300 -42 -141 315 -65 -361 531 -103 -157 61 174 -211
7598 -211 117 344 -195 -102 -132 202 -43 -32 0 -149 -136 -15 -45 -38 194 44 -121 70 -232 -161 -101 -132 -166 -390
7622 -390 106 1 -629 -202 107 -341 -217 -150 78 -220 7 101 -526 -298 -308 170 -17 -1 130 -453 226
$$ packed form
7464dQ8J90m97K51K13m3m55M10o8j02K34Ol72j70N95k58j66K68k62L6P7r8m0R7
7488g0K97m7l48L19j17j78R4Q0Q4m9k08K00n51M73M4n8o7K6j89Q0J86k9k99J45
7512a82k57j48M73R0k91J09K68J64k96j97M01k29J76Kj47k08L64N8k73J02J42
7533A21k10l76M03J47m5j25J24m38L49K58j61l22L81r2n67Q13n3l98J89J12M1
7554A51R3l3P2k40q7j20J92J14N2j01l55L81O5m81M52k86L09l55O04m51J39q5
7576C0J14k99P0K49R4l45R6J62l21L69Q1l42r9M56l80k96Q92o34n4K18J13l85
7598b11L28K27n39R3l0L34k45J1L2j49J3J21l0PK32j50j65J91l02P1O0l1l4k24
7622c90M96j05o30M27L09m48J24O7K28k98K27R4o27K28j0M78j87J6J31n83O79
$$ plain form
7643 226 -126 -251 -225 158 93 -61 220 -85 -334 -137 240 -81 -18 170 -54 94 235 -56 -242 14 325
7664 325 6 -79 146 -334 -34 130 192 -297 -178 255 135 -48 -101 -341 -244 175 252 -330 157 263 -98 17
7686 17 345 213 63 137 424 14 187 249 -88 214 448 -119 -272 137 276 63 178 154 225 -30 344 234
7708 234 -53 92 -2 -440 -111 646 -35 117 107 342 -86 -198 151 -303 -134 258 -73 45 274 -86 -289
7729 -289 158 129 16 -17 419 -8 -222 -4 61 66 248 194 -293 25 487 -22 -341 -228 -218 -219 122 23 -101
7752 -101 -319 46 -80 -27 41 47 -60 -172 120 -46 -309 104 -7 -307 -154 67 -319 -39 -96 241 70 -142
7774 -142 -167 -644 -230 40 -271 -114 176 -1 -18 32 -444 -125 122 -45 -144 -195 216 37 -44 21 76 -57 204
7797 204 -74 -170 -592 406 308 35 159 -117 -143 -148 100 120 -43 246 213 -78 389 329 185 -302 329 -263 63
$$ packed form
7643B26l52j25K6L83o5j54K81l05k49J97L77l21O3J88k24J48J41k91j86K56L11
7664C25l19q5K25m80L00J64O2m89J19M33j20j83n3k40R7M19P7n82M87J06l61J15
7686A7L28j32j50P4K87m10J73O2l37L02K34n67j53M09J39k13J15k4P1k55L74j10
7708B34k87J45r4m38L29P57o81J52j0K35m28j12L49m54J69L92l31J18K29l60k03
7729b89M47k9j13l3M36m27k14K18O5NJ82n4m87L18M62n09l19J13J0jL41r9j24
7752a01k18L65j26N3O8Oj07j12K92j66k63M13j11l00J53K21l86K80n7L37j71k12
7774a42k5m77M14K70l11J57K90j77j7N0m76L19K47j67r9n1M11j79q1O5N5j33K61
7797B04k78r6m22R98r8k73J24k76k6nK48K0j63K89l3k91M67o0j44m87O31n92L26
$$ plain form
7820 63 112 122 -303 259 195 -89 441 126 112 -123 283 93 111 244 111 -6 196 251 222 -156 97 -258 -311
7843 -311 65 206 -20 -12 -129 37 -47 153 70 -245 116 402 14 21 277 -364 -82 293 -99 -149 -8 12 -188
7866 -188 -216 -40 -229 -328 18 117 -291 89 84 174 38 90 68 -137 158 237 -82 -180 -15 -120 -363 -210 86
7889 86 -518 -137 -12 -343 -238 -73 168 -370 307 -93 -266 134 88 -203 -161 37 -36 -43 -55 185 -43 -169
7911 -169 -91 34 199 -143 -355 -121 50 -97 -175 65 -151 -483 -285 205 -19 -203 150 126 9 -247 95
7932 95 104 152 187 -2 -568 -120 1 142 60 182 -232 -163 170 92 -151 14 269 -218 151 365 178 -237 94
7955 94 -138 3 116 65 -243 263 190 58 99 86 122 -54 1 94 433 76 403 19 -144 118 78 119 147 166
7979 166 -96 3 32 -80 -149 227 232 11 53 395 -30 -147 175 90 -137 15 392 -15 -88 237 -3 -326 -145
$$ packed form
7820F3M9J0m25N62o4k84N30l15j4k35M06j90J8J33j33j17K02N5k9l78K53l55n3
7843c11L76J41k26Qj17J66q4K00q3l15L61K86l88PK56o41K82L75l92n0J41K0k00
7866a88k8J76j89r9L46R9m08L80nR0j36N2k2k05K95P9l19r8J65j05k43J53K96
7889H6o04L81J25l31J05J65K41n38O77m00j73M00m6k91M2J98p3pj2K40k28j26
7911a69P8J25J65l42k12K34J71j47p8K40k16l32J98M90k24j84L53k4j17k56L42
7932I5RM8L5j89n66M48J21J41q2J22m14O9L33p8k43J65K55m87L69K14j87m15L31
7955I4k32J41J13n1l08N06p3j32M1j3L6j76N5R3L39l57L27l84j63K62m0M1K8J9
7979A66k62R9K9j12o9L76Nk21M2L42m25j17L22q5k27J52L77m07p3L25k40l23J81
$$ plain form
8002 -145 -125 -56 136 -59 -195 59 428 91 -141 -33 -17 75 -188 256 -317 -229 104 210 -272 121 -173 -185
8024 -185 -290 14 89 -386 -205 -128 -84 -5 74 -224 -244 253 -188 -279 -17 -228 -135 -447 -29 -304 -242 -109 117
8047 117 -311 -142 21 -338 41 96 -323 -98 -134 4 -28 -154 79 45 87 -103 -249 17 -56 180 17 -19
8069 -19 302 -458 47 175 -75 -172 236 161 55 168 174 -256 282 17 143 -140 -19 218 -262 177 362 56
8091 56 55 116 198 -179 261 90 294 125 -48 36 -139 61 167 -253 164 49 -121 324 107 28 -184 149
8113 149 2 -194 88 298 77 -31 38 -225 -5 -56 -154 40 490 250 -545 -30 87 -197 -55 -147 -118 -134
8135 -134 -43 377 -263 69 192 -229 400 -162 69 -185 -84 225 -68 -44 -249 -216 -64 -302 -117 -159 65
8156 65 -338 -378 76 -234 -453 -315 -22 -72 -201 96 272 -76 -374 -249 -341 -170 -37 -276 -17 -106 -9 -88
$$ packed form
8002a45K0O9J92j95j36K54L69l37k32J08J6R2k63M44n73Q8L33J06m82L93k94j2
8024a85j05L04P5m75J81P7M4P9P9k98k0M97m41r1K62k11R3l12M18k75O2J33K26
8047A17m28J69J63l59L79N5m19K25l6J38l2j26K33l4M2j90j46K66p3K36j63l6
8069a9L21p60N05J28k50r7M08p5j06J13Om30N38k65J26k83J21K37m80M39J85l06
8091E6jO1Q2l77M40j71K04j69j73Q4j75K00J06m20M17j15j70M45k17p9k12L33
8113A49j47j96K82K10k21j08O9k63K20n1r8J94M50k40p95N15J17k84J42r2K9j6
8135a34R1M20o40L32J23m21O29n62K31k54J01L09k93K4k05L3J52k38J85m2K24
8156F5m03m0M54l10k19J38K93n0j29K97J76l48k98J25r2J71J33k39K59q9R7p9
$$ plain form
8178 -88 -261 50 -38 -192 -31 408 -93 162 353 -56 -172 346 65
$$ packed form
8178h8j73L11q8j54J61M39n01K55J91m09j16N18k81
8191F5
$$ Imaginary data points
##PAGE= N=2
##DATA TABLE= (X++(I..I)), XYDATA
$$ plain form
0 0 0 0 0 0 0 0 0 0 -2 8 -8 8 -8 12 -16 16 -24 24 -32 35 -40 48 -56 64 -73 85 -96 109 -125 141 -157 176
32 176 -199 222 -247 276 -308 341 -377 418 -463 512 -565 626 -697 771 -857 956 -1070 1203
50 1203 -1358 1546 -1784 2080 -2475 3022 -3839 5186 -7825 14955 -74470 -245727 -169119 -63032
64 -63032 -661 -21854 -56025 -91567 -95117 -93119 -96305 -104145 -84919 -52145 -22278 -36962 -103662
77 -103662 -165796 -143635 -72985 -38849 -61307 -97896 -127846 -133624 -113707 -104154 -125882 -134557 -107232
90 -107232 -81804 -94853 -134320 -165983 -153160 -101428 -64729 -73665 -98125 -115246 -121631 -101907
102 -101907 -61747 -45470 -57186 -53320 -33563 -35877 -53808 -54643 -32644 -1221 21583 16029 -7861
115 -7861 -21856 -22114 -14582 7362 26926 17849 -500 -321 -4789 -26447 -31182 -11162 1116 -1294
$$ packed form
0@%%%%%%%%kJ0j6J6j6K0k8L2m0M8n6O7p5Q8j04J20j37J58j81K05k34K66k98L33
32A76l75M21m69N23n84O49p18P95q81R75j077J191j323J468j628J813k026K273
50A203k561K904l330L864m555N497o861R025j3011K2780q9425j71257P6608J06087
64f3032O2371k1193l4171l5542l550J998l186p840J9226L2774K9867j4684o6700
77a03662o2134K2161P0650L4136k2458l6589k9950n778J9917R553k1728q675K7325
90a07232K5428j3049l9467l1663J2823N1732L6699q936k4460j7121o385J9724
102a01907M0160J6277j1716L866J9757k314j7931q35K1999L1423K2804n554k3890
115g861j3995k58P532K1944J9564r077j8349J79m468k1658m735K0020J2278k410
$$ plain form
129 -1294 -6431 -20849 -40923 -46482 -37728 -26375 -14832 -13610 -23336 -28359 -28218 -38227 -40107 -13926
143 -13926 8193 282 -11953 -11660 -14123 -13097 3794 16271 11244 5023 5787 4503 4473 3989 -159
158 -159 4130 13600 5799 -13649 -16961 -12251 -17169 -18834 -14723 -24946 -39352 -37032 -31944 -41081 -50653
173 -50653 -50559 -48546 -42063 -37750 -47593 -59276 -56203 -49472 -46405 -36810 -30292 -38562 -42635 -31767 -28076
188 -28076 -33368 -26215 -14992 -14382 -13494 -8440 -10649 -14093 -11697 -10471 -9027 1039 4172 -5214 -8872
203 -8872 -6466 -12249 -15452 -6190 -4314 -11306 -8556 -3592 -12902 -23061 -20891 -16412 -9027 864 -1017
218 -1017 -14530 -18017 -11675 -6527 -83 5845 595 -1125 12082 16816 4804 860 10957 19289
232 19289 27551 32706 21256 7121 13621 28274 31226 27815 23391 17788 21429 29302 21460 6316
$$ packed form
129a294n137j4418k0074n559Q754J1353J1543J222r726n023J41j0009j880K6181
143a3926K2119p911j2235K93k463J026J6891J2477n027o221P64j284l0m84m148
158a59M289R470p801j9448l312M710m918j665M111j0223j4406K320N088r137r572
173e0653R4K013O483M313r843j1683L073O731L067R595O518q270m073J0868L691
188b8076n292P153J1223O10Q88N054k209l444K396J226J444J0066L133r386l658
203h872K406n783l203R262J876o992K750M964r310j0159K170M479P385R891j881
218a017j3513l487O342N148O444N928n250j720J3207M734j2012l944J0097Q332
232A9289Q262N155j1450j4135O500J4653K952l411m424n603L641P873p842j5144
$$ plain form
246 6316 8997 21408 25663 22313 11258 -7348 -9701 9598 20890 11566 1070 -3989 -6361 -1749
260 -1749 2933 -4327 -8190 4765 13719 5566 -6341 -13769 -12701 4410 22144 15480 -1591 -3516
274 -3516 2556 4738 7939 8134 3397 9236 22439 18862 323 -6697 -961 11054 23503 22513 4451
289 4451 -5815 3063 9098 6529 5883 5682 4718 11174 13692 -869 -11939 -1515 12642 16084 12686
304 12686 2825 -7713 -1062 13306 13043 5666 5812 9849 12264 15268 8764 -3084 2830 22346
318 22346 27608 16276 6526 1718 3233 15688 24061 14678 6983 10595 12981 10826 8340 2347
332 2347 266 12785 22597 12499 -1620 -4852 -3716 1278 11816 11621 -1018 -4080 1789 438
346 438 -4864 -5355 -4650 -960 7406 5392 -7956 -14019 -8359 -3967 346 4825 -932 -10251 -7379 -2088
$$ packed form
246F316K681J2411M255l350j1055j8606k353J9299J1292r324j0496n059k372M612
260a749M682p260l863J2955Q954q153j1907p428J068J7111J7734o664j7071j925
274c516O072K182L201J95m737N839J3203l577j8539p020N736J2015J2449r90j8062
289D451j0266Q878O035k569o46k01r64O456K518j4561j1070J0424J4157L442l398
304A2686r861j0538O651J4368k63p377J46M037K415L004o504j1848N914J9516
318B2346N262j1332r750m808J515J2455Q373r383p695L612K386k155k486n993
332B347k081J2519R812j0098j4119l232J136M994J0538j95j2639l062N869j351
346D38n302m91P05L690Q366k014j3348o063N660M392M313M479n757r319K872N291
$$ plain form
362 -2088 -6326 -7884 -3579 -2987 -3564 243 -3360 -11475 -11144 -5646 -3984 202 2643 -5527 -12950 -8300
378 -8300 -3901 -4843 -698 1375 -5603 -7682 -2274 -2576 -6583 -3993 -944 -934 2940 3532 -6195 -10440
394 -10440 -2753 3491 5409 6964 1360 -7499 -3156 6847 4553 -1132 2299 5541 6728 8266 3563
409 3563 -6073 -2881 10587 14697 10103 4088 -3048 -2712 9153 15111 4683 -1328 4911 9122 7775
424 7775 4753 -2992 -7051 4570 15679 9207 -2716 -7380 -7160 -406 8280 4152 -7823 -7927 -270
439 -270 -1322 -6525 -8432 -11176 -8147 2317 1390 -12788 -19579 -13090 -6683 -3224 -4660 -13108 -17715
454 -17715 -9773 -5808 -13230 -16964 -13437 -10469 -7068 -4589 -14017 -24693 -18586 -7295 -5898 -10180
468 -10180 -14332 -18851 -16760 -9124 -11216 -19187 -16908 -10295 -10055 -11544 -14865 -22794 -21841 -9007 -3970
$$ packed form
362b088m238j558M305N92n77L807l603q115L31N498J662M186K441q170p423M650
378h300M399r42M145K073o978k079N408l02m007K590L049J0L874N92r727m245
394a0440P687O244J918J555n604q859M343J0003k294n685L431L242J187J538m703
409C563r636L192J3468M110m594o015p136L36J1865N958j0428o011O239M211j347
424G775l022p745m059J1621J1109o472j1923m664K20O754Q686m128j1975j04P657
439b70j052n203j907k744L029J0464r27j4178o791O489O407L459j436q448m607
454a7715P942L965p422l734L527K968L401K479r428j0676O107J1291J397m282
468a0180m152m519K091P636k092p971K279O613K40j489l321p929R53J2834N037
$$ plain form
483 -3970 -13153 -18944 -16947 -15274 -11551 -9648 -15197 -17560 -9353 -4172 -9724 -14827 -15450 -13997 -5000
498 -5000 3294 -4008 -14926 -11549 -3259 -1191 -1469 -2288 -6678 -4026 5535 4922 -4722 -6274 -975 4903
514 4903 10023 7694 -3615 -6813 3811 9088 5144 2555 2016 757 5200 8393 547 -5847 1519
529 1519 9928 8698 4203 -1126 -5186 729 10304 7687 623 505 3429 4441 7255 4939 -2712
544 -2712 -1041 10541 12541 4893 745 -106 588 6834 10725 4239 -550 2861 4612 1970 1585 -759
560 -759 -2991 2340 6830 -791 -7648 -4978 -3107 -3235 -355 -1128 -7501 -7466 -2018 -4102 -7644 -5807
576 -5807 -4816 -4166 -708 -1290 -6835 -6954 -2282 -1956 -1496 2607 1285 -3439 -984 1945 -1379 -1360 4114
593 4114 3949 999 2050 2067 -1357 -307 1966 1214 2325 4676 409 -4419 -1381 108 -887 2356
$$ packed form
483c970r183n791J997J673L723J903n549k363Q207N181n552n103o23J453Q997
498e000Q294p302j0918L377Q290K068k78q19m390K652R561o13r644j552N299N878
514D903N120k329j1309l198J0624N277l944k589n39j259M443L193p846o394P366
529A519Q409j230m495n329m060N915R575k617p064j18K924J012K814k316p651
544b712J671J1582K000p648m148q51O94O246L891o486m789L411J751k642l85k344
560g59k232N331M490p621o857K670J871j28K880p73o373L5N448k084l542J837
576e807R91O50L458n82n545j19M672L26M60M103j322m724K455K929l324J9N474
593D114j65k950J051J7l424J050K273p52J111K351m267m828L038J489r95L243
$$ plain form
609 2356 3983 -2443 -4849 927 2386 -1822 -875 1394 1227 3076 4744 -39 -2993 1400 4018 4671
625 4671 6904 3747 -1979 1593 7421 2489 -1993 3088 6121 3764 2603 -180 -6043 -4793 3875
640 3875 5712 -456 -5818 -9267 -6953 498 956 -7888 -9779 -4030 -3195 -5521 -5065 -7991 -11259 -4482
656 -4482 4150 -1235 -9820 -9147 -4438 -548 1462 -2304 -6447 -1570 3982 745 -3156 -3562 -4051 297
672 297 9617 7341 -6154 -10055 -442 5001 3428 1643 -2465 -4927 -560 2305 -1474 -4789 -3433
687 -3433 -470 3881 4431 -5742 -12020 -2977 7376 3807 -1719 -1614 -1755 -1179 4530 4458 -2747 -2753 4732
704 4732 8939 7461 717 -5343 -1708 8082 9272 3073 1358 1955 -1279 -295 4178 287 -5054 861
720 861 6925 307 -8249 -10305 -6546 -950 1949 -4193 -10816 -10198 -8392 -8373 -5835 -7356 -14265 -13281
$$ packed form
609B356J627o426k406N776J459m208R47K269j67J849J668m783k954M393K618O53
625D671K233l157n726L572N828m932m482N081L033k357j161k783n863J250Q668
640C875J837o168n362l449K314P451M58q844j891N749Q35k326M56k926l268O777
656d482Q632n385q585O73M709L890K010l766m143M877N552l237l901m06m89M348
672B97R320k276j3495l901R613N443j573j785m108k462M367K865l779l315J356
687c433K963M351N50j0173o278R043J0353l569n526J05j41N76N709p2p205oP485
704D732M207j478o744o060L635R790J190o199j715N97l234R84M473l891n341N915
720H61O064o618q556k056L759N596K899o142o623O18J806J9K538j521o909R84
$$ plain form
736 -13281 -3553 -4018 -14009 -15998 -10939 -9592 -8312 -5842 -8852 -12313 -11469 -9718 -9683 -8564 -8971 -9371
752 -9371 -4981 -3917 -13285 -16781 -8370 -3187 -6297 -7786 -7556 -13054 -14445 -7713 -5453 -8940 -10848
767 -10848 -10625 -10147 -8229 -9517 -13241 -10982 -6525 -8754 -10879 -6277 -5978 -11960 -9839 -3331 -4708 -7136
783 -7136 -3269 -799 -3776 -4248 -1832 -234 1942 3349 2451 3823 5601 1737 68 7580 11559 6269
799 6269 5217 7972 5195 3305 8896 11880 6901 3850 6165 7131 6892 5509 2692 3825 7841 6309
815 6309 2340 3270 3882 494 3300 8257 3735 -2241 2628 8172 4710 534 377 2223 5964 9438
831 9438 5782 185 -564 1799 4760 9241 7732 -903 -2183 5536 6097 -369 -754 2485 1702 1239
847 1239 1594 -3321 -7228 -3019 1509 298 -3447 -8570 -9308 -3019 1395 -6442 -12325 -7580 -2692 -3318
$$ packed form
736a3281R728m65r991j989N059J347J280K470l010l461Q44J751L5J119m07m00
752i371M390J064r368l496Q411N183l110j489K30n498j391O732K260l487j908
767a0848K23M78J918j288l724K259M457k229k125M602K99n982K121O508j377k428
783g136L867K470k977m72K416J598K176J407q98J372J778l864j669P512L979n290
799F269j052K755k777j890N591K984m979l051K315R66k39j383k817J133M016j532
815F309l969R30O12l388K806M957m522n976M869N544l462m176j57J846L741L474
831I438l656n597p49K363K961M481j509q635j280P719N61o466l85L239p83m63
847A239L55m915l907M209M528j211l745n123p38O289M414p837n883M745M888o26
$$ plain form
863 -3318 -3210 -5635 -12200 -9666 469 3314 -3648 -7651 -6555 -2318 2199 1011 -4393 -3514 2384
878 2384 3407 947 361 -1924 -2615 5196 10444 2520 -5490 -1396 4753 6136 4673 727 -2918 1015
894 1015 7048 5244 115 -1736 -960 3705 9408 5846 -4060 -3119 6165 8563 4656 2991 1778 2845
910 2845 8653 11433 4738 875 5009 10517 13438 11420 3901 688 8786 14934 11473 6154 6368
925 6368 6442 8608 12650 9889 2497 3243 10394 10949 6699 2742 691 3713 9173 7969 993 -567
941 -567 2895 4074 4237 4234 -1361 -3660 4023 8308 2834 -2672 -2305 -204 2972 5766 2417 -3085 -1420
958 -1420 1733 2102 1884 674 -2204 -423 4580 2613 -3644 -3184 430 304 585 1007 -2883 -5160 -949
975 -949 569 -2897 -4046 -3058 -3223 -1241 -657 -4993 -7712 -3380 -1030 -2548 -2443 -2477 -5723 -5562 -874
$$ packed form
863c318J08k425o565K534J0135K845o962m003J096M237M517j188n404Q79N898
878B384J023k460n86k285o91P811N248p924q010M094O149J383j463l946l645L933
894A015O033j804n129j851P76M665N703l562r906R41R284K398l907j665j213J067
910B845N808K780o695l863M134N508K921k018p519l213Q098O148l461n319K14
925F368P4K166M042k761p392P46P151N55m250l957k051L022N460j204o976j560
941e67L462J179J63ln595k299P683M285n474n506L67K101L176K794l349n502J665
958a420L153L69k18j210k878J781N003j967o257M60L614j26K81M22l890k277M211
975i49J518l466j149R88j65J982N84m336k719M332K350j518J05l4l246J61M688
$$ plain form
992 -874 -1616 -3940 -2301 -666 -2248 -1939 -869 -3429 -3195 648 460 -1261 224 19 -3162 -1208 1802
1009 1802 92 -809 1856 1256 -1888 -34 1525 -758 -126 2223 1195 32 1614 508 -1596 917
1025 917 3301 1376 755 2168 429 -284 3136 3183 -622 507 4093 2696 911 1559 -212 -256 4311
1042 4311 4984 545 -455 1169 1410 2454 4696 1090 -1849 1841 4309 1790 505 1087 -20 2188
1058 2188 5768 3087 -2385 -784 3074 3675 3518 2383 -1242 -714 4684 4242 -486 -1194 1171 1994
1074 1994 3309 3220 -2920 -4751 1656 5188 1561 -1315 -2671 -3360 702 3997 -633 -5892 -2939 1595
1090 1595 1662 438 -3006 -6613 -2989 4438 3334 -3005 -4506 -2809 -556 2368 2052 -4151 -5313 1294
1106 1294 3251 -470 -2913 -4691 -3736 2451 4668 -2362 -7641 -4165 -95 162 -709 -3905 -7559 -3405
$$ packed form
992h74p42k324J639J635j582L09J070k560K34L843j88j721J485k05l181J954L010
1009A802j710r01K665o00l144J854J559k283O32K349j028j163J582j106k104K513
1025I17K384j925o21J413j739p13L420M7l805J129L586j397j785O48j771m4M567
1042D311O73m439j000J624K41J044K242l606k939L690K468k519j285N82j107K208
1058B188L580k681n472J601L858O01j57j135l625N28N398m42m728p08K365Q23
1074A994J315q9o140j831O407L532l627k876j356o89M062L295m630n259K953M534
1090A595O7j224l444l607L624P427j104o339j501J697K253K924l16o203j162O607
1106A294J957l721k443j778R55O187K217p030n279L476M070K57q71l196l654M154
$$ plain form
1122 -3405 2169 -1251 -7312 -7475 -4704 -2248 579 -2582 -9542 -9228 -2104 -353 -3020 -4685 -6497
1137 -6497 -6054 -785 1057 -4837 -7619 -3090 282 245 -314 -4232 -6594 -2048 2982 317 -3430 -2453
1153 -2453 -2199 -554 1441 -1241 -5945 -3284 2061 1240 -2006 -3227 -4505 -3913 1390 1931 -3399 -4741
1169 -4741 -1922 -1479 -1098 -472 -2704 -3973 632 2884 -563 -2607 -1215 -585 1113 4294 3175 -1362
1185 -1362 705 3437 2520 1825 3443 2372 2800 5482 4314 416 1024 3602 3254 3721 4253 1342 -768
1202 -768 2148 3171 387 617 2176 570 592 2027 -521 -3146 22 1673 511 781 864 -2461 -2277
1219 -2277 1449 1572 -924 761 1879 -589 -9 1772 72 -537 2107 2131 244 1243 1082 -1471 -610
1236 -610 1984 1061 -445 1244 -135 -2448 -753 755 -2331 -2421 412 -685 -2444 -1762 -2526 -3777
$$ packed form
1122c405N574l420o061j63K771K456K827l161o960L14P124J751k667j665j812
1137f497M43N269J842n894k782M529L372l7n59l918k362M546N030k665l747R77
1153b453K54J645J995k682m704K661N345q21l246j221j278N92N303N41n330j342
1169d741K819M43L81O26k232j269M605K252l447k044J392O30J698L181j119m537
1185a362K067K732r17o95J618j071M28K682j168l898O08K578l48M67N32k911k110
1202g68K916J023k784K30J559j606K2J435k548k625L168J651j162K70Q3l325J84
1219b277L726J23k496J685J118k468N80J781j700o09K644K4j887R99j61k553Q61
1236f10K594r23j506J689j379k313J695J508l086r0K833j097j759O82p64j251
$$ plain form
1252 -3777 -1282 969 -1479 -2595 -1549 -2713 -2115 1164 707 -2750 -594 2526 1191 -570 1076
1267 1076 42 42 3887 4936 1373 67 2111 2879 3996 4772 1780 122 4241 6017 2620 1650
1283 1650 2326 1696 2958 6460 3977 -1437 587 4560 4328 2849 2332 452 2044 5891 4360 194
1299 194 688 3231 3883 5243 4803 -112 -1152 5326 7698 3430 909 1583 2387 4771 6693 3265
1315 3265 -1442 1438 5070 5445 4050 1433 -1983 1260 6368 3813 -1410 -451 1797 1334 1587 1240
1331 1240 -2343 -2878 2280 3646 -894 -3350 -3498 -1506 2321 2409 -2936 -5280 -1092 925 -130 -321
1347 -321 -2235 -5193 -1440 3615 1008 -4618 -4012 -705 696 1053 -394 -3815 -2587 1040 645 -1884
1363 -1884 -2123 -2617 -1702 2556 1739 -4691 -5965 -488 1704 -547 -903 -2178 -4351 -2234 922 -846
$$ packed form
1252c777K495K251k448j116J046j164N98L279m57l457K156L120j335j761J646
1267A076j034%L845J049l563j306K044P68J117P76k992j658M119J776l397r70
1283A650O76o30J262L502k483n414K024L973k32j479n17j880J592L847j531m166
1299A94M94K543O52J360m40m915j040O478K372m268k521O74Q04K384J922l428
1315C265m707K880L632L75j395k617l416L243N108k555n223R59K248m63K53l47
1331A240l583n35N158J366m540k456j48J992L827Q8n345k344M188K017j055j91
1347c21j914k958L753N055k607n626O06L307J401L57j447l421J228L627l95k529
1363a884k39m94R15M258q17o430j274N477K192k251l56j275k173K117L156j768
$$ plain form
1379 -846 -3143 -2485 -1094 -359 885 -2289 -5118 -1395 2833 345 -1957 -512 -837 -1780 1213 2449
1395 2449 -1737 -2827 1218 2651 1036 14 -1907 -1840 2302 3695 71 -155 758 -1690 -1144 3122
1411 3122 2033 -1822 -42 2762 297 -1976 95 954 143 1057 661 -892 -174 580 -449 803
1427 803 2069 -981 -1958 2244 2725 -1058 -278 2241 680 -140 2942 2855 25 -349 848 1194 2684
1444 2684 3199 350 -444 1476 391 386 3661 2736 -1745 -436 3502 1484 -1222 689 2615 1198
1460 1198 860 1283 -375 -496 1422 1993 1660 1550 -708 -982 2926 4196 -518 -1750 2333 2319 825
1477 825 2869 2178 -1642 -347 3356 3285 808 -219 -243 1029 3049 877 -2136 462 3056 728
1493 728 -272 402 -1882 -2716 2084 3627 -1508 -4466 -1301 322 512 231 -2520 -3712 -1065 628
$$ packed form
1379h46k297O58J391P35J244l174k829L723M228k488k302J445l25r43K993J236
1395B449m186j090M045J433j615j022j921O7M142J393l624k26R13k448N46M266
1411C122j089l855J780K804k465k273K071Q59q11R14l96j553P18P54j029J252
1427H03J266l050r77M202M81l783P80K519j561q20L082q7k830l74J197L46J490
1444B684N15k849p94J920j085nL275r25m481J309L938k018k706J911J926j417
1460A198l38M23j658j21J918N71l33j10k258k74L908J270m714j232M083j4j494
1477H25K044o91l820J295L703p1k477j027k4J272K020k172l013K598K594k328
1493G28j000O74k284q34M800J543n135k958L165J623J90k81k751j192K647J693
$$ plain form
1509 628 -724 -1518 -2034 -3908 -1697 2048 -366 -4990 -2740 1135 -944 -2848 -1819 -2108 -1459 492
1525 492 655 -3333 -4365 -1680 95 1610 717 -4339 -5059 483 2057 -1650 -2139 -518 -1985 -1429
1541 -1429 1754 137 -3849 -1646 1307 1179 -451 -1117 -1721 124 2862 672 -2345 8 2109 689
1557 689 2130 2266 -1716 -2046 4049 5371 874 -830 912 1438 3506 4213 1219 1 2463 3357
1573 3357 2478 2756 1698 -363 2850 6212 2597 -1445 1225 3753 2978 2871 2562 230 269 3479 3867
1590 3867 1451 916 450 1546 4236 3596 -543 -831 3104 2819 1003 1945 1432 -958 951 3398 1080
1607 1080 -1630 -45 1355 956 926 -685 -2283 -142 2055 -83 -1352 -432 -1860 -2512 589 1266
1623 1266 -2146 -3399 -606 -1177 -2578 -984 -1396 -3148 -2107 -1173 -2168 -2309 -1639 -3154 -3145 -1015 -1595
$$ packed form
1509F28j352p94n16j874K211L745k414m624K250L875k079j904J029k89O49J951
1525D92J63l988j032K685J775J515q93n056p20N542J574l707m89J621j467N56
1541a429L183j617l986K203K953j28j630o66o04J845K738k190l017K353K101j420
1557F89J441J36l982l30O095J322m497j704J742N26K068P07k994j218K462Q94
1573C357q79K78j058k061L213L362l615m042K670K528p75j07l09k332L9L210L88
1590C867k416n35m66J096K690o40m139k88L935k85j816R42n13k390J909K447k318
1607A080k710J585J400l99l0j611j598K141K197k138j269R20j428o52L101O77
1623A266l412j253K793n71j401J594m12j752J041R34r95j41O70j515RK130n80
$$ plain form
1640 -1595 -3984 -2316 -817 -2823 -3560 -1275 -2325 -3641 -1712 -632 -2763 -2936 -1882 -2366 -1673 -224
1656 -224 -1812 -3587 -1461 -693 -1583 -553 338 -2804 -2698 849 1082 -1586 -1150 -84 -720 229 1484
1673 1484 -473 -1544 300 1237 281 1278 794 -1144 355 3631 1582 -778 1085 1610 1407 2587
1689 2587 2875 -18 151 3300 3499 1324 1567 1316 1343 3657 3813 587 -43 2435 3207 1918 2378 1410
1707 1410 -663 2148 4837 2212 -1010 280 1553 2170 3190 1462 -2039 -318 2910 2042 197
1722 197 247 -1166 -948 2121 2067 -1870 -2413 978 1051 174 235 -2056 -2899 486 2057 -903 -2858 -1672
1740 -1672 -1077 -179 1005 -1628 -4416 -1794 1052 -227 -2616 -2465 -3320 -2145 619 16 -4678 -4407
1756 -4407 -1542 -971 -1450 -1526 -3523 -4036 -736 421 -2712 -3654 -2285 -2110 -939 214 -2201 -4951 -2077
$$ packed form
1640a595k389J668J499k006p37K285j050j316J929J080k131j73J054m84O93J449
1656b24j588j775K126P68q90J030Q91l142J06L547K33k668M36J066o36R49J255
1673A484j957j071J844R37r56R97m84j938J499L276k049k360J863N25k03J180
1689B587K88k893J69L149J99k175K43k51K7K314J56l226o30K478P72j289M60r68
1707A410k073K811K689k625l222J290J273O17J020j728l501J721L228q68j845
1722A97N0j413K18L069n4l937n43L391P3q77O1k291q43L385J571k960j955J186
1740a672N95Q98J184k633k788K622K846j279k389J51q55J175K764o03m694K71
1756d407K865N71m79p6j997n13L300J157l133r42J369J75J171J153k415k750K874
$$ plain form
1773 -2077 1034 -1185 -2309 -2205 -2595 -1595 1130 -579 -3463 -2145 -65 -265 -391 -693 -2898 -2279
1789 -2279 1027 1114 -1662 -1731 -553 -651 446 1456 -863 -2329 594 1992 127 11 115 -781 577
1806 577 2832 1157 -1401 213 1657 893 1434 1519 -483 -64 2239 1338 -354 517 1540 707 1393
1823 1393 2192 -453 -314 1997 1988 264 1288 1288 225 1261 3038 815 47 1944 1833 794 1745 1822
1841 1822 168 811 2758 1504 348 1627 1274 -197 1106 2117 -48 358 1270 380 -809 1278
1857 1278 801 -326 189 1217 -154 -506 848 -114 -1019 803 994 -784 -242 622 -861 -856 1042 -198
1875 -198 -1761 332 1208 -959 -784 0 -1235 -834 1157 58 -2094 -1222 -229 -1049 -559 -278 -2182
1892 -2182 -2642 325 184 -2166 -1845 -1024 -2049 -767 411 -1791 -3181 -1154 430 -616 -679 -811 -2249
$$ packed form
1773b077L111k219j124J04l90J000K725j709k884J318K080k00j26l02k205O19
1789b279L306Q7k776o9J178r8J097J010k319j466K923J398j865j16J04q96J358
1806E77K255j675k558J614J444p64N41Q5k002M19K303r01j692Q71J023q33O86
1823A393P99k645J39K311rj724J024%j063J036J777k223p68J897j11j039R51P7
1841A822j654O43J947j254j156J279l53j471J303J011k165M06R12q90j189K087
1857A278m77j127N15J028j371l52J354r62r05J822J91j778N42Q64j483NJ898j240
1875a98j563K093Q76k167J75P84j235M01J991j099k152Q72R93q20M90K81j904
1892b182m60K967j41k350L21Q21j025J282J178k202j390K027J584j046o3j32j438
$$ plain form
1909 -2249 -881 1495 -209 -2430 -1064 233 6 430 136 -2324 -1521 1664 1510 -960 -1125 -601 -87
1926 -87 1312 1465 -1368 -2077 698 1338 921 647 -436 -1593 972 3166 1112 -1551 80 1214 1043
1943 1043 2415 1362 -1443 -159 3077 2580 744 237 170 937 3577 2853 -256 -426 2358 2657 1692
1960 1692 1669 525 -352 2345 4011 1519 -682 810 2113 2125 2532 949 -1081 1085 3408 2042
1976 2042 994 551 79 595 3290 2476 -989 -1108 1797 2093 871 598 -526 -893 1404 2116 -86
1993 -86 -820 127 73 351 1096 -1149 -2477 354 1865 -640 -1704 -830 -1172 -1227 784 -84 -2941 -2088
2011 -2088 -277 -229 -681 -1242 -3040 -2386 297 -189 -2500 -2633 -1546 -2248 -1476 335 -1872 -3759 -1574
2028 -1574 -307 -1661 -1738 -1462 -1795 -1390 -510 -1638 -2819 -1561 -853 -1694 -661 -320 -2148 -2459 245
$$ packed form
1909b249J368K376j704k221J366J297k27M24k94k460Q03L185j54k470j65N24N14
1926h7J399J53k833p09K775O40m17k74j083j157K565K194k054k663J631J134j71
1943A043J372j053k805J284L236m97j836n07o7P67K640p24l109j70K784K99r65
1960A692k3j144q77K697J666k492k201J492J303J2M07j583k030K166K323j366
1976B042j048m43m72N16K695q14l465j19K905K96j222k73j124l67K297P12k202
1993h6p34R47n4K78P45k245j328K831J511k505j064Q74l42n5K011q68k857Q53
2011b088J811M8m52n61j798O54K683m86k311j33J087p02P72J811k207j887K185
2028a574J267j354p7K76l33M05Q80j128j181J258P08q41J033L41j828l11K704
$$ plain form
2045 245 -228 -1975 -1309 -102 -1572 -1110 374 -840 -1576 -731 -241 -280 393 -39 -1208 -52 1083 -678
2063 -678 -1086 645 690 -903 659 1744 -248 -710 1317 1472 449 989 680 189 1576 1889 1144 1147
2081 1147 1395 317 370 2916 2383 -171 512 2568 1670 920 1859 1931 132 1610 2370 712 866 1611
2099 1611 1276 1424 2334 383 -470 2383 2690 624 246 1406 343 24 2359 2106 -767 -460 1031
2116 1031 1510 1445 529 -1192 -903 1246 1120 -461 -2 227 -1054 248 1457 -898 -2456 -45 1441
2133 1441 -613 -1522 -984 -965 -721 325 -1126 -2334 -1609 -1004 -515 177 -509 -3600 -2872 1004 105 -2437
2151 -2437 -2098 -1162 -1508 -1381 -97 -1956 -3040 -1129 -144 -930 -1606 -2530 -2430 239 1083 -2286 -3020 -1045
2169 -1045 52 -902 -111 -330 -2692 -1915 1495 823 -1545 -1425 -1013 -445 462 64 -1725 -810 817 262
$$ packed form
2045B45m73j747O66J207j470M62J484j214p36Q45M90l9O73m32j169J156J135j761
2063f78m08J731M5j593J562J085j992m62K027J55j023N40l09m91J387L13p45L
2081A147K48j078N3K546n33k554O83K056q98p50R39P2j799J478P60j658J54P45
2099A611l35J48R10j951q53K853L07k066l78J160j063l19K335k53k873L07J491
2116A031M79o5r16j721K89K149j26j581M59K29j281J302J209k355j558K411J486
2133A441k054r09N38J9K44J046j451j208P25O05M89O92o86l091P28L876q99k542
2151b437L39R36l46J27J284j859j084J911R85p86o76r24J00K669Q44l369p34J975
2169a045J097r54P91k19k362P77L410o72k368J20M12N68R07l98j789R15J627n55
$$ plain form
2187 262 -608 263 -503 -1305 1291 2542 -710 -2500 415 1923 1701 725 276 -410 474 2652 2266 600
2205 600 489 69 1220 3306 2240 -660 612 2693 1578 686 1724 1620 252 1660 2574 629
2221 629 -37 1378 1978 2101 1808 -94 -319 2095 2904 880 407 1278 143 486 2787 2146 -585 -270
2239 -270 1659 1627 701 548 458 162 1229 1143 -811 378 734 -247 370 1274 -890 -1686 733 1623 -838
2258 -838 -1276 77 -498 -1097 403 -197 -1207 -1388 -759 -818 -47 -12 -1681 -1474 31 -636 -2317 -750
2276 -750 79 -1798 -1583 -236 -811 -1962 -1141 -358 -1308 -1018 -924 -1770 -1234 -73 -1329 -1462 -973 -1492 -2434
2295 -2434 -360 552 -1767 -2380 -394 -82 -1200 -653 -171 -1870 -1487 68 -103 -631 -214 -747 -807 656
2313 656 318 -1324 -544 1053 -195 -919 576 138 -868 740 1498 -101 -1085 324 720 863 1194
$$ packed form
2187B62q70Q71p66q02K596J251l252j790K915J508k22r76m49o86Q84K178l86j666
2205F00j11m20J151K086j066k900J272K081j115q92J038j04j368J408R14j945
2221F29o66J415O00J23k93j902k25K414Q09k024m73Q71j135L43K301o41k731L15
2239b70J929l2r26j53r0k96J067q6j954J189L56r81O17R04k164p96K419Q90k461
2258h38m38J353n75n99J500o00j010j81O29n9P71L5j669K07J505o67j681J567
2276g50Q29j877K15J347n75j151Q21P83r50K90R4q46N36J161j256j33M89n19r42
2295b434K074R12k319o13J986L12j118N47M82j699L83J555j71n28M17n33o0J463
2313F56l38j642P80J597j248p24J495m38j006J608P58j599r84J409L96J43L31
$$ plain form
2330 1194 -88 -986 1017 1996 737 430 926 -354 407 2777 1953 -694 198 1987 1371 768 1762
2347 1762 683 590 2157 2365 764 493 1176 1100 1785 2136 619 -320 1670 2843 926 538 1179 347
2365 347 1052 2123 1102 -743 -83 1449 1227 1245 363 -914 101 2063 1238 -923 -266 465 -296 859
2383 859 1442 -783 -1865 315 1577 115 -613 -534 -1024 322 710 -517 -1923 -613 -10 -831 -338
2400 -338 -840 -2488 -1323 803 -625 -2474 -1708 -942 -1294 -621 -642 -2129 -2154 -240 -433 -1432 -1687 -1912
2418 -1912 -1764 -378 35 -1813 -2744 -920 -882 -1231 -381 -849 -2357 -1344 130 -931 -2198 -1183 -945
2435 -945 -878 -184 -203 -1810 -1495 111 -94 -942 -234 -754 -1198 732 1214 -715 -1192 427 343 276 963 282
2455 282 -879 786 1733 500 173 927 534 249 1967 1079 -185 442 1797 1080 698 1494 838 194
$$ packed form
2330A194j282q98K003R79j259l07M96j280P61K370q24k647Q92J789o16o03R94
2347A762j079r3J567K08j601k71O83p6O85L51j517r39J990J173j917l88O41q32
2365C47P05J071j021j845O60J532k22J8q82j277J015J962q25k161O57P31p61J155
2383H59N83k225j082K180J262j462p28P9m90J346L88j227j406J310O03q21M93
2400c38n02j648J165K126j428j849P66P66l52O73k1j487k5J914j93r99k55k25
2418a912J48J386M13j848r31J824L8l49Q50m68j508J013J474j061j267J015K38
2435i45O7O94j9j607L15J606k05q48P08n20m44J930M82j929m77J619q4o7O87o81
2455B82j161J665R47j233l27P54l93k85J718q88j264O27J355p17l82P96o56o44
$$ plain form
2473 194 1790 1914 705 785 1666 690 734 1952 1534 117 1490 1959 708 1123 1872 594 391 1720
2491 1720 1494 390 1065 1304 463 884 1703 548 -453 1075 1111 -274 802 893 -245 200 1515 526
2509 526 -638 -89 205 -346 334 390 -1047 -947 -54 123 -857 -374 -688 -1076 -293 547 -995 -1509 -347
2528 -347 -510 -806 -407 -557 -1967 -1199 -66 -899 -1670 -823 -1428 -1665 -511 -498 -2308 -2023 -314 -879 -1895
2547 -1895 -1297 -1663 -1972 -256 -152 -1932 -2061 -820 -547 -925 -424 -1271 -2294 -705 371 -733 -1506
2564 -1506 -627 -741 -685 849 26 -1563 -651 781 60 -503 -151 -669 -694 881 1221 -642 -779 316
2582 316 349 677 885 -200 -568 1381 1927 299 151 601 327 1003 2082 1015 -816 814 2096 1201
2600 1201 1238 1115 361 631 2284 1982 -43 597 1269 811 1709 1827 650 -30 1772 2382 616 617 1158
$$ packed form
2473A94J596J24j209Q0Q81r76M4J218m18j417J373M69j251M15P49j278k03J329
2491A720k26j104O75K39q41M21Q19j155j001J528L6j385J076R1j138M45J315r89
2509E26j164N49K94n51O80N6j437J00Q93J77r80M83l14l88P83Q40j542n14J162
2528c47j63k96L99j50j410P68J133q33p71Q47o05k37J154J3j810K85J709n65j016
2547a895N98l66l09J716J04j780j29J241K73l78N01q47j023J589J076j104p73
2564a506Q79j14N6J534q23j589R12J432p21n63L52n18k5J575L40j863j37J095
2582C16L3L28K08j085l68J949N46j628j48M50k74O76J079j067j831J630J282q95
2600A201L7j23p54K70J653l02k025O40O72m58Q98J18j177o80J802O10j766JN41
$$ plain form
2619 1158 689 1262 2229 543 -456 845 1515 688 927 601 -201 471 2034 776 -735 227 858 -58
2637 -58 893 966 -669 -859 1167 820 -507 -346 -363 -614 413 936 -729 -1441 -195 56 -661 -249 -255 -1596
2657 -1596 -683 831 -328 -1410 -554 -719 -1206 -361 -539 -1326 -1212 -128 -1042 -1341 -1003 -972 -1500 -277
2675 -277 -47 -1328 -1420 -97 -993 -1434 -146 -873 -1903 -990 72 -685 -1075 -552 -949 -1292 306 -73
2693 -73 -1415 -659 48 -769 -544 500 -242 -1443 -117 340 -563 -581 210 -214 -602 847 200 -362 63
2712 63 513 56 222 690 -157 -215 1169 1278 -359 383 1100 223 442 1266 740 -69 907 1537 521 1080
2732 1080 942 -11 616 2206 602 99 1116 1389 552 1280 1482 249 -51 1884 1602 685 636 830
2750 830 625 1406 1721 200 287 1088 1137 660 1229 739 -604 323 1753 477 -439 -31 869 -197 454
$$ packed form
2619A158m69N73R67j686r99J301O70q27K39l26q02O72J563j258j511R62O31r16
2637e8R51P3j635j90K026l47j327J61j7k51J027N23j665p12J246K51p17M12oj341
2657a596R13J514j159j082Q56j65m87Q45j78p87J14J084r14k99L38L1n28J223
2675b77K30j281r2J323q96m41J288p27j030R13J062p57l90N23l97l43J598l79
2693g3j342P56P07q17K25J044p42j201J326M57r03j8P91m24l88J449o47n62M25
2712F3M50m57J66M68q47n8J384J09j637P42P17q77K19Q24n26q09R76O30j016N59
2732A080j38r53O27J590j604n03J017K73q37P28K02j233l00J935k82r17m9J94
2750H30k05P81L15j521Q7Q01M9m77N69m90j343R27J430j276r16M08R00j066O51
$$ plain form
2769 454 810 -753 -461 591 230 -328 230 -523 -706 669 735 -1586 -1176 161 -318 -805 10 -718 -1964
2788 -1964 -686 507 -474 -1490 -785 -618 -1052 -366 -1029 -2114 -1050 -154 -960 -1471 -564 -1179 -1757 72
2806 72 -259 -2045 -1859 -386 -348 -792 -699 -1131 -1638 -535 327 -954 -937 -1034 -1222 -652 928 -446 -2242
2825 -2242 -641 597 -646 -905 -311 -651 -1168 296 383 -750 -547 134 83 327 720 -897 -627 916
2843 916 1149 -523 277 934 -45 179 1416 752 -264 463 1349 734 581 818 484 859 1635 660 -43
2862 -43 1388 1475 214 1352 1705 -2 200 2018 1791 131 470 1278 472 812 1399 898 597 1055 597
2881 597 553 1426 1017 -424 659 1734 379 -404 1079 1049 -397 13 1174 68 -414 711 487 -70
2899 -70 118 -331 -284 552 343 -876 -668 360 -702 -943 219 348 -1592 -1262 351 -558 -1038 -657 -532
$$ packed form
2769D54L56j563K92J052l61n58N58p53j83J375O6k321M10J337m79m87Q15p28j246
2788a964J278J193r81j016P05J67m34O86o63j085J064Q96q06n11R07o15n78J829
2806G2l31j786J86J473L8m44R3m32n07J103Q62j281J7r7j88N70J580j374j796
2825b242J601J238j243k59N94l40n17J464Q7j133K03O81n1K44L93j617K70J543
2843I16K33j672Q00O57r79K24J237o64j016P27Q86o15j53K37l34L75P76r75p03
2862d3J431Q7j261J138L53j707K02J818k27j660L39Q08q06L40N87n01l01M58m58
2881E97m4Q73m09j441J083J075j355p83J483l0j446M10J161j106m82J125k24n57
2899g0J88m49M7Q36k09j219K08J028j062k41J162J29j940L30J613r09m80L81J25
$$ plain form
2918 -532 -1247 -763 -438 -922 -520 -380 -1324 -1057 -182 -1202 -1791 -130 230 -1539 -1491 -542 -1172 -1546 -326
2937 -326 -319 -1810 -1222 -615 -768 -601 -578 -1417 -1217 -79 -632 -1376 -617 44 -1322 -1003 360 -659 -1249
2956 -1249 -243 301 -398 -482 -267 -562 -17 563 -330 -878 96 168 -123 679 1081 -869 -606 1154 1029
2975 1029 -321 87 600 -11 589 1295 532 -3 739 739 608 864 647 -111 874 2026 504 -299 1153
2994 1153 1132 420 1268 1278 -469 -21 1682 1590 867 576 254 357 1308 1663 -77 335 1197 579 341 1525
3014 1525 383 -509 359 1593 1 -57 706 466 448 724 291 -494 196 1016 309 -125 121 -673 11
3033 11 764 322 -1091 -854 258 135 -284 -109 -434 -839 -40 360 -841 -731 -289 -651 -794 68 -750
3052 -750 -1438 -610 250 -885 -1041 -340 -1140 -1722 10 31 -1709 -1407 -305 -706 -806 -555 -1460 -1339 -353
$$ packed form
2918e32p15M84L25m84M02J40r44K67Q75j020n89J661L60j769M8R49o30l74J220
2937c26Pj491N88O07j53J67K3q39K00J138n53p44P59O61j366L19J363j019n90
2956a249J006N44o99q4K15k95N45N80q93n48R74P2k91Q02M02j950K63J760j25
2975A029j350M08N13o11O00P06p63n35P42%j31K56k17p58R85J152j522q03J452
2994A153k1p12Q48J0j747M48J703r2p23k91l22J03R51L55j740M12Q62o18k38J184
3014A525j142q92Q68J234j592n8P63k40j8K76m33p85O90Q20p07m34K46p94O84
3033A1P53m42j413K37J112j23m19J75l25m05P99M00j201J10M42l62j43Q62q18
3052g50o88Q28Q60j135j56P01q00n82J732K1j740L02J102m01j00K51r05J21R86
$$ plain form
3071 -353 -244 -985 -1014 -483 -1135 -978 284 -631 -1442 -496 435 -899 -461 -276 -526 -445 480 -28 -862 -80
3091 -80 64 -342 76 495 -553 -586 572 818 -439 295 778 -307 30 1178 337 -209 366 584 192
3110 192 783 928 127 388 1359 624 -98 984 944 322 1139 1428 426 441 1388 1334 298 1191 920 346
3130 346 836 1626 530 363 1284 951 623 1242 1208 -134 151 1424 492 69 811 287 -131 962 962 462
3150 462 134 969 136 295 683 489 -420 151 1015 -60 -272 408 -41 -352 380 163 -756 -484 626
3169 626 -308 -82 234 -713 -649 496 371 -660 -570 4 -480 -338 231 -830 -1553 -493 191 -675 -744 -361
3189 -361 -1157 -521 478 -670 -1441 -619 -224 -1117 -510 -601 -1521 -1260 -59 -99 -1678 -497 -589 -1032 -544 293
3209 293 -737 -1164 -242 4 -399 -509 -568 -742 -290 536 -263 -958 -181 265 -390 283 521 -778 -355 842
$$ packed form
3071c53J09p41k9N31o52J57J262r15q11R46R31j334M38J85k50Q1R25n08q34P82
3091h0J44m06M18M19j048l3J158K46j257P34M83j085L37J148q41n46N75K18l92
3110A92N91J45q01K61R71p35p22J082m0o22Q17K89j002J5R47n4j036Q93k71n74
3130C46M90P90j096j67R21l33l28O19l4j342K85J273r32m23P42n24m18J093%n00
3150D62l28Q35q33J59L88j94r09N71Q64j075k12O80m49l11P32k17r19K72J110
3169F26r34K26L16r47O4J145j25j031R0N74m84J42N69j061p23J060O84q66o9L83
3189c61p96O36R99j148p71Q22L95q93O07r1r20K61J201m0j579J181r2m43M88Q37
3209B93j030m27R22K46m03j10n9j74M52Q26p99o95P77M46o55O73K38j299M23J197
$$ plain form
3229 842 262 -419 33 50 -14 751 1010 -24 -240 831 850 169 898 602 -146 664 1548 335 -176 886
3249 886 1057 613 1140 435 162 477 1899 803 220 854 687 304 1530 1187 141 239 1534 1060 623
3268 623 925 425 -213 1132 1342 239 -267 904 293 271 1180 597 -419 306 1030 397 179 364 -162
3287 -162 61 696 219 -380 -142 577 -36 240 409 -305 -363 133 220 -855 -444 -170 -397 -519 -23 155
3307 155 -1513 -480 8 -749 -976 -118 -1029 -1055 -22 -48 -1129 -1095 -376 -910 -883 -373 -1100 -1008 -455 -504 -937
3328 -937 -468 -259 -1322 -851 405 -585 -1440 -276 -520 -851 -765 346 -1058 -698 -30 -537 -836 -406 -256
3347 -256 -929 -48 156 -515 -650 276 -72 -252 127 286 -610 67 969 157 -245 340 61 -115 345 774
3367 774 -79 180 927 486 349 1287 837 -221 796 1280 328 165 904 420 411 1020 872 88 848 1476
$$ packed form
3229H42n80o81M52J7o4P65K59j034k16J071J9o81P29k96p48Q10Q84j213n11J062
3249H86J71m44N27p05k73L15J422j096n83O34j67l83J226l43j046R8J295m74m37
3268F23L02n00o38J345K10j103n06J171o11k2R09n83j016P25P24o33k18J85n26
3287a62K23O35m77n99K38P19o13K76J69p14n8M96Q7j075M11K74k27j22M96J78
3307A55j668J033M88p57k27Q58r11k6J033k6j081L4P19n34K7N10p27R2N53m9m33
3328i37M69K09j063M71J256r90q55J164k44l31Q6J111j404L60O68n07k99M30J50
3347b56o73Q81K04o71j35R26l48j80L79J59q96O77R02q12m02N85k79j76M60M29
3367G74q53K59P47m41j37R38m50j058J017M84r52j63P39m84rO09j48p84P60O28
$$ plain form
3387 1476 303 379 768 580 543 1347 813 -319 583 1215 659 401 1166 211 3 698 1184 373 224 628
3407 628 111 541 1085 430 -342 456 555 55 289 538 -36 -172 912 368 -707 -182 293 -159 -164 -58
3427 -58 -543 -488 147 180 -636 -435 -118 -705 -595 -106 -603 -1328 -133 199 -1120 -576 -548 -1029 -719 -11 -507
3448 -507 -1221 -759 -805 -763 -248 -381 -1498 -984 51 -307 -927 -660 -320 -830 -538 -33 -1053 -1176 -425 -292
3468 -292 -313 -254 -586 -720 -82 144 -552 -641 82 50 -574 -44 -175 -1141 -453 857 168 -298 -183 224 -148
3489 -148 493 349 -323 57 638 298 -116 968 363 -297 948 1061 -73 153 1031 879 296 555 998
3508 998 70 568 1208 500 338 587 601 497 1351 632 161 606 1389 822 194 1159 839 -35 795 1353
3528 1353 191 594 559 757 369 688 187 -200 849 763 -233 177 693 -124 -279 627 754 -151 -162 446
$$ packed form
3387A476j173P6L89j88l7Q04n34j132R02O32n56k58P65r55k08O95M86q11j49M04
3407F28n17M30N44o55p72P98R9n00K34K49n74j36J084n44j075N25M75m52nJ06
3427e8m85N5O35L3q16K01L17n87J10M89m97p25J195L32j319N44K8m81L10P08m96
3448e07p14M62m6M2N15j33j117N14J035l58o20K67L40n10K92N05j020j23P51J33
3468b92k1N9l32j34O38K26o96q9P23l2o24N30j31r66O88J310o89m66J15M07l72
3489a48O41j44o72L80N81l40m14J084o05o60J245J13j134K26Q78j52n83K59M43
3508I98r28M98O40p08j62K49J4j04Q54p19m71M45P83n67o28R65l20q74Q30N58
3528A353j162M03l5J98l88L19n01l87J049q6r96M10N16q17j55R06J27r05j1O08
$$ plain form
3548 446 89 -398 455 34 -618 -178 -295 -301 234 -148 -724 -585 239 -527 -940 54 10 -1055 -599 85 -974
3569 -974 -935 -360 -416 -1013 -421 -828 -816 -566 -337 -733 -1087 -143 -646 -1183 -283 -533 -1357 -1162 53 -373 -1140
3590 -1140 -685 91 -661 -475 -279 -701 -717 -389 -385 -389 -91 -545 -1004 -127 219 -577 -760 70 -25 -423 111 73
3612 73 -502 -173 596 333 63 357 -697 22 563 360 -538 -91 875 237 283 655 242 14 750 1012
3632 1012 219 -23 782 738 375 812 487 174 790 1067 312 774 825 160 888 1334 1031 58 491 1068
3652 1068 797 562 739 377 185 670 1312 109 499 345 51 849 801 17 -215 970 977 -214 135 305
3672 305 -241 85 1017 576 -580 -253 148 347 -33 291 -396 -234 433 -71 -765 215 114 -857 -291 182
3692 182 -717 -731 70 26 -432 -750 -712 -797 -302 118 -726 -974 -457 -244 -966 -221 -423 -1272 -1010 156 -414
$$ packed form
3548D46l57m87Q53m21o52M40j17oN35l82n76J39Q24p66m13R94m4j065M56O84j059
3569i74L9N75n6n97N92m07J2K50K29l96l54R44n03n37R00k50q24J95J215m26p67
3590a140M55P76p52J86J96m22j6L28MmK98m54m59Q77L46p96j83Q30r5l98N34l8
3612G3n75L29P69k63k70K94j054P19N41k03q98M47R66o38M6L72m13k28P36K62
3632A012p93k42Q05m4l63M37l25l13O16K77p55M62N1o65P28M46l03r73M33N77
3652A068k71k35J77l62j92M85O42j203L90j54k94P98m8p84k32J185Pj191L49J70
3672C05n46L26R32m41j156L27M01J99l80L24o87J62O67n04o94R80j01r71N66M73
3692A82q99j4Q01m4m58l18L8q5M95M20q44k48N17K13p22P45k02q49K62J166n70
$$ plain form
3713 -414 -995 -595 -311 -939 -368 -268 -720 -1014 -588 -214 -553 -312 -661 -1002 -112 117 -517 -802 58 -355
3733 -355 -715 42 181 -693 -489 301 -49 -316 -133 -35 -404 372 -11 -388 40 395 260 306 812 214 -45
3754 -45 680 995 116 -177 840 489 154 939 679 151 96 743 452 642 975 375 182 832 912 73 688
3775 688 945 538 606 1135 655 125 678 1024 430 258 613 268 481 710 818 46 771 872 2 617
3795 617 1047 -70 -356 681 798 -16 29 327 -211 215 590 133 -585 289 -72 -374 345 173 -463 -144
3815 -144 575 -493 -602 -217 49 -622 -224 194 -793 -780 -77 -238 -392 -236 -442 -862 -394 14 -860 -991
3835 -991 -433 -344 -823 -266 -428 -798 -730 -69 -570 -691 -480 -595 -704 -353 -563 -952 -784 -77 -643 -436 -158
3856 -158 -231 -720 -329 105 -657 -466 241 -7 -433 -80 -376 -430 -12 230 -392 71 65 -141 17 461 -28
$$ packed form
3713d14n81M00K84o28N71J00m52k94M26L74l39K41l49l41Q90K29o34k85Q60m13
3733c55l60P57J39q74K04P90l50k67J83R8l69P76l83l77M28L55j35M6N06n98k59
3754d5P25L15q79k93J017l51l35P85k60n28n5O47k91J90L33o00j93O50Q0q39O15
3775F88K57m07O8N29m80n30N53L46n94j72L55l45K13K29J08p72P25J01q70O15
3795F17M30j117k86J037J17q14M5K98n38M26L75m57p18Q74l61l02P19j72o36L19
3815a44P19j068j09L85K66o71L98M18r87J3P03j61j54J56k06m20M68M08q74j31
3835i91N58Q9m79N57j62l70O8O61n01j21K11j15j09L51k10l89J68P07n66K07K78
3856a58p3m89L91M34p62J91P07k48m26L53k96n4M18K42o22M63ok06J58M44m89
$$ plain form
3877 -28 -242 99 719 138 89 139 250 -41 841 476 -1 289 645 371 440 774 269 164 653 947 614
3898 614 489 892 189 260 1106 620 -110 417 1154 406 666 687 95 204 628 712 212 652 591 -7 536
3919 536 770 130 -57 741 409 -4 11 165 -107 439 690 576 -294 209 234 -245 218 274 -163 -186 229
3940 229 -90 -414 11 210 -441 -147 270 -457 -756 -258 -221 -618 -338 -289 -780 -415 29 -638 -1068 17
3960 17 -560 -907 -1 -108 -832 -403 -316 -612 -861 -468 -166 -886 -310 -98 -526 -883 -20 -512 -734 -120 -397
3981 -397 -1015 -440 -14 -487 -615 -198 -706 -426 -62 -211 -595 -582 281 -202 -402 557 -226 -452 204 95
4001 95 -596 -180 7 -122 -119 656 -41 -331 551 515 191 70 400 -78 101 898 513 -35 329 664 -9
4022 -9 376 660 268 243 803 618 97 278 422 415 673 1270 354 261 647 665 208 630 555 121 459 845 388
$$ packed form
3877b8k14L41O20n81m9N0J11k91Q82l65m77K90L56k74O9L34n05j05M89K94l33
3898F14j25M03p03P1Q46m86p30N27P37p48K60K1n92J09M24Q4n00M40o1n98N43
3919E36K34o40j87P98l32m13J5J54k72N46K51j14q70N03K5m79M63N6m37k3M15
3940B29l19l24M25J99o51K94M17p27k99M98L7l97K80M9m91L65M44o67m30J085
3960A7n77l47R06j07p24M29Q7k96k49L93L02p20N76K12m28l57Q63m92k22O14k77
3981c97o18N75M26m73j28M17n08K80L64j49l84J3Q63m83k00R59p83k26O56j09
4001I5o91M16J87j29LP75o97k90Q82l6l24j21L30m78J79P97l85n48L64L35o73
4022iL85K84l92k5N60j85n21J81J44pK58N97r16r3L86J8m57M22p5m34L38L86m57
$$ plain form
4045 388 122 474 640 127 390 1093 505 -156 810 341 -134 154 246 -356 306 594 -132 -258 176 270 -158
4066 -158 377 149 -438 -183 242 -4 -679 -143 92 -347 -212 -199 -757 -323 -140 -437 -385 -184 -481 -680 -256
4087 -256 45 -323 -614 -181 -252 -671 -24 -364 -1009 -374 163 -493 -420 -222 -644 -807 -238 -167 -1138 -256 -400
4108 -400 -861 -404 -265 -620 -738 -106 13 -1205 -778 121 -668 -443 -294 -289 -707 -174 112 -231 -380 -134
4128 -134 -457 -132 689 -301 -305 191 497 -272 -102 398 -175 -250 299 574 53 162 533 438 162 656 11
4149 11 -111 735 762 159 507 765 38 343 1019 524 153 323 502 415 484 946 172 237 767 427 378 577
4171 577 251 -301 298 633 248 -208 728 530 68 471 515 -173 132 554 482 137 171 185 67 461 181
4192 181 -76 -238 356 194 -294 300 -76 -597 -87 218 -358 -446 130 150 -346 -54 -230 -555 -326 71 -603
$$ packed form
4045C88k66L52J66n13K63P03n88o61R66m69m75K88R2o02O62K88p26j26M34R4m28
4066a58N35k28n87K55M25k46o75N36K35m39J35J3n58M34J83k97N2K01k97j99M24
4087b56L01l68k91M33p1m19O47l40o45O35N37o56P3J98m22j63N69P1r71Q82j44
4108d00m61M57J39l55j18O32J19j218M27Q99p89K25J49Nm18N33K86l43j49K46
4128a34l23L25Q21r90mM96L06p69J70N00n73p5N49K75n21J09L71r5k76M94o45
4149A1j22Q46K7o03L48K58p27L05O76m95l71J70J79q7O9M62p74O5N30l40m9J99
4171E77l26n52N99L35l85m56R36j98m62M03M4o88L05M22p2l45L4J4j18L94k80
4192A81k57j62N94j62m88N94l76n21N10L05n76q8N76K0m96K92j76l25K29L97o74
$$ plain form
4213 -603 -640 -76 -667 -576 102 20 -1001 -691 38 -439 -630 -246 -456 -768 -386 -538 -712 -679 -324 -913 -422
4234 -422 120 -868 -884 -301 -67 -894 -646 -37 -693 -731 -92 -68 -866 -469 -9 -269 -66 -121 -435 -374 264 -26
4256 -26 -477 62 208 -380 24 739 118 -193 349 130 -373 -31 535 0 -40 251 75 28 359 207 -15
4277 -15 161 464 -381 -124 907 249 70 378 449 -35 405 1000 179 137 738 374 121 624 152 230 555
4298 555 809 161 263 923 420 97 151 520 26 35 561 397 301 389 252 95 723 452 -165 321 812 262
4320 262 182 411 177 -129 170 652 -85 -11 273 301 -297 -223 38 -151 -205 308 -33 -292 145 -657 -500 -173
4342 -173 127 -1190 -500 119 -835 -502 -301 -286 -936 -533 -221 -695 -483 -135 -382 -403 -210 -544 -538 -281 -226
4363 -226 -617 -410 28 -681 -708 179 167 -595 -667 -176 -293 -411 79 -617 -703 -381 -436 -416 -51 11 -737 -403
$$ packed form
4213f03l7N64n91R1O78q2j021L10P29m77j91L84k10l12L82j52j74L3L55n89M91
4234d22N42r88j6N83K34q27K48O09o56l8O39K4p98L97M60k60K03n5l14O1O38k90
4256b6m51N39J46n88M04P15o21l11N42k19n03L42N66n35m0K91j76m7L31j52k22
4277a5J76L03q45K57J031o58j79L08P1m84M40N95q21m2O01l64k53N03m72P8L25
4298E55K54o48J02O60n03l23N4L69m94RN26j64r6Q8j37j57O28k71o17M86M91n50
4320B62q0K29k34l06K99M82p37P4K84K8n98P4K61j89n4N13l41k59M37q02J57L27
4342a73L00j317O90O19r54L33K01J5o50M03L12m74K12L48k47k1J93l34OK57N5
4363b26l91K07M38p09k7Q87j2p62p2M91j17j18M90o96q6L22n5K0L65O2p48L34
$$ plain form
4385 -403 140 -30 -576 -39 127 -718 -327 518 -430 -421 95 202 -93 -24 668 22 361 468 -239 -38 472
4406 472 318 81 384 401 67 111 517 225 -144 536 239 340 680 810 353 292 718 435 616 743 357
4427 357 107 725 664 315 -233 1045 591 228 357 172 1 165 542 560 -74 490 7 -86 661 343 21
4448 21 154 635 -280 -112 254 284 -345 136 340 -21 -257 325 64 -134 15 -168 -538 -17 -70 -459 -483
4469 -483 53 -229 -821 216 -420 -794 -308 117 -470 -603 -65 -342 -531 -526 -434 -649 -330 17 -501 -751 -34
4490 -34 -467 -844 -550 -8 -606 -671 -334 -542 -407 187 -260 -644 -399 50 -380 -523 -182 -459 -655 30 -194
4511 -194 -623 -403 -408 -465 24 510 -374 -523 -4 30 163 260 92 274 -9 400 196 -152 508 176 3 442
4533 442 677 -79 -243 633 544 24 469 306 99 138 574 -8 -13 458 193 -77 460 174 286 154 761
$$ packed form
4385d03N43j70n46N37J66q45L91Q45r48RN16J07k95O9O92o46L39J07p07K01N10
4406D72j54k37L03J7l34M4M06k92l69O80k97J01L40J30m57o1M26k83J81J27l86
4427C57k50O18o1l49n48J278m54l63J29j85j71J64L77J8o34N64m83r3P47l18l22
4448B1J33M81r15J68L66L0o29M81K04l61k36N82k61j98J49j83l70N21n3l89k4
4469d83N36k82n92J037o36l74M86M25n87j33N38k77j89NR2k15L19L47n18k50P17
4490c4m33l77K94N42n98o5L37k08J35N94m47l84K45M49m30j43L41k77j96O85k24
4511a94m29K20nn7M89M86q84j49N19L4J33R7j68J82k83M09k04l48O60l32j73M39
4533D42K35p56j64Q76q9n20M45j63k07L9M36n82nM71k65k70N37k86J12j32O07
$$ plain form
4554 761 310 306 902 591 213 624 569 171 371 929 197 382 464 236 101 395 534 -37 155 370 61
4575 61 -45 767 219 -199 126 312 -17 62 277 105 -270 258 168 -272 201 87 -262 -334 28 -271 -345 47
4597 47 165 -600 -392 -74 -131 -405 -193 -263 -616 -274 -116 -757 -472 -565 -641 -220 -181 -246 -586 -406 -168 -627
4619 -627 -419 -153 -678 -525 -256 -134 -833 -230 -178 -914 -302 -105 -305 -423 -159 -271 -459 33 -40 -480 -578
4640 -578 225 -29 -412 -73 186 -252 -267 288 -160 -202 466 -84 -370 158 177 -275 213 404 -109 82 352
4661 352 163 -217 119 546 -130 281 501 217 169 545 505 105 742 431 -58 360 711 214 215 785 441
4682 441 55 735 802 199 136 669 434 318 613 374 55 336 613 -5 303 402 385 185 448 551 -264
4703 -264 214 575 -47 -98 271 15 -151 349 140 -177 -196 330 216 -7 346 -205 -425 -16 397 -331 -30
$$ packed form
4554G61m51mN96l11l78M11n5l98K00N58p32J85Q2k28j35K94J39n71J92K15l09
4575F1j06Q12n48m18L25J86l29P9K15j72l75N28r0m40M73j14l49p2L62k99p4L92
4597D7J18p65K08L18n7k74K12p0l53L42J58o41K85r3p6M21L9o5l40J80K38m59
4619f27K08K66n25J53K69J22o99O03N2p36O12J97k00j18K64j12j88M92p3m40r8
4640e78Q03k54l83L39K59m38j5N55m48m2O68n50k86N28J9m52M88J91n13J91K70
4661C52j89l80L36M27o76M11K20k84m8L76m0m00O37l11m89M18L51m97JN70l44
4682D41l86O80O7o03o3N33k35j16K95k39l19K81K77o18L08R9j7k00K63J03q15
4703b64M78L61o22n1L69k56j66N00k09l17j9N26j14k23L53n51k20M09M13p28L01
$$ plain form
4724 -30 205 -250 -251 88 -229 -367 -207 185 -352 -121 -9 -513 -676 -35 -262 -622 -439 -296 -408 -378 105
4745 105 -651 -491 -2 -431 -565 -494 -79 -498 -345 248 -271 -289 -348 129 -391 -523 -23 -443 -556 -216 -543
4766 -543 -785 -80 -369 -404 -75 262 -295 -284 342 -85 -290 161 -183 -345 -83 327 149 -2 -2 274 -329
4787 -329 323 200 -460 229 379 -55 92 511 257 170 178 452 -80 207 381 162 62 548 426 139 302
4808 302 569 435 232 626 194 -83 340 832 328 358 472 236 373 472 360 255 558 633 -40 320 411
4829 411 3 286 558 286 -46 432 567 404 -147 259 71 -145 279 65 -254 119 275 -12 -35 455
4849 455 -192 -181 69 -14 -399 -344 212 -294 -443 226 -172 -400 227 -324 -261 -396 -120 -507 -232 -296 -343 -494
4871 -494 -80 -87 -459 -702 131 -594 -439 28 -627 -624 -169 -307 -438 -156 -71 -644 -279 -274 -500 -387 -273 -140
$$ packed form
4724c0K35m55jL39l17j38J60L92n37K31J12n04j63O41k27l60J83J43j12L0M83
4745A05p56J60M89m29j34P1M15m19J53N93n19j8n9M77n20j32N00m20j13L40l27
4766e43k42P05k89l5L29L37n57J1O26m27k05M51l44j62K62M10j78j51%K76o03
4787c29O52j23o60O89J50m34J47M19k54q7QK74n32K87J74k19j00M86j22k87J63
4808C02K67j34k03L94m32k77M23M92n04L0J14k36J37R9j12j05L03P5o73L60R1
4829D11m08K83K72k72l32M78J35j63n51M06j88k16M24k14l19L73J56k87k3M90
4849D55o47J1K50q3l85N5N56n06j49O69l98k28O27n51O3j35K76l87K75o4m7j51
4871d94M14pl72k43Q33p25J55M67o55LM55j38j31K82Q5n73L65Nk26J13J14J33
$$ plain form
4893 -140 -720 -270 10 -264 -639 30 -340 -615 -359 457 -284 -208 193 -332 -136 -33 -425 -188 224 278 -74
4914 -74 -171 357 205 -312 73 192 6 290 594 502 -153 393 207 262 503 210 66 475 629 119 -22
4935 -22 555 88 -172 772 397 266 148 559 347 194 540 176 -65 625 679 320 506 675 91 -201 904
4956 904 499 37 122 284 84 377 284 231 -77 399 150 -79 344 313 -32 261 285 -76 330 446 403 -422
4978 -422 90 517 -426 -340 344 381 -426 92 -84 -297 -151 -163 -292 -246 81 -348 -512 -119 -129 -629 -230 257
5000 257 -358 -845 -436 -391 -813 -469 -75 -308 -254 -320 -174 -679 -338 -501 -359 -355 269 -471 -691 -308 -267 -149
5022 -149 -45 40 -599 -116 535 -229 -334 1 60 -175 49 316 -452 65 -43 -309 -296 324 167 34 90
5043 90 269 -660 -115 364 37 14 326 80 -437 -8 540 116 172 194 -83 3 332 515 63 483 452 82
$$ packed form
4893a40n80M50K80k74l75O69l70k75K56Q16p41P6M01n25J96J03l92K37M12N4l52
4914g4r7N28j52n17L85J19j86K84L04r2o55N46j86N5K41k93j44M09J54n10j41
4935b2N77m67k60R44l75j31j18M11k12j53L46l64k41O90N4l59J86J69n84k92J105
4956I04m05m62Q5J62k00K93r3n3l08M76k49k29M23l1l45K93K4l61M06J16m3q25
4978d22N12M27r43Q6O84L7q07N18j76k13J46j2j29M6L27m29j64L93j0n00L99M87
5000B57o15m87M09M5m22L44L94k33N4o6J46n05L41j63J42MO24p40k20L83M1J18
5022a49J04Q5o39M83O51p64j05L35N9k35K24K67p68N17j08k66J3O20j57j33N6
5043I0J79r29N45M79l27k3L12k46n17M29N48m24N6K2k77Q6L29J83m52M20l1l70
$$ plain form
5065 82 -287 490 372 -390 533 504 264 -57 711 246 265 553 40 150 588 638 -41 223 294 -59 183 563
5087 563 126 185 526 383 282 21 450 278 -31 340 -138 -231 412 94 -74 430 226 -151 -119 32 76
5108 76 -286 103 -122 -158 -211 67 15 -193 -266 -79 -90 45 -379 -259 -504 283 -95 -552 184 -158 -241 -275 81
5131 81 -428 -542 -103 59 -513 -318 -414 -599 -290 -142 -258 -416 -10 -227 -587 -261 -237 -533 -161 141 -386
5152 -386 -507 -84 19 20 -122 -201 -486 -603 156 -44 -234 39 -156 -449 240 6 -319 9 405 -242 -229
5173 -229 360 323 -433 -33 554 142 197 384 4 183 253 196 -224 409 602 108 308 756 406 -333 161
5194 161 368 164 236 354 118 182 392 479 171 427 420 81 376 369 296 190 254 348 87 357 506 185 366
5217 366 512 61 41 626 268 -89 287 364 -185 -139 425 -210 -338 139 299 -217 -149 362 -312 5 488
$$ packed form
5065H2l69P77j18p62R23k9k40l21P68m65J9K88n13J10M38N0o79K64P1l53K42L80
5087E63m37N9L41j43j01k61M29j72l09L71m78r3O43l18j68N04k04l77L2J51M4
5108G6l62L89k25l6n3K78n2k08p3J87j1J35m24J20k45P87l78m57P36l42q3l4L56
5131H1n09j14M39J62n72J95r6j85L09J48j16j58M06k17l60L26K4k96L72L02n27
5152c86j21M23J03Jj42p9k85j17P59k00j90K73j95k93O89k34l25L28L96o47J3
5173b29N89l7p56M00N87m12N5J87l80J79P0n7m20O33J93m94K00M48l50p39M94
5194A61K07k04P2J18k36O4K10Q7l08K56pl39K95pp3j06O4R4k61K70J49l21J81
5217C66J46m51k0N85l58l57L76P7n49M6N64o35j28M77J60n16O8N11o74L17M83
$$ plain form
5238 488 38 -209 95 9 -144 158 143 -315 19 -3 -42 -248 16 -24 -297 -248 39 -259 -273 -471 -203 -517
$$ packed form
5238D88m50k47L04q6j53L02j5m58L34k2l9k06K64m0k73M9K87k98j4j98K68l14
$$ [...]
8191c04
##END NTUPLES=NMR FID
##END=
