##TITLE=1H_EC-3188
 CDCl3, 8 sc, 
 9.4.2019
##JCAMPDX= 6.0         $$ Bruker NMR JCAMP-DX V2.0
##DATA TYPE= NMR FID
##DATA CLASS= NTUPLES
##ORIGIN= UXNMR, Bruker Analytische Messtechnik GmbH
##OWNER= root
$$ XWIN-NMR		Version 3.5
$$ Tue Apr  9 13:51:35 2019 Russian Standard Time (UT+4h)  she@DPX200
##.OBSERVE FREQUENCY= 200.131
##.OBSERVE NUCLEUS= ^1H
##.DELAY= (6, 6)
##.ACQUISITION MODE= SIMULTANEOUS
##.ACQUISITION SCHEME= undefined
##.AVERAGES= 8
##.DIGITISER RES= 18
##SPECTROMETER/DATA SYSTEM= spect
##.PULSE SEQUENCE= zg30
##.SOLVENT NAME= CDCl3
##.SHIFT REFERENCE= (INTERNAL, CDCl3, 0, 15.7039)
##AUDIT TRAIL= $$ (NUMBER, WHEN, WHO, WHERE, WHAT)
$$ ##TITLE= Audit trail, XWIN-NMR		Version 3.5
$$ ##JCAMPDX= 5.01
$$ ##ORIGIN= Bruker BioSpin GmbH
$$ ##OWNER= she
$$ F:/spectra/data/she/nmr/H-F/1/audita.txt
$$ ##AUDIT TRAIL=  $$ (NUMBER, WHEN, WHO, WHERE, WHAT)
(   1,<2019-04-09 13:50:27.67 +0400>,<she>,<DPX200>,
      <created by zg, POWCHK disabled, PULCHK disabled
       configuration hash MD5:
       00 E9 B6 7A A2 85 ED C7 34 08 36 98 17 FE 4E 26
       data hash MD5: 16K
       04 3C F8 02 1A 8C 21 23 5B 9D 0B 0F A0 8A 17 0A>)
$$ ##END=
$$ 
$$ hash MD5
$$ 7C B8 DA CD 98 EF 3A F4 0D AF 9B 75 94 1E 96 D4
##$RELAX= 
##$RELAX= 
##$RELAX= 
##$RELAX= 
##$RELAX= 
##$RELAX= 
$$ Bruker specific parameters
$$ --------------------------
##$DU= <F:/spectra>
##$EXPNO= 1
##$NAME= <H-F>
##$PROCNO= 1
##$TYPE= <nmr>
##$USER= <she>
##$AMP= (0..31)
100 100 100 100 100 100 100 100 100 100 100 100 100 100 100 100 100 100 
100 100 100 100 100 100 100 100 100 100 100 100 100 100 
##$AQSEQ= 0
##$AQ_mod= 1
##$AUNM= <au_zg>
##$AUTOPOS= <>
##$BF1= 200.13
##$BF2= 200.13
##$BF3= 200.13
##$BF4= 200.13
##$BF5= 200.13
##$BF6= 200.13
##$BF7= 200.13
##$BF8= 200.13
##$BYTORDA= 1
##$CFDGTYP= 0
##$CFRGTYP= 5
##$CHEMSTR= <none>
##$CNST= (0..31)
1 1 145 1 1 1 1 1 1 1 1 1 1 1 1 1 1 1 1 1 1 1 1 1 1 1 1 1 1 1 1 1 
##$CPDPRG= <>
##$CPDPRG1= <>
##$CPDPRG2= <>
##$CPDPRG3= <>
##$CPDPRG4= <mlev>
##$CPDPRG5= <mlev>
##$CPDPRG6= <mlev>
##$CPDPRG7= <mlev>
##$CPDPRG8= <mlev>
##$CPDPRGB= <>
##$CPDPRGT= <>
##$D= (0..31)
0 1.2 0 0 0 0 0 0 0 0 0 0.03 0 0 0 0 0 0 0 0 0 0 0 0 0 0 0 0 0 0 0 0 
##$DATE= 1554803427
##$DBL= (0..7)
120 120 120 120 120 120 120 120 
##$DBP= (0..7)
150 150 150 150 150 150 150 150 
##$DBP07= 0
##$DBPNAM0= <>
##$DBPNAM1= <>
##$DBPNAM2= <>
##$DBPNAM3= <>
##$DBPNAM4= <>
##$DBPNAM5= <>
##$DBPNAM6= <>
##$DBPNAM7= <>
##$DBPOAL= (0..7)
0.5 0.5 0.5 0.5 0.5 0.5 0.5 0.5 
##$DBPOFFS= (0..7)
0 0 0 0 0 0 0 0 
##$DE= 6
##$DECBNUC= <off>
##$DECIM= 24
##$DECNUC= <off>
##$DECSTAT= 4
##$DIGMOD= 1
##$DIGTYP= 9
##$DL= (0..7)
0 120 120 120 120 120 120 120 
##$DP= (0..7)
150 150 150 150 150 150 150 150 
##$DP07= 0
##$DPNAME0= <>
##$DPNAME1= <>
##$DPNAME2= <>
##$DPNAME3= <>
##$DPNAME4= <>
##$DPNAME5= <>
##$DPNAME6= <>
##$DPNAME7= <>
##$DPOAL= (0..7)
0.5 0.5 0.5 0.5 0.5 0.5 0.5 0.5 
##$DPOFFS= (0..7)
0 0 0 0 0 0 0 0 
##$DQDMODE= 0
##$DR= 18
##$DS= 0
##$DSLIST= <SSSSSSSSSSSSSSS>
##$DSPFIRM= 0
$$ [...]
##$SUBNAM2= <"">
##$SUBNAM3= <"">
##$SUBNAM4= <"">
##$SUBNAM5= <"">
##$SUBNAM6= <"">
##$SUBNAM7= <"">
##$SUBNAM8= <"">
##$SUBNAM9= <"">
##$SW= 24.9337681822398
##$SWIBOX= (0..15)
0 0 2 0 0 0 0 0 0 0 0 0 0 0 0 0 
##$SW_h= 4990.01996007984
##$TD= 16384
##$TD0= 1
##$TE= 0
##$TE2= 300
##$TE3= 300
##$TEG= 300
##$TL= (0..7)
0 120 120 120 120 120 120 120 
##$TP= (0..7)
150 150 150 150 150 150 150 150 
##$TP07= 0
##$TPNAME0= <>
##$TPNAME1= <>
##$TPNAME2= <>
##$TPNAME3= <>
##$TPNAME4= <>
##$TPNAME5= <>
##$TPNAME6= <>
##$TPNAME7= <>
##$TPOAL= (0..7)
0.5 0.5 0.5 0.5 0.5 0.5 0.5 0.5 
##$TPOFFS= (0..7)
0 0 0 0 0 0 0 0 
##$TUNHIN= 0
##$TUNHOUT= 0
##$TUNXOUT= 0
##$USERA1= <user>
##$USERA2= <user>
##$USERA3= <user>
##$USERA4= <user>
##$USERA5= <user>
##$V9= 5
##$VALIST= <valist>
##$VCLIST= <CCCCCCCCCCCCCCC>
##$VD= 0
##$VDLIST= <DDDDDDDDDDDDDDD>
##$VPLIST= <PPPPPPPPPPPPPPP>
##$VTLIST= <TTTTTTTTTTTTTTT>
##$WBST= 1024
##$WBSW= 4
##$XGAIN= (0..3)
0 0 0 0 
##$XL= 0
##$YL= 0
##$YMAX_a= 246749
##$YMIN_a= -297997
##$ZGOPTNS= <>
##$ZL1= 120
##$ZL2= 120
##$ZL3= 120
##$ZL4= 120
##$ABSF1= 10
##$ABSF2= 0
##$ABSG= 5
##$ABSL= 3
##$ALPHA= 0
##$AQORDER= 0
##$ASSFAC= 0
##$ASSFACI= 0
##$ASSFACX= 0
##$ASSWID= 0
##$AUNMP= <proc_1d>
##$AZFE= 0.1
##$AZFW= 0.1
##$BCFW= 1
##$BC_mod= 2
##$BYTORDP= 1
##$COROFFS= 0
##$CY= 11.3945322036743
##$DATMOD= 1
##$DC= 2
##$DFILT= <>
##$DTYPP= 0
##$F1P= 18.9103706918063
##$F2P= -1.10871071338519
##$FCOR= 0.5
##$FTSIZE= 0
##$FT_mod= 4
##$GAMMA= 1
##$GB= 0.15
##$INTBC= 1
##$INTSCL= 1
##$ISEN= 128
##$LB= 0.24
##$LEV0= 0
##$LPBIN= 0
##$MAXI= 10000
##$MC2= 0
##$MEAN= 0
##$ME_mod= 0
##$MI= 1.114404
##$NCOEF= 0
##$NC_proc= 0
##$NLEV= 6
##$NOISF1= 3.799351
##$NOISF2= 2.8
##$NSP= 1
##$NTH_PI= 0
##$NZP= 0
##$OFFSET= 15.70392
##$PC= 1
##$PHC0= -8852.014
##$PHC1= 15.60026
##$PH_mod= 1
##$PKNL= yes
##$PPARMOD= 0
##$PSCAL= 0
##$PSIGN= 0
##$REVERSE= no
##$SF= 200.130013532006
##$SI= 16384
##$SIGF1= 3
##$SIGF2= 2
##$SINO= 400
##$SIOLD= 16384
##$SREGLST= <1H.CDCl3>
##$SSB= 0
##$STSI= 0
##$STSR= 0
##$SW_p= 3612.71676300578
##$SYMM= 0
##$S_DEV= 0
##$TDeff= 0
##$TDoff= 0
##$TI= <>
##$TILT= no
##$TM1= 0
##$TM2= 0
##$TOPLEV= 0
##$USERP1= <user>
##$USERP2= <user>
##$USERP3= <user>
##$USERP4= <user>
##$USERP5= <user>
##$WDW= 1
##$XDIM= 8192
##$YMAX_p= 0
##$YMIN_p= 0
$$ End of Bruker specific parameters
$$ ---------------------------------
##NTUPLES= NMR FID
##VAR_NAME=  TIME,          FID/REAL,        FID/IMAG
##SYMBOL=    X,             R,               I
##VAR_TYPE=  INDEPENDENT,   DEPENDENT,       DEPENDENT
##VAR_FORM=  AFFN,          ASDF,            ASDF
##VAR_DIM=   8192,          8192,            8192
##UNITS=     SECONDS,       ARBITRARY UNITS, ARBITRARY UNITS
##FACTOR=    0.0002004,     1,               1
##FIRST=     0,             0,               0
##LAST=      1.6414764,     0,               0
##MIN=       0,             -297997,         0
##MAX=       1.6414764,     246749,          0
$$ Real data points
##PAGE= N=1
##DATA TABLE= (X++(R..R)), XYDATA
0 0 0 0 0 0 7 0 8 -8 8 -16 16 -24 24 -32 40 -48 56 -69 80 -96 112 -128 150 -174 198 -228 261 -294 335
29 335 -376 424 -480 536 -600 669 -747 830 -924 1022 -1134 1258 -1390 1541 -1706 1890
45 1890 -2098 2328 -2594 2900 -3252 3670 -4170 4784 -5559 6570 -7954 9975 -13224 19313
59 19313 -34793 160291 246749 -68590 -199570 -222346 -80808 58645 166769 138241 34983
70 34983 -93389 -134318 -107719 -24472 46518 84825 54649 -1074 -43041 -34998 -11039 19894
82 19894 50407 77883 66576 20110 -36123 -63011 -52710 -8700 34675 40977 -2961 -56225
94 -56225 -73084 -42934 5014 41205 41313 -1352 -66571 -99545 -63346 23673 101080 118633 65296
107 65296 -23221 -88771 -89389 -33944 28729 60576 53807 18189 -31514 -72169 -78664 -46355 3218
120 3218 42258 54364 37549 2802 -27885 -35218 -15155 19792 51998 60050 29458 -25681 -63091
133 -63091 -50338 2978 52239 59078 23284 -25009 -49415 -33461 7422 41459 44147 17844
145 17844 -17248 -36483 -23306 15520 50193 47841 5923 -41512 -56785 -32599 9361 38106
157 38106 38754 17013 -9801 -28578 -35416 -30769 -13345 10842 28455 27500 10640 -7542 -15630
170 -15630 -12073 996 18577 31086 25307 -1490 -35292 -52795 -36960 2748 35882 34797 1105
183 1105 -35571 -45733 -26111 5945 29271 35523 23334 2233 -12805 -12230 2214 17044 18319
196 18319 2790 -16505 -23872 -13451 2090 8164 4314 445 1099 1338 -5096 -12776 -12812 -816 15402
211 15402 23228 16925 2990 -7029 -7356 659 11222 18012 16040 2110 -16759 -24312 -11297 12643
225 12643 24774 11171 -18341 -39451 -34348 -7127 20872 30725 21088 4433 -8659 -11763 -5234
238 -5234 8506 19875 18166 2954 -14653 -21231 -13608 -1454 4792 3035 -1378 -1782 -2037 -6484
252 -6484 -12194 -9937 3558 19021 21767 9947 -6501 -14712 -11639 -1946 6233 9212 6572 -845
266 -845 -8682 -9657 -1087 12162 15261 1771 -19319 -28070 -15355 8333 24486 21795 5365 -10444
280 -10444 -16489 -12059 -1332 10808 19925 19495 7772 -8964 -18940 -15491 -4379 4276 6772 5185
294 5185 2097 -3471 -11248 -15594 -7769 10983 28165 28215 9022 -14554 -25044 -17614 -446 11852
308 11852 15606 9223 -2046 -12473 -15933 -8290 4758 12435 6828 -6481 -13957 -6264 9571 18896
322 18896 12928 -1152 -11579 -13417 -9060 -2083 4727 11763 13914 7284 -5311 -14384 -13460 -4024
336 -4024 5016 8016 5116 442 -4937 -10972 -13120 -5462 10501 23675 21781 4477 -14824 -21035
350 -21035 -10851 5565 15628 14629 6091 -4643 -13687 -17485 -12532 -667 9776 10553 2742 -4261
364 -4261 -2901 4639 9063 5860 -1178 -4702 -3119 -904 -936 -851 2889 7174 5910 -2331 -11497 -12878
380 -12878 -5045 4272 9373 8394 4098 -1167 -7576 -11215 -7862 3409 14228 14260 2150 -11063 -13976
395 -13976 -4341 8213 13693 9916 1932 -5238 -9934 -12172 -9919 -2604 6272 8979 4284 -1443 -2636
410 -2636 89 2621 1010 -1963 -1147 2971 5538 2896 -1420 -2185 681 1338 -3705 -9812 -10069 -3294
426 -3294 5768 9800 7442 3250 -817 -4257 -6652 -4947 1363 8523 9264 1801 -8407 -10209 -2840
441 -2840 5861 8803 4499 -776 -3089 -4046 -4597 -4830 -1084 4425 7121 3368 -2413 -5405 -3163 -54
457 -54 288 -564 803 5127 7138 3985 -1738 -4107 -2227 -527 -3124 -7362 -6541 -220 6852 8371
473 8371 3714 -1434 -4253 -3694 -3395 -1419 3332 8436 9373 2428 -6309 -9744 -4927 1718 3852 888
489 888 -1511 -947 111 -339 -1916 -478 3845 6489 3432 -2674 -6306 -4858 -778 1040 1233 1500
505 1500 3892 5007 1645 -2839 -4775 -2209 837 203 -2667 -2739 1440 6190 5167 -639 -6352 -6459
521 -6459 -3464 138 2546 4896 7860 7524 1524 -6165 -8830 -4920 1355 3664 1446 -1315 -1422 414
537 414 -106 -2166 -1797 1846 5303 3736 -1339 -4852 -3289 893 3053 1720 -97 654 1165 -467
553 -467 -3851 -4853 -915 2960 4012 837 -970 1136 3939 2566 -2662 -7460 -6168 -1495 2739
568 2739 3885 4659 5207 4278 -454 -6592 -8495 -4317 3530 6640 4508 -170 -2022 -1441 -2282 -3067 -2750
585 -2750 1298 4941 4122 18 -3335 -1886 2393 4142 2002 -1335 -2179 -963 -1099 -2780 -3430 -400
601 -400 3371 4153 1135 -1419 -802 1742 1863 -1585 -4430 -3121 1293 4194 3397 1275 766 568 -1916
618 -1916 -5478 -6695 -1895 5042 8496 5897 441 -3428 -3875 -3723 -3926 -2703 1224 5189 5486 1100
634 1100 -3218 -2885 1009 2953 1346 -1736 -2084 -166 792 -854 -2387 -1061 2428 2625 -10 -3549
650 -3549 -2872 661 2404 711 -1615 -922 2587 4776 2327 -828 -2162 -2102 -2272 -3763 -3953 -139 6057
667 6057 8358 4682 -1588 -4912 -4615 -2407 -1207 93 2589 5404 4843 216 -4526 -5200 -1335 1741
683 1741 1716 253 10 1982 2188 -80 -2263 -2462 638 2102 -108 -2876 -2574 437 2777 1550 -682
700 -682 -559 1518 3184 1495 -1592 -2433 -1346 -255 -1140 -2438 -90 4185 5280 2004 -3741 -6233
716 -6233 -3980 42 2211 2543 3069 4542 2943 -1181 -5857 -6576 -2472 1554 2752 1506 1131 2083
732 2083 2097 -504 -3523 -3829 -200 2515 1643 -1229 -1918 455 2508 1816 -1460 -2225 -215 2017 953
749 953 -1303 -1842 -458 1550 516 -787 -418 2043 3074 -49 -4480 -5946 -2895 2154 4681 3765
765 3765 2610 2389 1235 -2423 -5875 -5530 -1362 3520 4743 2331 428 -107 -197 -1804 -4165 -3082
781 -3082 728 4156 3645 646 -1615 -519 972 -22 -2339 -3178 -1012 2353 2378 20 -1484 -282
797 -282 1316 1133 -867 -1154 444 1905 542 -3008 -4152 -1150 3246 4141 2266 -273 -300 10 -1286
814 -1286 -3781 -3034 424 4968 5579 2098 -1361 -2557 -2558 -2918 -3248 -1813 2202 5540 5058 422 -2607
831 -2607 -2194 -269 96 -1347 -2276 -129 3066 3334 656 -1899 -2187 -253 341 -665 -1065 547 2166
848 2166 1400 -1538 -2805 -773 2598 3034 427 -2046 -1964 -530 -280 -1439 -1587 1158 4383 4837 1164
865 1164 -2859 -4090 -2637 -1480 -1358 -146 3056 5475 3933 -754 -4078 -4231 -1079 437 235 -196
881 -196 1700 3633 3300 -755 -3834 -3558 -1047 652 597 -180 1475 2779 2256 -728 -2806 -1614 1238
898 1238 2384 20 -2025 -1832 299 1116 -268 -1467 350 3082 3417 47 -3528 -3515 -895 626
914 626 1101 994 2258 3202 2239 -1845 -4744 -4146 -697 2034 2078 1327 1773 2866 1890 -1699 -5024 -4261
932 -4261 -715 3029 2461 1163 527 1344 859 -1393 -3252 -2061 1066 2688 1432 -751 -1098 557
948 557 1475 -441 -2018 -1242 1309 2179 373 -3019 -3000 -452 1890 2347 1054 516 1311 638 -2172 -4524
966 -4524 -3255 710 3312 3099 1278 352 800 -140 -2833 -4953 -3304 935 4538 4032 1551 -362
982 -362 -623 -1006 -2352 -3162 -1821 2019 3755 2320 -487 -1120 88 615 -1100 -2256 -1856 907 2441
999 2441 958 -1996 -2399 -12 2105 1475 -71 -679 367 754 -1020 -3040 -2289 1278 3611 2968 625
1016 625 -870 -796 -600 -2051 -3493 -1871 2109 4992 4138 391 -2631 -2290 -1461 -1903 -2062 -476 2727
1033 2727 4316 2755 -960 -2864 -1706 -458 -428 -1259 -521 1703 3309 1496 -1333 -2918 -1101 1059
1049 1059 892 -660 -1049 335 1395 819 -1551 -1607 540 2819 2009 -657 -1882 -1522 -223 -635 -1329
1066 -1329 -753 2745 4803 2930 -1108 -4318 -3662 -1030 24 139 1025 3080 3979 1953 -2120 -4314
1082 -4314 -2921 -398 1001 322 536 2311 3289 1519 -2297 -3729 -2320 553 1847 94 -351 711
1098 711 1941 1339 -1165 -2234 -594 1933 1810 -478 -1965 -882 618 388 -531 -584 1375 3329 1994
1115 1994 -1562 -4013 -2825 -211 1476 1344 1124 1805 2492 514 -2873 -4452 -2730 943 2681 1969
1131 1969 1082 1373 1663 -72 -2842 -3836 -1879 1750 2838 1460 -179 358 1106 392 -1904 -3033 -1163
1148 -1163 1552 2404 484 -1192 -562 724 863 -718 -1632 280 2297 1501 -1255 -3310 -2293 1120
1164 1120 2700 1681 130 199 814 -285 -2815 -3824 -1480 1888 3980 2805 826 -689 -392 -1247
1180 -1247 -2889 -3282 -886 2703 4036 2005 -575 -941 -488 -532 -1924 -2874 -979 2357 3437 1722
1196 1722 -1024 -1241 -361 239 -743 -1281 123 1758 2138 -177 -2232 -1736 960 2429 1198 -564 -785
1213 -785 123 20 -1715 -2683 -598 2338 3866 2116 -661 -1886 -1383 -959 -1991 -1722 498 3401 4306
1230 4306 1604 -1665 -2557 -1277 -447 -1058 -1514 -264 2936 3728 1207 -1816 -2376 -1306 131 -394 -933
1247 -933 240 2099 2588 499 -2539 -2369 -181 1534 1116 -260 -821 -79 462 -877 -1882 -511 2200
1264 2200 3524 1305 -1784 -3056 -1673 135 136 -258 829 2722 2960 710 -2762 -3509 -1639 272
1280 272 686 231 863 2596 2596 365 -2590 -3671 -1583 722 994 262 640 2106 2367 201 -3109 -3205
1298 -3205 -797 1384 1469 391 -131 797 912 -346 -1925 -1290 998 2594 1238 -1454 -2485 -1180
1314 -1180 724 1320 446 489 1429 1927 -162 -3263 -3155 -901 1695 2388 1151 269 1081 1605 -677 -2985
1332 -2985 -3611 -1202 1840 2612 1170 664 1365 816 -762 -3304 -3286 -275 2483 2575 1238 -202 255
1349 255 478 -472 -2112 -1834 832 2446 1834 -1101 -1882 -970 983 1348 -83 -166 476 1112 -244 -2032
1367 -2032 -2483 -546 2353 2181 870 -395 -153 335 -658 -2813 -2396 -22 2624 3016 1172 -621 -584
1384 -584 -78 -1030 -2910 -2475 160 3370 3321 860 -1165 -1345 -847 -1200 -1608 -1539 856 3074 2632 -419
1402 -419 -2248 -1699 277 992 -68 -663 106 1588 538 -1371 -1981 -80 2200 2247 253 -1392 -1363
1419 -1363 56 -372 -1057 -1457 489 3041 2827 412 -1652 -1849 -839 -587 -1494 -1320 1139 3394 3018
1436 3018 505 -2144 -2544 -1451 -793 -1007 -191 1521 3469 2306 -788 -2849 -2224 -402 840 451
1452 451 -308 499 1241 1245 -1094 -2046 -765 1274 1905 172 -1557 -1125 220 460 -700 -790 513 2027
1470 2027 1712 -211 -2157 -2184 -41 758 -1 -315 1049 2657 2117 -622 -2848 -3016 -770 673 927
1487 927 530 1804 2639 1628 -1322 -3465 -2816 -192 1705 1892 536 642 1212 367 -1284 -2490 -1410
1504 -1410 801 2479 698 -671 -1047 555 1003 -35 -1252 -421 1185 1650 -235 -1802 -1532 404
1520 404 1066 915 -295 109 1698 1121 -635 -2807 -2803 136 1887 1706 882 1040 1386 402 -1681 -3728
1538 -3728 -2315 414 2671 2383 598 109 -17 -108 -1752 -2675 -1187 1129 2623 1539 -385 -1313 -79
1555 -79 557 -131 -1346 -818 816 1552 194 -1151 -1040 389 1267 579 -508 -811 493 1186 -659 -2198
1573 -2198 -1840 218 2455 1905 600 -153 99 -280 -1607 -2716 -1504 1098 3403 2956 299 -994
1589 -994 -947 -814 -1365 -1658 -612 2124 3049 2298 -707 -1863 -978 161 -143 -1038 -545 897 2210 673
1607 673 -1127 -1584 -174 1335 662 -489 -387 222 887 215 -1253 -1543 470 1724 1801 -120 -1040 -676
1625 -676 50 -476 -1718 -694 1549 3029 2174 -744 -2206 -1865 -830 -519 -802 23 1978 3176 1774
1642 1774 -1313 -2619 -1650 71 670 230 250 1506 2255 1034 -1165 -2337 -1126 588 462 175 -384
1659 -384 734 1289 470 -939 -1575 -20 1297 1233 -257 -1409 -532 477 85 -498 -633 806 2588
1676 2588 1404 -1220 -2824 -1837 31 637 399 539 1822 2042 571 -2012 -3249 -1913 674 1522
1692 1522 786 435 1045 1530 328 -2010 -2611 -1231 1067 1507 390 -132 260 836 269 -1163 -1813 -1119
1710 -1119 1260 1619 414 -967 -628 635 86 -560 -1095 196 1520 1349 -451 -2221 -1199 596
1726 596 1353 696 178 382 886 8 -2068 -2761 -1355 1120 2323 1691 217 26 505 -577 -1934 -2598
1744 -2598 -1180 1653 2294 1119 -92 -282 237 -188 -1560 -1726 -490 1736 2065 718 -613 -719 -94
1761 -94 201 -857 -1141 234 1557 1413 93 -1791 -1024 1093 1360 788 -762 -411 671 186 -1193
1778 -1193 -2137 -563 1651 2554 1476 -174 -999 -759 -267 -1628 -1664 -238 2197 2707 1312 -747 -1646
1795 -1646 -802 -618 -809 -1138 -23 1992 2426 972 -875 -1765 -478 142 -195 -646 62 1595 1759 203
1813 203 -1514 -1253 142 968 241 -228 -662 532 448 -373 -1310 -862 1160 2057 1014 -857 -1629 -680
1831 -680 -205 -637 -689 253 2079 2186 625 -1572 -2067 -1108 315 -178 -243 539 1844 2338 239 -1641
1849 -1641 -2208 -1053 349 306 -219 642 1338 1545 146 -1775 -2032 -263 796 782 -6 -402 409 636
1867 636 -51 -1190 -1301 379 1493 412 -815 -1412 -708 637 264 -307 10 867 1355 295 -1990
1884 -1990 -2368 -751 701 877 727 317 1475 1533 -40 -2040 -2147 -710 919 1269 951 552 869 752
1902 752 -593 -2232 -2004 -366 1418 1440 471 -234 114 517 -556 -1404 -1406 320 1545 719 -426 -1253
1920 -1253 -490 795 556 -398 -472 616 1136 6 -1325 -1960 -358 802 1507 629 -34 555 462 -843
1938 -843 -1771 -1790 -235 1701 1710 1094 202 22 -519 -899 -1882 -2032 213 2090 2051 936 -698 -340 -326 -668
1958 -668 -1275 -770 391 1699 1776 61 -1248 -916 178 219 -297 -747 194 1206 781 -752 -1582 -328
1976 -328 1233 1033 334 -476 -251 -88 -416 -978 -1560 457 1854 1992 292 -1037 -810 -372 -424 -1142 -1019
1995 -1019 737 2078 1858 30 -1607 -1448 -607 -563 -726 -308 788 1967 1583 -92 -1477 -1527 -133
2012 -133 339 -187 -356 110 1177 750 -435 -1511 -613 858 1048 127 -661 -354 629 -114 -310 -989 92
2031 92 1514 1436 382 -1377 -1458 -154 239 -269 -293 1111 1618 1527 -210 -1751 -1685 -755 126 207 474 1029
2051 1029 1776 1287 -620 -1970 -1599 -184 639 709 366 462 1057 1182 -722 -1779 -990 498 1205 515
2069 515 -211 -350 228 313 -170 -1050 93 895 1214 -82 -1222 -1304 -134 818 316 -286 49 996 687
2088 687 -618 -1965 -1514 -35 1088 985 586 752 987 672 -1165 -2192 -1740 265 1274 1225 612 235
2106 235 323 261 -1094 -1513 -1106 774 1706 1036 -125 -456 95 378 -653 -1076 -388 890 1063 434 -904
2125 -904 -907 65 582 737 -125 -224 734 650 -159 -1783 -1416 10 1287 1104 240 53 -55 122 -848 -2017
2145 -2017 -1030 733 1916 1898 100 -218 -421 -173 -833 -1183 -775 1127 2149 1375 -328 -946 -524 -170
2163 -170 -354 -940 -217 706 1331 670 -739 -1379 -311 302 373 -493 -177 194 870 60 -858 -914 321 1289
2183 1289 885 -216 -761 -355 127 -327 -1094 -381 894 1911 1475 -192 -1179 -1159 -478 -278 -471 -165 1175
2202 1175 1859 1435 -589 -1731 -927 -404 16 -470 158 1096 1767 597 -1002 -1529 -738 346 655 -343
2220 -343 -120 181 1010 381 -919 -1040 -206 1040 628 1 -553 -255 141 111 -462 -273 823 1503 915
2239 915 -740 -1576 -911 148 -217 -10 257 1032 1456 905 -1127 -1586 -1368 241 524 422 352 1145 1372
2258 1372 349 -1327 -1933 -702 207 958 512 241 399 962 -163 -943 -1308 -634 931 1017 -89 -209
2276 -209 -204 270 274 -414 -732 312 1294 732 -589 -1489 -786 547 299 682 -10 575 1104 392 -1238 -1767
2296 -1767 -907 616 1238 747 318 477 521 -155 -1138 -1760 -849 845 1135 977 234 91 260 -339 -1197
2315 -1197 -1519 -295 1261 1349 685 -501 -511 24 -1 -409 -705 99 868 618 -255 -1065 -866 517 757
2334 757 305 -286 228 620 -110 -593 -1374 -862 833 1454 1008 66 -634 -330 -364 -1047 -1407 -316 1340
2353 1340 1828 908 -204 -837 -435 -451 -694 -940 -214 1402 1575 544 -744 -979 -333 28 -554 -375 -146
2372 -146 1277 1157 6 -827 -703 207 630 245 -535 -521 524 341 -419 -1147 -227 712 1383 673 -497
2391 -497 -799 -403 -217 -492 -835 -125 1463 1582 588 -1028 -788 -910 -33 -83 -651 290 1597 1213 164
2410 164 -1238 -1256 -456 -30 274 -68 183 971 935 -103 -1153 -1448 -589 875 489 -46 -11 503 557 -177
2430 -177 -783 -661 362 1222 309 -607 -778 -244 361 140 -451 -264 832 1320 154 -896 -1346 -476 151
2449 151 158 153 108 1008 1217 -33 -1161 -1371 -561 501 762 565 288 484 983 -320 -1581 -1484 -217 901
2469 901 551 301 -165 301 656 -168 -988 -953 430 1042 751 -412 -452 -327 438 307 -163 -364 572 1295
2489 1295 80 -788 -875 -549 427 803 18 151 514 988 -233 -1520 -1643 -204 1130 1294 809 -157
2507 -157 417 59 -512 -1334 -1576 -152 1434 1442 267 -536 -312 9 -246 -905 -887 429 1355 736 169 -730
2527 -730 -517 309 -53 -201 -310 294 889 633 -728 -1174 -302 621 728 143 -206 -198 459 -24 -820 -961
2547 -961 118 1151 1404 457 -482 -388 -91 -239 -902 -913 305 1527 1228 357 -597 -663 -361 -417 -596 -343
2567 -343 664 1489 1203 56 -1043 -740 -210 -30 -262 -327 93 1126 470 -500 -988 -404 641 738 242
2586 242 -518 -245 227 -88 -426 -693 -167 1129 1283 306 -495 -741 -490 -132 -299 -331 338 1404 1239 -50
2606 -50 -1266 -1212 -416 333 35 -143 554 1385 1004 -245 -1471 -1334 45 514 316 -124 16 946 953 -509
2626 -509 -1057 -892 335 800 130 -93 95 519 377 -545 -1048 -151 829 1112 245 -775 -775 -241 181 17
2646 17 35 337 996 703 -330 -1256 -818 -267 635 560 121 116 843 677 -524 -1416 -1152 42 915 745 460
2667 460 218 571 62 -609 -1123 -970 320 991 724 -96 34 175 374 -453 -965 -541 407 862 353 -578
2687 -578 -534 49 193 100 -187 -227 586 477 -109 -1077 -789 239 593 464 126 -127 280 421 -188 -1031 -950
2708 -950 193 956 1022 -60 15 65 -136 -637 -1044 -492 493 881 1256 63 -637 -276 130 -275 -563 -551
2728 -551 212 1165 833 -424 -859 -96 518 89 -432 -157 711 520 261 -631 -864 200 842 904 -134
2747 -134 -197 -161 -85 -317 -857 -550 725 1334 892 -70 -709 -331 -82 -280 -957 -15 879 1239 839 -161
2767 -161 -1057 -578 40 -141 -128 -156 828 1126 287 -436 -1269 -675 254 -5 113 -318 539 835 90 -715 -745
2788 -745 -110 993 166 -246 -394 -299 187 -59 -604 -499 510 1066 548 -261 -586 -646 52 46 -257 267 899
2809 899 1095 771 -515 -1329 -740 14 491 79 135 716 1091 402 -888 -1475 -995 357 661 155 352
2828 352 489 774 83 -429 -947 -590 420 805 -77 -124 -233 553 -81 -297 -550 145 836 725 -254 -938
2848 -938 -596 206 212 -64 -253 547 1153 367 -717 -1250 -860 -172 965 386 242 379 734 -32 -966 -1515
2868 -1515 -733 520 979 481 67 340 162 31 -826 -832 -528 834 1018 261 -537 -130 83 407 -144 -626
2888 -626 249 483 972 89 -1005 -555 484 583 166 -162 264 458 173 -503 -945 -702 356 836 347
2907 347 -84 82 303 -55 -673 -1073 -427 686 1203 787 -279 -691 -288 -201 -760 -956 -572 708 695 301
2927 301 -425 -559 -154 -56 -152 -427 -19 964 848 37 -934 -831 126 432 116 -273 -94 428 290 -263 -896
2948 -896 -574 244 983 713 -29 -431 -36 331 -623 -897 -528 892 1524 694 -297 -920 -518 -91 -246 -496
2968 -496 -41 1147 1274 138 -459 -978 -366 89 -28 -42 204 962 487 197 -676 -797 -223 828 446
2987 446 -216 20 607 298 -155 -809 -538 329 740 324 -104 -607 -286 13 -56 -393 -106 854 661 133
3007 133 -641 -945 -429 347 64 117 155 806 854 144 -666 -1127 -191 157 577 -331 -106 588 596 -334 -958 -1149
3029 -1149 -123 637 638 142 -366 157 644 365 -886 -599 168 911 489 -324 -723 17 280 176 -288 -439
3049 -439 610 819 232 -970 -955 -198 382 592 52 -289 487 516 -15 -1039 -1110 -58 417 654 154 -211
3069 -211 627 331 -365 -882 -865 -102 1191 808 119 -505 -311 157 -193 -829 -611 70 777 780 51 -563 -174
3090 -174 90 374 -264 -523 58 591 533 -798 -819 -424 320 550 -153 -76 -19 368 -182 -775 -921 -193 868
3111 868 863 351 39 -138 352 -80 -981 -845 147 1047 1225 305 -409 -522 20 -477 -618 -468 476 995 779
3132 779 -284 -789 -437 41 224 -247 -467 227 633 412 -308 -727 -216 370 356 -173 -488 52 522 229
3152 229 -578 -506 -346 1065 722 -53 -319 -30 86 208 -261 -489 215 853 1128 190 -747 -581 -108 174
3172 174 -217 -423 391 793 879 -97 -868 -749 22 466 163 -275 322 740 251 -457 -819 -599 324 429
3192 429 308 -645 -235 34 -106 -281 -655 -328 474 577 145 -742 -431 12 315 -270 -166 106 643 812
3212 812 -200 -1263 -682 102 559 159 145 276 720 731 -531 -970 -747 -118 396 666 172 236 494 431
3232 431 -554 -1085 -924 185 873 304 113 -144 278 204 -300 -707 -409 387 498 373 -495 -352 202 308
3252 308 40 -329 659 234 554 -256 -825 -808 -36 585 341 0 -210 372 489 -405 -743 -756 12 843 512
3273 512 175 -73 -18 215 -249 -825 -328 368 1162 920 -44 -333 -15 209 -128 -909 -265 705 945 488
3293 488 -498 -610 19 361 27 -240 -96 239 342 3 -588 -683 167 610 74 -189 -364 -117 90 -57
3313 -57 -596 -689 338 654 615 94 -350 -208 17 -309 -788 -359 313 1062 563 14 -835 -387 244 -134 -353
3334 -353 -43 443 870 455 -57 -523 -372 257 33 -213 -167 357 657 252 -418 -716 -517 510 367 400
3354 400 -107 229 432 64 -319 -538 34 641 597 1 -628 -167 -86 -91 -196 -282 564 728 736 -209 -836 -578
3376 -578 10 296 147 -234 727 766 663 -754 -796 -415 179 526 35 13 406 732 460 -696 -887 -418
3396 -418 368 706 78 -254 218 202 185 -144 -482 116 589 571 -215 -439 -325 208 399 -209 -244 -137 732
3417 732 238 -180 -971 -853 113 129 129 -70 325 393 45 -715 -1086 -472 289 662 398 16 123 224 134 -197
3439 -197 -653 -140 286 598 349 -226 -216 194 -62 -454 -695 72 733 481 -151 -529 -460 185 262 11 -390
3460 -390 293 424 106 -452 -1015 -555 421 562 24 196 54 312 -244 -564 -916 -286 433 877 469 -47
3480 -47 -90 -121 -252 -614 -467 -298 976 1176 470 -273 -614 -107 -40 -422 -415 -21 471 722 26 -591 -553 -19
3502 -19 462 -188 -309 92 523 250 29 -289 -543 154 461 533 203 -290 18 -137 -559 -578 -125 208 829
3523 829 99 -362 -449 -234 325 -412 -440 -197 647 829 50 -639 -303 -494 -134 -291 -347 220 260 665 197
3544 197 -611 -638 -22 45 315 -209 -51 62 357 -116 -617 -337 -181 614 7 -20 -142 150 8 -64 -428
3565 -428 -146 510 767 435 -721 -768 -146 29 -129 -234 369 428 552 325 -527 -846 -376 -186 -48 445
3585 445 51 446 725 243 -350 -618 -321 22 329 72 244 228 308 9 -896 -623 130 580 261 -173 -232
3606 -232 18 -70 -41 -414 -134 361 318 232 -421 -457 -430 213 303 1 77 510 433 -56 -792 -712 -269 352 487
3629 487 103 -103 395 239 93 -521 -759 -482 367 278 305 -4 -105 52 -25 -461 -272 68 981 437 -183
3650 -183 -397 -364 117 -217 -226 -495 302 445 275 -166 -483 -432 120 413 102 59 127 498 -10 -388 -725 -158
3672 -158 495 888 201 -35 -44 -247 -165 -206 -541 343 513 676 203 -205 -575 -78 -161 -485 -123 74 657 769
3694 769 -62 -562 -398 -57 6 -211 -224 276 706 391 86 -305 -104 -81 130 82 -116 359 -56 42 -359 -641
3716 -641 22 393 544 28 -188 -72 149 -15 -237 -341 170 671 497 139 -496 -691 -147 213 -365 -164
3736 -164 547 594 704 -264 -418 -610 -20 -99 135 69 153 495 460 -118 -493 -532 -354 247 -153 -385 79 397
3758 397 18 103 -177 -437 183 548 367 -335 54 82 -132 -275 -350 74 511 330 125 -367 -342 -86 127
3779 127 451 -37 245 381 838 33 -731 -395 -489 300 408 176 38 444 228 -290 -743 -643 186 520
3799 520 177 -147 108 276 377 -159 -299 -308 -114 561 37 -270 -112 115 151 -70 -446 -109 96 684 -51
3820 -51 -256 -179 -80 116 476 0 101 243 310 -311 -726 -466 -146 629 292 -63 -129 323 -4 -195 -251 -260 205
3843 205 631 568 255 -321 90 126 -420 -278 -413 353 461 281 -266 -454 -345 119 240 -261 -6 544 541
3864 541 365 -471 -453 -124 296 430 -84 40 447 320 -65 -284 -457 -78 451 292 11 -140 -453 231
3884 231 -223 -426 -71 155 706 548 -358 -137 -282 75 -144 -59 33 139 748 427 -410 -885 -391 196 132
3905 132 -316 163 232 360 98 -519 -596 -106 482 156 -45 -344 276 180 122 -254 -310 -149 210 685 -73 -406
3927 -406 -136 207 38 -250 -419 80 756 304 -427 -309 -371 120 34 129 11 431 726 326 -332 -622 -404
3948 -404 44 -12 -188 -98 229 202 233 -507 -615 -14 388 398 -80 -94 60 107 -33 -436 -315 -72 425 704
3970 704 -31 -231 -21 168 -97 -161 120 274 307 711 -120 -715 -412 37 313 -1 -49 204 347 189 -378
3991 -378 -571 -387 152 517 405 -261 354 17 214 -698 -752 -252 403 649 489 -130 354 302 -67 -643 -475
4012 -475 -53 7 448 71 -316 -120 248 300 -106 -431 -100 0 445 -9 -724 -161 232 48 179 176 34
4033 34 -29 358 -351 -445 -242 103 657 355 -28 -119 227 -209 0 -720 -88 138 543 324 -109 -149 -477 -28
4055 -28 -212 -564 28 322 537 165 -302 -450 -113 51 -85 -312 -67 279 235 -70 -602 -50 128 43 113
4076 113 -99 -101 355 169 36 -338 5 437 733 585 -12 -178 -260 53 -268 -512 -141 569 639 316 -92
4097 -92 -579 -48 62 -121 -284 -75 692 612 223 -325 -515 -66 -51 41 -204 39 629 223 -18 -467 -545 161
4119 161 231 163 21 -7 249 782 -24 -269 -454 379 394 295 41 -338 -70 231 -130 -468 10 631 552 156
4141 156 -382 -374 19 -134 122 -97 190 451 251 -188 -413 -486 -182 31 530 159 82 542 126 215 -390 -346
4163 -346 -200 681 357 -192 -40 -182 170 141 -333 -178 97 449 -3 -22 -389 -155 210 -103 -127 -24 314
4184 314 413 312 -467 -292 -340 403 -33 -111 -294 -9 454 -10 -470 -463 -92 5 519 229 -240 160 404 57
4206 57 -383 -291 -148 537 137 14 -233 -74 367 361 -603 -608 231 389 208 -179 -468 -202 227 52 -189 -48
4228 -48 -72 353 430 -100 -649 30 311 233 123 -114 -27 249 -114 -448 -522 -131 442 306 97 -380 -357 125
4250 125 130 -370 -229 -58 412 591 245 -213 -381 184 214 -310 -294 2 826 323 -159 -317 -177 353 365 -194
4272 -194 10 250 138 244 -221 -552 -411 442 383 7 -153 -50 -80 389 -418 -383 60 435 595 192 -142
4293 -142 -282 -2 -144 -428 -110 52 639 288 -82 -285 -552 -37 20 -196 -17 196 319 494 -35 -346
4313 -346 -568 -80 -19 108 -385 10 463 85 46 -582 -239 20 355 208 -235 -270 419 135 -281 -473 -119
4334 -119 496 496 53 -591 -338 -337 67 -55 -266 49 582 409 -18 -488 -508 -24 121 85 398 77 402 373
4356 373 33 -428 -491 126 599 155 -82 -167 528 142 -59 -523 -572 222 402 234 -172 35 360 263 -235
4377 -235 -223 -185 442 233 326 -357 -322 67 157 -243 -10 -160 218 515 138 -449 -268 -106 216 34 206 184
4399 184 212 135 177 -345 -498 183 487 251 -60 -152 -45 73 -191 -438 -306 -39 450 199 -310 -101 -127 247
4421 247 -172 -287 -118 174 262 294 -231 -383 -222 507 -220 -78 118 174 361 -148 -399 -95 -160 249 734
4442 734 -4 -165 -11 551 -84 -384 -521 -210 667 66 -182 -344 -312 146 -176 -357 -78 175 497 381
4462 381 -96 -115 -192 81 179 -155 -366 127 438 -18 -248 -483 -242 -27 97 -19 -44 170 415 -64 -366
4483 -366 -332 219 549 696 -28 248 121 -140 -42 -526 -163 39 588 402 -36 -307 106 74 -132 -10 -206
4504 -206 -3 195 197 -86 -546 -248 -137 228 -34 -97 357 692 354 -288 -549 -126 11 -189 189 95 112 -78
4526 -78 258 -79 -240 -97 158 473 -3 -298 -123 237 92 -350 -266 268 520 341 -295 -259 -171 63 -123
4547 -123 -131 47 -64 473 277 32 -630 -198 -4 203 -151 -215 77 125 42 25 -499 -40 208 478 -1 45
4569 45 53 -75 -10 -140 -324 -54 338 410 122 79 400 53 242 -60 -222 4 254 147 -55 -463 -260 -80
4591 -80 133 431 71 -44 354 9 -378 -643 -329 244 275 191 -249 -134 20 -47 -419 -781 -300 237 175 495
4613 495 9 48 190 -69 -280 -522 45 287 361 -28 -109 -479 -213 -167 -106 -125 26 235 359 -89 -379 -198
4635 -198 -100 314 18 125 64 596 48 77 -187 57 78 327 216 -257 151 327 134 -179 -576 -311 314
4656 314 480 362 -95 -335 -70 133 -360 38 -280 640 557 213 -304 -370 61 159 -98 -94 251 189 477 44
4678 44 -101 -359 -77 210 135 -331 -124 431 -93 -178 -332 -220 125 538 256 -34 -139 -75 -207 -52 -147 -97
4700 -97 317 375 85 -290 -331 -175 -5 -178 -122 90 287 521 335 -468 -287 -43 199 134 13 -243 658 220
4722 220 75 -299 -403 -190 120 313 -103 -114 86 6 -210 3 -228 301 339 185 -12 -278 -92 -96 -1 55
4744 55 -146 117 276 43 -266 -504 -174 -136 55 175 122 256 224 13 -282 -284 -323 -73 330 -165 -118 -75 -6
4767 -6 -74 -404 -525 -172 394 87 124 -414 206 88 -59 -315 -405 -220 239 159 112 -183 -187 -6 -206 -136 -119 156
4791 156 487 137 -225 -254 -276 573 132 -44 -34 -94 175 -90 -291 -393 15 5 350 61 -105 -156 90 -231
4813 -231 -355 -210 202 459 175 240 -161 -145 -169 -68 -269 -182 69 363 225 -191 -306 -221 71 176 -6 -96
4835 -96 81 124 -32 6 -197 -213 126 119 -19 169 -233 170 -304 -115 -219 -20 35 126 151 -46 -463 74 -217
4858 -217 -383 -81 -125 653 500 -13 -218 -317 -313 -140 -241 -33 229 318 234 177 -225 -172 -30 74 245 -340 -244
4881 -244 277 -28 92 -205 -63 35 194 54 -57 -140 -110 79 -108 -462 79 185 312 442 -177 -136 -15
4902 -15 139 228 -202 13 289 417 -25 -366 -349 -81 -49 -174 -276 10 44 216 -259 -317 -180 -147 190 99 153
4925 153 42 36 200 -66 -515 -44 24 29 -16 -10 -35 143 -26 -16 -33 -235 247 521 212 -122 -329 -85 199 304
4949 304 11 118 -95 52 94 -155 64 -260 134 291 -124 155 199 298 138 -330 -729 -152 301 257 114
4970 114 26 -174 155 -241 -331 68 -142 182 261 243 -203 152 319 72 -284 -135 362 465 -63 -184 -354
4991 -354 -241 203 -99 -88 -152 12 110 327 -409 -636 -100 374 363 185 -79 90 -16 -150 -340 -303 110 181
5013 181 159 10 -259 63 209 -123 -550 -401 35 357 435 -104 -376 62 119 68 31 -37 440 185 333 51
5035 51 -246 79 -35 240 20 240 -77 233 82 -147 -232 53 -20 166 302 -112 133 114 -23 -203 -155 278
5057 278 380 222 201 -124 86 127 -64 186 -77 120 491 588 373 -280 -364 -165 197 255 -286 -163 75 437
5079 437 42 -387 -124 -111 92 78 109 -109 170 46 -71 -552 43 111 101 7 -230 35 97 385 -115 -137 -303
5102 -303 325 320 -40 -248 -215 55 146 -108 -170 140 211 97 130 -160 -343 161 245 308 -140 64 169 94 -209
5125 -209 -505 -21 17 284 291 137 144 235 -39 -326 -378 186 -70 60 -65 -163 -254 97 238 -63 -234 4 37
5148 37 382 -240 -423 -117 -24 42 -101 60 -131 -14 245 -122 -538 -371 -69 548 206 58 -88 602 157
5169 157 -66 -302 -43 81 135 141 -238 -276 -153 35 -177 4 28 1 229 269 -95 -183 -100 -89 -165 -273 192 184
5193 184 214 -151 -205 -421 136 283 75 15 14 -51 133 48 30 -54 -89 309 192 -75 -69 -317 160 51 -81 -120
5217 -120 -55 282 -40 71 -27 -129 46 -363 -47 -109 89 146 158 39 -206 -285 8 -322 -152 -97 110 86 -45
5240 -45 -224 -237 -205 303 -70 -210 -408 103 106 -3 -221 -244 2 255 274 -18 -223 -221 -182 -145 -269 -146 -29 448
5264 448 181 -208 -328 33 113 -19 -97 -103 386 254 -181 -246 -250 -327 148 40 150 -24 366 -58 26 -156 -127
5287 -127 -231 52 -30 174 8 130 280 -159 -159 181 -46 67 79 -87 -235 49 -54 292 -32 -60 250 446
5309 446 254 66 40 -428 -93 40 46 28 50 335 -61 -138 12 -80 186 167 108 -92 6 -12 33 -246 -435 89
5333 89 161 403 23 58 168 133 207 -320 62 -204 380 188 -4 -52 -133 1 -13 58 -117 242 211 62 163
5356 163 -180 -70 -205 -149 -238 123 -110 138 236 -268 -186 -213 448 -138 -66 -137 64 140 -54 -68 -174 43 109
5379 109 231 -81 -244 -150 77 117 -257 -334 -104 136 85 101 -171 -181 265 -26 -337 79 -47 107 178 -39
5401 -39 -365 -294 132 50 -89 -251 177 164 184 -83 -318 -36 391 171 -205 -58 290 296 373 -256 -261 5 -19 107
5425 107 189 393 -145 -54 98 45 -274 25 264 250 349 -96 -249 -74 689 110 -215 197 -199 104 23 -273
5447 -273 -90 -11 107 342 -136 -182 531 -174 106 -196 -60 270 472 272 -147 6 77 446 -45 136 -42
5468 -42 435 78 280 -200 -147 -125 -174 101 -205 211 374 211 -20 -279 135 179 -165 216 130 40 148 -49
5490 -49 22 -373 -19 105 75 147 -39 -228 46 29 -264 -247 -79 9 438 306 -284 66 -6 -110 -146 -284 -317
5513 -317 240 162 247 -173 -467 -119 -47 435 -144 -74 112 109 -65 -172 -90 -21 269 178 -41 -105 -28 110 -218 -318
5537 -318 -264 191 344 -9 53 146 88 43 -395 -485 12 -36 234 130 -170 52 -13 295 -75 -162 -406 289 179
5560 179 494 -287 33 404 -6 -145 -141 -117 -164 234 39 58 -53 -41 -65 328 -331 -215 -27 159 24 -161
5582 -161 -198 89 333 133 427 88 -175 -152 5 -246 -90 -52 249 -60 -115 -296 -117 -3 121 -123 -77 216
5604 216 180 -13 -108 -84 39 43 165 -69 162 -86 131 -63 -87 -197 65 86 472 113 64 -67 -84 157 -240
5627 -240 -84 407 434 311 -130 -208 -90 42 44 54 8 172 480 127 173 -246 -71 164 75 -44 -49 -74 297 -97
5651 -97 -227 -311 -235 -135 181 -326 -216 -203 -170 32 -306 -114 116 222 272 30 300 58 -383 -286 -252 -130 367
5674 367 114 28 47 -208 -120 191 258 -68 -70 176 62 48 27 -498 -277 91 -12 -97 76 375 50 68 -281
5697 -281 -207 177 95 49 120 204 -118 340 -7 60 -224 -100 276 175 312 -295 -74 -115 108 -272 -66 41
5719 41 142 356 -265 -280 -171 62 -148 -22 2 33 -124 62 -10 -153 -49 70 84 87 -183 -112 -35 -16 -173 -510
5743 -510 -123 218 34 297 -54 91 56 224 -11 17 -315 462 -141 182 -255 -118 258 -39 58 -188 -188 512
5765 512 -350 -60 -173 -337 129 57 213 38 171 76 110 164 -192 -64 99 162 10 -20 -342 -303 91 -131
5787 -131 108 37 85 120 180 190 -120 114 122 -76 -141 -79 95 166 118 -220 35 -132 221 378 10 8 -80 200 108
5812 108 -104 -183 -5 -102 201 40 190 52 24 290 -403 172 15 441 119 -20 -396 -15 131 -169 -80
5833 -80 37 38 229 308 -201 -248 -129 39 431 301 -32 -238 296 133 173 -415 -175 297 292 -205 -131 180 109
5856 109 -41 -157 5 82 -54 81 73 -76 45 -248 150 -101 -84 223 69 386 158 -193 -23 -372 127
5877 127 126 -37 -144 56 28 -247 105 -15 66 -20 14 -375 125 190 -236 -161 -444 -258 -28 -464 -265 -243 122
5900 122 438 -43 -132 -173 -120 -78 68 -105 -109 114 111 -337 -210 106 -227 -9 390 -333 -335 -25 -15 -90 223 7
5924 7 336 -189 -116 -259 -289 -70 343 250 -2 263 -54 67 48 -82 -243 -359 -79 384 -74 -16 -167 -276
5946 -276 -18 -40 -99 462 82 239 72 -102 -13 81 -208 -228 -36 56 381 279 13 -143 -278 -131 384 180
5968 180 -176 -106 257 61 -20 -263 -292 74 -244 -103 132 71 292 305 65 -448 -160 427 120 -5 5 -164
5990 -164 -243 -140 -152 -286 -139 96 437 78 85 157 32 -236 -127 -128 215 286 296 -60 -360 -143 -186 25 95 -363
6014 -363 -95 21 97 -198 -415 0 58 526 -44 -125 -155 51 -90 -34 -136 -145 141 331 -161 -218 30 91 -51
6037 -51 80 133 -136 262 45 194 -428 -248 -62 151 -147 199 17 251 -90 -21 50 -228 157 168 140 -426
6059 -426 -193 92 82 140 -60 -197 88 53 -70 -146 -262 164 -172 222 -214 -6 164 0 -153 -267 -256 66
6081 66 -13 -279 214 73 539 295 46 -86 -238 -175 162 -55 -22 -14 64 -90 -208 -390 -104 174 67 193
6103 193 84 -101 142 73 -147 -25 90 -189 -32 69 -502 126 340 30 55 -76 135 370 76 -170 -186
6124 -186 -283 449 -185 182 68 -2 58 -119 151 -270 -171 -1 56 396 235 -67 23 -211 -93 -73 82 -23
6146 -23 471 106 64 1 -99 155 -451 92 115 408 233 227 -52 -48 -57 -4 -28 -202 -313 312 161 123 -81 -462
6170 -462 -1 -168 364 -46 -186 96 242 171 -79 -348 -230 443 49 -268 -58 -153 -119 -71 -230 -50 10 208
6192 208 -204 41 -362 355 101 -66 -195 -128 111 -51 265 -107 -318 76 363 48 -427 153 158 3 22
6213 22 -222 -47 -106 125 20 57 -74 -197 447 -24 -339 -244 -9 -148 126 -18 -202 89 42 268 -165 -103
6235 -103 -23 167 248 171 205 -79 59 126 -46 64 90 -96 -118 -85 -51 -226 194 157 -21 134 -5 -8 310 -145
6259 -145 -217 58 -184 403 30 -76 141 -37 147 -142 28 -112 -1 82 52 112 -182 -12 77 -83 -53 -48 -185
6282 -185 218 155 -89 16 -320 271 -259 -59 -129 -130 121 -192 -56 100 28 509 -125 85 71 51 292 -103
6304 -103 -30 62 -3 -218 327 85 -10 54 309 188 -349 -161 195 -30 170 -136 153 82 -87 -168 -125 -86 -184
6327 -184 315 -3 -378 -280 391 47 -120 -80 463 31 411 53 -38 -77 133 363 289 32 -172 5 -18 75
6349 75 143 -12 126 135 -18 4 -213 -21 106 135 -193 104 -194 263 -132 -74 96 -249 358 -21 -69 -216 220
6372 220 -136 -359 -178 -143 -2 235 122 -81 -56 52 127 -442 -251 304 107 -99 -22 280 112 28 67 -188
6394 -188 -77 90 -96 -145 -70 -72 -287 -18 45 -14 -186 63 88 0 -86 -153 -4 -39 400 74 112 36 105 143 -166
6419 -166 -169 -499 75 33 88 -320 -213 125 48 161 -21 -255 177 245 -18 139 321 154 200 -50 -104 -295 -119
6442 -119 27 302 -4 -169 -93 234 -308 -22 272 -62 -29 177 -200 -308 -102 -69 -40 -106 -205 -199 342 -55 -61
6465 -61 -347 193 146 43 58 116 -141 153 -62 99 -78 199 0 -141 -87 -216 -176 -6 -71 -35 151 -189 228
6488 228 294 131 127 -158 156 138 111 -191 -83 209 96 -307 -448 -264 205 -103 10 268 -345 -173 -358 -125
6510 -125 -147 10 161 209 111 -178 -321 -155 248 105 -162 -6 97 33 -316 71 -109 490 274 112 -122
6531 -122 3 131 125 -104 -124 100 392 228 2 -30 -121 125 41 -77 33 140 -97 224 -194 -252 195 -206
6553 -206 -261 -66 -153 -75 306 47 -363 180 109 59 54 -143 25 129 105 446 -73 -295 -450 52 168 108 202
6576 202 115 93 -72 55 3 -65 92 235 148 -10 -179 116 112 53 -117 -164 35 -115 30 -32 -348 6 -18 -307
6600 -307 47 -15 -22 128 19 17 -140 110 138 4 -135 77 231 325 39 158 -316 -245 331 -52 131 127 323
6623 323 35 31 71 -265 209 2 635 21 -56 -16 -280 295 172 340 89 -117 -89 -65 -247 -96 117 -19
6645 -19 -99 249 292 6 173 -216 173 -213 -164 -11 -200 -154 35 88 -70 -59 -246 90 528 139 -384 -401 0
6668 0 131 -215 -150 -446 -245 187 -27 -96 -65 2 -94 4 -46 185 218 103 -161 34 -151 -191 13 -52 99 -128
6692 -128 20 14 162 -388 6 54 -78 -19 -189 -360 42 -53 3 -81 -628 116 -49 159 84 6 87 -105 -8 -275
6716 -275 -272 -39 190 372 -285 100 72 25 235 -29 109 -76 221 -69 58 -193 28 92 -155 51 50 -125
6738 -125 78 -10 -83 -244 -251 -101 -152 -87 -60 -19 300 78 179 50 292 173 118 195 -65 -121 184 -198 -328 205
6762 205 -397 -4 -207 250 -82 242 -4 430 117 -217 -105 112 141 -123 37 -233 -121 29 -144 149
6782 149 -49 1 -90 -205 -202 -162 -321 157 144 66 -23 110 69 -72 209 -240 116 -73 289 -78 -285 185 135
6805 135 -15 -230 -75 -55 41 200 -285 -81 -76 -43 -328 38 -92 77 160 -344 -62 -20 66 190 -54 -137 -200
6828 -200 -211 15 -112 -314 -107 -28 223 62 168 32 -153 222 -26 -124 -138 -139 209 -21 -48 -189 -58 56
6850 56 -150 -79 -144 -116 45 25 -194 72 15 135 69 105 73 -159 -90 -43 -139 -418 229 -67 130 118 31 217 -202
6875 -202 30 30 -123 -87 234 -10 -48 -44 -34 151 -125 166 -220 3 75 -132 177 5 47 6 152 222 7 79
6899 79 104 21 -446 -48 28 189 -181 -52 245 17 -22 -82 151 -92 258 -255 -102 1 73 148 32 -9 -195
6922 -195 -158 244 2 49 118 -237 189 -227 -48 -188 98 -65 56 83 -130 -104 -116 -117 -48 -168 -52 -165 61
6945 61 -99 9 -170 35 -178 21 -260 -131 162 -57 76 -135 -250 -267 3 273 542 -16 -74 -172 116
6966 116 -188 69 66 119 126 118 -30 63 261 280 234 -123 75 80 144 -281 214 112 -81 164 100 81 -387 16 197
6991 197 -248 37 -255 8 56 233 -107 -107 74 264 7 -85 -66 148 260 -56 -32 -224 52 76 57 -29 -198
7014 -198 -34 82 -131 42 -342 131 -121 238 176 -64 100 -200 -191 -192 7 -46 192 -28 35 241 162 -123 26
7037 26 -17 -2 -87 30 -151 170 -83 -77 -221 87 153 -94 -20 42 -44 -21 -273 -21 197 209 225 19 -16 118 -164
7062 -164 -123 -230 -38 177 133 159 -52 -51 -150 -103 -329 -248 -57 -19 201 219 32 297 61 -277 131 292 -322
7085 -322 -129 89 -205 -16 174 -4 -365 -146 -6 -79 163 -154 -38 -123 -16 -16 -59 -33 95 25 234 61
7107 61 -119 43 99 75 -333 -160 -54 -173 88 45 -146 -80 267 248 12 -153 -161 4 274 -62 -120 232 -44
7130 -44 6 -113 -164 27 23 -205 218 49 -31 226 157 -136 -279 -120 17 57 174 -355 82 -360 57 379 -35
7153 -35 -147 31 -38 389 -189 -98 33 -278 201 -265 -122 111 2 89 -25 -289 -210 31 320 52 -118 71
7175 71 65 251 115 119 6 198 -59 101 227 59 -110 -28 -146 -64 -6 345 -328 -286 342 -289 -16 8 58 138
7199 138 -6 180 -176 -9 28 87 -201 36 -152 229 -137 -56 -171 -115 104 86 64 -96 -97 -106 -174 -54 -39 -13
7223 -13 -202 115 108 -3 -51 8 117 -227 -95 -254 -386 -257 -118 -135 -374 268 24 -187 -22 -230 -345 325
7245 325 -114 -150 2 126 -76 350 59 -94 -50 29 193 211 -26 -123 -16 -53 188 187 170 -153 -10 121 171
7268 171 -126 -14 220 -231 4 -73 72 -108 257 -102 4 155 -62 -90 -19 -84 -212 4 -69 -60 7 -21 148
7291 148 108 -402 -6 116 207 406 -14 54 111 190 156 183 35 -270 15 -203 22 27 -117 331 -27 375 -77
7314 -77 110 6 -275 -150 249 -255 61 93 174 149 -64 -5 -252 -100 38 25 -40 140 -250 3 -55 47 185
7337 185 -41 -39 1 16 167 121 265 -4 -34 206 -89 -88 -141 -172 -6 47 29 111 186 -116 267 310 -87 46 213
7362 213 137 -108 -181 297 -144 97 -48 -70 102 -184 61 -183 -247 2 124 -19 -82 54 105 217 152 -51
7384 -51 215 -103 217 -204 172 89 260 -134 -7 -148 -289 111 9 381 -68 -123 172 11 22 -24 -137 77
7406 77 134 106 116 -65 59 -13 156 82 -5 43 373 -80 73 -33 215 247 215 150 42 39 145 -1 -19 70 -162
7431 -162 172 118 -120 -29 206 -92 18 35 -67 77 -29 27 142 386 129 -2 56 -79 -40 215 204 -23
7453 -23 -211 -139 191 -166 210 71 29 -100 84 445 -32 123 73 -87 -91 -158 190 -47 -82 212 -83 -67 49
7476 49 77 100 -272 40 -76 27 111 -134 -47 144 255 328 155 -127 -275 -386 -91 114 -49 -52 40 33 206 -215
7500 -215 94 269 -99 -94 -198 -219 -39 -304 177 81 -200 -165 401 149 -60 54 106 155 104 -44 -191 229 369
7523 369 -386 -59 -4 177 -2 -219 -5 84 165 -154 -41 57 44 -185 -136 90 157 126 -56 -36 -22 174 -32
7546 -32 -33 161 27 305 -49 -7 -129 -35 -284 -115 -178 -27 225 131 172 188 95 179 152 169 -38 115 -24 163
7570 163 2 186 -48 -203 277 52 191 45 -20 -38 81 88 200 198 122 238 188 118 31 -84 -137 51 295 150
7594 150 -187 -35 -230 87 -140 -143 -8 -171 -45 153 -72 -3 116 -352 -3 -3 -337 146 -150 259 12 -148
7616 -148 -298 -341 25 -67 304 -62 67 -219 -113 -160 -150 -141 130 -223 148 239 200 -82 30 -202 164 -26 84
7639 84 331 -264 330 -64 177 -12 351 298 96 101 -210 -98 230 -320 -51 6 3 -123 -18 -150 100 483
7661 483 122 40 29 286 -14 -87 42 -138 -40 164 0 146 -22 -176 66 -87 116 145 -23 129 95 61
7683 61 376 -105 5 41 -203 99 -211 -118 -33 382 214 92 -198 -45 10 188 13 -196 -235 252 107 13
7705 13 151 -62 137 185 -106 -234 -361 -293 -183 -97 85 97 -182 23 274 -185 402 -82 18 -153 -294 111
7727 111 289 92 12 -110 -142 -4 -128 97 77 -45 240 88 90 -85 -101 372 59 -87 -258 90 -17 -120
7749 -120 14 22 144 -11 63 163 -236 -23 -119 66 -290 -228 80 112 67 61 125 -57 424 403 134 -120 -96 -60
7773 -60 4 438 -7 46 33 227 -42 -8 -358 -263 5 60 79 -276 109 -198 219 110 -152 169 -8 -39 65
7796 65 -295 -59 -94 151 25 -167 -170 -138 183 -267 79 264 -19 228 -142 15 -101 83 -20 160 -1 88
7818 88 -220 -172 131 159 252 68 53 -107 44 -84 -280 -35 -117 19 114 -247 120 211 -100 72 104 39 -368
7841 -368 116 172 245 165 -24 -35 239 104 -274 -96 15 242 -78 185 -315 -150 -210 -248 152 -199 21 -234
7863 -234 -54 -83 94 -42 -43 12 -260 -199 75 216 -137 -146 31 -13 -52 98 74 -143 -190 71 302 -131 212 -206
7887 -206 269 156 -193 -25 -23 -217 -136 222 -28 -40 121 419 -125 75 -193 85 -134 -67 -120 209 52 222
7909 222 -57 -169 -75 383 -212 -117 73 -48 61 -364 -162 199 -8 153 394 90 232 90 -244 -259 99
7930 99 -46 -49 -323 376 44 -261 -3 -26 -57 113 37 12 -126 53 -196 248 -13 32 -189 -93 9 -88 88
7953 88 18 107 -154 -189 460 -195 -103 -76 -118 -6 -81 -148 56 89 -31 66 -21 -81 -336 208 170 -245 -249 -8 84 102
7979 102 417 -25 32 264 49 -10 -324 -268 -131 -54 -73 95 -100 277 -177 38 -164 91 330 356 154 125
8001 125 53 -173 -70 -147 227 -66 25 -10 94 -71 -57 134 217 82 -89 -227 -225 175 208 -47 -37 -8 87 134
8025 134 -92 -12 -149 17 183 -71 -49 -151 79 343 -20 -10 75 187 284 -35 176 133 -25 235 -111 146
8047 146 -356 -39 -39 -38 -97 -141 141 240 -298 -239 102 -125 -216 14 38 1 35 -275 254 -93 -138 305 -41 -113 -7
8072 -7 163 144 10 126 225 74 75 -426 -79 -151 11 39 191 -139 -367 -6 187 16 -109 -94 -277 146 -18
8095 -18 91 -175 17 263 -102 294 -108 130 110 67 106 -454 -60 -152 -123 161 -130 304 -319 -180 -103 -55 -23
8118 -23 3 186 -103 -155 -67 -83 -13 -97 27 -310 24 -113 -150 256 124 -57 -81 119 -111 -147 -299 46 22 -1
8142 -1 180 101 7 125 383 -152 34 183 -298 91 227 -177 33 -147 -132 258 -116 -72 -249 0 -42 35 484
8165 484 -81 -266 0 243 343 -31 -367 60 9 225 74 7 -203 -138 -32 20 81 -5 223 173 -264 -227 62
8188 62 -261 -138 12
8191A2
$$ Imaginary data points
##PAGE= N=2
##DATA TABLE= (X++(I..I)), XYDATA
0 0 0 0 0 0 0 0 0 0 -3 8 -8 8 -8 8 -16 16 -21 24 -28 32 -40 47 -54 62 -70 80 -91 103 -117 132 -149 167
32 167 -186 209 -233 259 -290 321 -356 395 -437 485 -536 593 -660 730 -811 905 -1012 1139
50 1139 -1289 1468 -1691 1975 -2350 2878 -3662 4968 -7546 14660 -75516 -297997 -288888 -152458
64 -152458 60693 180486 156788 23041 -99889 -155742 -117707 -16565 97441 143533 106203
75 106203 26919 -26985 -38954 -15125 26254 65102 73227 50407 11476 -28468 -61855 -62014 -16358
88 -16358 42177 58322 22417 -30507 -58070 -44475 3780 56414 73940 38478 -22239 -60883
100 -60883 -50141 5343 72979 105319 68192 -20667 -94045 -99553 -46432 19013 54728 44723
112 44723 -57 -51401 -77068 -66601 -27497 21614 61925 70165 39447 -9994 -44951 -48950
124 -48950 -28645 5020 38560 50820 27118 -22284 -62608 -63305 -22132 32390 58258 34591
136 34591 -18386 -53801 -42208 2755 43397 53317 29713 -11656 -42584 -41886 -7066 33663 47897
149 47897 24010 -18725 -46122 -36054 3729 39064 41715 15064 -15731 -30052 -25539 -10105
161 -10105 10178 29225 37932 29861 9189 -13329 -24598 -18532 -141 18837 26975 20220 -818
174 -818 -29884 -50531 -44204 -9182 30688 43880 20852 -16075 -35832 -23232 9643 37195 39820
187 39820 18902 -8523 -26524 -27556 -12792 7662 19325 11080 -10833 -27467 -25100 -8716 5095
200 5095 7591 2859 692 3826 6322 3019 -3378 -3278 5684 14682 11537 -1171 -10530 -9435 173
215 173 10540 15339 10508 -3086 -20368 -30297 -23261 -830 21214 24610 4045 -21324 -26324 -5339
229 -5339 23043 35370 24736 2918 -14103 -16279 -6479 7951 19069 17853 3903 -16450 -29735
242 -29735 -25576 -8333 8257 13676 9007 4610 4334 2623 -3299 -8044 -4399 6941 14493 10753
256 10753 -2572 -13082 -11468 -225 8291 8781 2028 -6881 -13582 -14329 -6295 7225 17123 12703
270 12703 -4742 -20472 -19184 -1348 18362 22278 7887 -10026 -16507 -9043 4126 14589 17857
283 17857 12926 144 -16088 -26382 -22340 -6371 10697 19083 15594 6157 -1799 -8839 -12909 -10672
297 -10672 2024 18805 26272 15446 -7202 -23476 -21203 -5161 9842 13462 5562 -5814 -13038
310 -13038 -12642 -4344 8540 18417 16227 1950 -13160 -15532 -3298 11387 14313 4264 -7976
323 -7976 -11568 -5584 2296 6434 6535 4816 196 -7654 -14685 -12365 -1473 11228 15814 9867 -926
338 -926 -8942 -13251 -12061 -5047 7922 21666 24712 11982 -9503 -24104 -20334 -4105 9689 11739
352 11739 3569 -5818 -10905 -10361 -4570 4629 12324 13395 4903 -6471 -10366 -3449 7436 11239 6043
367 6043 -1982 -5138 -3539 -2722 -3974 -4171 -977 3289 2524 -2914 -5695 -2320 6188 10621 7101 -1107
383 -1107 -7705 -10333 -8576 -3037 6077 16288 18348 8404 -9125 -19538 -15884 -1096 11066 11874
397 11874 4415 -4043 -7089 -7056 -5653 -2446 3176 6835 5151 -631 -3735 -438 5882 7787 3520
412 3520 -1934 -3502 -1490 -1489 -4512 -6110 -2780 2979 4612 502 -4297 -3194 2446 6813 4833 -735
428 -735 -4277 -3623 -1264 847 3865 7437 7630 1328 -9875 -15287 -9816 3143 12228 11928 4439 -1982
444 -1982 -4590 -5144 -5233 -4876 -679 3941 5601 2665 -1242 -1086 2415 3727 996 -2343 -2598 248 1227
461 1227 -803 -3139 -2006 1841 2738 -1494 -5949 -5269 1215 5949 5025 15 -2269 -1055 2270 3379
477 3379 2886 2692 2407 -1333 -8423 -11661 -7540 3382 11016 9700 2577 -3341 -4442 -3637 -3892 -3229
493 -3229 205 5874 8019 3970 -2351 -5435 -2829 -170 -1 -1659 -890 2401 4154 1940 -1478 -1781
509 -1781 297 1015 -1982 -5380 -4352 1517 6103 4582 -332 -3236 -1269 2523 3356 1922 418 695
525 695 -1299 -4495 -6561 -3605 3279 8177 5329 -1310 -6003 -5713 -2689 -456 741 3746 7250 8434
541 8434 2936 -4843 -8020 -5432 -1004 812 380 159 2039 3921 1993 -2086 -3059 -1207 1022 138
557 138 -2805 -2488 2226 5594 3826 -2239 -4794 -3216 831 2712 1691 573 1415 1068 -1009 -3686
573 -3686 -2624 2147 5526 3413 -2881 -7201 -5888 -1220 2230 3311 4468 5728 5374 55 -6299
588 -6299 -8161 -4283 1858 4550 2707 490 469 1569 -475 -3451 -4316 -1403 2374 2585 1017 401
604 401 2336 4445 2188 -3073 -6301 -4406 32 2488 1620 726 1563 1675 603 -2999 -3360 437 4122
621 4122 3768 -1108 -5228 -4397 -691 2158 2689 2456 2499 2407 -956 -5371 -6475 -1739 4319 6549 3766
638 3766 -346 -2132 -1345 -2179 -4529 -4392 -609 3526 4720 2875 279 598 1911 774 -2913 -5046
654 -5046 -2911 1897 4565 2393 -262 -779 -275 -1529 -3427 -3614 489 4915 5211 1017 -3037 -3242
670 -3242 172 2008 1479 -258 -258 366 -870 -3404 -4184 -212 4920 6532 3322 -1379 -3612 -2384 -2290
687 -2290 -2801 -2347 714 5236 5769 1912 -2281 -2957 -952 -164 -1424 -2521 -270 3983 5571 2528
703 2528 -1240 -3128 -2348 -2063 -3063 -2648 789 5226 5883 1843 -3096 -3615 -357 2006 1769 -324 -861
720 -861 587 189 -1977 -3192 -828 2784 4617 2000 -2592 -3678 -1603 -178 -562 -634 1612 4325
736 4325 4610 300 -4441 -4993 -1932 901 865 401 1206 3528 4087 1324 -3093 -4261 -2904 -697 -317
753 -317 -221 1943 4472 4518 -34 -4525 -5135 -1500 2612 2699 1283 736 1026 1148 -957 -3151 -2515 690
771 690 2664 1060 -2049 -3029 -1010 1410 1365 362 1094 2645 2561 -768 -4789 -4797 -1176 2320 3027 1153
789 1153 700 2065 2373 -320 -4002 -4487 -1884 1682 2514 1625 1816 2802 1971 -1679 -5275 -5479 -1067
806 -1067 3228 4232 2143 790 952 839 -941 -3820 -3382 218 3181 2529 -680 -2527 -1117 1127
822 1127 1383 97 159 1517 1956 -109 -3372 -3242 -95 3028 3007 402 -1175 -498 597 -929 -2984
839 -2984 -3765 -322 3457 4128 2159 879 192 -525 -2725 -4867 -3726 833 4841 5169 1631 -949
855 -949 -1249 -644 -1311 -3344 -2640 890 4152 3986 150 -2103 -2200 -331 145 -1203 -1059 1083 2620 1245
873 1245 -1951 -2717 -85 2864 2833 -139 -2260 -1493 159 -161 -2108 -2178 455 3707 3969 1178 -1574
890 -1574 -1870 -1202 -1639 -2531 -1646 2033 4866 4532 559 -3008 -3228 -1899 -1307 -1729 -822 2165 5164 4327
908 4327 -94 -3786 -3668 -1355 72 -68 -2 1513 2735 2179 -969 -2866 -1255 1280 2033 -102 -1869
925 -1869 -749 1096 1206 -975 -1867 192 2798 3208 110 -2672 -2757 -924 539 251 282 2221 3960
942 3960 2587 -1282 -4398 -4157 -1251 732 202 643 2174 4119 3083 -1242 -4769 -4475 -1147 1450
958 1450 1771 1206 1309 2093 1427 -1908 -3500 -2493 335 2448 1025 -773 -391 1482 1018 -783 -2452
975 -2452 -919 1820 2633 317 -2422 -2788 -199 1508 1186 29 1043 2307 1237 -1685 -4068 -3506
991 -3506 -32 2298 1803 783 1014 2198 1155 -2378 -4944 -3609 298 3528 3365 1809 1055 518
1007 518 -323 -2675 -4401 -2484 1081 3599 2283 456 -285 343 268 -1786 -2702 -1639 1827 2986 1201
1024 1201 -1606 -2085 34 1631 664 -686 -399 886 863 -879 -2847 -1931 825 3313 2216 156
1040 156 -703 -274 -350 -2230 -3806 -2288 1672 4372 3709 851 -958 -791 -973 -2397 -3249 -1966 2255
1057 2255 4216 3500 459 -1654 -1232 -1035 -2017 -2352 -685 2673 4393 2043 -1568 -2727 -1188 1001
1073 1001 817 -664 -871 651 1656 -160 -2277 -1983 926 2636 1847 -694 -1666 -694 232 -1052 -2313
1090 -2313 -865 2180 4199 2629 -875 -2794 -2076 -708 -986 -1516 -125 2801 4081 2418 -927 -3253
1106 -3253 -2674 -1012 -1038 -1120 612 3387 4456 2149 -2157 -3907 -2344 199 1174 64 93 1008 1943
1123 1943 540 -2187 -2219 -288 1961 1513 -762 -1899 -679 824 457 -794 -533 1002 2852 1430
1139 1430 -1585 -3180 -2019 21 864 347 351 2151 3076 1596 -2483 -3978 -3246 0 966 846 1409
1156 1409 2876 3386 625 -3041 -4408 -2399 932 2023 1574 836 1221 1619 -556 -2560 -3240 -760
1172 -760 2277 2287 322 -1189 -565 635 553 -769 -879 184 1766 1018 -1657 -2941 -1233 969 1926
1189 1926 232 -384 565 1580 288 -2108 -3608 -2174 998 2422 1873 804 1070 1531 -762 -3328
1205 -3328 -4340 -1540 1890 3733 2541 363 251 -59 -1071 -2925 -3411 -547 2893 3523 1165 -868
1221 -868 -975 61 334 -1015 -1560 108 1922 1653 -623 -2072 -984 1188 1773 359 -1096 -563 570
1238 570 389 -1314 -2423 -879 1640 2940 1564 -366 -320 -165 -835 -2498 -3180 -543 2926 4378 2414
1255 2414 -456 -1344 -1127 -1653 -2208 -2015 489 3470 3798 1336 -1908 -2309 -1046 -582 -685 -1006 312
1272 312 2392 2338 283 -1757 -1683 762 1138 218 -1281 -876 787 1281 -256 -1621 -714 1540 2495 928
1290 928 -1342 -1536 -253 33 -934 -1502 233 3114 3850 1591 -1595 -2743 -1950 -718 -909 -486 1473
1307 1473 3696 3631 268 -2892 -3593 -1634 436 685 318 1111 2172 2212 -460 -2700 -2323 62 1596
1324 1596 655 -640 -295 1244 1911 -8 -2016 -1106 644 1971 623 -1298 -1358 57 1116 164 -1397
1341 -1397 -339 1759 2699 745 -2237 -2795 -1382 469 643 521 816 2416 2157 -563 -3596 -4209 -1367
1358 -1367 1353 2451 1256 1029 1674 1320 -1107 -3646 -2941 -410 2204 1786 240 -328 617 895 -251
1375 -251 -2262 -1999 -27 1571 1440 -579 -942 402 1176 143 -1313 -1184 760 1909 641 -1805
1391 -1805 -2717 -789 1327 1453 376 387 1356 913 -849 -3432 -3433 -418 2618 3133 1506 3 219 -349
1409 -349 -1354 -3325 -2326 298 2949 2781 705 -946 -445 205 -708 -2067 -1755 696 2515 2232 55
1426 55 -1335 -186 538 244 -1623 -1427 493 2262 1450 -1266 -1757 -247 1105 1698 138 -487 -155
1443 -155 835 -513 -2271 -2503 290 3012 2823 628 -1111 -1433 -546 -1428 -2096 -1329 1610 3525 3034
1460 3034 320 -1880 -2070 -848 -814 -1279 -983 1318 2897 2631 83 -2100 -1787 -446 -132 -966 -968 538
1478 538 2431 1506 -633 -2465 -1081 343 1072 -247 -526 -243 1049 149 -1189 -1733 -133 2352 2347
1495 2347 401 -1875 -1800 -755 -252 -621 -408 1912 3236 2564 -739 -2702 -2465 -718 718 402 373
1512 373 1410 2381 1491 -678 -2734 -2209 -203 593 277 93 1136 2278 1551 -1056 -2770 -1705 -34
1529 -34 1280 790 -311 267 1164 565 -1042 -1988 -585 1642 2162 97 -1613 -1559 -475 707 -81 -303
1547 -303 858 2183 1457 -1008 -3027 -2504 -151 1564 1702 602 882 1601 764 -1570 -2867 -2007 226
1564 226 1917 1526 236 385 1261 816 -1409 -2982 -2331 708 2121 1685 356 -123 580 105 -1153
1581 -1153 -2338 -1231 1568 2252 716 -1068 -1327 -119 980 369 -613 -120 1094 1094 -740 -2542 -1871
1598 -1871 647 2151 1472 393 -370 421 -308 -1562 -2675 -1522 1319 2890 2064 246 -417 -58 -31
1615 -31 -1623 -2656 -1417 1136 2837 2240 93 -916 -111 -237 -1361 -1870 -801 1499 2868 1161
1631 1161 -860 -1698 -791 582 670 -617 -157 704 1285 -205 -2066 -1812 502 1937 1111 -243 -961
1648 -961 -231 -55 -842 -1704 -914 1348 2369 1555 -190 -1617 -507 -270 -999 -1386 -772 1564 2914 1719
1666 1719 -603 -1821 -1185 -616 -711 -1243 -41 1833 2720 1347 -1421 -2603 -1492 62 467 -117 151
1683 151 1521 1640 133 -1396 -1828 -252 1454 1221 -207 -1028 -445 846 76 -932 -641 793 2112
1700 2112 1008 -1051 -2095 -1212 81 139 -482 -144 1305 2238 1224 -1163 -2659 -1555 -245 427 168
1717 168 991 1716 2567 1009 -1617 -3338 -1709 461 1110 760 652 1105 1363 95 -1419 -2216 -532
1734 -532 1594 1344 142 -878 -124 713 502 -1073 -1015 116 1610 955 -863 -1781 -768 733 1152
1751 1152 402 -4 751 1386 376 -1220 -2663 -1411 326 1367 1066 555 910 1325 228 -2426 -2652
1768 -2652 -1276 1053 2279 1557 471 559 491 -300 -1894 -2360 -373 1943 2160 1004 -435 -353 441 -65
1786 -65 -737 -1427 -348 1563 1449 -254 -1252 -670 602 1234 -60 -691 136 786 473 -1190 -1681 -823
1804 -823 877 1900 985 -83 -216 293 -267 -1700 -2255 -743 1773 2716 1844 -57 -434 -133 -912 -1838
1822 -1838 -2070 112 2244 2713 813 -1205 -1046 -133 -602 -727 -1207 67 1774 1926 384 -1611 -1063
1839 -1063 -127 695 55 -613 -318 914 595 -301 -1548 -606 485 1555 952 -861 -795 93 -46 -981
1857 -981 -1352 -60 1765 2418 1166 -985 -1422 -1031 -524 -1007 -919 529 2086 2797 464 -1628 -2066 -984
1875 -984 221 61 -143 684 1796 1253 -277 -1884 -1292 46 613 101 -499 -52 1278 1161 -131 -1251
1893 -1251 -1012 664 1361 464 -1057 -1070 33 68 -287 -942 -137 1493 2077 410 -1358 -1790 -691 355
1911 355 107 -158 617 1811 1832 -40 -1869 -2488 -923 588 680 566 814 1426 1456 -391 -2270 -2153 -389
1930 -389 888 1170 -129 121 864 639 -239 -1533 -1672 177 1249 919 -273 -652 189 660 -216 -813
1948 -813 -414 821 1515 466 -1183 -1352 -230 854 663 319 384 818 764 -589 -2106 -1948 -359 1329
1966 1329 1679 777 -29 665 193 -788 -1991 -1840 135 1739 2182 744 6 87 75 -935 -1708 -1204 228
1985 228 1565 1347 69 -993 -294 82 369 -872 -632 460 1353 560 -759 -1113 -442 1182 845 411
2003 411 -326 136 617 58 -1424 -1670 68 1618 1846 272 -274 -317 -28 -398 -1769 -1420 776 2339
2021 2339 1836 379 -1298 -1009 -409 -619 -1170 -574 716 2015 1933 88 -1140 -1366 -272 3 -788 -620
2039 -620 588 1670 1136 -497 -1302 -632 533 751 39 -517 214 877 207 -1128 -1133 -92 1449 1308
2057 1308 193 -940 -839 -394 -327 -1023 -797 735 1843 1761 113 -1540 -1270 -495 96 -247 -273 704 1865
2076 1865 1387 -686 -1898 -1684 -349 276 -176 78 1077 1587 1039 -732 -1799 -1238 -59 728 267 -183
2094 -183 212 796 542 -671 -1146 -466 990 1027 36 -1037 -777 -55 452 -507 -144 630 1153 1122 -665
2113 -665 -1824 -1651 -229 467 586 131 791 1356 897 -797 -2179 -1573 386 969 652 619 994 1109 440
2132 440 -1027 -2020 -1524 443 1366 833 -56 12 367 243 -1051 -1492 -516 996 1156 770 -901 -802 45
2151 45 380 -53 -113 253 966 904 -56 -1718 -1431 439 1231 873 553 302 464 91 -827 -2006 -1162 152
2171 152 1576 1281 471 112 152 52 -1295 -1934 -1038 517 1732 1331 -159 -249 -364 -144 -755 -1371 -663
2190 -663 747 1518 783 -596 -999 -211 183 190 -542 -289 487 1087 -265 -1261 -1180 213 1056 523 -215 -447
2210 -447 207 247 -439 -1363 -762 857 1736 1330 -108 -417 -192 -45 -868 -1161 -393 1281 2001 1374 -100
2229 -100 -1148 -478 -403 -394 -597 -180 1290 1845 771 -747 -1466 -529 -58 377 -420 -92 869 993 377 -1035
2249 -1035 -1078 -133 653 824 -39 -894 -8 567 -189 -1224 -771 467 1688 1070 -433 -1130 -787 -200 -102
2268 -102 -368 107 1085 1936 813 -585 -1527 -868 -85 88 -27 290 1157 1753 552 -1370 -1915 -1081 -40
2287 -40 516 292 190 916 1178 255 -1059 -1050 -317 669 794 -52 -326 140 179 173 -636 -790 334 1033 591
2308 591 -497 -1022 -440 310 79 245 81 654 911 505 -1004 -1655 -924 0 895 563 254 731 845
2327 845 -235 -1096 -1840 -1072 781 1107 843 54 681 510 -336 -1393 -1699 -301 745 1109 283 -184
2345 -184 -203 262 -21 -760 -1142 -10 963 877 -88 -710 -596 337 493 -190 -124 119 646 194 -887 -1430
2365 -1430 -847 901 919 547 170 78 165 -381 -1233 -1688 -394 1298 1604 990 -81 -168 -11 -400 -1203 -1312
2385 -1312 -44 1544 1557 677 -452 -451 -145 -365 -739 -930 69 1064 1045 52 -871 -661 84 300 -104 -364
2405 -364 -122 655 570 -357 -1009 -238 652 1114 538 -462 -544 225 69 -652 -887 -349 1520 1806 514 -538
2425 -538 -1057 -672 -354 -478 -660 323 1509 1812 637 -1256 -1182 -569 14 -289 -169 302 1520 1393 5
2444 5 -1056 -1362 -207 245 46 -249 15 632 459 -223 -789 -748 482 1018 652 -370 -538 259 36 -245
2464 -245 -837 -132 801 1266 316 -668 -1479 -822 76 -10 45 375 1216 1139 -101 -1083 -1478 -454 403 416 32
2485 32 196 860 927 6 -1397 -1358 -297 416 549 83 161 927 746 -65 -1423 -1067 148 921 661 -167
2505 -167 -496 -39 523 -327 -584 -421 751 1051 350 -576 -1098 -298 577 656 86 171 256 1052 -144 -1549
2525 -1549 -1313 -122 699 940 243 372 381 189 -620 -1587 -1323 -412 1364 1305 234 224 423 475 -581 -1641
2545 -1641 -1048 111 1112 1252 32 -530 -341 319 -148 -760 -312 454 1283 449 -568 -1301 -291 235
2563 235 428 136 -468 146 978 -215 -872 -1109 -171 1116 1092 449 -418 8 -89 -653 -1263 -1096 0 1562
2583 1562 1246 662 -400 -241 -197 -396 -937 -554 359 1514 1143 60 -729 -616 142 -26 -589 -422 476
2602 476 1170 596 -381 -882 -759 347 545 -87 -475 391 711 183 -489 -997 -73 962 1356 25 -569
2621 -569 -337 16 122 -713 -829 333 1305 1185 131 -844 -1114 -210 16 -305 -232 766 1423 1187 -436
2640 -436 -860 -1033 -273 87 -288 -289 646 1304 632 -740 -1025 -626 205 550 204 -315 -10 608 591 -421
2660 -421 -1055 -226 902 939 147 -444 -827 44 87 -515 -644 -16 865 835 -78 -1240 -1036 -49 27 111 102 443
2682 443 957 477 -193 -1265 -1393 -319 573 233 264 363 773 522 -826 -1557 -848 436 930 375 -120
2701 -120 -2 192 192 -552 -892 -512 404 959 430 -355 -870 450 649 18 -578 235 697 1076 -108 -1067
2721 -1067 -878 -232 562 547 -145 551 758 388 -535 -1325 -1035 366 1042 379 185 -145 426 73 -656 -1361
2741 -1361 -920 484 1278 683 -211 -533 73 26 -754 -1049 -354 884 1139 629 -287 -725 -142 350 -90
2760 -90 -493 -296 465 999 127 -730 -955 101 454 609 36 -5 50 457 -413 -1213 -666 473 1188 824
2780 824 68 -559 -151 -176 -738 -1061 -540 684 1404 736 -163 -580 -777 -96 -188 -769 -63 867 1469 648
2800 648 -759 -773 -458 -47 290 -297 -242 422 879 69 -800 -1003 -98 946 435 -199 -414 210 492 -114
2820 -114 -830 -878 334 1105 682 -154 -561 -272 -33 -386 -676 -294 910 1547 924 -492 -838 -593 79
2839 79 -44 -74 -106 705 1414 178 -978 -1236 -584 139 305 -417 96 758 1029 -19 -477 -990 -666 487
2859 487 553 45 -357 317 328 116 -385 -720 263 865 588 -186 -525 -395 562 177 -118 -311 470 1365 510
2880 510 -614 -1309 -770 84 506 362 36 200 791 257 -1011 -1265 -520 1030 801 1 -160 391 429
2899 429 342 -558 -1387 -506 565 800 283 45 -29 503 -110 -687 -658 -235 482 829 189 -862 -263 291
2919 291 525 -319 -563 12 523 828 -679 -1016 -498 238 739 458 -122 163 455 -17 -669 -988 -449 840
2939 840 769 341 15 244 170 185 -664 -1216 -421 1047 990 291 -301 -314 292 -172 -708 -1050 121 820 1001
2960 1001 187 -874 -369 -7 240 -80 -265 49 676 92 -305 -791 -434 324 655 35 -389 -220 459
2979 459 -15 -896 -619 -475 788 1336 264 -280 -385 -320 4 -622 -786 27 778 1151 340 -247 -829 -498
2999 -498 180 -275 -373 173 1152 1223 30 -809 -885 -177 192 -59 -534 142 886 175 -203 -1062 -502 347 1019
3020 1019 35 -368 -102 276 134 -361 -844 -209 539 991 556 -580 -852 -139 13 -138 -289 87 737
3039 737 1106 219 -1106 -1115 -373 175 236 -345 -7 830 1051 -49 -1037 -583 -55 541 74 -27 124 625
3059 625 429 -275 -1011 -627 19 690 544 -12 -51 234 285 168 -408 -325 405 489 297 -737 -599 -186 245
3080 245 210 -333 -7 649 773 -61 -1014 -1081 -98 351 440 206 113 837 542 -166 -1042 -1109 -2 702 632 289
3102 289 0 397 490 -177 -963 -476 560 1077 600 -181 -463 -265 154 173 -695 -764 19 870 397 -279 -759
3123 -759 3 178 153 -216 47 480 408 11 -812 -861 -160 787 624 252 70 259 393 -427 -840 -879 10
3144 10 825 1022 264 -273 -278 114 -425 -655 -492 392 964 1051 12 -516 -308 -151 7 -644 -192 519 745
3165 745 661 -412 -639 -144 288 82 -114 237 -144 445 315 -539 -685 76 350 606 13 -472 -158 76
3185 76 51 -367 -469 338 920 811 91 -401 -392 -244 27 -789 -365 489 1275 790 -135 -957 -573 -146 -75 -485
3207 -485 -131 572 1051 807 -206 -812 -457 289 556 243 -255 232 239 183 -553 -831 -248 552 477 25 -502
3228 -502 -281 369 79 -136 -744 81 783 730 112 -781 -795 233 -124 14 -95 328 1082 425 -158 -897
3248 -897 -838 214 259 -91 2 301 629 371 -225 -1009 -713 48 452 281 63 99 352 323 -395 -1052 -453
3269 -453 271 709 364 -332 -74 91 255 -309 -639 153 429 813 -9 -913 -594 70 248 227 -185 170
3289 170 663 469 -230 -544 -745 -309 878 288 161 71 418 -97 -526 -777 -715 119 851 459 -36 -67 161
3310 161 -167 -371 -581 -827 590 882 345 -221 -436 142 -48 -200 -532 -121 149 679 54 -727 -544 32
3330 32 471 23 -188 -105 504 274 -210 -1090 -820 -129 607 324 103 74 114 -6 -405 -836 -566 454 769
3351 769 1029 62 -278 -382 -171 -446 -615 -16 751 990 510 -324 -676 -389 -36 -192 -354 -81 351 893
3371 893 531 -478 -828 -148 308 244 -75 -68 130 94 -419 -380 -680 37 468 319 -86 -506 -165 27 -287
3392 -287 -525 -291 662 775 410 -425 -646 -595 58 -280 -401 -103 722 774 677 -195 -710 -402 -6 299 -285
3413 -285 -2 444 687 206 -314 -1029 -252 394 155 -58 -150 -96 579 140 -545 -341 -181 263 419 41 -497
3434 -497 -74 257 239 -319 -392 126 589 530 -252 -844 -262 91 119 20 -14 276 627 518 -367 -1072 -692 125
3456 125 316 106 424 29 486 80 -692 -751 -566 394 732 359 61 166 426 125 -501 -664 189 796
3476 796 663 94 -455 -133 75 259 -446 -304 21 591 509 -386 -502 -581 183 585 -70 103 355 437 124
3497 124 -502 -899 -552 322 564 513 -31 -77 260 -107 -747 -850 -172 382 777 363 163 -299 50 -271 -134
3518 -134 -544 -157 689 623 159 -532 -290 -43 505 26 -615 -107 403 308 -178 -710 -390 209 493 -136 -439
3539 -439 -347 128 61 -418 -833 -544 414 665 417 96 -3 205 -74 -511 -894 73 552 607 746 -138 -318
3560 -318 -197 105 -258 -419 -20 715 809 254 -356 -525 -206 341 85 159 -32 287 291 -178 -829 -512 73
3581 73 294 348 -206 -317 157 447 -145 -720 -165 617 634 414 -280 -625 -213 86 -134 -248 15 564 813
3602 813 303 -254 -704 -115 -168 -93 -58 154 498 656 -198 -553 -921 9 268 12 290 331 201 633 165
3623 165 -656 -812 233 407 483 -158 -20 105 125 241 -281 -453 257 438 8 -307 -286 -112 -63 214 -197
3644 -197 -113 262 982 383 -725 -899 -140 291 186 248 51 432 540 -16 -848 -1034 -155 220 581 27
3664 27 -98 253 149 -354 -779 -746 27 608 590 36 -434 6 335 -181 -428 -328 182 880 474 -320 -493
3685 -493 13 332 193 -109 3 113 588 -133 -628 -393 -61 307 209 182 -39 365 97 -196 -432 -665 -204
3706 -204 625 547 319 -190 -83 213 -238 -592 -512 -154 740 724 234 -519 -25 -13 150 -195 -534 436 593
3727 593 588 -19 -386 -244 76 190 -535 -349 132 553 141 -326 -490 -359 195 494 38 112 142 443 -59
3748 -59 -758 -739 -13 830 755 318 -548 -330 -222 -28 -184 -286 263 481 767 151 -542 -151 7 -163 -336
3769 -336 53 319 664 575 -432 -514 -523 70 152 -40 -88 120 811 525 -219 -628 -311 257 308 248 -163 -124 30
3792 30 300 -375 -272 -49 488 156 -121 -580 -440 22 86 -2 -173 150 443 460 -285 -784 -503 -304 202
3813 202 200 -82 256 499 370 -258 -580 -567 187 441 212 -24 222 579 281 -146 -688 -435 457 618 480
3834 480 -231 -484 222 233 -167 -304 -140 381 495 -97 -250 -221 97 171 -8 -152 37 353 477 -292 -619
3855 -619 -480 17 -4 73 -155 96 291 196 -49 -887 -846 22 606 406 330 -6 364 335 -479 -509 -528 139 462
3878 462 376 -224 -234 141 25 -207 -462 -320 533 -65 55 -504 -502 87 150 120 -136 -241 296 318 -410 -466 -405
3901 -405 17 219 359 31 -99 236 -2 -530 -655 -438 279 505 674 -32 -192 -52 122 -422 -561 -207
3921 -207 467 693 576 83 -243 -196 41 -309 -257 -123 337 529 14 -490 -223 31 105 -114 -17 -208 236
3942 236 261 -107 -528 -595 139 512 226 -130 -240 -366 -93 -6 -780 -503 -9 615 214 -199 -517 -174 -113
3963 -113 -360 -136 -125 488 518 201 -22 -540 -275 110 39 -283 -31 406 594 185 -402 -131 -278 137 133 -111
3985 -111 -206 63 445 -15 -389 -550 -230 340 425 -87 -164 -61 434 -135 -345 -92 204 581 355 -195 -614
4006 -614 -170 20 -11 -327 -111 351 863 294 -230 -526 -149 42 74 -68 -21 256 437 271 -525 -750 -241
4027 -241 89 459 618 -253 368 303 6 -654 -522 38 220 705 -175 -175 -11 207 97 -434 -108 354 601
4048 601 286 -350 -312 -183 105 200 109 -376 22 -37 198 -339 -572 -654 334 246 435 -175 84 268 -84 -630
4070 -630 -572 -130 170 617 -1 26 -78 -112 -275 -323 -564 -161 335 427 76 -195 -515 85 130 133 -569 25 470
4093 470 154 36 -231 103 -64 298 204 -241 -79 -68 195 -98 -260 -133 82 322 71 -129 43 -222 -102
4114 -102 -52 -562 -143 368 502 13 13 -219 -250 132 -150 -375 188 546 770 262 -199 -525 103 122 202 226
4136 226 -78 616 270 -15 -319 -339 -54 167 11 -221 -55 319 55 -261 -227 -361 194 313 255 -182 -299
4157 -299 -4 69 250 -346 146 384 639 19 -390 -403 64 193 -196 194 11 407 535 135 -539 -500 45
4178 45 59 -42 -75 83 452 361 -48 -427 -278 -122 527 215 -199 -53 294 397 -135 -563 -9 157 358
4199 358 497 -79 -285 52 -18 -93 247 -9 278 606 99 -309 -406 -55 268 79 -193 182 319 350 38
4220 38 -567 -730 -12 134 237 -140 105 367 269 2 -709 -380 -201 272 236 40 -58 113 183 -132 -620 -89
4242 -89 285 476 280 -416 -166 -14 424 300 -13 -200 176 144 -342 -220 -467 -173 278 116 -57 77 -1
4263 -1 210 14 -250 -431 -138 334 387 -185 -335 -41 -155 145 -543 -634 71 713 380 287 -202 -8 -20 215
4285 215 -469 -263 48 438 312 -71 -205 -298 198 227 -62 -574 243 435 290 -319 -362 -97 412 410 49 -35
4307 -35 60 320 290 -256 -542 68 327 383 -106 -215 127 -46 -260 -293 -187 -66 634 372 217 -405 -74 -13
4329 -13 -155 -285 -363 189 659 376 -32 -138 -595 13 70 216 -172 -64 375 352 -248 -422 -406 -12 301 -53
4351 -53 -368 -334 350 8 -123 -479 -338 348 680 111 70 -36 51 -22 -113 -424 26 205 522 13 -544 -232
4373 -232 -371 151 -188 10 267 319 680 85 -655 -329 -177 262 163 -174 -23 211 103 -100 -703 -418 201
4394 201 -23 79 -22 -169 10 -92 66 -113 29 440 644 243 -422 31 220 715 10 -240 -152 451
4414 451 198 62 -627 -189 -128 321 -35 -51 258 507 218 -305 -702 -358 88 283 422 -130 -254 514 161
4435 161 -166 -432 -396 174 162 0 -36 92 177 -55 -238 -273 -232 133 -1 185 -310 -105 -281 329 -138 -364
4457 -364 244 121 165 129 -305 -165 11 359 -46 38 136 61 -17 -326 -842 -234 230 224 270 -324 -198 165 158 -309
4481 -309 -520 274 297 617 218 -30 -53 -267 69 -411 -483 -29 5 236 144 168 -485 150 -189 279 22 25 266
4504 266 358 286 -258 -438 242 442 89 -256 -102 164 319 43 -429 -441 -146 569 516 58 -154 -8 -80 -410
4526 -410 -399 -58 415 685 386 -364 -490 -205 -94 -109 -476 24 127 727 460 -266 -426 -431 182 223 -260 -310
4548 -310 71 251 124 -256 -373 -151 332 143 97 -358 196 35 6 -170 -81 270 473 437 -193 -290 -99 213
4570 213 -98 -536 172 469 186 193 -151 -534 -408 47 549 -47 -71 177 407 275 -186 -416 -289 263 -222
4591 -222 312 -280 89 161 -55 -52 -297 -239 159 275 0 -277 -41 176 86 -454 -418 115 334 90 -334 -415
4613 -415 -387 220 128 -239 -346 73 307 -133 -248 -290 -321 183 184 -174 -119 -49 469 -52 -12 -635 -451 205 84
4636 84 168 -143 83 179 68 -305 -501 -651 154 375 146 -497 51 164 328 -139 -547 -198 195 176 -60
4657 -60 -237 -44 37 -125 89 -377 -38 454 253 -154 -223 -488 15 314 415 39 89 395 247 -211 -637
4678 -637 -222 261 550 101 -171 -356 -23 -9 -131 -439 169 435 152 76 -210 -665 123 90 -3 -122 -58 390
4700 390 544 -115 -356 -293 160 -84 -44 -428 223 174 316 -344 -478 -345 136 435 -61 -147 -293 -76 -10 -75
4722 -75 -534 48 155 373 256 94 -28 -174 107 -65 58 4 3 295 -269 -278 -610 -116 -80 -348 -216 140
4744 140 283 396 157 -140 -490 -29 276 25 -222 -212 -119 617 53 -61 -525 246 430 -46 -143 -270 -66
4765 -66 189 -369 -87 -232 345 359 140 -184 -210 138 195 306 -326 -292 96 375 -257 -565 -358 -81 96 486
4787 486 -112 -273 118 339 -9 -75 -255 62 158 187 -32 10 48 162 -178 -40 -178 64 361 135 33 -208
4809 -208 48 95 137 -211 -79 376 256 -47 -320 -170 -1 16 6 195 167 180 278 310 -423 -271 -121 295 388
4832 388 64 105 -203 338 -56 -240 -138 146 415 268 76 -469 -286 -186 -39 -380 -406 -178 396 181 77
4853 77 -432 -171 -25 150 -21 -213 314 199 140 28 -431 132 -68 -18 169 -128 325 335 -163 46 -558
4874 -558 -192 141 203 175 192 -209 -425 -81 -353 -560 49 61 221 180 -225 42 -88 -155 -15 -293 219 348
4896 348 -90 33 -238 -165 -260 167 -87 50 141 154 207 -163 -331 -251 384 303 -55 -124 25 126 -123 -237 -241
4919 -241 -40 46 185 99 -213 104 43 128 -141 -71 243 205 336 8 -424 -56 -59 79 -354 -152 -70 258 195
4942 195 47 -86 -151 -19 -318 98 90 145 143 66 -253 -552 -354 202 551 610 -144 -220 187 477 -567 -416 -165
4965 -165 429 332 38 -265 -231 3 60 -169 -17 352 420 112 -20 -122 -48 -18 235 63 3 188 308 399 -229
4988 -229 -444 -488 -217 363 322 40 146 178 -52 -549 -168 -298 -97 52 162 -22 32 -48 -149 99 -366 -422
5010 -422 37 327 179 102 -168 1 76 -236 -35 -191 523 356 189 -114 -135 154 353 102 -325 -36 53
5031 53 183 -81 -413 -64 -12 423 353 31 -13 57 68 -385 -499 -206 -6 475 163 -53 -279 63 -319 285
5053 285 -327 130 332 185 451 -41 -243 -57 -17 -76 -136 -258 157 195 25 -218 -5 -104 137 195 181 -324
5075 -324 73 49 34 -244 -41 -69 141 82 48 -142 -50 -154 36 -240 113 -85 379 352 31 -80 79 -132
5097 -132 151 -82 -72 312 294 282 -103 -580 -241 -40 120 -108 29 133 87 261 -39 -164 -20 142 37
5118 37 -75 -79 -33 82 4 -124 -87 43 378 334 -132 -300 -113 90 -90 -292 -132 274 166 200 -102 12 188
5141 188 156 -13 94 -122 66 103 12 50 -462 86 22 2 -43 -187 37 270 34 -247 -226 -68 271 201 -11
5164 -11 -299 405 -110 -151 3 -66 -210 65 8 198 -281 -112 -20 -99 -226 -102 45 6 155 -36 -113 -56 -401
5187 -401 -35 -269 -74 28 345 104 -222 -761 -306 592 103 -72 76 -131 -28 33 291 -17 -228 -29
5207 -29 188 -117 253 -121 69 -76 58 -58 19 130 336 238 -441 -27 36 135 70 -25 298 246 -14 -397 -119
5230 -119 -240 11 394 -33 69 -148 34 7 109 -88 -38 119 148 165 -30 -76 -234 35 -303 -270 -46 3
5252 3 216 312 76 -218 -180 -152 -17 -149 -88 71 140 143 356 -165 -180 153 107 -142 -28 322 58 -180 -310 -205
5276 -205 -67 14 106 -179 -97 2 86 170 -295 -70 199 304 10 1 10 -86 -255 -246 -214 224 62 461 71 -287 -99
5301 -99 39 -94 135 -116 -379 261 411 174 125 -270 -176 216 168 -111 170 -67 287 -20 -274 -120 -182 497
5323 497 170 -130 -242 95 -217 -281 -60 -239 6 289 168 155 -72 -115 71 50 74 -8 487 235 284 -119
5345 -119 40 -544 -168 -88 126 225 550 344 -36 -351 -353 125 115 40 -175 -63 287 138 -267 -353 -246 -201 97
5368 97 36 -17 -219 -188 362 218 -279 -278 -193 231 54 -41 -585 45 197 80 109 -173 -185 272 25 -43 -427 -283
5392 -283 69 360 68 34 357 383 -79 45 -380 -289 131 249 105 273 23 24 -137 -132 -98 -71 -33 242 308 -149
5416 -149 384 237 -38 -336 100 223 133 286 113 187 -163 308 202 176 27 -23 275 132 -212 -175 2 325
5438 325 248 270 -135 -44 -9 -417 -309 -213 107 -25 205 -244 -59 -327 -114 220 16 -108 181 -93 494 110
5460 110 -360 -296 199 -57 -282 -329 -44 18 68 251 -72 -21 282 444 208 15 -68 -183 -79 -181 -140 -83 -105
5483 -105 -13 22 -233 -136 321 173 -216 -202 174 307 397 45 -74 49 161 244 -246 -45 -353 93 337 12
5505 12 180 -364 57 88 54 -175 -67 339 187 11 -162 -414 -40 374 -8 98 -190 230 429 -111 -242
5526 -242 -253 86 9 39 110 -136 -85 29 228 -289 149 -185 314 41 -117 -222 -194 -100 239 -289 99 126 290
5549 290 -101 -417 -98 166 -49 -150 -182 -75 54 84 -186 -332 -27 102 -1 227 244 187 129 61 -157 -411
5571 -411 -222 -38 130 -7 137 -5 -59 98 -93 -181 10 -87 337 -296 -372 -151 -240 -53 -40 108 258 184
5593 184 232 -83 -99 13 -39 5 30 -104 -95 -118 211 -99 -493 -190 -274 257 -11 243 -280 -397 158 -144 -30
5616 -30 -108 51 310 176 -263 -470 -170 -150 -70 -168 -78 169 45 -20 -216 -394 51 231 13 173 23 40 312
5639 312 25 -354 12 -79 171 198 -2 -236 -25 -36 175 -433 -287 201 412 157 -2 -334 -183 126 -35
5660 -35 78 -42 345 527 404 45 -16 -93 -145 -56 -189 -112 147 155 -77 116 -217 154 261 53 29 -221 -239
5683 -239 -182 92 -84 -120 169 64 138 -250 23 -426 46 -67 -116 8 -71 370 254 -56 -167 -131 -25 397
5705 397 -120 -128 91 178 294 -281 -204 -28 89 224 -221 -50 215 177 -354 -222 41 -186 -61 63 37 144
5727 144 174 42 165 -260 199 212 237 183 19 -203 -226 157 5 -247 192 87 46 259 -18 -209 8 -117
5749 -117 122 144 -47 70 108 -45 -184 -230 -156 -103 184 -129 82 -25 285 162 -169 -380 -150 89 -42 189
5771 189 27 40 177 -85 -61 -175 -25 -41 195 103 -214 -164 132 91 -134 -213 -31 102 -89 -64 89 -200 -55
5794 -55 36 -105 -111 -57 234 146 -249 178 143 57 98 -2 -235 -217 -112 -155 -266 -289 -161 22 58 201 -164 14
5818 14 -199 -149 70 -103 104 -5 28 102 -285 -97 -64 -21 55 3 217 158 130 152 -175 -327 -177 30 225 32
5842 32 -84 -113 74 -13 -313 -217 -280 -11 -10 -107 -39 114 13 168 -38 -14 429 -103 183 -290 -335 -12 234 -381
5866 -381 163 0 182 425 54 -284 -159 80 387 212 -94 -129 144 76 59 -232 -141 60 108 21 -66 -156 -209
5889 -209 244 -160 -35 -309 135 239 114 -312 71 96 352 -338 -156 -139 17 -3 88 -74 -144 237 -126 -117
5911 -117 155 -40 240 524 -173 -204 -343 -262 29 -265 -266 45 199 178 -119 -164 -76 -48 114 388 81 428 71
5934 71 -166 -28 -231 -185 105 75 -321 -55 -151 -250 -60 -125 10 -507 32 5 157 114 -18 -44 8 -296 21
5957 21 -141 -55 380 -177 -24 -115 -135 117 492 -252 -33 203 2 -208 -276 -97 146 -4 -225 52 -118 -81
5979 -81 183 217 -137 -384 -226 -62 244 -23 -280 82 80 -49 -21 -84 132 -23 -28 30 -270 55 162 299 333
6002 333 67 19 369 116 -98 -196 71 318 -277 106 -133 -152 97 41 -100 -152 -216 388 109 62 9 150 117
6025 117 -89 55 24 143 -113 124 144 -21 -131 -139 -149 -6 76 -38 -10 109 -151 -214 87 197 220 -43 -89
6048 -89 101 -64 -124 36 -103 21 -66 535 -84 -67 -147 -101 -84 -8 380 -77 157 244 -107 -82 -258 155 363
6071 363 -263 -102 43 77 128 62 -94 131 114 -153 282 -68 170 44 232 217 -278 -35 -20 255 -4 288
6093 288 -220 -161 211 44 -353 194 268 28 211 103 -27 275 204 71 -130 10 198 -219 6 -244 -85
6114 -85 -422 49 22 -48 88 80 30 -175 -347 -21 -177 -135 30 41 84 10 146 -31 -248 144 57 51 29 11 15 -101
6140 -101 157 66 -214 78 -106 260 121 14 25 202 -77 99 155 -80 107 239 215 -38 -206 4 169
6161 169 26 -5 -337 54 -110 -88 -111 -42 238 202 141 -355 93 100 -79 -162 -64 268 7 140 -18 -278 88
6184 88 -37 -102 47 100 -7 -201 123 85 -15 -177 -184 -27 186 91 -109 -68 303 12 -158 -290 -219 -67 184
6207 184 -210 -86 -129 -24 11 -372 -28 219 116 123 34 22 97 -150 -95 -207 -189 16 337 228 11 248 -25
6230 -25 208 -48 -70 -77 -223 399 -17 207 -19 -288 -134 -93 41 -166 236 219 67 -105 -253 -36 253 20
6252 20 -18 -222 -126 252 -114 -294 119 -397 -142 82 -116 48 -246 3 90 -1 38 -77 -238 220 -88 17
6274 17 -18 74 82 -146 -199 60 82 28 -150 -252 42 144 66 95 -127 71 174 -39 -52 -160 -139 310 267 88
6298 88 162 -99 -8 108 -75 -378 37 -79 98 219 -188 -141 -143 -330 -173 -126 -83 360 191 -119 14 134 337
6321 337 -40 170 74 0 -104 -181 -198 -118 -120 102 -8 196 -71 77 231 -40 415 6 -156 68 132 290 81
6344 81 -179 -71 51 -32 14 203 -157 -68 218 -270 -213 9 15 -121 -19 -95 214 -151 41 17 -187 199 40
6367 40 242 -156 -83 -50 -7 -104 -113 23 -179 115 217 -181 -67 -116 -144 -49 -120 71 377 84 41 192 82 27
6391 27 -11 -135 -61 -191 267 54 33 4 -37 37 -30 -89 -124 339 292 250 225 -144 -100 -231 24 139 -121 -146 -221
6416 -221 246 -43 -96 94 -64 -130 144 -219 -344 -27 -59 -86 -255 143 212 178 149 -7 -62 -383 -108 -53 -14
6439 -14 104 16 -24 -110 -54 -93 124 92 38 66 196 108 -272 -106 -52 -80 -69 242 -234 192 -177 287 79 82 -21
6464 -21 -7 -166 -21 133 -287 -197 -217 -43 -307 -239 2 159 11 -24 -72 -372 -177 42 47 224 -70 36 397
6487 397 114 -191 -154 64 316 -10 59 -96 106 -38 -96 -32 34 -55 42 222 281 -185 116 78 21 155 -132
6510 -132 181 234 -148 1 83 -462 18 453 -94 -231 54 172 373 72 -131 -351 46 48 -102 72 -39
6531 -39 -60 -110 39 42 -146 -196 -129 -171 -347 -310 217 137 112 -317 -184 255 257 -353 -307 172 202 -70 -57 -169 -159 254
6557 254 336 -87 -218 -94 -80 57 -11 -69 -3 -92 -43 -278 -289 1 12 241 -515 -56 9 210 119 306 -77 157
6581 157 363 -16 -46 277 -210 93 -15 -216 -11 101 -22 84 -127 -202 79 82 -98 27 89 119 101 114 -149
6604 -149 -95 -63 123 -30 -136 -211 -106 -74 -77 -221 -351 -96 62 26 17 -50 110 100 100 238 -178 -151 98 320 -114
6629 -114 17 -93 -139 15 -205 -169 66 9 -178 102 -132 97 39 48 -354 -94 -279 -19 203 -127 -120 -139 -22
6652 -22 -78 -351 79 88 -27 73 -46 -68 -16 -112 -70 187 -4 17 139 -82 -24 -205 -38 -67 -27 -78 43 -226
6676 -226 0 352 29 -108 64 144 96 -57 -112 -111 183 95 -65 -214 -18 95 278 220 -23 288 -82 81
6698 81 196 -79 86 374 -248 -232 -261 -74 69 66 173 143 303 226 223 -96 186 46 40 224 -61 -152 -18 87
6722 87 127 248 78 -110 -44 -157 205 -280 -31 -184 74 102 -122 -87 -47 78 -78 -21 -94 -58 -24 204 139 -10
6746 -10 49 7 -139 -158 -7 56 142 -68 -17 -165 -305 -50 14 -52 169 213 18 -150 142 81 144 97 -179 3
6770 3 78 250 -19 259 -77 -395 147 -7 233 187 -176 -38 110 188 -127 -199 -83 28 -194 175 -23 303
6792 303 186 -71 -50 220 -10 -25 93 -162 73 256 35 -84 -51 -182 -182 102 -120 -233 -318 111 -136 29
6814 29 27 -406 27 -107 -17 -395 -277 87 -73 -140 9 -267 51 205 -38 -32 21 178 185 8 28 74 -81 -3
6838 -3 140 -205 -96 -143 73 -67 -93 -4 37 -49 57 -39 -183 119 -186 534 103 -218 -121 186 119 -18 -331
6861 -331 85 187 61 -407 -205 -81 -112 -355 21 -48 94 414 31 -63 -30 58 61 -5 53 -244 16 442 57
6884 57 36 -101 196 110 86 -30 -359 13 -27 60 118 -43 -142 210 -89 -43 74 12 -99 48 -265 144 121 -20
6908 -20 137 -41 -147 67 159 19 141 -415 -37 40 137 -207 -270 55 -38 100 -103 137 120 -167 313 -57
6930 -57 -92 70 22 -62 -111 174 -72 189 -124 451 -60 386 314 -129 -154 -398 58 -2 125 251 132 58 95
6953 95 191 64 -164 -3 261 30 216 69 -109 -35 -58 22 -20 11 -131 216 -97 9 -233 365 292 -47 -390
6976 -390 -101 145 288 -103 -555 -30 -134 46 -100 -77 -197 130 -39 -171 -155 -174 179 407 251 75 -48
6997 -48 -191 -70 -156 232 -271 -209 28 208 116 -40 132 -189 -78 -75 32 177 138 -96 -354 -94 171 104 66
7020 66 103 -227 -22 68 -256 55 -62 131 348 -107 242 -245 103 203 157 -61 -22 133 20 -55 -73 -79 -158
7043 -158 258 -79 4 118 -103 -63 -30 -66 79 15 358 78 -69 207 10 20 99 103 36 6 -49 1 53 209 172
7068 172 272 283 167 54 64 186 -21 -108 63 10 21 -111 -153 363 150 -31 -123 211 63 180 188 -173 -107
7091 -107 -130 -143 100 -127 212 -132 -325 63 79 250 -127 77 -53 40 -160 -121 -83 38 83 243 -356 -369 -280
7114 -280 -161 162 -222 -398 183 116 -173 -416 -277 -55 -147 190 -262 113 -248 -28 116 -94 -200 -13 -250
7135 -250 249 97 63 81 -174 -261 -246 -279 80 20 203 117 79 -111 -75 -382 240 122 -37 25 272 66 -24 -107
7159 -107 115 216 -358 45 -78 61 -86 -92 -79 221 25 189 -112 -61 119 -82 73 20 -207 133 -178 -132
7181 -132 -54 -60 -218 -3 -9 -129 95 -106 24 54 -107 -93 202 -235 77 103 38 230 21 -280 63 -152 156
7204 156 19 175 9 -54 23 282 217 -160 -129 -75 226 148 27 -211 108 111 -106 -206 113 119 -74 250 -107
7227 -107 -144 164 -148 -228 -78 5 252 141 329 -78 138 -42 -84 16 -406 68 42 332 -115 -251 -97 -172
7249 -172 34 -119 -374 -49 220 212 -236 269 72 -50 -5 10 73 244 85 52 135 -29 -58 -94 136 293 -288
7272 -288 -327 -204 -130 73 -74 -29 -57 -172 -130 -136 -97 -45 112 88 -73 -8 208 -6 -25 -250 -212 -147 -12 223 234
7297 234 -302 111 36 15 305 156 192 -11 -34 -1 -69 153 159 238 -68 -143 106 116 156 -80 -122 198 172 -55 -359
7322 -359 -212 301 139 -167 11 -237 27 31 27 101 -82 -96 132 42 -108 148 221 19 108 131 136 -124 -13 32
7346 32 26 244 31 188 216 -180 -256 172 72 -27 68 23 246 72 -111 57 -11 -122 66 -32 -57 30 48 -43 -75
7371 -75 -145 6 51 -106 -133 -67 -74 -136 83 144 -20 43 29 46 44 -18 -146 192 50 -49 -177 10 -100 296 97
7396 97 -135 339 14 -119 4 0 101 273 123 -46 93 -212 136 43 87 -382 -28 -23 -39 65 118 -336 216
7419 216 434 286 -107 -125 21 148 -86 -138 -252 66 181 151 241 89 -161 -202 268 -142 106 48 591 306
7441 306 -28 -119 -24 -141 133 -31 166 -171 -140 25 -266 157 37 -99 199 -161 210 30 182 162 -219
7462 -219 116 -160 92 299 231 -215 -31 -41 -11 -104 19 -28 263 216 -250 -181 99 -2 66 15 -32 -1 199 22
7486 22 197 -175 12 35 256 5 -201 -59 63 -187 96 136 22 -216 -12 59 45 200 95 37 -78 -270
7508 -270 -365 -207 52 26 274 -139 100 136 241 -28 66 57 -118 -142 71 203 -221 228 -173 -83 -211 -200 101
7531 101 280 36 -38 60 107 150 129 -106 102 -111 387 33 -50 137 -178 62 101 25 69 135 -182 255 77
7554 77 -336 246 44 -155 75 -219 -136 -145 92 132 31 150 36 92 -7 -230 196 111 -30 -250 302 205 73
7577 73 236 139 -75 255 117 -195 -73 -180 106 -60 -82 -319 -176 24 328 -182 -199 130 296 108 -88
7598 -88 162 84 -219 -75 -110 -18 62 121 193 102 140 -98 128 255 29 -65 166 298 104 -156 -108 32 101 8
7622 8 344 -217 14 232 24 177 -159 19 128 -38 -277 97 88 -188 39 -193 183 65 -150 441 140
7643 140 -293 110 -49 198 -192 -341 183 -70 3 -20 -73 262 -191 79 221 -238 -2 80 210 124 2 -133
7665 -133 72 472 -26 223 99 -9 148 -72 265 27 144 98 7 77 181 -110 -83 269 -5 -411 19
7686 19 86 -312 -2 176 -99 239 124 217 -138 -260 9 -160 -133 345 3 80 101 -40 -74 166 487 150
7708 150 111 -427 160 58 98 71 99 177 -93 -118 58 125 9 182 -120 183 -97 370 -167 -358 129 -268
7730 -268 -56 -253 201 31 -205 120 96 -54 102 -147 -9 19 -198 190 298 -109 140 -120 -102 -89 141
7751 141 214 54 23 -53 22 6 163 -25 54 -6 -106 423 -117 215 -37 161 162 -171 -64 112 -68 1 -219
7774 -219 -4 -26 -41 290 24 126 290 175 -138 -76 -190 46 -110 30 -244 41 169 -85 -384 -225 -36
7795 -36 109 27 -36 -169 -397 -159 -178 -63 -76 248 120 328 7 122 -393 -48 -65 158 -45 326 -110 379
7817 379 -198 -20 51 -242 363 352 -195 -188 -26 99 171 -89 -204 -137 -37 -3 215 6 8 -174 106 -246 -422
7840 -422 -116 65 14 55 -212 -82 -214 109 -75 -67 -49 6 237 -144 -36 -240 329 101 -159 -102 -61 1 -182
7863 -182 -167 292 102 289 117 -319 185 -14 421 120 107 -251 -3 -56 -68 182 185 -158 132 -83 27 -139
7885 -139 -37 -64 5 121 18 -124 17 199 285 -137 52 40 -18 84 -15 36 230 130 -200 -39 7 -117 -57
7908 -57 -72 11 201 -12 294 208 -226 -105 40 224 -334 -304 201 107 23 24 -274 71 -54 -73 -57 -84 -62 -126 32
7933 32 93 -77 -201 32 251 -163 -197 90 -2 -28 54 235 -321 -120 -59 -186 122 -198 40 -156 106 80 -406
7956 -406 152 -33 292 9 117 96 -162 13 -120 -230 139 362 36 -83 -66 32 -67 290 -355 35 79 127
7978 127 -46 5 -157 49 56 40 191 -91 34 -31 -106 -50 264 -76 22 93 54 -100 6 -153 -20 172 -129
8001 -129 -35 -31 144 -34 -121 -102 62 -82 154 4 119 13 158 -102 156 -112 111 195 -124 -94 -127 -22 -14
8024 -14 -35 86 4 194 117 -371 261 -259 -118 -270 66 -164 7 56 -40 -78 75 -259 -74 193 18 -158
8046 -158 -136 46 29 -30 148 -106 218 -15 179 120 -140 85 -221 155 -119 -123 167 233 49 -10 199 -58 72
8069 72 40 170 -92 351 -136 -86 -94 250 372 -134 -299 49 -112 128 -233 164 19 -170 -237 -74 227 -61
8091 -61 -203 173 60 -1 -167 -68 -48 52 32 -54 -22 -136 116 148 -152 14 43 354 257 1 -26 89 -112 111
8115 111 -54 -123 409 -22 60 236 -161 29 -415 -145 -159 -229 -150 221 35 -213 318 -64 -3 24 15 -61 144
8138 144 -114 382 -115 -58 154 74 -151 -101 363 427 204 97 -97 38 -244 -75 141 39 33 -3 -215 67
8160 67 -45 -334 189 198 -52 -3 -360 229 8 -99 106 -169 179 152 -209 96 -272 -22 12 -137 229 -231
8182 -231 3 -13 -135 175 118 165 121 365 268
8191B68
##END NTUPLES=NMR FID
##END=
