##TITLE=1H_EC-3188(1)
 CDCl3,8 sc, 
 11.4.2019
##JCAMPDX= 6.0         $$ Bruker NMR JCAMP-DX V2.0
##DATA TYPE= NMR FID
##DATA CLASS= NTUPLES
##ORIGIN= UXNMR, Bruker Analytische Messtechnik GmbH
##OWNER= root
$$ XWIN-NMR		Version 3.5
$$ Thu Apr 11 14:33:05 2019 Russian Standard Time (UT+4h)  she@DPX200
##.OBSERVE FREQUENCY= 200.1315
##.OBSERVE NUCLEUS= ^1H
##.DELAY= (6, 6)
##.ACQUISITION MODE= SIMULTANEOUS
##.ACQUISITION SCHEME= undefined
##.AVERAGES= 8
##.DIGITISER RES= 18
##SPECTROMETER/DATA SYSTEM= spect
##.PULSE SEQUENCE= zg30
##.SOLVENT NAME= CDCl3
##.SHIFT REFERENCE= (INTERNAL, CDCl3, 0, 15.7039)
##AUDIT TRAIL= $$ (NUMBER, WHEN, WHO, WHERE, WHAT)
$$ ##TITLE= Audit trail, XWIN-NMR		Version 3.5
$$ ##JCAMPDX= 5.01
$$ ##ORIGIN= Bruker BioSpin GmbH
$$ ##OWNER= she
$$ F:/spectra/data/she/nmr/H-F/1/audita.txt
$$ ##AUDIT TRAIL=  $$ (NUMBER, WHEN, WHO, WHERE, WHAT)
(   1,<2019-04-11 14:30:55.64 +0400>,<she>,<DPX200>,
      <created by zg, POWCHK disabled, PULCHK disabled
       configuration hash MD5:
       00 E9 B6 7A A2 85 ED C7 34 08 36 98 17 FE 4E 26
       data hash MD5: 16K
       50 1C 79 3C 68 81 4E BE 93 AF 6E 44 A4 89 DC 19>)
$$ ##END=
$$ 
$$ hash MD5
$$ C7 88 53 1C C1 B0 4C 44 55 CA 93 DC F4 83 13 70
##$RELAX= 
##$RELAX= 
##$RELAX= 
##$RELAX= 
##$RELAX= 
##$RELAX= 
$$ Bruker specific parameters
$$ --------------------------
##$DU= <F:/spectra>
##$EXPNO= 1
##$NAME= <H-F>
##$PROCNO= 1
##$TYPE= <nmr>
##$USER= <she>
##$AMP= (0..31)
100 100 100 100 100 100 100 100 100 100 100 100 100 100 100 100 100 100 
100 100 100 100 100 100 100 100 100 100 100 100 100 100 
##$AQSEQ= 0
##$AQ_mod= 1
##$AUNM= <au_zg>
##$AUTOPOS= <>
##$BF1= 200.13
##$BF2= 200.13
##$BF3= 200.13
##$BF4= 200.13
##$BF5= 200.13
##$BF6= 200.13
##$BF7= 200.13
##$BF8= 200.13
##$BYTORDA= 1
##$CFDGTYP= 0
##$CFRGTYP= 5
##$CHEMSTR= <none>
##$CNST= (0..31)
1 1 145 1 1 1 1 1 1 1 1 1 1 1 1 1 1 1 1 1 1 1 1 1 1 1 1 1 1 1 1 1 
##$CPDPRG= <>
##$CPDPRG1= <>
##$CPDPRG2= <>
##$CPDPRG3= <>
##$CPDPRG4= <mlev>
##$CPDPRG5= <mlev>
##$CPDPRG6= <mlev>
##$CPDPRG7= <mlev>
##$CPDPRG8= <mlev>
##$CPDPRGB= <>
##$CPDPRGT= <>
##$D= (0..31)
0 1.2 0 0 0 0 0 0 0 0 0 0.03 0 0 0 0 0 0 0 0 0 0 0 0 0 0 0 0 0 0 0 0 
##$DATE= 1554978655
##$DBL= (0..7)
120 120 120 120 120 120 120 120 
##$DBP= (0..7)
150 150 150 150 150 150 150 150 
##$DBP07= 0
##$DBPNAM0= <>
##$DBPNAM1= <>
##$DBPNAM2= <>
##$DBPNAM3= <>
##$DBPNAM4= <>
##$DBPNAM5= <>
##$DBPNAM6= <>
##$DBPNAM7= <>
##$DBPOAL= (0..7)
0.5 0.5 0.5 0.5 0.5 0.5 0.5 0.5 
##$DBPOFFS= (0..7)
0 0 0 0 0 0 0 0 
##$DE= 6
##$DECBNUC= <off>
##$DECIM= 24
##$DECNUC= <off>
##$DECSTAT= 4
##$DIGMOD= 1
##$DIGTYP= 9
##$DL= (0..7)
0 120 120 120 120 120 120 120 
##$DP= (0..7)
150 150 150 150 150 150 150 150 
##$DP07= 0
##$DPNAME0= <>
##$DPNAME1= <>
##$DPNAME2= <>
##$DPNAME3= <>
##$DPNAME4= <>
##$DPNAME5= <>
##$DPNAME6= <>
##$DPNAME7= <>
##$DPOAL= (0..7)
0.5 0.5 0.5 0.5 0.5 0.5 0.5 0.5 
##$DPOFFS= (0..7)
0 0 0 0 0 0 0 0 
##$DQDMODE= 0
##$DR= 18
##$DS= 0
##$DSLIST= <SSSSSSSSSSSSSSS>
##$DSPFIRM= 0
$$ [...]
##$SUBNAM2= <"">
##$SUBNAM3= <"">
##$SUBNAM4= <"">
##$SUBNAM5= <"">
##$SUBNAM6= <"">
##$SUBNAM7= <"">
##$SUBNAM8= <"">
##$SUBNAM9= <"">
##$SW= 24.9337058887773
##$SWIBOX= (0..15)
0 0 2 0 0 0 0 0 0 0 0 0 0 0 0 0 
##$SW_h= 4990.01996007984
##$TD= 16384
##$TD0= 1
##$TE= 0
##$TE2= 300
##$TE3= 300
##$TEG= 300
##$TL= (0..7)
0 120 120 120 120 120 120 120 
##$TP= (0..7)
150 150 150 150 150 150 150 150 
##$TP07= 0
##$TPNAME0= <>
##$TPNAME1= <>
##$TPNAME2= <>
##$TPNAME3= <>
##$TPNAME4= <>
##$TPNAME5= <>
##$TPNAME6= <>
##$TPNAME7= <>
##$TPOAL= (0..7)
0.5 0.5 0.5 0.5 0.5 0.5 0.5 0.5 
##$TPOFFS= (0..7)
0 0 0 0 0 0 0 0 
##$TUNHIN= 0
##$TUNHOUT= 0
##$TUNXOUT= 0
##$USERA1= <user>
##$USERA2= <user>
##$USERA3= <user>
##$USERA4= <user>
##$USERA5= <user>
##$V9= 5
##$VALIST= <valist>
##$VCLIST= <CCCCCCCCCCCCCCC>
##$VD= 0
##$VDLIST= <DDDDDDDDDDDDDDD>
##$VPLIST= <PPPPPPPPPPPPPPP>
##$VTLIST= <TTTTTTTTTTTTTTT>
##$WBST= 1024
##$WBSW= 4
##$XGAIN= (0..3)
0 0 0 0 
##$XL= 0
##$YL= 0
##$YMAX_a= 104142
##$YMIN_a= -163351
##$ZGOPTNS= <>
##$ZL1= 120
##$ZL2= 120
##$ZL3= 120
##$ZL4= 120
##$ABSF1= 10
##$ABSF2= 0
##$ABSG= 5
##$ABSL= 3
##$ALPHA= 0
##$AQORDER= 0
##$ASSFAC= 0
##$ASSFACI= 0
##$ASSFACX= 0
##$ASSWID= 0
##$AUNMP= <proc_1d>
##$AZFE= 0.1
##$AZFW= 0.1
##$BCFW= 1
##$BC_mod= 2
##$BYTORDP= 1
##$COROFFS= 0
##$CY= 11.3945322036743
##$DATMOD= 1
##$DC= 2
##$DFILT= <>
##$DTYPP= 0
##$F1P= 18.9103706918063
##$F2P= -1.10871071338519
##$FCOR= 0.5
##$FTSIZE= 0
##$FT_mod= 4
##$GAMMA= 1
##$GB= 0.15
##$INTBC= 1
##$INTSCL= 1
##$ISEN= 128
##$LB= 0.24
##$LEV0= 0
##$LPBIN= 0
##$MAXI= 10000
##$MC2= 0
##$MEAN= 0
##$ME_mod= 0
##$MI= 1.114404
##$NCOEF= 0
##$NC_proc= 0
##$NLEV= 6
##$NOISF1= 3.799351
##$NOISF2= 2.8
##$NSP= 1
##$NTH_PI= 0
##$NZP= 0
##$OFFSET= 15.70392
##$PC= 1
##$PHC0= -8860.661
##$PHC1= 25.40026
##$PH_mod= 1
##$PKNL= yes
##$PPARMOD= 0
##$PSCAL= 0
##$PSIGN= 0
##$REVERSE= no
##$SF= 200.130013532006
##$SI= 16384
##$SIGF1= 3
##$SIGF2= 2
##$SINO= 400
##$SIOLD= 16384
##$SREGLST= <1H.CDCl3>
##$SSB= 0
##$STSI= 0
##$STSR= 0
##$SW_p= 3612.71676300578
##$SYMM= 0
##$S_DEV= 0
##$TDeff= 0
##$TDoff= 0
##$TI= <>
##$TILT= no
##$TM1= 0
##$TM2= 0
##$TOPLEV= 0
##$USERP1= <user>
##$USERP2= <user>
##$USERP3= <user>
##$USERP4= <user>
##$USERP5= <user>
##$WDW= 1
##$XDIM= 8192
##$YMAX_p= 0
##$YMIN_p= 0
$$ End of Bruker specific parameters
$$ ---------------------------------
##NTUPLES= NMR FID
##VAR_NAME=  TIME,          FID/REAL,        FID/IMAG
##SYMBOL=    X,             R,               I
##VAR_TYPE=  INDEPENDENT,   DEPENDENT,       DEPENDENT
##VAR_FORM=  AFFN,          ASDF,            ASDF
##VAR_DIM=   8192,          8192,            8192
##UNITS=     SECONDS,       ARBITRARY UNITS, ARBITRARY UNITS
##FACTOR=    0.0002004,     1,               1
##FIRST=     0,             0,               0
##LAST=      1.6414764,     0,               0
##MIN=       0,             -163351,         0
##MAX=       1.6414764,     104142,          0
$$ Real data points
##PAGE= N=1
##DATA TABLE= (X++(R..R)), XYDATA
0@%%%%%%%qJ6j6J6j6K4l2M0m8N6o7P6r0J06j26J49j71J96k26K59k95L35l80M29
31B27m81N40o05O76p55Q40r33J037j151J276j414J565j733J919k127K362k628
48a385K932l282L690m174M763n495O432p681R440j2127J6794k7164R1268m7917
62B6094j63858J12726J07594l8691j05117L5637Q3166o22q9578j8458O9331M9319
74F7543m7693m8265R662K6152r542r321J0458K4040Q028k5298m1425J1264N0012
87B5615M571m9663j0049L5330L636k9878O326L5314K159l6908j3683K6598J2604
100A1972l3338j3844M6056K6243n0799l7818M5847M5558l1779m2134J4113L0485
112A0562n718k6663o730K8512K8747j5676l9629p05L5285J0785k6555j8703J6915
$$ plain form
0 0 0 0 0 0 0 0 0 -8 8 -8 8 -8 16 -16 24 -24 32 -35 41 -49 57 -69 80 -91 105 -121 138 -157 178 -202 227
31 227 -254 286 -319 357 -398 442 -491 546 -605 671 -743 822 -911 1008 -1119 1243 -1385
48 -1385 1547 -1735 1955 -2219 2544 -2951 3481 -4200 5240 -6887 9907 -17257 74011 26094
62 26094 -137764 -25038 82556 43865 -61252 -25615 57551 56929 -32649 -51107 18224 67543
74 67543 19850 -28415 -18753 7399 -2143 -11464 -1006 23034 31062 5764 -35661 -24397 25615
87 25615 30186 -19477 -29526 5804 9440 -20438 -14112 21202 23361 -13547 -27230 -632 11972
100 11972 -21366 -35210 10846 37089 -13710 -51528 -5681 39877 8098 -34036 -19923 10562
112 10562 4844 -21819 -28549 -37 28710 13034 -26595 -27300 7985 18770 -7785 -26488 -9573
125i573K5273r070l2331O106M5547L549n0111j2054M3784J0360l9082o135L6479
138A2742O791k9646q022K5075J3857j7798j8571R088J3963j0739q007K0275R691
151A8699k4852j0004K4107Q338j8068m713R980j064o285J272J248N236J1454l276
165A2072j9181n807J4187J1066n401j2017K52J4016q94j9394L022L1210J341l6652
179a2180p759K8546N674k0192K19J8349J125j4495p127O697J1619J487r851n165
193c053K888j839P00R654K140q148J356K153j1492k313J6760L944j4949j558Q688
208D931n602o392J1703R280q286j0630j219M337J879k322K526R994l596j8256
222a1653p12K0063Q96j6062L857J1013j2044j1652J2124J2002m442n429o0k913
$$ plain form
125 -9573 15700 6630 -25701 -19595 25952 29501 -20610 -32664 11120 21480 -17602 -23737 12742
138 12742 19533 -10113 -18135 6940 20797 2999 -15572 -6484 7479 -3260 -11267 9008 18699
151 18699 -6153 -16157 7950 16288 -1780 -6493 3487 2423 -3862 -2590 -1342 3894 15348 12072
165 12072 -7109 -12916 1271 12337 6936 -5081 -4829 9187 8293 -11101 -8079 23131 24472 -12180
179 -12180 -19939 8607 14281 -5911 -5692 12657 13782 -713 -7840 -1143 10476 11963 2112 -3053
193 -3053 -165 -2004 -1304 8350 10490 2342 3698 5851 -5641 -7954 8806 12750 -2199 -3757 4931
208 4931 -671 -7063 4640 13920 5634 -4996 -6215 -1878 1 -2321 205 10199 6603 -11653
222 -11653 -12365 7698 8594 -7468 -3611 7402 -4642 -16294 -4170 7832 3390 -2039 -2099 -5012
236e012k359K073K575M720k12r389j735P936J64m862P320L107j2502m152R864
251b464J067n271O471M076j0085l478Q148J991m383J682K503l155l688p46N458
266a874P989m145j0120N093R295r094q688J3909Q790j3848q122J1538N384n661
280D46j791K610J353q0m319m016P133P473n123o755K751K939J345J534m128m421
296c049Q076L376j2712j890J7027L386j6776l567J2810J627q321j007N399L576
310G955m860p729L346J1592j640j1233L016P614p618n872R985N296q121l510L921
325B142p80P66K439k978j156M259k713p847L642R393m50o666l157N71N491J713
341D669q281j790J2909Q33j8114k301J8878L955j4046m267P450K265m051l480
$$ plain form
236 -5012 -7371 -5298 -2723 1997 1785 -7604 -9339 -1403 -1239 -6101 1219 4326 -8176 -12328 -2464
251 -2464 -1397 -6668 -197 3879 -6206 -9684 -1536 455 -3928 -2246 257 -2898 -6586 -7332 -1874
266 -1874 6115 1970 -8150 -3057 6238 -2856 -11544 2365 11155 -2693 -10815 723 6107 446
280 446 -1345 1265 2618 2538 -1781 -5797 1336 8809 3686 -3069 -318 2621 3966 5500 1372 -3049
296 -3049 5027 8403 -4309 -6199 10828 14214 -2562 -6129 6681 8308 -13 -1020 4379 7955
310 7955 3095 -4634 -1288 10304 8664 -2569 447 8061 443 -5429 4556 9852 1731 -1779 2142
325 2142 1362 2128 4567 1589 433 4692 1979 -5868 -2226 7167 6717 51 -3106 -2535 2956 4669
341 4669 -3612 -5402 7507 8340 -9774 -12075 6803 10758 -3288 -7555 -105 2160 -1891 -5371
355e371J529P920P37j0540m179R851L933o677n73L670l053k231K283j074J001
370b774N832k863q778L068O975m355l172O683J148p920j340N190L398o19l889
385c416k586N805K639j0179j779J4371L309j4560m290J0903L453n462j817K168
399a441K562L43m534m795Q143Q028o720p908M020M576j074r01j306K32N025m31
415C819r053J338J1478o29j0168J485O018k673k622L590J390j819j17j280n6L045
431C746k41l385L304K750p076j781Q308J967p495j13M075j173p51R11k140J236
447B142M439l508o999M257O792k457n146P84R03J640O37m060j354O893J118r826
463c745p62Q950K91n164M47J208k483J369J413k648R66K988l011l033K559J025
$$ plain form
355 -5371 -3842 4078 4815 -5725 -9904 -53 3880 -2797 -3370 300 -2753 -4984 -2701 -3775 -2774
370 -2774 3058 195 -8583 -5515 1460 -2895 -6067 616 1764 -6156 -7496 -2306 1092 473 -3416
385 -3416 -6002 -197 2442 -7737 -9516 4855 8164 -6396 -10686 217 3670 -1792 -3609 -1441
399 -1441 1121 1464 -3070 -7865 278 8306 1586 -6322 -2302 2274 1200 299 -1007 -775 4250 3819
415 3819 -5234 -3896 7582 6953 -3215 -1730 4288 1615 -1007 2583 3973 2154 2037 757 701 3746
431 3746 3505 120 3424 6174 -902 -2683 5625 7592 97 -16 4059 2886 2135 3046 906 2142
447 2142 6581 3073 -3926 331 7123 4666 -480 304 1207 2847 3484 -576 -1930 4963 6081 -3745
463 -3745 -4507 4443 4734 -430 17 1225 -1258 111 1524 -1124 -158 2830 -181 -3214 -655 370
479C70j620J953P37n365J97M911j325l452K970O13l209Q90J352l059J155N476
495B594l251n666K700M208j994r45M63j699J858J281l630j750O835J424p158n77
511e307M434r40p78K391k023j978L568J94m435J927N302k259l337J352o6m22L538
528A161J12m684J683L224k985j379M294q2k485J801J70l897K423M754k462l634
544a986K941O52k092J908K15k041K404K378m900k097O049J206m122N60J111k034
560A52J558K702l498j065M578m98n085J320L978j589k0N94k885k04M673q51m946
577a086K707L335l748j250K442o52k59K441j993l815L024L484l928q40K400r40
593A322j482J794p77k439L186K566n191j707M442n9k573J334l19k070J837J247
$$ plain form
479 370 -1250 703 1440 -3925 -3728 1183 -142 -3594 -624 -11 -3220 -2330 -978 -4037 -2882 2594
495 2594 -657 -6323 -3623 585 -1409 -2354 -1891 -3590 -1732 -451 -4081 -5831 1004 2428 -4730 -5307
511 -5307 -873 -1813 -2591 -200 -2223 -4201 -633 -439 -4874 -2947 2355 96 -3241 -1889 -1955 -2377 1161
528 1161 1273 -3411 -1728 1496 -1489 -2868 1426 1344 -1141 660 830 -3067 -644 4110 1648 -1986
544 -1986 955 1607 -485 1423 1638 -403 2001 4379 -521 -2618 3431 4637 515 1075 2186 152
560 152 1710 4412 914 -151 4427 3929 -1156 164 4142 2553 2533 3127 242 38 4711 3860 -1086
577 -1086 1621 4956 1208 -42 2400 1748 1489 3930 1937 -1878 1146 4630 702 -138 2262 1322
593 1322 -160 1634 857 -1582 1604 4170 -1021 -2728 1714 1655 -918 416 97 -1973 -136 1111
609A111l988M09N055k197l888J546J403j531J785J073m313j73M531j590l613K563
625a817J842k187j28P45k425J632L786l257l589L720J951l203K52J916j280j85
641b227J998k476k199M904J799m651q69L435q73r66J911j374j473L576k77l835
657c597J279M103j706k272K022o83j052L291J11m121J315M264k694k337L037R17
673A877j482J048m11k620J701L604k611k119L157J64k463J708L83j598J790K230
689D358m404j787N167J072l730n6K067j404O12J016k311k34M189j285m012J691
705I49K457j317m00J132k237o68L927j507l744K932K685l172j725K322l29p53
721E52K434j727k909K026K425k910j231K611m32j708J891j417j896L262K132m746
$$ plain form
609 1111 -2877 -2468 2587 390 -3498 -1952 -549 -2080 -295 778 -3535 -3708 823 -767 -4380 -1817
625 -1817 25 -2162 -2290 -1545 -3970 -2338 1448 -1809 -5398 -1678 273 -2930 -2678 -762 -2042 -2227
641 -2227 -229 -2705 -4904 0 1799 -2852 -3721 -286 -1159 -2125 -214 -1588 -3061 515 238 -3597
657 -3597 -2318 1785 79 -2193 -171 -854 -1906 1385 1496 -2625 -1310 2954 260 -2077 960 1877
673 1877 395 1443 1032 -1588 113 3717 1106 -1013 2144 2308 -155 1553 1936 338 2128 4358
689 4358 -46 -1833 3334 4406 676 620 2687 1283 1895 2911 600 366 4555 3270 -742 949
705 949 3406 2089 1689 2821 584 -84 3843 2336 -1408 1524 4209 1037 -688 1634 1305 552
721 552 2986 1259 -1650 376 2801 -109 -1340 1271 839 -869 1022 -395 -2291 971 3103 -1643
737a643j791M631m29k825J192O85j877J930N43l728O71L762j231l188J596P49
753i53j306J432Q18l482N79M348k691l640L295K482l109q21J976j446L38K335
769A55j715k321K628J283k891K26K078j358M46J595k417j645M140J552m460q1
785b785L556j451j312K147j004r66K896L58m161R45L816j000j922J245o64n24
801h26K759o15l106K322L213l169k620L377J033j644N28P39k592J388L005k550
817A242k009L132R93k629J63P95j088J638J338l612n90M298k34l774J623K155
833C441k299j93K088k578n92L527k11l742O40K979j624n51O89j224J47K559k071
850I85l008L001K754l412j506K528o66j351K306r11k916K354K099l096j302K518
$$ plain form
737 -1643 -3434 1197 768 -2057 -865 -180 -2057 -127 416 -3312 -2641 1121 -110 -3298 -1702 -953
753 -953 -2259 -827 -9 -3491 -2912 1436 -1255 -4895 -1600 882 -2227 -3048 -1072 -2518 -2180 155
769 155 -1560 -3881 -1253 30 -2861 -2635 -557 -1915 -1469 126 -2291 -3936 204 1756 -2704 -2785
785 -2785 771 -680 -1992 155 -849 -1815 1081 1439 -2722 -1777 2039 1039 -883 362 -302 -826
801 -826 1933 1318 -1788 534 3747 578 -2042 1335 2368 724 1252 1991 -601 787 3792 1242
817 1242 -767 2365 3358 729 892 1687 599 2237 3575 -37 -627 3671 3437 -337 1286 3441
833 3441 1142 949 3037 459 -133 3394 3183 -559 81 3060 1436 885 1574 350 497 3056 985
850 985 -2023 978 3732 320 -1186 1342 676 -675 1631 720 -2196 158 2257 -839 -2141 377
866C77J22j512P98q64j032K582P11l766k50L774j224k608J782Q57k048J368R42
883Il305J08M063j303l123J715J222j243O95j45j643N69L553k974k605L321J704
900F18k947J65J550j569J30K748k047k257L397J188k897o39K527o47j69J253j747
917a343q61K924L39l432J036K776j446j101J697o72j160K774N82m037P49L605
933B430j235k301J931J52k52J208n73k182J762K609k652j840K792K28j717J255
949A615J18j976J500K413k884j968L643R68l004K57J138m07N70P41k492l18L111
966C025k69l171R79J918j504j62J234k144k85L533o51m077J520L055k493o75J155
983I88p32l71J890j228k939K719K157k913j096K004o70o90J793j493j755K310
$$ plain form
866 377 499 -1013 -215 -1079 -2111 471 1182 -2584 -2834 940 -284 -2892 -1110 -253 -2301 -933 9
883 9 -3296 -3188 875 -428 -3551 -1836 -614 -1857 -1162 -1307 -2950 -2381 1172 -1802 -4407 -1086 618
900 618 -2329 -2164 -614 -2183 -2053 695 -1352 -3609 -212 976 -1921 -2560 -33 -680 -849 404 -1343
917 -1343 -2204 720 1059 -2373 -1337 1439 -7 -1108 589 -83 -1243 1531 2113 -1924 -1175 2430
933 2430 1195 -1106 825 977 725 1933 1360 -822 940 3549 897 -943 1849 2077 360 1615
949 1615 1733 -243 1257 3670 786 -1182 2461 3429 425 682 1820 1413 1983 2724 232 -86 3025
966 3025 2756 -415 564 2482 978 816 2050 -94 -379 3154 2503 -1574 -54 3001 508 -167 988
983 988 256 -115 1775 547 -2392 327 2484 -429 -1525 479 -191 -881 912 -581 -2336 -26
999b6J901l522j061L211J41k276P61n5j431K195N16l037O8K990j233k115J840
1016a133M24j585J295R30k930L83L722j493l176K113J430j532j69Q50j413M90
1032a794J969j395k737L135J515k395j76J884j565K37K049k122j804L737J041
1047A579l950K66K747q57n12J144j184p12L059K98l575R81K642j389j091J467
1063I13o60p08K575m04l360J587L180j694k276K316M02j650J409J49j951J159
1079I87K265k092j804K322Q76j602O09L34j671J679J499l039q36L012M31l213
1095b43P01K056j511J67J118j982o24K859n10k771P71K401j776k01P90j717p7
1112e49L213j588l012J927K366k305j268J987j010l67J665p58k501J959J733k472
$$ plain form
999 -26 1875 -1647 -2708 503 644 -1632 -871 -926 -2357 -162 354 -2683 -2615 375 -858 -2973 -1133
1016 -1133 -709 -2294 -999 -69 -2999 -2616 1106 -387 -3563 -1450 -20 -1552 -1721 -871 -2284 -1794
1032 -1794 175 -1220 -3957 -822 693 -1702 -1878 6 -1559 -1322 727 -1395 -3199 538 1579
1047 1579 -2371 -2105 642 -215 -727 417 -767 -1479 1580 1878 -1697 -716 1926 537 -554 913
1063 913 253 -455 2120 1716 -1644 -57 3123 1429 -847 1469 1871 221 1630 1779 -172 987
1079 987 3252 1160 -644 1678 2554 952 1561 1895 224 1903 3402 363 -473 2539 2970 -243
1095 -243 458 2514 1003 1170 2288 306 -318 2541 2031 -740 31 2432 656 455 1245 -472 -549
1112 -549 2664 1076 -1936 -9 2357 52 -1216 771 -239 -606 1059 301 -2200 -241 1492 -980
1128i80p75J974m36r39J357j071j658K323J075l082m36L127p28j657O80N22j568
1145b272J654O89l201O67L108j105k229Q22J316j011L39N80k058M75L244j857
1161h39k574K612J196j940q7J179j442N87K369k040k412L036J579k675J31J766
1177D46r81q8J426j848r44L254L09l253L06K950j409n93J677j214r19K486K27
1194A832l205J096K906j066j867J394k53n93J958o26k473J403K919k206j929K415
1210A705L78j506J068J3j957J757J963k753j221K525N48j978M80N54j189P44J387
1227B518k434p54L256k10k870Q34J916j578R0Q09j826k89K986o30l368J118K102
1244A670j515n46J084j282L88J839j079k663J716J986j877j685J805k89p26K022
$$ plain form
1128 -980 -1755 219 -217 -1156 201 -870 -2528 -205 870 -2212 -2648 479 -249 -1906 -1226 -704 -2272
1145 -2272 -618 71 -3130 -2463 645 -460 -2689 -1867 -551 -1562 -1223 -643 -2701 -2226 1018 -839
1161 -839 -3413 -801 395 -1545 -1632 -453 -1895 -1308 1061 -979 -3391 -355 1224 -1451 -1320 446
1177 446 -535 -623 803 -1045 -1989 1265 1574 -1679 -1373 1577 168 -425 1252 38 -881 1605 1832
1194 1832 -1373 -277 2629 1563 -304 1090 837 244 2202 1576 -897 506 3425 1219 -710 1705
1210 1705 2083 577 1645 1658 -299 1458 3421 668 -553 1972 2520 542 1022 1576 387 1131 2518
1227 2518 84 -670 2586 2376 -494 340 2256 678 768 1577 -249 -538 2448 1818 -1550 -432 1670
1244 1670 155 -391 693 -589 -201 1638 559 -2104 -388 1598 -279 -1964 -159 -448 -1174 848
1260H48j351k067K429J387k873p40K299k45j350J252m98j599J975J378l485kL092
1277D50o73j941R40J88r49J226N90k674N95K833j117k373J964R28j246J43O80
1294d36j677N71K686j949k031K021J886k272mJ046r64K72K065k157j449K589J599
1311A796l108m5K202p80m44J031r85j058K833J99k867P40K151q06p81Q13k67p96
1329a72K357k43l017J179K549j590j541J498M6n37J269m2k400J552K418k125j900
1346f99K362J37j323Q45J98j586J081J631k139j269L040k30j891M37O43p35K23
1363G25J441k206p60K817m35k613Q84K051j666j30R51j498j49K317j134k632J602
1380d35J760j827k92J133r08k75J869j170k138K151J460k461q07J951n64o19J166
$$ plain form
1260 848 -503 -2570 -141 1246 -1627 -2367 -68 -313 -1663 -411 -909 -2508 -533 845 -2640 -2642 450
1277 450 -223 -2164 -1224 -1036 -1985 -759 -169 -2843 -2248 585 -532 -2905 -941 -13 -1259 -1116 -436
1294 -436 -2113 -1542 1144 -805 -2836 -815 1071 -1201 -1205 -159 -1123 -851 1214 -943 -2392 197 1796
1311 1796 -1312 -1357 845 65 -379 652 -333 -1391 1442 1641 -1226 -486 1665 859 78 891 624 -172
1329 -172 2185 1942 -1075 104 2653 1063 -478 1020 1066 529 1798 1756 -644 908 3326 1201 -699
1346 -699 1663 1800 477 1322 1520 -66 1015 2646 507 -762 2278 2048 157 594 1237 502 725
1363 725 2166 -40 -800 2017 1582 -1031 -147 1904 238 108 1059 -439 -588 1729 595 -2037 -435
1380 -435 1325 -502 -794 339 -569 -844 1025 -145 -2283 -132 1328 -1133 -1940 11 -553 -1172 -6
1397fq61j554J939J254k894j74K372n01j362J020r6j398K035P64l060O9K907r00
1415d46j764J259M55r72M77M71j492L72K436j298j879J568J121j420M51Q52j770
1432a579R60J865j735j707K170J270k073oJ045m65L33R52j128j411K240J179k760
1449h50J62J931n42j74O60j249o04K249K00k363K18K701r57j710J387o0n73J813
1467B239n69k329J005K421j353j670J447K68p25J012l45k102J497J897j862j428
1483e97K325Q0j331P06k58j062J166J205k202q89K835M1k460N89J084j213K62
1500B81O51j259n10K502n15k600J073J710j376k47Q11j269j81K085p44k625J472
1517g41J673j176j100J571j046l03J452p18j700J508J690k640p69J952n7j056
$$ plain form
1397 -6 -867 -2421 -482 772 -2122 -2296 76 -425 -1787 -767 -863 -2261 -226 538 -2522 -2453 454 -446
1415 -446 -2210 -951 -496 -1468 -991 -520 -2012 -1640 796 -502 -2381 -813 308 -1112 -661 191 -1579
1432 -1579 -619 1246 -489 -2196 -26 1244 -829 -835 210 -255 78 1030 -98 -1509 731 1910 -850
1449 -850 -688 1243 701 527 1187 -62 -666 1583 1783 -580 -362 2339 1382 -328 1059 999 426 2239
1467 2239 1670 -659 346 2767 1414 -256 1191 1459 734 1746 1401 -701 796 2693 831 -597
1483 -597 1728 1808 477 1183 925 -137 1029 2234 32 -857 1978 2019 -441 148 1232 19 281
1500 281 932 -327 -837 1665 1150 -1450 -377 1333 -43 -290 521 -748 -929 1156 412 -2213 -741
1517 -741 932 -244 -1344 227 -819 -1122 330 -388 -2088 -580 1110 -1530 -2299 -347 -404 -1460
1533a460Q02k72j053J720R31k636n50K741n31j455P66K19r33J234M00k377M52
1550b002K700o73k308J289J117j055O11N78j988M96K316j056k237K097Q44j464
1566g35J08M63r79O35K125j633j831K689N70j811k55J518p07j02J529j637j139
1583a192K459Q55k533L69J739j029m42R08m16j035J944J73k037M12K152j423j076
1600a72J310n69l20J647n96k182J417K157j859j259J808K31r86O15k04j494J354
1617H98J525j880j330K508k43j668N45M35r45Q30J179k047j021K956q0k535O78
1634a95J312j116p8Q65j464k87K147m88k199R11J547j308n35R68r61PJ528p33
1652g9k514J895J550j838n40J454p03l50P76m12j475J918J130k866J01J793j93
$$ plain form
1533 -1460 -658 -930 -1983 -263 668 -1968 -2518 223 -308 -1763 -997 -778 -1711 -477 -77 -2454 -2002
1550 -2002 698 25 -2283 -994 123 -932 -321 257 -1731 -1235 1081 25 -2212 -115 729 -735
1566 -735 -627 -164 -1143 -508 1617 -16 -1847 842 1412 -399 -654 864 157 55 1584 -53 -1192
1583 -1192 1267 2122 -411 -42 1697 668 226 1134 718 -317 1627 1800 -237 175 2327 904 -172
1600 -172 1138 569 249 1896 1300 -882 535 2692 833 -426 1382 1613 627 1242 1038 -456 898
1617 898 2423 543 -787 1721 1478 -190 355 790 -155 675 1854 -193 -1214 1742 1662 -873 -195
1634 -195 1117 1 -77 788 -676 -963 1184 696 -1503 -592 955 -353 -888 80 -881 -874 654 -79
1652 -79 -2593 -698 852 -986 -1526 -72 -775 -1125 -349 -761 -2236 -318 812 -2054 -1953 -160 -353
1669c53j202R87k68p69J385L95k212K48K284q59j559J076K69o72J191J8j603l2
1687a676K617q04j788J039O42p91M97N62j476M39K130j307j678J533J210j292
1703a43l79R57r00L65J669j723j276K386P85k134j43J443l27j59Q82q27j267K663
1721A872j09k175M83J444n14j142J480o65m21J427r1k048J025J711j400j074J248
1738A051J98q51P14J17j855J399J458j466j458J813M59j569N21K11j088R09J196
1755A759j775o49J887Kj502M09O39j084O33P69k008j96K172j65k092M01J740j420
1773d80M2Q71j558L19J567o18k124R25J668j290k55O76n03k52J200n10j616J204
1791g34J487j675q64J580m10m22J178r25j083J660O38k027n95K204j50j104P02
$$ plain form
1669 -353 -1555 -568 -836 -1605 -220 175 -2037 -1789 495 -364 -1923 -847 -578 -1250 -59 -41 -1644 -1676
1687 -1676 941 137 -1651 -612 30 -761 -264 298 -1178 -739 1391 84 -1594 -61 1149 -143
1703 -143 -522 435 -465 -100 1569 -154 -1430 956 1741 -393 -536 907 580 421 1303 476 -791 1872
1721 1872 1763 -412 71 1515 1001 -141 1339 674 253 1680 1589 -459 566 2277 877 -197 1051
1738 1051 1249 398 1112 1229 -626 773 2231 765 -693 1120 1579 10 531 742 -346 563 1759
1755 1759 -16 -665 1222 1224 -278 131 770 -314 319 1088 -920 -1116 1056 891 -1201 -800 940 -480
1773 -480 -438 433 -1125 -806 761 143 -1981 -1056 612 -678 -933 -257 -760 -1012 188 -322 -1938 -734
1791 -734 753 -922 -1786 -206 -616 -1038 140 -785 -1868 -208 430 -1597 -2192 12 -138 -1242 -540
1808e40j92p19J170M73j716o9K208l20j780R64L57j082J174J17j385K10K176q39
1826B07j720J451J040j422K33M52j134N54J720j273j522J992N99j647K00R21p53
1843a02N6J582j272q76J735O85j666pJ191m81m84Q48n13p14J513M8k038N65J699
1862A769n54r46R07l12p86J239m9j735R77J827j564j005J397j68o55N80J05j554
1880e27R66J396j379j354J346O84j177M60J64q91O23J088j685q19J709M37j818
1897g77M42J012q91M64L20j619J8J715k22j814O74J325j202l53R87j234n7J475
1915B63m69j998J335J204j277o57J357o11j52J119p19j500J293J396j854l20J615
1932B5l51q88P39qj462J659P50k102M0J783Jj470J071k63o24J227M34j893M04
$$ plain form
1808 -540 -732 -1451 -281 192 -1524 -1593 615 295 -1485 -521 -164 -1246 -72 45 -1340 -1130 1046 207
1826 207 -1513 -62 978 -444 -211 241 -893 -339 1381 108 -1414 578 1177 -470 -270 651 -102
1843 -102 -46 1536 264 -612 1123 1808 142 135 1326 845 361 1209 696 -18 1495 1543 -495 70 1769
1862 1769 1215 269 1176 864 78 1317 1268 -467 510 2337 773 -232 1165 997 342 922 1027 -527
1880 -527 439 1835 456 -898 448 1132 -45 415 579 -312 311 1399 -286 -1105 604 1041 -777
1897 -777 -335 677 -214 250 570 -1049 -1031 684 462 -1352 -678 647 -555 -908 79 -1155 -1212 263
1915 263 -206 -2204 -869 335 -942 -1599 -242 -853 -1005 114 -605 -2105 -812 584 -1270 -1590 25
1932 25 -326 -1214 -475 -483 -1945 -286 464 -1638 -1598 185 186 -1284 -213 -476 -1100 127 561 -1332 -928
1951i28J952q46j318Q97P09j010N56O80j720N72J719q32j895J557J164j201n8
1968bM06r45Q24R61j272r75J830Q98j540o42J379l61j43R53j086o69J855K76k025
1987b78L19J422l48q56P16m44m25J205J33j699oJ668n02r61R57j65m74J124rk011
2007f34N20J960j349r18J140P8n81J85L14j165J039P92j402q70J371L70j296L47
2025i9O09r77L02Q73j433k67J695L2j849L86R49q20N52j62p29o6J503j75j845
2044a521N58J538j198l10P82m56l51J161n22j818J447R92j041n54P59k43J54O49
2062B6q82n87R90J107j600o70J723j92q76P31j18p21J171L0j068q2J483m15p09
2081f59M54J28o12O12L38j204J88J843r08j200O04J031p76K16L51j011M71J594
$$ plain form
1951 -928 1024 178 -1140 -243 466 -544 12 692 -1028 -456 1263 431 -1464 93 1257 56 -2
1968 -2 404 -541 283 1244 -28 -1003 827 1725 185 -457 922 561 418 1371 285 -384 1471 1747 -278
1987 -278 41 1463 1115 259 975 531 106 1311 1444 -255 -261 1407 905 -56 901 736 262 1386 1377 -634
2007 -634 -114 1846 497 -421 719 797 216 401 715 -450 589 1381 -21 -891 480 850 -446 -99
2025 -99 510 -467 -165 708 -725 -992 703 735 -1114 -728 221 -599 -47 -209 -938 -1004 499 324 -1521
2044 -1521 -963 575 -623 -933 -151 -607 -958 203 -319 -2137 -690 302 -739 -1293 -534 -777 -623 26
2062 26 -856 -1443 -453 654 -946 -1616 107 -85 -961 -230 -348 -1069 102 132 -936 -1018 465 50 -659
2081 -659 -205 -77 -689 -77 261 -943 -755 1088 180 -1020 -416 615 -161 55 406 -605 -134 1460
2099A460j109j229J061Q88j052k24J052p36R6J076q74j053J672K16j284MJ200
2116A164j86q01O69k03j066J678M26j831k23J641k65o73L64l30k71Q55P8j251
2134b25M78R94n22j040Q45M04q61Q30k46j550J507P63j046j235J496r8p62L38
2152G0n6n35Q73P15j543o18J864k44j299N68L30n91N03J78j076m0J341Lj414L25
2172f46O81o85j94M79q31J12J519m04j534O94R28q66j00N20l40l95J372m31j376
2191a497J042J115j591k88R41m83M28L17k16j053J338K92j084l79J157M4q87L98
2209d06K49o47R72K54j223m5J405l25r89O19L87n51M38L58j349N48J562o73j590
2228a006J043P43q27L48M80j265L32J870j280q53J180K99j074L60L84m64K48P78
$$ plain form
2099 1460 351 -878 183 1071 19 -205 847 111 207 1283 409 -644 1028 1244 -40 -36 1164
2116 1164 978 177 846 643 -423 1255 1681 -150 -373 1268 1003 330 694 364 93 948 1026 -225
2134 -225 253 1247 725 -315 530 934 73 903 657 -893 614 1377 331 -904 592 494 -268 70
2152 70 14 -521 352 1067 -476 -1094 770 526 -773 -205 125 -466 37 215 -861 -901 440 443 -971 -646
2172 -646 35 -650 -844 -365 -1196 -1084 435 31 -1503 -809 119 -747 -847 -327 -667 -1062 310 -121 -1497
2191 -1497 -455 660 -931 -1219 -278 -761 -333 -16 -232 -1285 53 345 -739 -1118 39 83 -804 -406
2209 -406 -157 -804 168 422 -801 -846 559 234 -755 -136 251 -300 138 496 -853 -305 1257 584 -1006
2228 -1006 37 780 -47 301 781 -484 -152 1718 438 -415 765 1064 -10 350 734 270 518 1296
2246A296p46j093J596O06j430l44J023l97j63M10l52m18J233K52j743N4J524l50
2264I58j077P77m28j42Q87p1j416O85J140q03j044P91L49n40L00N2j011N54J062
2283A023j373m68J499m3j079M25K46q63O55R10j611m14J414R3j358L77N18o73
2301g22N06L18r85j54J238l9j391K92J154q89j2O53q01m18J566o85j363J227Q59
2320C54j101l87Q88k57l26R98q42p89J242Q52j066n74P64N1k69K75l19l49P68
2339h7O90j515J41J044k74o14N70L15n10N10M01j448J18J740o87q56N74M50k92
2358B70K2J21o77K18J211o99j258J033O95o12j69N23o41L45R35q69j165J392P16
2377A391r95j85N07l13J50M57m61r46J095O75j648N42M25k63l74N86n55Q9O32
$$ plain form
2246 1296 550 -543 1053 1659 229 -115 908 511 348 758 406 -12 1221 1473 -270 -216 1308 958
2264 958 -119 658 230 88 975 904 -512 173 1313 510 -534 257 606 66 366 418 -593 -39 1023
2283 1023 -350 -818 681 638 -441 -16 230 -633 22 932 -679 -1093 321 414 -944 -567 -49 -722
2301 -722 -216 102 -883 -1037 201 162 -1229 -937 217 -672 -684 -31 -832 -1250 316 -369 -1732 -505 354
2320 354 -747 -1134 -246 -503 -829 169 -673 -1462 -220 632 -434 -1008 -244 -193 -462 -187 -506 -855 -87
2339 -87 603 -912 -771 273 -1 -615 -45 270 -240 270 671 -777 -659 1081 394 -462 112 562 270
2358 270 292 413 -264 -46 1165 466 -792 241 936 324 155 678 37 382 1317 448 -717 675 1391
2377 1391 396 211 718 405 555 1012 551 -395 700 1375 -273 269 694 431 57 643 88 177 809
2396H09J12j449M55J559o44p16O02o13l55Q29k7j179P76J155j325p77J034K4l23
2415e3L23k49m69J51J152j048n17J031j3q96J76O03q43M47N00r10m29J068K70
2434B94j332M25M94n41J37P57j176J33R17J13j667O26R46r30M8M96l87k12J151
2453B92o47j108J013Q66p58l40M71j22l76R11m59o65P43Q87j590j5J005N4o37
2472d75M25j79l79J201j05j088J5J200j95r65N05L6r1M59L84j279K10J452n15
2491F16j005O55K78n25L49K53o66K41J232j085o34O73O84q10k85L90j90J00J035
2510A306q40n49J199L96j419J3Q21n96J5L32l40o33J259K55j231J44J055o39p53
2529b05O75l24k77R21l81q59K46J046o57o86Q04J70q50P94j88r50P21Q84r01r58
$$ plain form
2396 809 921 -528 -73 1486 842 126 728 115 -240 589 562 -617 159 1314 -11 -788 246 270 -53
2415 -53 270 21 -448 -297 855 -193 -710 321 308 -588 -412 191 -652 -205 295 -615 -1044 24 294
2434 294 -1038 -613 -119 -660 -523 234 -942 -809 108 221 -1446 -820 126 -804 -756 -260 -647 -859 292
2453 292 -355 -1463 -450 416 -342 -682 -211 -333 -709 202 -257 -922 -179 708 -882 -897 108 162 -475
2472 -475 -50 -229 -608 593 488 -600 -585 615 420 -545 -40 -4 -95 364 748 -531 -321 1131 616
2491 616 -389 266 544 19 368 621 -45 196 1428 343 -291 382 1066 256 -29 361 171 271 1306
2510 1306 466 -83 1116 1512 93 106 927 331 346 678 338 -295 964 1219 -12 132 1187 548 -205
2529 -205 470 146 -131 790 409 -450 -204 842 185 -501 303 473 -377 417 229 -721 0 884 -17 -975
2549i75R27J34o35J51L02p00N65P83j098m41J168k39r31L49L01j59K96M59j029
2568g72k39J245k44j123M51R31p10j96M72k59k93J177m45j302O30R91p71j65M00
2587b22n09J20O54j96j005R07O97r07o86J285l23k44P33k76j001J086O76j015
2605b26n28J204j41p07M90l90M9P08K54j090l22J584l97r60Q14Q2m53L19N32j138
2625c16K59J059n96o71M19M97l84l9M65q11L50R85o93q02P89M75p14j41L67k74
2645B24j1M07m03m67J044L47j206o8O45pp3L47o65j47O49M45j393m5J275o03k90
2666EL12r0k27N81j08j211M59Q95m96p02O95L38o72K08j38q72P08R76j052r24
2686a315J288L11q08K40L39n92L13L70r51j46J183j1j231N82O20q91L59N50r57
$$ plain form
2549 -975 -48 86 -549 -398 -96 -796 -231 552 -546 -987 181 -58 -989 -640 -339 -498 -202 257 -772
2568 -772 -1011 234 -10 -1133 -682 249 -461 -657 -185 -444 -737 440 -5 -1307 -677 314 -457 -622 -222
2587 -222 -731 -611 43 -153 -1158 -251 446 -461 -1147 138 -185 -429 304 28 -973 113 789 -226
2605 -226 -754 450 309 -398 92 -298 -249 459 713 -377 -699 885 488 -472 342 424 -29 290 822 -316
2625 -316 -57 1002 406 -265 154 651 267 228 693 -118 232 1217 524 -278 511 986 272 131 498 224
2645 224 213 620 217 -250 794 1141 -65 -133 512 505 432 779 114 -33 616 1061 -332 -377 898 295 5
2666 5 317 227 0 581 473 -738 -279 616 120 -582 113 451 -221 -13 -151 -1023 -315 661 -391 -1315
2686 -1315 -27 284 -524 -284 55 -537 -224 146 -805 -951 232 221 -1010 -428 192 -699 -340 210 -747
2705g47n09J281j15j075O13O54o27j14L08j14o70J274j45j001M44Q62p33k91O71
2724c4l99R3O14k11r95R55K63q20j01N40J61k7L27l80n84J048L07j055r0J056
2744F68j13m39J82l08l25Q46j57r93J46J516l05r27O32L95r44P44o2n76m96J407
2764H91k21j287P81R30q66K97P2m11k9Q40n22j101J367J54q46L17j24J51j75O23
2784H41q01l18J126M1j046J68M64j02j98P8j18m16R73J4j150J28P61m52m97Q25
2804C21k72k92N80j6j004N90O82o22n49Q09l67l12K68Q1n67L27N18q63k68Q70
2824h6J26p91M58K11l79K22M68q72k93J202m52n50k5P09m31kN99p29j66J057k52
2845B4p62L85N85q04J13L28m20k64J029k55p68N55Q35q58k40O88n07kP26k59p10
$$ plain form
2705 -747 -1256 25 -90 -1165 -552 102 -525 -639 -331 -445 -1115 159 14 -987 -543 319 -414 -705 -34
2724 -34 -433 -340 274 63 -932 23 286 -534 -635 -95 66 39 366 -14 -598 450 757 -298 -388 668
2744 668 555 116 298 -10 -335 511 354 -639 -493 1023 718 -209 423 818 -126 618 556 -20 -516 891
2764 891 670 -617 164 1094 228 525 597 186 157 997 475 -626 741 895 49 366 242 393 218 841
2784 841 40 -278 848 889 -157 11 475 373 175 253 135 -281 692 706 -444 -316 445 -7 -504 321
2804 321 49 -243 337 321 -683 -93 589 -33 -582 227 -140 -452 -184 -103 -670 -343 175 -688 -956 -86
2824 -86 40 -751 -293 -82 -461 -239 229 -643 -936 266 -186 -736 -761 -52 -483 -485 114 -615 -781 276 24
2845 24 -738 -353 232 -572 -459 -131 -551 -815 214 -41 -809 -254 581 -277 -517 171 -336 -338 388 129 -581
2866e81O58O66j347L22P99k85m61O07j38p58R00J01m85l56R51q5n78K2O54o89
2886h3N33M44j055O0J063m00n63L81J53k24J5O50j143J84R91n85r64R91N59p43
2906B64K4N04q34j46J113q58n19Q12K96o68o8M80k36q4Q96o27m48O12j59p80Q0
2927c46R11j76p44N98m49P2N76M1j317O24R12q25l07O01N1l30K56R4j087Q74M05
2948D34o44l72N00j65m10N97r6m87M08O35q88o15J162L07q93RL15m75N69K19o43
2969e33m45J412j41j152N47K60l98M4O37q80P7J191n90j155P41Q34q48k0L29q6
2989a76j4N85k90q57Q54M72r01j62Q43j97j63L84k09n67N67Q04j154J25M74n4
3009C64p11N42j71j01K64P07q67j27R01k67m34Q8N08p36P46K8q98J22J098o41
$$ plain form
2866 -581 77 743 -604 -282 517 232 -229 378 240 -518 382 483 -2 -358 593 508 -70 -48 606 -83
2886 -83 450 894 -161 -101 962 562 -1 380 533 309 324 974 -169 15 1006 421 -543 448 1007 264
2906 264 288 792 -42 -188 925 67 -452 360 656 -12 -80 400 164 80 976 349 -99 513 354 -426 -346
2927 -346 565 389 -355 243 -206 -134 442 483 -834 -210 702 -123 -430 171 222 -108 148 242 -845 29 434
2948 434 -210 -582 -82 -247 -657 -60 -156 -643 -235 400 -488 -1103 59 366 -527 -518 -203 -678 -109 110 -533
2969 -533 -978 434 293 -859 -312 -52 -450 -406 231 -649 -572 619 29 -1126 -385 449 -399 -419 -90 -176
2989 -176 -190 395 105 -752 102 574 -327 -489 354 157 -6 378 169 -398 169 973 -181 -56 418 364
3009 364 -347 195 24 -77 187 894 27 -100 801 534 100 188 696 -40 706 734 -164 -42 1056 415
3029D15p15R17J99q32M62j36m81N78L01k83q00O51M14q02J44N72n59J31O65n52
3049B89n95P80K00j027j92J278q34j20J70k46j66P26j1r20M07N35j11n07L42j74
3069a76n5M95K41j040l8J156n49p84M80K39j26q4Ln07J74R19n91o34O60N69o56
3090c04K10k27k90K34Q47j254l04J403k1r40j44Q11n27M68L5p94M5Q60N4q87L69
3111c56N32m81J88J77o81K63O42k33p90P24L72m33P7J93j49j56M13k46l48K02
3131i0O47l89k55N88n67l57Q35m42l33P41K44o55K0L71J22l25L32j77n78N77N30
3152H39r07J16R21j55j162N65N09l73J65k13p28L00J090n95o73N21M18n05j83
3171e0N05q00N04P55n97j149J361M69j107M1J62l70K77M22m67m23Q85J26q73L53
$$ plain form
3029 415 -300 617 816 -16 446 310 -171 407 708 425 -375 276 690 -112 32 604 45 176 841 289
3049 289 -306 474 674 -353 -545 733 -101 -221 -51 -297 -463 263 252 -668 -261 274 163 -344 -2 -176
3069 -176 -231 264 505 -535 -573 583 34 -750 -270 -31 -157 -241 -238 -745 -571 348 -243 -877 -217 352 -304
3090 -304 -94 -321 -611 -377 470 -784 -1088 315 294 -646 -790 21 -506 -38 -3 -797 -752 108 162 -725 -356
3111 -356 176 -305 -117 60 -621 -358 284 51 -739 -15 357 -76 1 194 45 -111 302 56 -292 -90
3131 -90 557 168 -87 501 -66 -423 412 -30 -363 378 622 -33 -13 358 480 155 487 310 -268 309 839
3152 839 -68 48 969 814 -348 217 726 353 518 305 -423 -123 967 372 -301 220 638 133 -50
3171 -50 455 -345 159 914 317 -832 529 998 -109 -68 94 -276 1 423 -44 -467 418 544 -329 24
3191B4L06K5n09N01n29j84M36L50j152L53P19k54p41J15N40l38M46O7p11K21M34
3212A19o39J08K70J28n52P50k99l17K95K46m58p07J041n6n22L99J27m30Q6O77
3232B66p56m52J194nq66K5N82n17M89J56l27j77P56r1j138P43M52o94k23Q79m45
3253a49q1O92k27p40O96N67q66k40P96l43l31M84k6m69O18L16o83l67P95K41o24
3274E9L88j38n13Q07r4q92M04J17L60p65M86K17n90M19L79j005J51J238l02p99
3294g3K78Kj14m8K36o99O11N39n85j62L72J79o39J16K57m44J73O43l63o66M60
3315G3P48q87P3J13q3l37M61m07j91P92K58j282K43J009p03l06P22m78k40J99
3335b23P27j143M14P22q88k78P09j07m73N96j30n06L39R01j005k44L68L99o11
$$ plain form
3191 24 330 355 -154 347 -182 -366 70 420 -732 -379 340 86 -655 -540 0 -338 108 175 -536 -315 119
3212 119 -520 -412 -142 -14 -566 184 -115 -432 -137 109 -349 -1056 -15 -71 -593 -194 -67 -497 -411 266
3232 266 -490 -942 252 247 -619 -594 -12 -529 -40 116 -211 -388 368 277 -861 -118 334 -360 -583 296 -149
3253 -149 -230 462 235 -505 191 758 -108 -348 448 105 -226 258 232 -237 381 697 14 -353 442 683 59
3274 59 447 309 -204 603 509 -383 21 138 498 -267 219 436 -154 265 644 -361 -210 1028 726 -73
3294 -73 205 207 93 45 281 -418 193 732 147 -15 357 536 -103 13 270 -174 -1 642 279 -387 73
3315 73 821 -66 7 120 37 -300 161 -246 -437 355 613 -669 -426 583 -120 -426 296 -182 -422 -223
3335 -223 504 -639 -225 497 -391 -669 40 -67 -540 56 -74 -580 -241 660 -345 -589 -221 178 -433
3354d33J85J22l05M08pm72LP11l18n02K74K68P4j20K30m62j9M64L2o77N36J9k12
3377b01M01k38k43J03Q66m42o65M37P81q67j38N17m43l08O53K1n11N17N00m96
3397B44m36N49k25j07L19p0n92P62L08p67l86J074j04o64M00k39n5M45J88n72
3417G2l02J096k45j098N81N95o06K80R4p83L61L65j29r03Q12M76o45j68N34o74
3437b87J07R28n31o56M17R80q72r0J09p4k56P29o73k23N82R0p02n0Q13j68n41
3458c68O26j28p48R98o7q27n9Q64k48l74L16R7o95N22J54l89J89M50n80m47M78
3479b36Q9j2K03j69m30J56O88n88m52O70K34o70J68J34k56J98O56o30o75R61L88
3500D27r92L99L04l55M35j3m95r4O29j39m67K91L52k42oJ53n05kO55k38n15K89
$$ plain form
3354 -433 -248 -126 -431 -23 -30 -502 -499 212 -106 -608 -334 -66 8 -112 118 -344 -363 101 133 -544 -8 11 -201
3377 -201 200 -38 -281 -178 688 246 -419 18 799 -68 -206 311 -132 -440 213 234 -277 240 740 244
3397 244 -192 357 132 25 344 274 -318 444 752 -15 -401 673 569 -95 305 66 11 456 644 72
3417 72 -230 866 621 -477 104 699 93 373 467 -316 45 410 281 -622 190 666 21 -147 387 -287
3437 -287 -180 748 217 -439 -22 958 86 -4 105 31 -225 504 -169 -392 190 280 -422 -472 341 173 -368
3458 -368 258 130 -618 380 313 -514 -573 291 43 -331 -15 82 -613 -91 63 -326 -137 313 -267 -714 -236
3479 -236 -147 -159 44 -125 -555 -399 289 -299 -751 -81 153 -517 -349 -215 -471 -273 383 -247 -922 39 427
3500 427 -565 -166 138 -217 218 205 -290 -384 245 106 -361 -70 282 40 34 187 -318 -320 335 97 -418 -129
3522a29N49m49l41N94k62q7N62k91m94M18N53n69k56N56Q9l96K95k85l22L54O98
3543G87n64p44P54L85l47j86L77o01M64K22n41j26O92l34l22K90K02m01J80j05
3563H2l45L90M14q8p46L16K35m87r8Q70q77K33K44jo62N01L99p33J51L17l39k33
3585d57L41k5l61O79K40j033Q8R25n13j18M5n1m82Q59l15j13k05P40o18j70K50
3606b94j15P0N11k33o38K15N37p96J83N40J6m8J47j00p97Q55K18n79o14Q13K8
3627h1k98J64l2k12N45J91o58j24O17J61m99j69N42J3j00J28l79J68L35J38q10
3648c60L44J41M0o7L29o22N6M27m9o53N63M12o34j45O28k50j54N22m74k98L29
3669H5K99j83l28O02J4m21J5J90n65N24O19q56j73N83J8k96K05k07J7K88K27p79
$$ plain form
3522 -129 420 -29 -370 224 -38 -125 437 146 -348 70 623 54 -202 354 443 47 342 57 -265 89 787
3543 787 223 -521 233 618 271 85 462 -139 325 547 6 -120 572 238 -84 206 408 7 187 82
3563 82 -263 127 541 453 -293 23 258 -229 -327 543 -334 -101 143 142 -520 -19 380 -353 -202 115 -224 -457
3585 -457 -116 -141 -502 177 417 -616 -528 397 -116 -234 -189 -240 -722 137 -178 -291 -496 244 -374 -544 -294
3606 -294 -409 -339 172 -61 -699 -484 53 -743 -560 -20 -4 -52 95 -5 -802 53 271 -308 -922 -109 -81
3627 -81 -379 -215 -247 -459 86 277 -381 -505 112 273 -226 -395 147 160 60 188 -191 -23 312 450 -360
3648 -360 -16 125 165 98 427 -195 -139 288 239 -414 149 561 -73 -218 410 160 6 528 54 -244 85
3669 85 384 201 -127 475 489 68 83 273 -292 232 851 -5 -178 405 423 127 332 125 142 430 657 -122
3691a22J99P40r04j12K84J50k96q3O80n77l01O92o0p11O83j9k27J04J49l95MM15
3713B93n39k75P15K42n90m36J011o97K64m4j54m30O75J91o40J85K84J73m13p0
3733b55K24m47O15J34o50J3L62k99k36N34k57kM0r1L0P5K03k59q1L57N4k64j61
3756c61J46j24K2N93m36k69L14K36j02K23j82j13j06L28l26k27N37M00j066L78
3776a35N26k18j37M81m11n40Q36j94o23N27K52k48j39J57l30L43L64n15j64P40
3796E72k50j70m5L72k06k38K22J97m24k63O49l55p4M81j42k79R5jj99J87K03n21
3818a89J26N51m32m8L34j14l83L61Rk10j59O22j89n57M68r0mk51M33k19j44M43
3840C58n27q3L72L06l19j36rk65P0O61q68J68L93O0o34K15J13K18k75j43K77m11
$$ plain form
3691 -122 77 817 -87 -199 85 235 -61 -144 536 -41 -342 350 290 -421 262 243 16 120 269 -126 -122 293
3713 293 -246 -521 194 436 -154 -590 421 -276 -12 -56 -210 -640 35 226 -414 -229 55 228 -185 -255
3733 -255 -31 -478 137 271 -379 -366 -4 -303 -539 -5 -262 -264 -224 -315 -285 -210 -7 -266 -347 10 64 -200 -361
3756 -361 -215 -339 -317 276 -160 -429 -115 121 19 242 60 -53 -159 169 -157 -384 153 553 -513 -135
3776 -135 391 173 36 517 106 -434 402 208 -415 112 364 116 -23 134 -196 147 511 -4 -168 572
3796 572 322 152 107 479 273 35 257 454 30 -233 416 61 -13 468 326 47 142 141 -58 129 332 -189
3818 -189 -63 488 56 8 342 228 -155 206 215 5 -154 468 279 -278 190 100 96 -155 278 59 -85 358
3840 358 -169 -252 120 426 107 -29 -38 -303 -233 428 -440 -272 121 181 -453 -238 -125 93 -182 -325 -48 -459
3862d59N39J45n40O0K24k35j76K65N2j76N01j21o08L68J51j18p6m6j34L97R2j72
3884f7k97j6O22m26k48L21K61n16J72j2o3K32O4r3n14O65J81r85Q56j22j36L31
3906B10j23J67l69M39pn89L81L04m55o2M65n65K62M61k08o05L75L18k23l65M47
3927B58k69j17P01o83k01N36M53n26J75m8k08K66K05l94k65M74L02o64R2N43l54
3948B76m42L87J77o95P74l41q5n1M71J61r89L68K98l75L25j81k86K27Q26o56m44
3969b55j3N92o77M51j16j03k01N95j75n16M18M29p50N8L12M8m31J15L1m37N51
3990g4L50r11J77L33j7j00K86j76j88P8K56l83J27L82k98J2P5L2k14K88l33q0
4012c78M33K88n80o8L33J61m05J4K67k20R6O04p02j03K69M88o18J98L0j78j25
$$ plain form
3862 -459 80 225 -315 -255 -31 -266 -442 -177 -125 -301 200 79 -529 -161 -10 -128 -204 -250 -384 13 105 -67
3884 -67 -364 -380 242 -184 -432 -111 150 -366 -194 -206 -269 -37 27 -66 -580 85 266 -719 137 15 -121 210
3906 210 87 254 -115 324 317 -272 109 413 -42 -104 361 -204 58 519 311 -294 81 399 176 -189 258
3927 258 -11 -128 573 -110 -311 225 678 152 327 279 71 337 542 148 -117 357 659 -5 87 630 276
3948 276 -166 221 398 -297 477 136 51 0 471 632 -357 11 309 -66 259 78 -208 19 845 189 -255
3969 -255 -268 324 -353 98 -18 -121 -322 273 98 -418 0 429 -321 -263 49 97 -334 -219 -188 -625 -74
3990 -74 276 -635 -458 -125 -142 -242 44 -132 -320 -242 14 -369 -242 140 -158 -146 -71 -39 -253 35 -298 -378
4012 -378 55 343 -237 -305 28 189 -216 -202 65 -155 -59 545 -157 -260 9 497 -121 77 107 -71 -196
4033a96N04j57l24O63k08l45J02J01j92L95l44k00J27O05j84p69K35N30m1l72
4053g0K96p8l55M40k10l27M20J11m27N3K97K5m11M63j72k39K22K44k56l52M88
4074A62p2o5l6K75m38K03L79p77J27O84l88k59K77J44k65j3L02m88K23K21K6k62
4096d0kK84l77j34N09l69J96j4K14m98k4L64j91j25J71m13L19K87j84l55M09J79
4118B06n11LN09m28J20L11n08j86N85k05o5q4J1M36m91M35k68k55K77j08k25L78
4140f3J70l7m11L50L23o08K37K36m62P7O84m63n73M57J58N4k42J85k38J45M79
4161D58n77M6J73J45m95K68K0m03N98J3qn78M60K18r77M72P56o68O8L28k42j57
4183h2K82j28l01L14L38l56k21L23j25K84p6K92o97K91K08l89J29L33l45qJ24
$$ plain form
4033 -196 308 151 -173 490 282 -63 39 140 -52 343 -1 -201 -74 531 347 -422 -187 343 302 -70
4053 -70 226 148 -207 233 23 -304 116 227 -200 -147 150 175 -236 227 55 -184 38 282 26 -326 162
4074 162 90 25 -11 264 -174 29 408 -369 -242 442 54 -205 72 216 -49 -62 240 -248 -25 196 222 -40
4096 -40 -42 242 -135 -269 240 -129 67 53 267 -231 -255 109 -82 -207 -36 -449 -130 157 -27 -382 27 206
4118 206 -305 -302 207 -221 -101 210 -298 -484 101 -104 -169 -253 -242 194 -297 138 -130 -385 -108 -216 -441 -63
4140 -63 107 70 -341 9 332 -276 -39 197 -265 -188 496 33 -540 -83 75 129 -113 72 -166 -21 458
4161 458 -119 -73 100 245 -250 18 38 -365 233 246 238 -340 120 338 -639 -167 589 -79 -11 317 75 -82
4183 -82 200 72 -229 85 423 67 -154 169 44 328 252 544 -153 138 346 -43 86 419 74 66 190
4204A90J0m33K11K46m20o2K89K70l19Q8j23m6J70K8m13J77L80jl16J23J83n16
4226b84O10j45l64j56N35o3p18L99L03l72J78k88L62j89L76J02o82L56M52n93
4246a81j30O39m58oM08n92k82M68P2p9j0K37l34k1J64K00l61K98L23o45J7L93
4268A20l4l37k3O7Q8L03M5m72j9L58k5k50j6J95k33K31j80j23J41N36m58l77K04
4291b59M28l71p1K37m3K27J61l83k67O27l5l55N6L12k38K12Q1n94L33J55J56m66
4313i7J95L11m15K11Jl36o8O83l35j47oK75m05K39R3k41NL85J12n41J40M98n46
4336A1j94L59J8m95N59l91j08M90K14l46l17N55k03k12P5j11K54L52k58k65k10
4357b23K99J31k61J08L20j68k61L12m72o8N34l45m30N90L9l85K07o1J11j90K33
$$ plain form
4204 190 200 -233 -22 224 -196 -258 31 301 -18 70 -53 -99 71 99 -314 -137 243 242 -74 49 232 -284
4226 -284 326 181 -183 -339 196 133 -585 -186 117 -255 -77 -365 -3 -192 184 286 -396 -40 412 -181
4246 -181 -311 328 -130 -136 272 -320 -602 -134 -62 -141 -151 86 -248 -269 -105 95 -266 32 355 -290 -273 120
4268 120 86 -251 -274 -207 -119 184 229 -243 -262 96 71 -179 -195 0 -233 -2 -182 -305 -164 372 -86 -463 -259
4291 -259 169 -202 -273 -36 -79 148 309 -74 -341 286 251 -104 -48 264 26 238 319 -275 58 213 369 -97
4313 -97 98 409 -6 205 206 -130 -198 485 150 3 -3 272 -133 106 199 -42 -37 348 460 -81 59 557 11
4336 11 -183 176 194 -301 258 -133 -241 249 463 117 -200 355 152 -60 15 -96 158 510 252 -13 -223
4357 -223 76 207 -54 54 374 206 -55 257 -215 -283 251 -94 -524 66 105 -280 -73 -134 -23 -213 20
4378B0j60l6L38k41j60L10O8l42l1K55mm64M95J64o67K01K10m42N53N4k62o2N02
4401B99k73o07N9M98J6O5N5q1j6j94M62n85L71K06m03p3L21R1k37N2K68p10L57
4424e9L41j41l35J87K63o84M30J22l74K37J71j55J90P1k19k86J78M71m37J1J70
4445A52m96K20N51J64o12j7M15j03m15L3L69l66M65l89p1O6M27j37j93J7N1j33
4467bL10J80n71L17J21j81l58J84j26j38O14n71j39O65R9n01j7K60K12m03j01
4488a46J27J26J07l07l64K13N23k88l37K36K37j60r5M25m05k5K49k34l07L02L75
4509B52m27O3J93k99J44L15l99n17P02K01o06K05K30k87J49K31n0m21K03L64m82
4530b36O8J99Q4k67K99m07J22J16p4k94L22L44l66k10N08j89k60J45N85p22j2
$$ plain form
4378 20 -140 -176 162 -79 -239 71 139 -203 -234 21 17 -447 48 212 -455 -254 -44 -486 67 121 -141 -203 299
4401 299 26 -581 -522 -24 -8 57 112 31 15 -179 283 -302 69 275 -128 -201 120 211 -26 26 294 -416 -59
4424 -59 282 141 -194 -7 256 -428 2 124 -250 -13 158 3 193 264 45 -241 -63 408 -29 -18 152
4445 152 -344 -124 427 591 -21 -38 377 274 -141 -108 261 -105 360 -29 -100 -34 393 256 63 80 131 -2
4467 -2 308 488 -83 234 355 174 -184 0 -126 -264 350 -221 -360 305 404 -97 -114 146 358 -45 -146
4488 -146 -19 107 214 -93 -457 -244 279 -9 -346 -110 127 -33 -128 297 -108 -133 116 -118 -425 -123 252
4509 252 -175 -112 81 -218 -74 241 -158 -675 27 228 -378 -173 57 -230 -81 150 100 -321 -118 246 -236
4530 -236 -168 31 115 -152 147 -260 -138 -22 -96 -390 -68 276 -90 -300 208 19 -241 -96 489 -233 -245
4551b45Q3K36j98K72j32L2J87k69k0M56k29q2q7J89K21k73k76K98m55L73K25m68
4573a62J40N13l75k65kK91j05J49K9k90M8M56J9m73K68j15n3J18q1K65m38M65
4595D02l98j72L24K72l28j80K91l46J75N09n33k60J56m2jK0N07l0m15O5j2j21
4617a17M81k60l03M5K91l8n12M73Pn0j32K64m48p9M29j18k02J34M25l0n17L89
4639A32l89R9M12m31J64j6K6j37j21K51M6j0j22M6J56k23L51m24J05N11m89q7
4661a50j3L98n34O37l88m57J80O60n67j02L24j26Kq1K80n80N24J2k41o9K32L88
4683C29n11K10J15j3p0M15n98j06L82n3l40K10J39m46L47J46K1q7M8mp2K11k22
4706E1j62L05j60J04k64M66j71k36M46j78k5k07M2J06m04L74L55n12P8J40J08
$$ plain form
4551 -245 -162 74 -124 148 16 48 235 -34 -54 402 173 91 4 193 414 141 -135 163 -292 81 306 -162
4573 -162 -22 491 116 -149 -151 140 35 184 213 -77 -29 427 446 -27 241 126 73 191 110 375 -63 402
4595 402 4 -168 156 428 100 -80 211 -135 40 549 16 -244 -88 -130 -131 -111 396 366 -49 16 4 -117
4617 -117 364 104 -199 -154 137 99 -413 60 67 17 -115 149 -299 -378 51 -67 -269 -135 290 260 -257 132
4639 132 -257 -158 254 -177 -13 -29 -3 -140 -261 -10 36 26 -96 -50 106 -117 234 -190 -85 426 -63 -150
4661 -150 -163 235 -299 338 -50 -507 -327 333 -234 -336 -12 -138 -136 -217 63 -517 7 19 -222 -291 -59 329
4683 329 -182 28 143 130 60 475 -123 -229 153 100 -240 -30 109 -337 10 156 177 90 138 134 62 273 51
4706 51 -111 194 34 138 -126 340 169 -67 379 201 176 -31 11 117 -287 87 442 -70 8 148 256
4727B56k09R8m7j44N47o24p6K49K94k26l13J30j87K23n0J59k54J33L92m22j13
4748a84K31J78n10J38J93j25J64J89n31o0L01j93j73N34R5l26L67l21l24L69j23
4769a11qk65K84K12n39K94J37l03K21L83l68j5J48qj24j14K56l18K25N7r5L4L51
4792C34j29m00K51Jk6J38M7m10J93J87l6m14L7Q05o51J2rj49K89k20L37k00r8
4815a11N16m24k13J57K41k65J16m9q0p2K04j36k68M22K80k77P9N1j99l29R15o13
4837e5P1K44l2l18L77O5m61n5M60l81J86K99m80M3j60L51k80K34j06j88J59O1
4859C4jMJ13N9l12J90J17k36J06K94l62lk03L92L1k70K0K78k28J24J2m30M63j79
4883A3k14Q2N54l93M1j26l5kJ00J65j40q3K24M0r4J12l56L05j64K03l85k44N23
$$ plain form
4727 256 47 145 98 -46 501 -123 -199 50 344 118 -195 -65 -252 -29 -79 80 -174 -41 351 -71 -184
4748 -184 47 225 -285 -147 46 -79 85 274 -257 -317 -16 -209 -382 152 247 -79 288 -33 -357 12 -111
4769 -111 -119 -384 -100 112 -427 -133 4 -299 -78 305 -63 -78 70 62 -62 -176 80 -238 -13 44 -51 -17 334
4792 334 205 -195 56 57 31 169 216 -194 -1 186 150 -264 -227 578 -73 -61 -70 -219 70 -150 187 -13 -111
4815 -111 405 -19 -232 -75 166 -99 17 -32 -112 -184 20 -116 -384 38 318 41 120 171 -28 -357 558 -55
4837 -55 16 260 228 -90 287 352 -109 -164 296 -85 101 400 -80 -37 -197 154 -126 108 2 -186 -27 34
4859 34 33 37 150 209 -103 87 204 -32 74 368 6 3 -200 192 223 -47 -27 251 23 147 159 -271 192 13
4883 13 -201 -119 435 42 83 -43 -78 -80 20 185 45 -38 186 226 132 244 -112 193 29 232 -153 -397 126
4906A26j56k89K57n5j41J54K85m01J70l0j59k34N02L53m86pJ40m60M97K50o08
4927b92q2M05P2m95K68K71m35K17j28K57m9L28n40J89o0J85j9O4k50L53k31J11
4949A39Lk07L0J89J9j16J86j94L51l52j7k87L48J63k91j16J77L69q27L30L01j13
4971H5Q7O9k86j8J74j70o3K80ml44N76l5j95q7k25M58j71P7K0j20l14K70O5l87
4995b58M61J95m22j40M01l17j51K86m0J32q5k2L2J5N6r0l04j53K76k28K36J64
5017D4k10Q6L86k82l77N79j70j71L17l70K5O3L31n87M0J26J30k23K79Q8K6j82
5039e2j00J96j04M34j47n65L79J61Rm46J91j2j99O39l53Kj52K68j85L1j0O7J62
5062B14m18M9L0L36j09k89k0N24n1j6l11K1J51j47K25l01J03M20p01L13r4L8N2
$$ plain form
4906 126 -30 -319 -62 -117 -258 -104 181 -220 -50 -80 -239 -473 29 382 -104 -111 29 -431 66 316 -292
4927 -292 -374 31 103 -392 -124 147 -288 -71 -199 58 9 337 -203 -14 -74 111 92 156 -94 259 28 139
4949 139 142 -65 -35 154 173 57 243 49 400 48 31 -256 92 255 -36 -152 25 394 -433 -103 198 85
4971 85 172 241 -45 -63 111 -59 -122 158 154 -190 386 351 156 69 -156 302 131 208 228 108 -206 64 129 -258
4995 -258 203 398 -24 -164 237 -80 -231 55 15 147 62 40 72 87 143 53 -251 -404 -128 -356 -120 44
5017 44 -166 -80 306 24 -353 226 56 -115 202 -168 -143 -80 251 -336 -296 -170 -40 -263 16 104 130 -52
5039 -52 -152 44 -60 374 227 -338 41 202 211 -235 -44 -56 -255 384 31 33 -119 149 -36 -5 -15 52 214
5062 214 -204 -155 -125 211 102 -187 -207 317 266 250 -61 -40 111 -36 189 -112 -9 411 -290 23 -71 -33 19
5085A9J11q8k26L22m1j52q1K05L14p94M58n8n9K47J41m93R9L34o8k42L24jr6k05
5109c0mk19K03K83J32o13K09M47m87J07J42K41o66L24j01Rj84K50q9J90j86K7
5131a5K04j72L9p2j78K62k60K63m55M71j83p7L5j0K23J8m47N8K35J31l66J35J36
5154b5l9K96j17l57lN33j64n14L69J53j14l34L46o7K62m91L20j0M1j94K42q3K02
5177B52m00L15Km02k26O07P3o65K95qL7RL28k97j88M10R4n20J12J41J43k97K70
5200H5j98oJ33J56j56j15M43k36j78J15n9J01j46k99L92o5K05M1k14r6K28J00
5222B31N2j71l0j56K22l92N40r7k36k00J45J35N0k34K67o0MM5K74n7j64l4k18
5245h4K38R4m52P4K62Pk20Q1m7o6J56j28J51J76k75J35n39L34K86m95Q0L11rQ7
$$ plain form
5085 19 130 42 -184 138 97 -55 -136 69 383 -411 47 -11 -70 177 318 -175 -76 258 190 -52 272 271 175 -30
5109 -30 -34 -253 -50 233 365 -248 -39 408 -79 28 170 411 -255 69 -32 -23 -207 43 -46 144 -42 -15
5131 -15 189 17 56 -16 -194 68 -192 71 -384 87 -96 -173 -138 -148 75 93 -354 -296 -61 70 -296 -161 -25
5154 -25 -64 232 115 -242 -245 288 124 -390 -21 132 18 -316 30 -37 225 -266 54 44 85 -109 133 50 252
5177 252 -148 167 169 -233 -459 148 221 -444 -149 -157 -120 -111 217 -80 -268 142 236 -284 -172 -31 112 -185 85
5200 85 -113 -119 14 170 14 -101 342 106 -72 43 -16 85 -61 -360 32 -33 172 213 -1 -97 131 231
5222 231 283 112 82 -74 148 -244 296 199 -37 -237 -92 43 93 -141 126 66 70 115 389 332 168 134 -84
5245 -84 154 248 -204 -130 132 139 -81 0 -47 -113 43 -85 66 242 -33 102 -437 -103 183 -312 -232 79 70 157
5269A57r1j75k80M04K6l55M47j31j62N3J7J7L4l20M98j79q4L67q5o4j66M65m82
5292h9L7M1R4k41R3Q0k42j15L50o6k74J29o5J70M15k57m70L51L05j37j42l3l40
5315d06O24m33P0n9K41n5m8j51L92j68j0O5J62l07J32j07Q9r6J12j13L2K7k8k14
5339b49K85L01l14K00k76J26p0M6j47J67m8J89j39k9Q5l3l05M21n6r1%j75Kn3
5363a63K91l10J72p5M12j32k03J47q6N7K2k77n0k0J66K9jn1K80p7J41l75j75M53
5387A75p4j99j46j1L58n2n4k3k48L46J61N9n88K79K94k99K00j84n7j76K97n6j05
5410a03K44k10k44M79j05o4M1ll2j13L29l33J05J11j87J11J89j06n3l69L11j05
5432a07J16lP2l83J33J38j14K12J53j47M3l2j41N7N07l06j32l1j19K0M54l12k42
$$ plain form
5269 157 66 -109 -389 15 41 -314 133 2 -160 -107 -90 -73 -39 -359 139 -40 -124 243 158 94 -72 393 -89
5292 -89 -52 -11 83 -158 -65 15 -227 -342 8 -58 -332 -203 -268 -98 317 60 -410 -59 246 109 -33 -66 -406
5315 -406 218 -215 -145 -204 37 -18 -66 -217 175 7 -3 62 224 -83 49 -58 31 -65 47 -66 -34 -7 -35 -249
5339 -249 36 337 23 223 -53 73 3 49 -98 69 21 210 71 42 127 94 -211 210 154 63 63 -112 -110 -163
5363 -163 128 -182 -10 -85 327 195 -8 139 53 110 132 -145 -195 -215 -49 -20 -21 -72 208 131 272 -103 -278 175
5387 175 101 -98 -244 -255 103 51 -3 -26 -274 72 233 292 -296 -17 277 -22 178 -6 -63 -239 58 2 -103
5410 -103 141 -69 -313 166 61 -3 38 35 3 -110 219 -114 -9 102 -85 26 215 109 56 -313 -2 -107
5432 -107 9 6 78 -305 -172 -34 -148 64 217 70 113 81 -60 -3 504 198 66 35 -84 -64 390 78 -164
5455a64Q6N82l50k32m8p2J60J2m4R7j55K87n3j11J06j53l6j78K52K09j3m7o1j54
5479h0M10j68j9k11J81l4k37L76j67k58J84J45l02L2J54j3j04K14O6n03L2N31
5501B29j59k26K17K4K03n91M56L9j9Q5m01O1r7J55j37J32l8K67l7k01m08Q4K97
5524f5j29L29m13N66j69l42L21k47O7K55k65n5J74J43k35j09L42P6O8m87K85j39
5546b9pK49k4l16l8j26J82O3j9j41J64L2J62k13K27rj78j88K24j00JJ77n07J86
5570b28L49k07o4K7K15q4L8J64l28J73M8J11n61K2L84q8J75q1j52J48o6k50k7
5593b82M00n6r2J6QK22M9M6m66K72j74j64K08J55J30q7l99L83l67O0M5K70k55
5616g8J6M18Rn18J60Q7j88l35N02l80L23L76o3l56J57K48k22p1j98O0L82l31%
$$ plain form
5455 -164 -78 504 154 -78 -126 -198 -38 -26 -70 27 -128 159 106 -5 101 -52 -88 -266 -14 195 182 135 74 -80
5479 -80 330 162 143 -68 113 79 -158 218 51 -207 -23 122 -180 -148 6 -7 -111 103 169 -334 -302 229
5501 229 70 -156 61 85 288 -303 153 192 173 258 -143 -82 -179 -24 -161 -29 -67 200 163 -38 -446 -362 -65
5524 -65 -194 135 -278 288 119 -223 98 -149 -82 173 -92 -147 27 170 -65 -174 168 244 312 -175 110 -29
5546 -29 -36 213 189 -127 -165 -291 -109 -46 -65 -206 -42 -10 152 -61 166 157 -21 -209 15 -85 -84 93 -414 -228
5570 -228 121 -86 -150 -123 92 8 46 210 -118 55 103 214 -347 -325 59 -29 146 65 -87 61 -5 -255 -282
5593 -282 118 62 -30 -14 -6 216 265 311 -155 117 -57 -221 -13 142 272 185 -214 169 -198 -138 -93 177 -78
5616 -78 -62 356 365 -153 7 94 -94 -429 73 -307 16 392 329 -27 130 378 156 85 -113 -53 329 -2 -2
5639bJ79k5k27j81M71m3j03j72J97k34oM33l16j50j7J0M31k05J85k78Q6j46L41
5662B28l78K71k9k49J79k86L39Ok28J32J06j97J77o9j01L55l35Q9J01K03l87J60
5684H7K6j41q6L37m53K33j46j38M13j73K13j8Q5m32K44m1J13o2m07N29J5m98N82
5707B82k14k35J21K20j54j27p2M28l35R2j37K24l76R1L29j81l3M5J09r9L9J44
5729A61k92J76k27J46p5QK23m8j26j51q3M05N1l80J61L0K99j9r5k46J38J82J88
5752D26m10J62j39K24l81J28L32l31p8L05Q8m15ok59M04O5J9k74k42Q07p05J51
5774a29L47l19m7k5Q0K5j38M94l30j01J07j75K10j10K59r1j78O05q34J12N98n9
5796C01j31R8j99Q9j46o3j98j1J97M0J55k37J5K00M0j64Q3q0J25n2K9J65j22l07
$$ plain form
5639 -2 177 152 -75 -256 215 172 69 -103 94 -140 -146 287 -29 -179 -196 -186 245 40 225 -53 33 -113 228
5662 228 -150 121 92 -157 22 -264 75 81 -147 -15 91 -106 71 2 -99 256 -79 10 111 314 -73 87
5684 87 113 -28 -114 223 -230 3 -143 -281 132 -41 172 154 239 -193 51 10 123 61 -346 183 198 -300 282
5707 282 68 -167 -46 174 20 -107 -179 249 -86 6 -131 93 -283 -192 137 -44 -77 -32 77 -22 17 161
5729 161 -131 45 -182 -36 -111 -103 120 72 -54 -205 -288 117 168 -212 -51 -21 278 259 164 -82 56 238 426
5752 426 16 178 39 263 -118 10 342 11 -67 238 326 -89 -95 -354 50 115 134 -140 -382 425 -280 -129
5774 -129 218 -101 -148 -173 -93 -68 -206 288 -42 -143 -36 -211 -1 -111 148 57 -121 484 -350 -238 360 301
5796 301 170 268 69 158 12 -51 -249 -260 -63 -23 132 -105 -90 110 150 -14 69 -11 114 62 91 256 134 -173
5820a73O93n78K00p3l9j45J89J68l45M3P3l7j0k41K02K73k67J23k4j41J46k42
5842b05M50l18J16j77m46M82J80j3p6J48j15L0p0K60l88L7J70j24K57j3n5j00
5864C0J42Nl11oK83j28J3l3J3R2J04k30L1Q2N8n5r8k2q6L16k54J62N7k30K44m9
5890A30Nk06K07j49P2N4o7P2j00j8LK92l77J59k80L08q8j12q6N90l64k58Q9M1
5914h3L31J24l94K56j90R6J4l67j5K09N7k07L51no3j17J03j54J21J20k94Np0q4
5938b56N28O0l57q1L39j77m39O05l50k80L26J9p9Q6J6j0k31K64j48J02P0l7j91
5961b21O3N1k25N57k70J00q8O6M9j78L07l47Q5K23rl49O3L68M1l59J21j51J42
5984C9K96j10k87O6k04K57j17j4j59K15Q1k59K14q7O4K1K16j10l12J48j22L88
$$ plain form
5820 -173 520 -58 142 69 30 -115 74 242 -103 -60 13 -24 -34 -275 -73 200 -67 56 32 -109 37 -205
5842 -205 245 -73 43 -134 -580 -98 82 69 -7 141 26 56 -14 246 -142 -105 65 -59 198 185 130 30
5864 30 172 177 -134 -140 143 15 28 -5 8 100 204 -26 5 87 145 90 -8 -30 -116 200 -54 108 165 -65 179 130
5890 130 135 -71 136 -13 59 113 46 118 18 0 3 295 -82 77 -203 105 17 -95 -181 409 45 -213 -124 -83
5914 -83 248 372 -22 234 44 140 154 -213 -228 -19 38 -169 182 177 114 -3 100 -54 67 187 -107 -102 -172 -256
5938 -256 272 332 -25 -106 233 56 -383 222 -128 -408 -82 -63 -142 -56 -40 -50 -281 -17 -165 -63 7 -30 -221
5961 -221 -158 -107 -332 225 -45 55 -33 33 82 -96 211 -136 -51 172 163 -186 -123 245 286 -73 48 -103 39
5984 39 335 225 -62 4 -200 57 -60 -74 -233 -18 63 -196 18 -69 -5 16 232 122 -190 -42 -164 224
6006B24j12k73L47j66P0m2o2J4o6k26L55k4j77K15j13q9J44q6J71j43J15p2K66
6029B70l05K11l69Q4J90j35p9l36L48K41J22l29j30N31j93k50K68j72k47L82j70
6050f8j60L32L11o57k35N82k0l40m7J41m2J8L30n8j86J74j48j06Q2Q2L97j62m17
6073a97J29j35M21j0k22J09R9m4k66J13J16l73K64Q6J19l81J82j26R3j68L96j07
6095I8o9L06k34k78L44k37J2l8J09m8O9k76K69J89k04km9L07m11J46P7m8o5K21
6119A88Mj97k14M05k65J41k03K64l18M5L02o47O97J66n22J34J83j98Q9j36k1J17
6141A4J25L27m40j71L67k63N4J43k40K3j61M95k20l4L54k73k8O4K67l64l8k70
6163b69P5K35j49k05K48o8N9J19j57J03LJ78R0l04j8M75l26j0Pj38J58M1j1l82
$$ plain form
6006 224 112 -161 186 20 90 48 -14 0 -66 -292 63 39 -138 77 -36 -125 19 -67 104 -39 76 4 270
6029 270 -35 176 -193 -109 81 -54 -133 -469 -121 120 242 -87 -217 314 121 -129 139 -33 -280 102 -68
6050 -68 -228 104 415 -242 -477 105 85 -255 -302 -161 -203 -185 145 87 -99 75 -73 -179 -97 -15 382 220 -197
6073 -197 -68 -203 218 208 -14 95 194 150 -116 -3 113 -260 4 90 209 -172 10 -116 -23 -191 205 98
6095 98 29 335 101 -177 167 -70 -58 -96 13 -35 34 -242 27 216 12 10 -39 268 -143 3 80 32 -33 188
6119 188 192 -5 -219 186 -79 62 -141 123 -195 -150 152 -495 202 368 -154 -20 163 -35 54 -82 -103 14
6141 14 139 466 26 -145 222 -41 13 156 -84 -61 -222 273 53 19 373 100 72 136 403 39 1 -269
6163 -269 -194 41 -108 -313 -65 -133 -74 45 -112 -9 -6 172 262 -42 -60 415 89 79 86 -52 106 147 136 -246
6187b46J30p0L70l20q6L63l32l6M38l99r8L52J56k65j45KP2N7j01P5J71j45N3
6210dk10K31J25n7k2j35P2k99R0J54K8o7J44J77J08k74j03Q8k74L54L3k46L82
6233B95n65J93nM1j10M90l54p2j44J77j9Q6j6k26k6M35l96L68r0j40j51J19L62
6256B52o9j63J6J36j61J28k96K82m25L31j78k7J45L18L3j59j30n3J72m57K59K05
6278A59l4K30n1l57K50l0j65r7L07j73J20r5j34K41l40L53k57M51n09M2L37j50
6300I8k65j77M02Q0j83K01m34M37k38m2K36j55p0J26R9j60k02K77K86l28K78k64
6322BJ5j25J76M9m6m06L90j61L23k06k2J0j95K68k95MK00j08j49L58K10n71N51
6345B72m18k6J25J02Q5n0j71J56O0j25M16n83J78m8Q6JP3l66J75l60K74M54m32
$$ plain form
6187 -246 -116 -186 184 -136 -222 141 -191 -227 211 -188 -286 66 222 -43 -188 -186 -114 -57 -158 -83 88 -57 -4
6210 -4 -214 17 142 85 63 -72 0 -299 -209 -55 -27 -94 50 227 335 61 -42 46 -228 126 159 -87 295
6233 295 -270 -77 -82 -41 -151 339 -15 -87 -231 -54 -73 13 -3 -229 -255 180 -216 152 62 -78 -229 -110 252
6256 252 183 20 36 172 11 139 -157 125 -300 31 -147 -174 -29 289 322 163 33 -20 152 -305 -46 159
6278 159 125 355 304 -53 197 167 2 -95 212 39 159 64 -70 171 -169 184 -73 378 -131 -89 248 98
6300 98 -167 -344 58 138 -45 156 -278 159 -79 -121 115 -40 -110 16 115 -45 -247 30 316 -12 266 2
6322 2 17 -108 68 117 71 -335 55 -106 217 11 -11 -1 -196 72 -223 -219 -19 -127 -276 82 292 -279 272
6345 272 -146 -172 -47 55 140 90 -81 75 135 10 426 -157 21 -27 59 60 133 -233 -58 -418 -144 310 -122
6368a22K10K56l67rQ7J24M2k32Q9l08Q5K74k43K32J7L7m03K01J91K4k13R3j3k05
6392a53N77n79N22k93Q2j62J12k77K51j91K7L16k34m0K0J02j72L50k44j07J46
6413E3j11n2Q9n0J99k28J85o9Q5K5k69J59m70L68k28L91J86k66K43m32M37l01
6435e6k53O41k97j32K79P6k02j41Q9N5l06L85Q0l84J70k8J82k55K6mj31K81k49
6458a74J70K81m53K12J91k50j54K88l9P5k97K12j68K04l04k6L50j04j34J25k13
6479b08K64J2r2J52l7KR3j28l3L88m61J0K2J73l68L04j23J0J09R6m03j12J77p5
6503b28J50J1L38j54k41m4r4J41L54m20Q0R1j25K30j5J30l38J69J6J26m14L06
6525F9R3p0J29o74O58k79M8J10k68M23k65N0r9J44m2k44nP5P9j38K04K97l94j61
$$ plain form
6368 -122 88 344 -23 -32 55 179 221 -11 78 -230 -145 129 -114 118 135 172 -231 -30 161 185 -28 65 52 -153
6392 -153 424 -155 367 74 156 -6 106 -171 80 -111 -84 232 -2 -42 -22 80 -92 258 14 -93 53
6413 53 -58 -110 -21 -71 128 -100 85 16 101 126 -143 16 -454 -86 -314 77 263 -3 240 -192 245 -56
6435 -56 -309 332 35 -97 182 258 56 -85 4 59 -247 138 218 -166 4 -24 158 -97 -71 -75 -206 75 -174
6458 -174 -4 277 -176 36 227 -23 -177 111 72 147 -150 62 -106 98 -206 -232 118 14 -120 5 -208
6479 -208 56 68 -24 128 91 93 186 58 25 413 -48 -38 -16 157 -211 93 -30 -20 89 185 -218 -330 -153 -228
6503 -228 -78 -67 271 117 -124 -168 -262 -121 233 -187 -107 -16 -141 89 74 204 -134 35 51 177 -237 69
6525 69 162 92 221 -453 205 -74 -26 84 -184 239 -26 24 -75 69 27 -217 -222 -147 -68 -206 -2 295 -99 -260
6549b60K50J7j30L12p3j2j63p6K83k26K39l66J51MR6J21l39K85l91J82L03r2k75
6572a60L66k44J35j34l00M47jk97Q4n3J93M5Q4M7k98J21k95L66m8l14M39J65m48
6595a00j05J05L08m49J09K51j22R1k06J64k78J94O2M8j86P9pm4q3L32k38P8J85
6618A88m24L3J56P5o3j6L75k73k24L53k45N5L92l32K31l1j90j45J33j17J47J16
6640A94k6l93K87O3k41r2j01N20m58L22jm60K07j40K07L0m9J85K00k85j3l06M27
6663G7N2m16m3M99k32k03N8M70l19J59p2m6j93L3J45m8jK32j03n5m4J56l66L65
6687A05N6k01o0J31J71m61N52j34j78k61M28j38J07po0N9l65J03J05j79L18J6
6709A07R9j00J63r2l24J85j66j5K10k43J61Q7n0q4J8K73m39K25n1K61l23R2L14
$$ plain form
6549 -260 -10 7 -123 189 116 104 -59 -135 148 -78 161 -205 -54 -50 46 167 -172 113 -278 -96 207 115 -160
6572 -160 206 -38 97 -37 -337 110 109 -188 -104 -157 36 81 165 212 -86 35 -260 106 58 -256 183 348 -100
6595 -100 -205 -100 208 -241 -132 119 -3 88 -118 46 -232 -38 24 72 -114 -35 -42 -86 -169 163 -75 3 188
6618 188 -236 -203 -47 28 -35 -51 324 51 -173 180 -65 -10 382 50 281 250 60 -85 48 -69 78 194
6640 194 168 -225 62 125 -116 -208 -309 211 -247 75 74 -386 -179 -319 -112 -82 -131 54 254 -31 -44 -350 77
6663 77 129 -287 -330 169 -63 -266 -208 262 -57 102 30 -16 -209 -176 -31 -79 -80 152 49 -6 -50 106 -260 105
6687 105 161 -40 -100 31 202 -259 293 159 -19 -280 148 10 117 110 50 109 -256 -153 -48 -227 91 107
6709 107 206 106 269 177 -147 38 -128 -143 67 -176 -15 72 22 -62 -44 229 -210 15 -36 225 -98 -6 308
6732C08n1o10M93j92J84l60j47O63j54p0O4k34L24n99M40j48K64k47r8M3j63K24
6754f6j36K78l04K73k07O17m35J52p9m01K73J27L8k29K8j28m27L39M01k32J71
6775E3N5q1l88L51O9M7j89J76k50R1m8L12M2j08q7j62m7J7J96k0l48K74L81m65
6799a29O6j31L89j75j22L97m67k3K78m3j32M3K35k95N4J98R0m15K57rj33K14l2
6822A15n8q4L00l71K62j94q4j5n8L90k27K2K17j62o3q2N7K32q1j54L06n66P5L65
6846A42j07k78J07NQ7R8LL5Q7k33j46J91J9N6l47J20J54n1J9N9n9n7K81O0k37
6871HP6n8m3j05K41N2M5l35L71l73p1K53j58J03j75m9k32N32k77L53l41J72K90
6894B79j90k8k47K11K1L2m47O41k89j73K31J6j34K0k4Q0N0q4K7q7L30l92K77k30
$$ plain form
6732 308 257 -353 140 -52 132 -228 -375 288 134 64 128 -106 218 -381 59 -89 175 -72 -170 -127 -290 -66
6754 -66 -202 76 -228 45 -162 455 20 172 93 -308 -35 92 130 -99 -71 -199 -626 -287 114 -118 53
6775 53 108 27 -361 -10 59 106 -83 93 -157 -66 -114 198 240 132 45 -117 -164 -147 49 29 -319 -45 336 -129
6799 -129 -63 -194 195 20 -102 295 -172 -195 83 40 -92 -49 186 -109 -55 143 233 -182 75 66 -67 147 115
6822 115 57 -27 273 -98 164 -30 -114 -129 -187 203 -24 -2 215 53 -10 -92 -35 197 116 -38 268 -298 -223 142
6846 142 35 -243 -136 -131 -44 54 57 92 179 -54 -200 -9 10 66 -281 -161 -7 -58 -39 20 -39 -96 185 245 8
6871 8 84 26 -17 -122 119 171 216 -119 252 -121 -192 61 -97 6 -169 -218 -450 82 -195 158 -183 -11 279
6894 279 89 61 -186 25 46 78 -369 272 -17 -190 41 57 -77 -57 -81 -1 49 -35 -8 -95 235 -157 120 -110
6918a10K20j87n3J42J49l75K32k82j04N41k25q9RLJ66J5j95J70q7L47l6k86L77
6941C42p16M3J70M16l28R6N3o4J90j88K45j7k05q3K4p4J78J17j68k62K60j35p2
6964a78O60p85L11O5r4J37j83Q2j57J32k9r2O4J38R6l11K22j76J3O8J70N0m01
6987a98J56j10Q8R2J1N0k54K16O4k52k65N13R1k37M5j97N62m36K06k29P3L76k41
7010A24j97L06l47OJ17L3k79M35j5Nk72N6J30j21L51o8k12m07M70l8M1k24o3J60
7034ij05J01l5q4P4j31J17K47k81j7M21k56L2k69J98J02l11K73L4M1j75N5k1K82
7058B83k46q0J49k69J73j56K91k25J0J02j81K81m99K59J07k98J24J18L6J08nk25
7080a43M45j40Qk7j09o4k40K82k6R7m1j83J78Q6j48R0L9J05o0k75j06P0J44J23
$$ plain form
6918 -110 110 -77 -130 12 161 -214 18 -264 -368 173 -52 -141 -132 -129 37 52 -143 27 -60 287 251 -35 342
6941 342 -374 -331 -161 255 -73 23 76 12 202 14 259 242 37 -46 -22 -96 82 199 31 -231 29 -106 -178
6964 -178 482 -303 8 73 -21 116 -67 15 -142 -10 -39 -131 -67 71 167 -144 78 -98 -85 -17 153 203 -198
6987 -198 -42 -152 -64 28 39 89 -165 51 115 -137 -402 111 202 -35 10 -187 375 -61 145 -84 -11 365 124
7010 124 -73 233 -114 -108 9 42 -237 198 183 188 -84 -28 102 -19 332 264 52 -355 115 77 118 -106 -169 -9
7034 -9 -114 -13 -48 -132 -58 -189 -72 175 -106 -123 298 42 74 -195 3 105 -206 67 101 142 -33 22 1 283
7058 283 37 -43 106 -163 10 -146 145 -80 -70 32 -149 132 -367 -108 -1 -299 -175 -57 -21 87 82 -143
7080 -143 302 162 170 143 34 -30 -270 12 -14 83 42 -141 37 123 -25 65 104 209 149 -126 -232 -162 -18 105
7104A05J37l85K42J73l60j89L26l84L81m0o5j36L3J87K0j09k04K56M5J28r5j83
7126a17J65L02m54J90k63J13j40l66O24m8J8l00M07O6k18J66J93k80j31j46J05
7147a14n5K74k55j93l8K37K67j19j25J80k24p1K09q8L38l61K7J91l43J96J89o9
7169E3l04J28j84n1N80k19k01L02j27O0J7k99K46k33L68j92NK60n1n1j39M5N2
7192F5n14M53j76L65k75o1J66J19M7j81k1J12l39J79K10r0o0o2L9q2O8J76l64
7215b26J51k7K54q7N1r8J79r4j77L6L45m15J30j0J67k84j74J41L45k96J84J19
7237B14r6k4j73J30J89j09l09J91K20l10j67N45l64K7N0K09m84L00l0K55j88j25
7259d9L7J44l0k22o6L30l22J16K97k8j34K89j64l24K29L6R6j71k81N02k71l0R6
$$ plain form
7104 105 242 -143 99 272 -88 -277 49 -335 46 6 -59 -195 -162 25 45 -64 -268 -12 33 161 66 -117
7126 -117 48 350 -104 86 -177 -64 -204 -570 54 6 24 -276 131 197 -21 145 338 58 -73 -219 -114
7147 -114 -169 105 -150 -343 -381 -144 123 4 -121 59 -165 -236 -27 -115 223 -138 -111 80 -263 -67 122 53
7169 53 -251 -123 -307 -358 222 3 -198 104 -23 37 54 -245 1 -232 136 -56 -51 209 158 107 -32 13 65
7192 65 -449 4 -172 193 -82 -143 23 142 189 8 -13 99 -240 -61 149 59 -1 -63 -24 -106 -38 138 -226
7215 -226 -75 -102 152 65 116 18 197 103 -74 -38 307 -108 22 12 179 -105 -279 -138 207 -89 95 214
7237 214 118 94 -79 51 240 131 -178 13 233 -77 -244 301 -63 -36 14 223 -261 39 9 264 76 -49
7259 -49 -12 132 102 -120 -186 144 -178 -62 235 207 73 362 198 -126 103 139 235 64 -217 285 14 -16 80
7282H0l02J76k14L37k79J58J55k20p9J92k26K35K92l16j0j32L61k91K1k16L52
7303G4l48L11K94j92L8k11J69l8k42N62l83k79J14L5L46k29j82J01K29k62K37
7324A44n10L28l24O21l2M2l18L07m25J09lO0J88l63O1J90k31L07pk11o5k3N60
7347D05j58l80J49j46J03J77k03j4q8J97K25n98L89J6Rn1j32J84k21L03l23K78
7369A21l86M66l37K32L3k57n5K75k35q2j2J01J07N2M5k0L5k09K27M3J68l96J11
7392B7k60J74R2Q2J81l57k9K03k74M2k4N23n79J8j31K89k85O10j56l97J34N6O4
7415CQ6k6j20J62J65k82L00j56k38O58q47L84k90J16R3o4n3J22J21j50r1M70k10
7438A53m68J00K44j7K5J57j83J39j97j70J13L22l9k32j03O3K54K61l82Q9n2OK5
$$ plain form
7282 80 -222 -46 -260 77 -202 -44 111 -109 -188 4 -222 13 305 -11 -21 -153 208 -83 -62 -278 74
7303 74 -274 37 331 139 177 -34 135 97 -145 417 34 -245 -131 -96 250 21 -161 -60 169 -93 144
7324 144 -366 -38 -362 259 227 269 -49 258 -167 -58 -61 -1 187 -176 -115 75 -156 151 144 -67 -132 -155 405
7347 405 247 -133 16 -130 -27 150 -53 -67 -155 42 267 -331 58 74 83 32 -100 84 -137 166 -157 121
7369 121 -265 201 -136 96 129 -128 -183 92 -143 -225 -237 -136 -29 23 68 48 83 -126 101 144 312 -84 27
7392 27 -233 -59 33 115 296 -61 -90 113 -161 -119 -143 380 -199 -181 -312 -23 -308 302 146 -251 -117 -61 3
7415 3 89 63 -57 105 270 -12 288 132 -106 552 -295 89 -201 -85 8 -56 -109 13 134 -16 -107 363 153
7438 153 -315 -215 29 12 37 194 11 150 -47 -217 -104 218 179 -53 -156 -93 161 422 40 129 77 83 108
7461A08j12K08j2j29k10J39N8l8J18L5r7k41M04n12J80Q1N9m11N12p7rJl9Q5k38
7486a37K15j59J4N3L36l80J54J24k79o4M07j66l85j4M84o16M07O9j13l0j2N3j60
7509a99J94j42L53j97j18Ro5J65K08k83K50r1l7p5k49M76n10M70j64M1j63J13
7531a4K44k58P6p5k83L18q5m7N08m05O7j25o4m3r1J43J60k11K84J12m81J21O9
7554h0M4M31m98L0j79M98o6j10j63M48n96K20O7J4k92N02k18Q0n42P31k27j34
7576d0Q4O6l5nQ0j38O0k6m8J72l02L48k5j29K36m61K44j53J34j61J39p0K34R1
7600B95k85P1j40J67m63K53o3M25j57j56K95n8l7k29J43p3K82j63j34L5J20O9
7622A97R2j52J19m46K34M35n10j77J88m5O3J26J25n49L10j0j09P0J26N4k45K25
$$ plain form
7461 108 -4 204 192 63 -147 -8 50 12 130 165 68 -173 231 -281 -101 -20 39 -372 140 63 54 55 16 101 -137
7486 -137 78 -81 -67 -14 322 -58 96 220 -59 -123 284 118 -267 -281 203 -413 -6 63 -50 -80 -92 -39 -199
7509 -199 -5 -147 206 9 -109 -100 -165 0 208 -75 175 84 47 -28 -277 199 -311 159 -5 36 -127 -14
7531 -14 230 -28 48 -27 -310 8 -77 -124 384 -21 46 -79 -143 -186 -277 -134 26 -185 99 211 -270 -149 -80
7554 -80 -36 395 -103 -73 -252 246 180 70 -93 355 -241 -21 46 60 -232 270 52 132 -410 321 94 -40
7576 -40 44 110 75 70 150 12 72 46 -2 170 -132 216 191 62 298 -163 81 -72 62 -99 40 -30 204 295
7600 295 10 81 -59 108 -355 -102 -165 260 103 -53 242 184 147 -82 61 -12 270 107 -27 8 128 197
7622 197 289 137 256 -190 44 479 -31 -208 -20 -65 -2 124 249 -300 10 0 -109 -39 87 141 -104 121
7644A21j43J43O7l5k03J21J19l22Rr1K65k8k5J42k48P0q5M14k84m2m1r0K68j7
7668H5M4k96L19k89J33j84K4J30oj7j85J84J5j56K34p1K4l4p4J14j93J93n1J42
7692H5m27L47l21K27j38K53l8K08j22Q1J40j69m58L95j32O5q6L99k47J34k87J69
7714G8N4j59K6M8l3Q4J88k85K01j76k10K07K40m70K97q5%j06J03j80M2K05J9J38
7738B26l15k19L92O0k4M3j46K4Nk84L54j50k1Q6O5O7l8k54K70P5l31L90k52r6
7762g3l74L69M16l56K73l32r3L34j03k25K13j70M26k53o4J09l44M53m47M57j34
7783H2j65L72l12J29J31j63k33K21lJ97k91R4k75K7J73Kq0j32K83l61M38j30j00
7806i6L00k80L14k31J8J32L7k41j3L10l99J01J27j52J17j59J98J82k37K1n8K05
$$ plain form
7644 121 -22 121 188 153 -50 71 190 -132 -123 -214 51 23 -2 140 -108 -38 -123 291 7 -35 -76 -166 102 85
7668 85 129 -167 152 -137 -4 -188 -164 -34 -40 -57 -242 -58 -43 -199 35 -36 -12 -46 -120 -6 -199 -6 -57 85
7692 85 -342 5 -316 -89 -227 26 -12 196 74 155 295 126 -332 63 -69 -4 -90 309 62 196 -91 78
7714 78 132 -27 -1 47 14 98 286 1 202 26 -184 23 263 -207 90 5 5 -101 2 -178 -136 69 88 226
7738 226 -89 -308 84 144 120 163 17 41 46 -238 116 -34 -55 31 96 163 125 -129 141 216 -115 275 23 -73
7762 -73 -447 -78 338 -18 255 -77 -170 164 61 -164 49 -121 305 52 -12 97 -247 206 -241 216 82
7783 82 -83 289 -23 106 237 74 -159 62 59 256 -35 59 -216 -189 -16 -14 -94 -226 57 -304 134 4 -96
7806 -96 204 -76 238 7 25 157 194 -47 -60 250 -149 -48 79 -73 44 -115 83 265 28 49 -9 196
7828A96r1j85R9j06j49L05J44j70Q3j41O2j89J21K18p0j39K63m66L93k78l3J00
7850c3J51K46m95J94j23n9P2M0l3n6J98K27l80K89k54K8K11l9L28m09K9j51j1
7873c0m5K52l14L77j79J3k72J85K4J57q7k38L97j6l7m80O50p24K70J76l98M13
7895I4j99k39L66qm4J14J06k14M4l0J30J09n23L15K64k18o7l12L43P2l43L42K18
7918C20l53j89K43%j74K41k34L71l39K5J94k90J41j02J65k1j16n7N1K46k16o9
7940a63L2J35O8q9K41J93o79J66K47r6j83j21J05K43J5l98J28K16o9O2j17L20
7962B56o12K98K28j62o7K87m15j1K40j01K4K75n0k37l7O2q1R2Nk98N27k18N8O0
7986A23l58P6L44l41k11L89j54r1J88k4m2J19R6J0o6j5K08n54M25n4k32R9N4o5
$$ plain form
7828 196 105 -80 19 -87 -236 69 213 43 126 -15 47 -142 -21 197 127 -12 251 -215 178 -100 -133 -33
7850 -33 118 364 -131 63 -60 -119 -47 -7 -40 -96 102 329 -51 238 -16 12 223 184 512 103 132 -19 -30
7873 -30 -75 177 -137 240 61 74 -198 -13 11 168 81 -157 240 224 187 -293 357 -367 -97 79 -319 94
7895 94 -105 -344 22 14 -30 84 190 -24 20 -10 120 229 -294 21 285 67 0 -312 31 103 -240 102 320
7918 320 -33 -222 21 21 -153 88 -146 225 -114 -89 105 -185 -44 -146 19 -2 -118 -175 -124 122 -94 -163
7940 -163 -131 4 72 -17 224 417 -262 -96 151 55 -128 -249 -144 99 114 -284 -156 60 -9 53 -64 256
7962 256 -356 -58 170 8 -59 228 -187 -198 42 -59 -35 240 190 -47 -84 -22 -103 -11 -6 -304 223 5 63 123
7986 123 -235 -159 185 -156 -367 22 -132 -223 -35 -59 -101 18 114 124 58 43 251 -303 122 68 -164 -65 -11 -76
8010g6j56K00N7J97P3j23k01n4J69q7K6K6j43L59k70P8N4j81j52Q3q5L20Kk12
8034i6j91N07J23o42N12q1r5n6J14r0L1j47M6rP2L91q01K86j4L3l2L06k28M95
8058D34m99m78M34L65l59L17j59O7K7l13J25R5l3K0L67l17J3l39K49j07L8O6P5
8081H8k0q4o3K95P2l64J6K44m52Q0J13J26k87N01j64J39j73j06k15L88N2O7j51
8104A02p0O3q2N2K85j98k87L90Q6m52K28K0M1k51P3j27L21m0m3or9N9o3o3J18
8129E7J70j26j75N2n6M29k97l47M61L04k11k54j55P7J44j19J41Q7k78l8J85j56
8151a05J57k79j5L27pl10L40k20J18Q4m4J53k52m6K30j6j97k22Q1J62J7J35j98
8174a07J77j6j44K62k61J33q5Q6Q0k40L5j06J92j37J56o9K97
$$ plain form
8010 -76 -232 -32 25 222 295 172 -29 -83 86 -1 25 51 -92 267 -3 75 129 -52 -204 -121 -206 114 116 -96
8034 -96 -287 220 343 -299 213 132 37 -19 95 5 36 -111 -65 -74 -2 389 -412 -126 -140 -107 -139 167 -61 434
8058 434 -65 -543 -109 256 -103 214 55 122 149 -164 -39 56 23 43 410 93 106 -233 16 -91 -53 13 88
8081 88 68 -16 -79 216 288 -76 -60 184 -268 -188 -75 51 -236 265 101 240 67 -39 -254 134 186 253 102
8104 102 32 95 13 65 350 152 -135 255 341 -111 117 137 178 -73 0 -127 194 154 111 105 6 65 2 -61 57
8129 57 227 101 -74 -22 -78 351 54 -293 168 472 261 7 -148 -71 73 -46 95 182 -96 -134 51 -105
8151 -105 52 -227 -242 85 78 -232 108 -112 6 90 46 199 -53 -99 131 115 -82 -304 -223 -61 -44 91 -107
8174 -107 70 54 -90 172 -89 44 -41 45 125 -115 -80 -186 6 -131 25 -44 253
8191B53
$$ Imaginary data points
##PAGE= N=2
##DATA TABLE= (X++(I..I)), XYDATA
0@%%%%%%%%%%%Qj6J6j6J6j7K5l2L4m2M8n6O6p4Q7r8J09j24J40j57J78k00K23k48
35a30K76l09L42l77M18m64N12n68O31o99P75q60R58j073J206j362J552j786K083
54A125k473L014l812N104p548J3714n4608j17867J42828J24665o9667j13979M2160
67c7344R6005j1420q9442j2192P4056L6342n7331m6823K6550L6129j1479j5060
79a2009J4997K1091k620l0204l1450J6380M9511K480m8654r306L9006M931l0652
92a6499O243L5329l854m1411j2920K9497J6557k4212r427L8091J6187n1871l1772
105e0062N2997M4414m0772m8195J9658L6244o530k4315K242K6378J4954k4295
117B718l4724R354M0303N495l3655j6516K3012K4895r895k7736N649L6989k087
$$ plain form
0 0 0 0 0 0 0 0 0 0 0 0 0 8 -8 8 -8 8 -9 16 -16 18 -24 24 -32 34 -40 47 -51 58 -66 74 -83 95 -105 118 -130
35 -130 146 -163 179 -198 220 -244 268 -300 331 -368 407 -453 505 -568 638 -724 828 -958 1125
54 1125 -1348 1666 -2146 2958 -4590 9124 -45484 -163351 -20523 104142 34475 -79504 -37344
67 -37344 58661 47241 -42201 -54393 19663 56005 -1326 -48149 -21599 14530 3051 -12009
79 -12009 2988 24079 21459 -8745 -40195 -23815 25696 28176 -20478 -29784 9222 14153 -16499
92 -16499 -10256 25073 21219 -20192 -33112 -3615 12942 -11270 -20697 17394 33581 -18290 -50062
105 -50062 2935 47349 6577 -41618 -21960 14284 7754 -16561 -14319 12059 27013 2718
117 2718 -32006 -22652 17651 23146 -10509 -27025 -4013 20882 10987 -16749 -11100 25889 23802
130B3802m7756p308M8806J1326m2919p480L9486P909l2146p488K5558R522k1832
143e20j5581J4690J7804r594j1538J4874R609k1857r488K4011P809k2435o600
156h816J5681K103q043J279L618K505N275n050j6738k590J7157Q149r060j0749
170e279K619J2268j509j6093J976K6036j962l5425o490L2345Q043k3120j802J9186
184A0793j482j8001m658J1095J0791k194j1956n507N329K504J157P318N8j0321
198e074k539M075n802q06J5595L297j7869l670J2189j135n860R068O570j2255
212d216j0280L826Q589K995k482l64N317l176j4610K137K0240K29j8242R93J3391
227D347p394j0692J2525J2471q525q858J558R37m95K576K867K031j830o988k39
$$ plain form
130 23802 -23954 -31262 17544 28870 -14049 -21529 17957 25866 -6280 -13768 11790 21312 -520
143 -520 -16101 -1411 16393 6799 -4739 10135 19744 -2113 -11601 12410 20219 -2216 -8816
156 -8816 6865 8968 925 2204 5822 8327 13602 8552 -8186 -10776 6381 14530 5470 -5279
170 -5279 -2660 9608 8099 -7994 -6018 20018 18056 -17369 -23859 8486 16529 -6591 -8393 10793
184 10793 9311 -8690 -13348 -2253 8538 6344 -5612 -11119 -5790 -3286 -2129 5189 5247 -5074
198 -5074 -7613 -3538 -9340 -10146 5449 8746 -9123 -12793 -604 -1739 -7599 1469 8039 -4216
212 -4216 -14496 -10670 -2081 914 -1568 -1932 3385 209 -14401 -12264 7976 8205 -10037 -9044 4347
227 4347 -3047 -13739 -1214 11257 2732 -6126 -4568 -3631 -4126 -1550 1317 3348 1518 -5470 -5709
242e709Q570J420n911L726L462j0552m334J1921L826p215L599M511r269m683R733
257C095L281n943M55K828l025l364K400N760M546n280j0098L583J0384o355r021
272f754J2508Q427j4756q559J3128P626q332m001L462Q24j167k124j656N697O156
287A0479o491p918L655N421l57n40l492l488N988M099j0018k429J5224J725j7947
302f089l087J4854K852j0687j881O734K133m944n495L760R706k746j2140J991
316e039R605n528o585R071N571r864m239N523J446j228J145j740k046L162j109
331a855o227L435R596k362q861j290L372M127J074o640j620J0255O72j5688j069
346a3081J9067L671j7352m517J0710L369n517k377K904O307o70r661l070J1291
$$ plain form
242 -5709 2861 4281 -1630 2096 5558 -4994 -9328 2593 6419 -796 2803 7314 -1955 -6638 3095
257 3095 6376 433 888 3716 691 -2673 -273 5487 10033 4753 -5345 -1762 8622 2267 -6754
272 -6754 5754 14181 -575 -9134 3994 11620 3288 -713 2749 3573 2406 282 -1374 4323 10479
287 10479 3988 -3930 -275 5146 4789 4249 757 -2731 3257 7356 -2662 -5091 10133 11858 -6089
302 -6089 -9176 5678 8530 -2157 -4038 2696 4829 -115 -5610 -1850 7856 5110 -7030 -5039
316 -5039 4566 -962 -7547 1524 7095 -2769 -7008 -1485 -39 -1267 -122 -1862 -3908 -746 -1855
331 -1855 -8082 -4647 4949 2587 -6274 -7564 -4192 -65 1009 -5631 -7251 3004 3676 -12012 -13081
346 -13081 5986 9657 -7695 -12212 -1502 1867 -3650 -6027 -3123 3184 2514 -7147 -10217 1074
360A074N004q621k653M674j124k448L096J158q15L491j883p630K856Q417l079
375A517m877N174K004p445m86O693K716k615l755j071M441K843p716j634J2347
390H136K830j4878m118J3548L699q418j766K994J926j33l563k626O675O297p263
405C340q938N839O290k692k445j25J60L413k22p015N30J0738j136j0985Q33P615
421E200j936m375L940J448l261m53P9k47K406J35l643J776K318n310j980Q042
437D139J727q465j091N663p06k955J453n15l40L422k742n860L846P463l591o432
453d984J522K496N98j9k415j592N394P14q051q37R502N77p643K82L244j899M22
470b689J983j655o71K945k220l109L290J861k411R52J123m105o07O658q58m581
$$ plain form
360 1074 6078 -2543 -5196 -522 -1646 -4094 -998 160 -655 2836 953 -6677 -3821 4596 1517
375 1517 -3360 1814 3818 -3627 -4113 2580 5296 2681 -1074 -2145 2296 5139 -2577 -4211 8136
390 8136 10966 -3912 -8030 5518 9217 799 -967 2027 3953 3820 257 -2369 4306 10603 3340
405 3340 -5598 241 6531 3839 1394 1269 1429 4842 4620 -2395 -1865 8873 7737 -3248 -2415 5200
421 5200 3264 -1111 2829 4277 1016 563 642 395 2801 2936 -707 1069 3387 -1923 -3903 4139
437 4139 5866 -2599 -3690 1973 1267 -1688 -235 -750 -1090 2332 -410 -6270 -2424 5039 1448 -4984
453 -4984 -3462 -966 -368 -387 -2802 -4394 1000 1714 -6337 -7174 2328 2905 -4738 -4456 -1212 -3111 -2689
470 -2689 -706 -2361 -3032 -87 -2307 -5416 -2126 -265 -2676 -1724 -601 -4706 -5313 1345 487 -4094
486d094K208J511k804L98K347j695k30M873k788n806L494N450k365k415Q76J9
502a021N56J402k255j698N849J701p521m89N837P9k646J965m46k414L018J517
518C434m313J030N261k112m581J758J938r39J909O35m297P62M054k447k375M035
534C752P55l760Q85J551l462J665M987l358m139K816K368k674O13J166k610R65
550A520K413l747k110N748J318n149m20K740j590P6K339k294k313L856L76n357
566b594J087M631j947j785R04j741m60L850n44m267J318L780l463k512L331J31
582b81j323J890j569l606K949L903l846k177L343l24k326J670M73k624K227K212
598E91m388j330M533R86l256L86J364k176J380J650l010l46M438j535m136K321
$$ plain form
486 -4094 -1886 -375 -3179 -2781 -434 -2129 -2359 2514 -274 -6080 -2586 2864 499 -1916 -1040 -1021
502 -1021 -465 937 -1318 -3016 2833 4534 -2987 -3476 2361 2440 -206 1759 1313 -1101 1917 3434
518 3434 -879 151 5412 3300 -1281 477 2415 1476 3385 4020 -277 485 4539 2092 -283 3752
534 3752 4507 747 1632 3183 -279 1386 6373 3015 -1124 1692 4060 1386 1999 3165 555 1520
550 1520 3933 186 -1924 3824 5142 -7 -427 2313 723 799 3138 844 -1469 2387 2763 -2594
566 -2594 -1507 3124 1177 -608 296 -1445 -1905 1945 1401 -2866 -1548 2232 -1231 -3743 -412 -281
582 -281 -1604 286 -1283 -4889 -1940 1963 -1883 -4060 -717 -1041 -3367 -1697 -1224 -3848 -1621 591
598 591 -3797 -5127 -594 392 -2864 -2478 -1114 -3290 -1910 -260 -3270 -3616 822 -713 -4849 -2528
614b528K507j806M72J430l108k90L991l56m151K276K814k163j093J614j002O12
630g81L343k539l880L462L023l170j093L459j433r19K279j485j812L612K379n368
646i23j134M438j06j859J157r4j348J917J107l819R61M464j985l248K333L35j651
663E45K744K99l769Q63L813j909l677L441J697k530L25L23k330J531L257k681
679A942k862L297R03l071K42J680j568Q51J900l243k519M948J519m819j22K485
695A563j067r54J761j915r10L409k78m453J377L183j947j116J405j453q46L371
711A130q32l653J740L480l321k437K983P13j977J166K91l142J852K715k610j908
727c810K884J00k038J573o61j379K020K308m212j768M791N63l420L79K123j646
$$ plain form
614 -2528 -21 -1827 -1355 75 -3033 -3323 668 312 -3839 -1563 1251 -912 -2005 -391 -1393 -781
630 -781 2562 23 -3857 -395 2628 -542 -1635 1824 391 -528 1751 266 -1546 2066 4445 -923
646 -923 -2057 2381 2275 416 1573 1479 131 2048 3155 -664 297 4761 2776 -472 1861 2196 545
663 545 3289 3588 -181 682 4495 2586 -1091 2350 4047 1517 1842 2165 -165 1366 4623 1942
679 1942 -920 2377 3280 209 451 2131 563 1414 3314 71 -2448 2500 4019 -800 -922 1563
695 1563 496 -458 1303 -612 -1522 1887 1609 -2844 -1467 1716 -231 -1347 58 -1395 -2241 1130
711 1130 298 -3355 -1615 1865 -1456 -3893 -910 -197 -2174 -1008 -717 -3859 -2007 708 -1902 -3810
727 -3810 -926 -826 -2864 -1291 -1952 -3331 -1311 997 -3215 -4983 -192 371 -3049 -2670 -547 -2193
743b193N50J372k469j40M109q85l980J350K260q58j01J118k380J38L781j924l400
760c652L120L464l667j384K389l80K4K069j162k750K512J872k517n19K682o19
776A482j326J660r34k299L872J469l996p26M025p90k222J375P58j807J957O50
792C148l296L58L869j335k946J586M60p01J475L01l332J322L587k920l077L524
808B023J763l011L5R10j820O35K986k349k452L092J401l492J59J670j299R08R12
825B071k742j662M089N72m387R57K833j892j240J870j038j365K609P24m341N18
841b424L078q86j653J011p60k50K184j165l024K451L064l302k252L263K48k041
857b458J297M9k490J641K878l156j599K855R47k386N97K86j003J783J474l588
$$ plain form
743 -2193 -1643 -271 -2740 -2880 1229 344 -3636 -2286 -26 -884 -985 133 -2247 -2109 1672 -252 -3652
760 -3652 -532 2932 -735 -2119 270 -110 -86 1983 821 -1929 583 2455 -62 -581 2101 1482
776 1482 156 1816 882 -1417 2455 3924 -72 -798 3227 2437 215 1590 2348 541 2498 3148
792 3148 -148 210 4079 2744 -202 1384 1844 1143 2618 2919 -413 909 4496 1576 -1501 2023
808 2023 3786 775 810 1720 -100 535 3521 1172 -1280 1812 3213 -279 -120 1550 251 1159 2071
825 2071 -671 -2333 1756 2328 -2059 -1102 1731 -161 -1401 469 -569 -1934 675 1399 -2942 -2424
841 -2424 654 -232 -1885 -874 -1634 -1884 300 -865 -3889 -1438 1626 -1676 -3928 -665 -417 -2458
857 -2458 -1161 -1112 -3602 -1961 917 -2239 -3838 -983 -36 -2422 -1825 -1539 -2542 -759 715 -2873
873b873o92M236k45l660J383K249k273N50J620k398n00M054l54l759J215K319
889H72r43m50J059j734N85K714j995k701K962K618l407n37K417q13q48K628j184
906A243k940K943K120l203j238L362J50j534M93l15j113L040L61l497L23L207
922C402j386j834J554L74j493J551P13l170K49L764r87l001J504J003j183L96
938A456J71j699J172K693k937k338L041J203k653L91R61j951Q77K243k327k451
954b148L181J545l389n91K128o83M1J006k315l72K436J39l384O86K557j497p29
971a389J411j382q01K880n69l769J574K958j960j777J715K79j258J660p45k409
987c582K096K591k963j585K619K17j617J616l30k556K129K153k516j611L294M53
$$ plain form
873 -2873 -3565 671 426 -3234 -1851 398 -1875 -1325 295 -2103 -2603 1451 1097 -2662 -1447 872
889 872 -71 -521 538 -1196 -611 2103 108 -2593 369 2987 -420 -957 1460 647 -201 2427 1243
906 1243 -1697 1246 3366 163 -1075 2287 2437 903 1396 1081 -32 3008 3369 -128 195 3402
922 3402 2016 182 1736 2110 617 2168 2881 -289 -40 3724 2737 -264 1240 2243 1060 1456
938 1456 1627 -72 1100 3793 856 -1482 1559 2762 109 500 1461 -490 387 2630 303 -2148
954 -2148 1033 2578 -811 -1402 726 43 84 1090 -1225 -1597 839 978 -2406 -1720 837 -660 -1389
971 -1389 22 -1360 -2161 719 150 -3619 -2045 913 -1047 -2824 -1109 -830 -2088 -428 -1173 -3582
987 -3582 -1486 1105 -1858 -3443 -824 -607 -2224 -608 -938 -3494 -1365 788 -1728 -3339 -45 408
1003D08k650L35J577j248R56R29j988r28L551n61l019J747J634j668N62R84k496
1020a875K92L295n91l334J718K648j847j123J503q21K43J883j132k643K693K066
1036B975k651q94K330n07o98K000j481j726K920J199l515o34L481m83j710J028
1052A634m50j252K442L73k656O5L464j703k027J503M67j199J371N00l324P26L651
1069C585j881l039K324J227j751L74O61j752R51K248k339k429K892P63j966M6
1085h6Q55j008K53J461k146j662L498Q38m024K16K382p17j309J526j242r69K787
1102F53J42l364Q40K510j640j063J112j178MK227n00l186J545L003k293j903K099
1119i92O69j585J136l78j950K030J950k301j918K656P08j819Q58kj188J460J598
$$ plain form
1003 408 -2242 -1907 -330 -1578 -622 307 -1681 -2609 942 381 -2638 -891 743 -925 -363 621 -1875
1020 -1875 -1583 1712 1121 -2213 -495 2153 306 -817 686 -135 108 1991 859 -1784 909 2975
1036 2975 324 -570 1760 1253 555 2555 1074 -652 2268 3467 -48 -682 2799 2316 606 1634
1052 1634 1184 -68 2374 2747 91 156 3620 1917 -110 1393 1860 661 2032 2532 -792 -66 3585
1069 3585 1704 -1335 989 2216 465 839 1500 -252 699 2947 608 -1821 1071 1834 -132 -86
1085 -86 769 -239 14 1475 -671 -2333 1165 2003 -2021 -1805 577 -140 -1449 77 -1165 -2134 653
1102 653 795 -2569 -1729 781 -859 -1922 -810 -1988 -1984 243 -257 -3443 -1898 1105 -1188 -3091 -992
1119 -992 -323 -1908 -772 -1150 -3100 -1070 880 -1421 -3339 -683 25 -1794 -936 -938 -2126 -666 932
1136I32l026o78L728k02k871J130R31j096Q11J115k581L3L339l14l073J241K165
1153A584j562K24N84j652M65K798j289k849J934K346k456l85J711r95N6J722j370
1170H66k086K509J937k629p90K554r69n83J106q85j309K675J028l430n2K567q64
1187A645j222J191j82j189J554N42k570L69K835j128k287J220O53q99R53rk314
1204h38J179K552k091k243K248R32j986R2O31j038M57J995j859k155K720J023
1220A619k699q2J351p28l6J191j896r67K915M17l565M48K561j167j057J271j095
1237a519n31K243m7l164J031K606j589q61R17n00n06J685k59k878J833K778k342
1254a103j497K063j0q32O22j62j696J579K081k276j377K790K48k363J305M25j513
$$ plain form
1136 932 -2094 -2772 956 754 -2117 -987 -56 -1152 -341 774 -1807 -1774 1565 1251 -1822 -581 1584
1153 1584 22 246 830 -822 -357 2441 1152 -1697 237 2583 127 -258 1453 458 514 2236 866
1170 866 -1220 1289 3226 597 -193 2361 1392 809 1915 1030 -279 2396 3424 -6 -58 2509 1645
1187 1645 423 1614 1432 243 1797 2339 -231 138 2973 1845 -442 778 1431 532 1485 1476 -838
1204 -838 341 2893 802 -1441 807 1739 -247 -155 476 -562 -105 1890 31 -2124 596 1619
1220 1619 -1080 -1162 189 -539 -575 616 -1280 -2247 668 1085 -2480 -2032 529 -638 -1695 -424 -1519
1237 -1519 -2050 193 146 -3018 -1987 619 -970 -1831 -914 -1414 -1920 -235 -494 -3372 -1539 1239 -1103
1254 -1103 -2600 -537 -547 -1379 -757 -919 -2615 -1036 1045 -1231 -2608 182 430 -1933 -628 -203 -1716
1271a716J474J456k589o76L014l48k401J301J061r97L27J330j878l06K789m55
1287A386l153J702J935j459n98J540j482M01J832r73k331K109J644j945p94J457
1303A271k37o48J775j285j551K046J903l083j64K216n27r06R01p46q96J899M69
1320B437k576r6K923j052j840J262J53j006J538M08k998N95K976j172k525J705
1336G32J079j728M30P41k154M56K888k206j875J885J131k076K24R24j361P75J330
1353A195j883j912L106O77k717L64J290j063N04O55j877m30K537O7l095M67K442
1370C27j092j030J298r07j85J664l51k623J309K276j549j389J300j9m53J187j37
1387c74k388J762K099k185j362J905M42j188Q19J90j268J404R18k308n12K617
$$ plain form
1271 -1716 -242 1214 -1375 -2051 963 615 -1786 -485 576 -421 -94 1236 -642 -948 1841 1386
1287 1386 -1767 -65 1870 411 -187 1353 -129 272 2104 1131 -1200 909 2553 608 -186 1271
1303 1271 1034 386 2161 876 -675 1371 3274 191 27 2243 1716 810 1711 965 69 1968 2437
1320 2437 -139 -235 2688 1636 -204 1058 1211 205 1743 2151 -847 -252 2724 1552 -973 732
1336 732 1811 83 513 1254 -900 -444 2444 238 -1637 248 1379 -697 -473 451 -910 -135 1195
1353 1195 -688 -2600 506 1183 -1534 -1170 120 -943 -439 216 -1661 -2091 446 513 -2582 -2115 327
1370 327 -765 -1795 -497 -1404 -1589 75 -276 -2899 -1590 686 -863 -2252 -952 -971 -1424 -237 -374
1387 -374 -2762 -1000 1099 -1086 -2448 -543 -101 -1289 -470 -280 -1548 -144 774 -1534 -2046 571
1403E71O41k787J233N83j003J119J066k401n24L088l22k478R47J419j370j5J710
1420A477j843P6K610r16k498J654J315j077p34J244p99n7J952j139k074K104J523
1437B818k621j32J691n81m39J370j169j616K117J150k659n19K672p18q65N81K00
1454A280j180J580N25k974O61K136n47j907J186K94r56J111j28k208J022K400
1470B295j657j778J495J014j694M89J65j359P29J643j697j847K426P18j725k48
1486a031J213j178N45J395j860j513K687N13k867L88J899j110N1Q93j554n93K421
1503B99k07k550O65K351j496j192J539k74r46J867j98k334J056K394j837q76J155
1520e84J72q81J070k04j978J915J395j900r32K012M23j681O13P02j375J213J254
$$ plain form
1403 571 1212 -1575 -342 241 -762 357 1423 -978 -1502 1586 1264 -1214 -267 1152 -218 -233 1477
1420 1477 -366 -290 2320 1404 -1094 560 1875 798 64 1308 509 452 2404 1265 -809 1295 2818
1437 2818 197 65 1756 1175 736 2106 937 -679 1438 2588 -71 -590 2082 1364 499 1080 1280
1454 1280 100 1680 2205 -769 -108 2028 1481 -426 760 1054 98 1209 1081 -1127 -105 2295
1470 2295 638 -1140 355 1369 -325 164 329 -1030 -301 1342 -355 -2202 224 942 -783 -1031
1486 -1031 182 -996 -451 944 -916 -2429 258 771 -2096 -1708 191 -919 -868 25 -1529 -2122 299
1503 299 92 -2458 -1793 558 -938 -2130 -591 -865 -1811 56 -142 -2476 -1420 974 -863 -1739 -584
1520 -584 -412 -1293 -223 -427 -2405 -490 905 -995 -1927 85 508 -1173 -560 142 -1233 -20 1234
1537A234k136n42K324J91k160J090P79j038N42J154j714p33K965n01k634J146
1553c3J710j260k64J067j176K02K019j219j741J478J620j850o27J359o48J62J198
1570A997r42j721J907J487k493m18K171o33j158J425p70j072J568J146k877j25
1586e08K589p88j351J013m0j279J956j09k118J10K410j128j487J257j62o59Q23
1603E29M31j874N03J963j620j743J737R41j498K37M45j355O37J537j558j504K262
1620G0P00k030J47J234p68r0P53j034j184K165O11k403K28J632q82k36P77j004
1638a314n25K145j76k620J158J881j348j117J544l05p56J504l00j991J049J984
1654H13j060j659J756P0q36J129n49j210J362J413k191o63K184L14j363O25L04
$$ plain form
1537 1234 -902 -1444 880 1071 -1089 1 780 -258 284 1438 -276 -1009 1956 1455 -1179 -33
1553 -33 1677 417 153 1220 44 246 2265 1046 -695 783 2403 553 -74 1285 637 799 1997
1570 1997 1055 -666 1241 2728 235 -183 1988 1355 197 1622 852 -220 1348 2494 -383 -508
1586 -508 2081 1293 -58 955 915 -364 1592 1483 -635 -525 1885 757 -730 527 365 -294 529
1603 529 960 -914 -411 1552 -68 -1811 -74 867 -631 -394 51 -1304 -667 870 -688 -2192 70
1620 70 770 -1260 -1113 121 -647 -737 16 -1018 -2202 -37 574 -1829 -1601 31 -851 -1087 -310 -1314
1638 -1314 -1839 306 130 -2490 -1332 549 -799 -1916 -372 -677 -1433 71 -229 -2220 -1171 813
1654 813 -247 -1906 -150 -80 -916 213 -336 -1546 -184 1229 -962 -1625 559 873 -490 135 439
1671D39j588J544J005j899m80K213l6j772N16J427j102K59P39j888N23K214p47
1688A367k581J710J488j432j2N24q56M17J431q76k014J485J513j522p53J624n52
1705I61l53J108j198j179K110P31j977m86K037p33q01O90k62r61J625M43k406
1722f51JK299l92j678Q58R2q88J387J52k373O94J770p53j929J389P58j252O98
1740A82K45j538N60J690j326j582J749P53j473k30M12l89L10J334j484j328K202
1757H7P96k418O2J252o64p4Q09j346p8J590k4j835J26K094p71n83O94r79p2J340
1777Fn6j884J100J781j511j195J367J24n89J026l20j596J267J526j621j123J787
1794H9N36j029O05l9j063J311J193k018n88J770Q0j359M47P37r92J014K65j154
$$ plain form
1671 439 -1149 395 1400 -499 -979 1234 1198 -574 -58 1369 267 526 1265 -623 -100 2114 1367
1688 1367 -1214 496 1984 552 540 1064 208 625 2056 1180 -834 651 2164 642 -111 1513 961
1705 961 608 1716 518 -661 1449 2180 203 -283 1754 1021 220 910 648 -313 1312 1755 -651
1722 -651 -650 1649 1257 -421 437 529 -359 1028 1180 -1193 -499 1271 518 -1411 -22 736 -516 182
1740 182 427 -1111 -551 1139 -187 -1769 -20 733 -740 -970 -558 -947 -637 697 -787 -2115 87
1757 87 883 -1535 -1473 -221 -885 -959 -150 -1496 -1574 16 -8 -1843 -1717 377 -394 -977 -283 -1262 -1334 6
1777 6 -50 -1934 -834 947 -564 -1759 -392 -268 -857 169 -151 -1747 -480 1046 -575 -1698 89
1794 89 625 -404 201 162 -901 410 1603 -415 -1003 767 847 -512 -65 672 -320 694 959 -195
1812a95l95K152j34k359J253R53j006L73M96j156K32J656q58j788J421J436j357
1829G24n67Q29l29l30J621j168j465J765R72j576r34J552l73n44J145m35j470
1846e83J655Q68k186m65J828n2j096O17k69p70J029N49j961K66J876o91j519Q98
1864fM18p34R11j47j718K77J987o99j772R52R30r98L42J98j088L51J307j006j825
1883b320K305L94j741J72Q95q43L73J024j772n74J735Q33j972K06J514j064n3
1900h88M95r46j57J523r4j969P62J544o18q89J166m47p73J513j34j673P39J916
1918A070j381o46R65k00k89Q60m71j181J098J724j868r69K028L7r12J03J56n68
1936d44J077P87j635n71J983j78j449K95Q69k36%R22j634j95J940k71j558M82
$$ plain form
1812 -195 -590 1562 1428 -931 322 1275 269 642 1138 -18 214 1870 1012 -776 645 2081 724
1829 724 157 986 657 327 1948 780 -685 1080 2052 476 -458 1094 721 177 1322 887 -583
1846 -583 1072 1940 -246 -711 1117 1065 -31 586 317 -453 576 1125 -836 -570 1306 615 -904 -6
1864 -6 412 -322 589 442 -1276 -999 988 289 -1483 -531 399 -599 -257 -59 -1147 -796 511 -495 -2320
1883 -2320 -15 379 -1362 -1190 -295 -1138 -765 259 -1513 -2087 -352 481 -1491 -1285 229 -835 -888
1900 -888 -393 -1339 -1496 27 -67 -2036 -1274 270 -348 -1237 -71 -518 -1291 222 88 -1585 -846 1070
1918 1070 -311 -957 8 -192 -481 379 -92 -1273 -175 1549 -319 -1288 740 777 -135 -32 124 -444
1936 -444 633 1420 -215 -786 1197 1019 -430 -135 734 498 498 1420 -214 -409 1531 1260 -298 184
1954A84J346q81j62Q05j030M2J705j070j381R92J351j380n60J407o45l71J008
1971A360n14j294J125R80j569m92J348j97o43P19m47r53J440P21k152NJ680l92
1989G25j115O41J09j125J314l6j730J77J912m15j622J245L92r31L56M11j593N86
2007f99J484j137j193J172N78j160R8M30q90L10J490j150j300J822M06j364P5
2024a028O75o79L37P48j055o07J508K44k020N59J478o21m16P76j136j43J748k27
2042A41j793O12J645j014p23R44j92k51Q75j97j649Q31J613p73r43P77K17m86
2060c66P60j53j004J193Q08j099j048J761K83j108O52k67m16L74R96j242o15K076
2078A585l28j239L09O94o74K07N34j149l3J973p42j743R47R77p50k93O94p06o6
$$ plain form
1954 184 1530 649 487 1292 262 304 2009 939 -442 550 1901 521 -39 1368 723 352 1360
1971 1360 846 -448 677 1657 88 -404 944 747 104 823 376 -577 863 1584 -568 -563 1117 725
1989 725 -390 251 360 -765 549 513 -1217 -1040 872 457 -1165 80 472 -459 -103 308 -1285 -699
2007 -699 785 -352 -1545 -373 205 -955 -857 -427 -1317 -1007 483 -667 -1967 -145 261 -1103 -1028
2024 -1028 -353 -1032 -695 53 -1002 -1609 -101 143 -1877 -1318 160 -461 -877 -101 -1237 -1380 368 141
2042 141 -1652 -1040 605 -409 -1132 -188 -380 -631 244 47 -1602 -771 842 69 -874 -97 120 -366
2060 -366 394 241 -763 430 1238 139 -909 852 1135 27 679 412 -4 370 1366 124 -491 1585
2078 1585 1257 18 327 1021 347 554 1088 -61 -94 1879 1137 -606 341 1318 568 275 969 263 197
2097A97J054l29j629J818N96j158m52P30n53j99R96n61r60J179Q59j476n44J190
2115G58n78l68O59n04n09J083K95j742J88J482k16j406N77K17n48O80N00j925
2133a357J62J978p09j125M72M27o36J05N59j188P51J174j231j130J405P62j373
2150i54J21M57q06N59J078j216q47J446K55j152j79R33k47M1O95j094m56J381
2168A5L37j822L43J288m50j85N55m04l78J167j82j391N23J457j064q47J294l4
2186B22l42O67k18j204P81J326j063p36Q12M38o09K62J64j038P69J355j696p09
2204h19J647L47j127K38M15l91P48K54j231l30J651j84j336N11J123r80lO10r14
2223B29k4R65k36j086O38P72o79m81M07j38k37J212j103r39J364O41j134n84Q35
$$ plain form
2097 197 1251 922 -707 1111 1707 549 97 827 274 75 1071 510 -450 729 1588 112 -432 758
2115 758 180 -188 471 -33 -542 541 836 -906 -718 764 548 -858 -281 -64 -612 68 568 -1357
2133 -1357 -1195 783 74 -1051 -579 -152 -788 -683 -124 -1312 -561 613 -618 -1748 -343 419 -954
2150 -954 -833 -376 -1182 -623 455 -761 -1608 -162 93 -1059 -1238 -305 -552 -511 184 -910 -1366 15
2168 15 352 -1470 -1127 161 -289 -474 81 -323 -701 466 284 -1107 -584 873 -191 -1038 256 222
2186 222 -120 547 329 -875 -94 1232 169 -567 245 683 74 336 500 -538 231 1586 -110 -819
2204 -819 828 1175 48 286 701 310 1058 1312 81 -249 1402 1218 -118 393 1516 536 533 1143 229
2223 229 205 1170 934 -152 486 1258 579 98 505 367 130 1342 239 -700 664 1305 171 -413 422
2242D22K30o32P59o66p95J138R70j775j00J057j50p98L21n6m06Q53K53j347q7
2261h09J342n20p85O14P5l49M26rq88J58J203o97j234Q45Q17j092K53K7l84L38
2281f69J206j300j018J394L56p41l66O96l32J43R02j063o57J409K11j343M22O45
2299a05k61k93N31n35m66J495O3j554M95J309p27n81L17j17l6J131k54j280O26
2318b42J168q61o89Q16L5o02R02j90p48M04J491j272p23J193j63m34L99j20m93
2337a29Q10O68j227o10J720j08r53K72L02m75L33L92p35k50J183k37j042O48M80
2356A042q08L01Q5p13J03J424r52j252J235N24q21m97R79m29k31R67r22m99J151
2375F87L61j475k08J165j65n36N03k93q87J382L74j729j58J505m17n29J66Q3m62
$$ plain form
2242 422 652 20 779 113 -682 456 1426 -349 -449 608 458 -340 -19 -75 -481 372 625 -722 -809
2261 -809 533 13 -772 -158 -83 -432 -6 -15 -903 -745 458 -239 -1473 -628 189 -903 -650 -623 -1007 -669
2281 -669 537 -763 -1781 -387 -31 -772 -1138 -442 -774 -631 271 -792 -1449 -40 171 -1172 -750 -105
2299 -105 -366 -659 -128 -663 -1129 366 429 -1125 -630 679 -48 -629 -312 -429 -465 666 412 -868 -242
2318 -242 926 65 -624 192 227 -375 527 337 -411 -7 1484 212 -511 682 519 85 484 364 -129
2337 -129 681 1349 122 -488 1232 1124 171 443 745 270 603 995 260 10 1193 956 -86 562 1042
2356 1042 234 535 620 -93 10 1434 482 -770 465 989 168 -329 650 221 -10 957 35 -464 687
2375 687 1048 -427 -635 530 365 -171 332 39 -848 534 908 -821 -979 526 109 -420 -254 -171 -633
2394f33P00J41j156k33J522k51j099O99J67l00M17l9r09J69J221p38j081J097
2412c06K80n96J45L51n92j09Q77q69q79J439N12o14l96N19k89K21M66r28k73J486
2432D45j53j014N0J039m17m23O45j33n67J294m63j511P79Q51m08p09P54M8m59
2451c52O88R1j045P46J190r88q02Q59K48o61N87k8r12P08P23r88k41R41L75q15
2471C24j40M97o77N56O81j160l95J324J48j355M00M50k25J64K23o45l31J453m99
2490G93j016O73M84n67l16L71n23O93J24m9j159N48Q37r30j34M75j63m68P13L5
2510D21r42P27M33r86l79J134j47m35L69l29m94O08O45j276j69J291k30j214R73
2529@k65n74O35K63j255M03J174n27p93M77K28n97M60L79j240O78J023r53r22
$$ plain form
2394 -633 67 208 -948 -1181 341 90 -1009 -310 -143 -443 -26 -65 -974 -805 416 -322 -1403 -306
2412 -306 -26 -622 -477 -126 -718 -827 50 -819 -1698 -259 253 -361 -757 -238 -527 -306 160 -768 -1041 445
2432 445 292 -722 -672 367 -50 -473 172 39 -528 766 303 -1208 -429 422 14 -695 59 107 -352
2451 -352 336 427 -618 128 1318 330 -472 387 635 -26 561 533 -379 329 1052 64 -177 764 1139 324
2471 324 184 681 4 560 1241 81 -314 1010 1158 -197 203 653 428 592 815 170 -161 1292 793
2490 793 -223 450 934 367 51 422 -101 592 716 667 -492 56 893 -37 -171 304 141 -327 386 421
2510 421 -521 206 639 -347 -726 408 261 -174 195 -134 -628 -20 625 -651 -820 471 241 -973 0
2529 0 -265 -839 -204 59 -1196 -793 381 -146 -939 -462 -234 -831 -371 8 -1232 -554 469 -484 -1406
2548a406R23Q69j157M09J7m12J92R76r49p96J551J4j067J14Q87n59R9P38j005
2567e62k72J437k88j116O08O74o74k51K07J1j0P80J51j423N66J551j250n31N90
2586A98J05m84P86J58j228Q86O72q98n24J274k51l97K57j00l80L86Q15j206m95
2605d26J155L48j187O31J73n48M64L22p66l43J426j89j398O58L67o76K44K48n11
2624hK23Q89n01q73O69M11k14p42L44k14Q6P07o41p32Q23Q29j097o14Q36l2l92
2645b43L93j22n54M60P83j249k4Q79k92o47N55n56k61R85K48j269r8J423k37q96
2665g22M51L07n38N73R7j139L85J191p89r50Q10J65m78N11K25r86L61Q77r85n70
2685a204J047O44j368J50R28p88J00O63p78m44J208M77j189K29N04m76O3L51k48
$$ plain form
2548 -1406 -483 386 -771 -362 -345 -757 -565 411 -538 -1334 217 231 -836 -722 165 -394 -295 443 -562
2567 -562 -834 603 315 -801 -193 481 -193 -444 -237 -226 -236 544 695 -728 -162 1389 139 -392 198
2586 198 303 -181 605 763 -465 421 1093 195 -329 945 694 297 554 454 74 460 1275 69 -426
2605 -426 729 1077 -110 521 694 146 610 932 166 -177 1249 1060 -338 320 687 11 255 503 -8
2624 -8 215 1104 603 -270 399 810 596 -146 198 -16 70 777 136 -596 227 1056 -41 -655 181 149 -243
2645 -243 150 28 -526 -66 717 -532 -556 323 31 -616 -61 -617 -878 107 355 -914 -1012 411 174 -722
2665 -722 -271 36 -502 71 168 -971 -586 605 -184 -1134 -324 -159 -637 -126 99 -887 -526 351 -634 -1204
2685 -1204 -157 487 -881 -731 197 -591 -491 172 -606 -1050 158 635 -554 -325 179 -297 -234 117 -131
2704a31n61J069J49j287Q24N00m63l38N96k27k40Q18j03j521N81J120n31l59P57
2723F53l27m98Q97k00j092J207M21n90p73J074L8r24M52K81n97M05M32p57o01
2742d99J094R9r34P14j10o5o9P18o29m86R82j61j115P25O11m96r8J65o63l7J012
2763G58o00r95Q23P47p89l97O61j26l01P42m09j082J293L28r89j56P43n58q0N41
2783A54l46n35P86L18j005K88N23L6r21M60J90n63N46L29j377M04J235q17q19
2802a114Q06J54n47J23L99m50Q4R53n32q68P47K92m15r0M98o48J67J265j264n95
$$ plain form
2704 -131 -692 377 526 -761 63 563 100 -238 358 131 -109 709 606 -915 -334 786 255 -104 653
2723 653 326 -172 725 525 -567 640 1061 471 -302 772 810 -114 338 619 22 427 859 102 -499
2742 -499 595 694 -240 474 364 299 230 948 319 -167 815 654 -461 264 875 379 281 446 -217 -254 758
2763 758 158 -837 -14 733 -56 -453 208 82 -219 523 114 -968 325 653 -336 -492 251 -307 -387 154
2783 154 -192 -727 59 377 -628 -340 183 219 -702 -242 -52 -615 -69 260 -1117 -713 522 -295 -1114
2802 -1114 -308 -154 -701 -578 -179 -629 -545 408 -124 -992 -245 47 -368 -458 40 -608 -441 824 -440 -1035
$$ [...]
8191e4
##END NTUPLES=NMR FID
##END=
