##TITLE=1H_EC-3187
 CDCl3, 8 sc, 
 4.4.2019
##JCAMPDX= 6.0         $$ Bruker NMR JCAMP-DX V2.0
##DATA TYPE= NMR FID
##DATA CLASS= NTUPLES
##ORIGIN= UXNMR, Bruker Analytische Messtechnik GmbH
##OWNER= root
$$ XWIN-NMR		Version 3.5
$$ Thu Apr  4 13:49:55 2019 Russian Standard Time (UT+4h)  she@DPX200
##.OBSERVE FREQUENCY= 200.1316
##.OBSERVE NUCLEUS= ^1H
##.DELAY= (6, 6)
##.ACQUISITION MODE= SIMULTANEOUS
##.ACQUISITION SCHEME= undefined
##.AVERAGES= 8
##.DIGITISER RES= 18
##SPECTROMETER/DATA SYSTEM= spect
##.PULSE SEQUENCE= zg30
##.SOLVENT NAME= CDCl3
##.SHIFT REFERENCE= (INTERNAL, CDCl3, 0, 15.7039)
##AUDIT TRAIL= $$ (NUMBER, WHEN, WHO, WHERE, WHAT)
$$ ##TITLE= Audit trail, XWIN-NMR		Version 3.5
$$ ##JCAMPDX= 5.01
$$ ##ORIGIN= Bruker BioSpin GmbH
$$ ##OWNER= she
$$ F:/spectra/data/she/nmr/H-F/1/audita.txt
$$ ##AUDIT TRAIL=  $$ (NUMBER, WHEN, WHO, WHERE, WHAT)
(   1,<2019-04-04 13:47:59.90 +0400>,<she>,<DPX200>,
      <created by zg, POWCHK disabled, PULCHK disabled
       configuration hash MD5:
       00 E9 B6 7A A2 85 ED C7 34 08 36 98 17 FE 4E 26
       data hash MD5: 16K
       F1 B7 A7 74 BC D6 51 5E 39 D9 E5 98 4A 64 E5 44>)
$$ ##END=
$$ 
$$ hash MD5
$$ 38 61 43 B0 5B 73 50 95 AB BC 37 C1 09 1C 72 16
##$RELAX= 
##$RELAX= 
##$RELAX= 
##$RELAX= 
##$RELAX= 
##$RELAX= 
$$ Bruker specific parameters
$$ --------------------------
##$DU= <F:/spectra>
##$EXPNO= 1
##$NAME= <H-F>
##$PROCNO= 1
##$TYPE= <nmr>
##$USER= <she>
##$AMP= (0..31)
100 100 100 100 100 100 100 100 100 100 100 100 100 100 100 100 100 100 
100 100 100 100 100 100 100 100 100 100 100 100 100 100 
##$AQSEQ= 0
##$AQ_mod= 1
##$AUNM= <au_zg>
##$AUTOPOS= <>
##$BF1= 200.13
##$BF2= 200.13
##$BF3= 200.13
##$BF4= 200.13
##$BF5= 200.13
##$BF6= 200.13
##$BF7= 200.13
##$BF8= 200.13
##$BYTORDA= 1
##$CFDGTYP= 0
##$CFRGTYP= 5
##$CHEMSTR= <none>
##$CNST= (0..31)
1 1 145 1 1 1 1 1 1 1 1 1 1 1 1 1 1 1 1 1 1 1 1 1 1 1 1 1 1 1 1 1 
##$CPDPRG= <>
##$CPDPRG1= <>
##$CPDPRG2= <>
##$CPDPRG3= <>
##$CPDPRG4= <mlev>
##$CPDPRG5= <mlev>
##$CPDPRG6= <mlev>
##$CPDPRG7= <mlev>
##$CPDPRG8= <mlev>
##$CPDPRGB= <>
##$CPDPRGT= <>
##$D= (0..31)
0 1.2 0 0 0 0 0 0 0 0 0 0.03 0 0 0 0 0 0 0 0 0 0 0 0 0 0 0 0 0 0 0 0 
##$DATE= 1554371279
##$DBL= (0..7)
120 120 120 120 120 120 120 120 
##$DBP= (0..7)
150 150 150 150 150 150 150 150 
##$DBP07= 0
##$DBPNAM0= <>
##$DBPNAM1= <>
##$DBPNAM2= <>
##$DBPNAM3= <>
##$DBPNAM4= <>
##$DBPNAM5= <>
##$DBPNAM6= <>
##$DBPNAM7= <>
##$DBPOAL= (0..7)
0.5 0.5 0.5 0.5 0.5 0.5 0.5 0.5 
##$DBPOFFS= (0..7)
0 0 0 0 0 0 0 0 
##$DE= 6
##$DECBNUC= <off>
##$DECIM= 24
##$DECNUC= <off>
##$DECSTAT= 4
##$DIGMOD= 1
##$DIGTYP= 9
##$DL= (0..7)
0 120 120 120 120 120 120 120 
##$DP= (0..7)
150 150 150 150 150 150 150 150 
##$DP07= 0
##$DPNAME0= <>
##$DPNAME1= <>
##$DPNAME2= <>
##$DPNAME3= <>
##$DPNAME4= <>
##$DPNAME5= <>
##$DPNAME6= <>
##$DPNAME7= <>
##$DPOAL= (0..7)
0.5 0.5 0.5 0.5 0.5 0.5 0.5 0.5 
##$DPOFFS= (0..7)
0 0 0 0 0 0 0 0 
##$DQDMODE= 0
##$DR= 18
##$DS= 0
##$DSLIST= <SSSSSSSSSSSSSSS>
##$DSPFIRM= 0
$$ [...]
##$SUBNAM2= <"">
##$SUBNAM3= <"">
##$SUBNAM4= <"">
##$SUBNAM5= <"">
##$SUBNAM6= <"">
##$SUBNAM7= <"">
##$SUBNAM8= <"">
##$SUBNAM9= <"">
##$SW= 24.9336934301222
##$SWIBOX= (0..15)
0 0 2 0 0 0 0 0 0 0 0 0 0 0 0 0 
##$SW_h= 4990.01996007984
##$TD= 16384
##$TD0= 1
##$TE= 0
##$TE2= 300
##$TE3= 300
##$TEG= 300
##$TL= (0..7)
0 120 120 120 120 120 120 120 
##$TP= (0..7)
150 150 150 150 150 150 150 150 
##$TP07= 0
##$TPNAME0= <>
##$TPNAME1= <>
##$TPNAME2= <>
##$TPNAME3= <>
##$TPNAME4= <>
##$TPNAME5= <>
##$TPNAME6= <>
##$TPNAME7= <>
##$TPOAL= (0..7)
0.5 0.5 0.5 0.5 0.5 0.5 0.5 0.5 
##$TPOFFS= (0..7)
0 0 0 0 0 0 0 0 
##$TUNHIN= 0
##$TUNHOUT= 0
##$TUNXOUT= 0
##$USERA1= <user>
##$USERA2= <user>
##$USERA3= <user>
##$USERA4= <user>
##$USERA5= <user>
##$V9= 5
##$VALIST= <valist>
##$VCLIST= <CCCCCCCCCCCCCCC>
##$VD= 0
##$VDLIST= <DDDDDDDDDDDDDDD>
##$VPLIST= <PPPPPPPPPPPPPPP>
##$VTLIST= <TTTTTTTTTTTTTTT>
##$WBST= 1024
##$WBSW= 4
##$XGAIN= (0..3)
0 0 0 0 
##$XL= 0
##$YL= 0
##$YMAX_a= 198960
##$YMIN_a= -287714
##$ZGOPTNS= <>
##$ZL1= 120
##$ZL2= 120
##$ZL3= 120
##$ZL4= 120
##$ABSF1= 10
##$ABSF2= 0
##$ABSG= 5
##$ABSL= 3
##$ALPHA= 0
##$AQORDER= 0
##$ASSFAC= 0
##$ASSFACI= 0
##$ASSFACX= 0
##$ASSWID= 0
##$AUNMP= <proc_1d>
##$AZFE= 0.1
##$AZFW= 0.1
##$BCFW= 1
##$BC_mod= 2
##$BYTORDP= 1
##$COROFFS= 0
##$CY= 11.3945322036743
##$DATMOD= 1
##$DC= 2
##$DFILT= <>
##$DTYPP= 0
##$F1P= 18.9103706918063
##$F2P= -1.10871071338519
##$FCOR= 0.5
##$FTSIZE= 0
##$FT_mod= 4
##$GAMMA= 1
##$GB= 0.15
##$INTBC= 1
##$INTSCL= 1
##$ISEN= 128
##$LB= 0.24
##$LEV0= 0
##$LPBIN= 0
##$MAXI= 10000
##$MC2= 0
##$MEAN= 0
##$ME_mod= 0
##$MI= 1.114404
##$NCOEF= 0
##$NC_proc= 0
##$NLEV= 6
##$NOISF1= 3.799351
##$NOISF2= 2.8
##$NSP= 1
##$NTH_PI= 0
##$NZP= 0
##$OFFSET= 15.70392
##$PC= 1
##$PHC0= -8853.187
##$PHC1= 17.20025
##$PH_mod= 1
##$PKNL= yes
##$PPARMOD= 0
##$PSCAL= 0
##$PSIGN= 0
##$REVERSE= no
##$SF= 200.130013532006
##$SI= 16384
##$SIGF1= 3
##$SIGF2= 2
##$SINO= 400
##$SIOLD= 16384
##$SREGLST= <1H.CDCl3>
##$SSB= 0
##$STSI= 0
##$STSR= 0
##$SW_p= 3612.71676300578
##$SYMM= 0
##$S_DEV= 0
##$TDeff= 0
##$TDoff= 0
##$TI= <>
##$TILT= no
##$TM1= 0
##$TM2= 0
##$TOPLEV= 0
##$USERP1= <user>
##$USERP2= <user>
##$USERP3= <user>
##$USERP4= <user>
##$USERP5= <user>
##$WDW= 1
##$XDIM= 8192
##$YMAX_p= 0
##$YMIN_p= 0
$$ End of Bruker specific parameters
$$ ---------------------------------
##NTUPLES= NMR FID
##VAR_NAME=  TIME,          FID/REAL,        FID/IMAG
##SYMBOL=    X,             R,               I
##VAR_TYPE=  INDEPENDENT,   DEPENDENT,       DEPENDENT
##VAR_FORM=  AFFN,          ASDF,            ASDF
##VAR_DIM=   8192,          8192,            8192
##UNITS=     SECONDS,       ARBITRARY UNITS, ARBITRARY UNITS
##FACTOR=    0.0002004,     1,               1
##FIRST=     0,             0,               0
##LAST=      1.6414764,     0,               0
##MIN=       0,             -287714,         0
##MAX=       1.6414764,     198960,          0
$$ Real data points
##PAGE= N=1
##DATA TABLE= (X++(R..R)), XYDATA
$$ [...]
2523a840J969l23j405J387K05j434J341N34k631K091L531m227k505N375J345m673
2539a260Q11L123j440j553J178K47k80L94j016o60R43N03M9k458n41L261L7m592
2557c254J310M215l187l263L859J760l409P58J224j208J042J921k541q15L088
2572A500K42k213J30K155M59k402j228L371J002l964j59L206j466j903K674j123
2588B81j874K352ml749K059L383l654k719L421J832k202j289J286J391q38j278
2604a602J430J444j390j10J091j064O00K692l263j898M780L98m927J389L916k658
2620H28k652K666L76j515J42n27l54J161o8r86o54N50J361p83j769J154L249k819
2638f40l042M823J688m320N65K458j332k69J473j285j56K645j156k773K004J735
$$ y = [-1840, 129, -194, -1599, -212, -7, -1441, -100, 434, -2197, -106, 3425, -802, -3307, 2068, 3413, -1260, -449, 2674, 1234, -319, 859, 1106, 826, 1220, 204, -456, 487, 990, 1039, -1419, -1960, 1301, 1338, -3254, -1944, 2271, -916, -4179, -320, 1440, -1969, -1211, 13, -1195, -153, 1768, -773, -1588, 1500, 1742, -471, -341, 1814, 2273, -129, -1357, 2014, 3016, -948, -1107, 2099, 633, -1270, 1404, 281, -1593, 759, 755, -2994, -935, 2448, -1206, -3925, -504, 1328, -874, -2163, -877, 514, -324, -1602, -172, 1272, -118, -228, 863, -201, 399, 3091, -172, -2070, 2710, 3108, -1819, -430, 3486, 828, -1824, 842, 1218, -297, -155, -682, -1036, 125, 57, -929, -1583, -1033, 328, -455, -2224, -1070, 2179, -640, -3682, 1141, 2829, -1491, -926, 1532, 200, -69, 1404, 119, -37, 2608, 1452, -1321, 683, 2418]
2654B418j190k645P20K129r9k820r8L141j512k528K242Q41k159J030N47k493J771
2671g05K709l415j923M482M55l412J000K221l68j295k9J089J271j544q00J252
2687I88K57o38J254j659j748L023N59m531J603L961l429l065L633J297k928p2
2703a495J113n84O16M10j419K64J013p2n73l64J630J551k457j679L868J320m156
2720a014L44L460j650j767K247l47j432J208k12k195J442K111k650j262J625J172
2736A080j672j368R28K269j676k253K090J734k302m85J893j110N87K069k459j119
2752a794M136k75l957J777L336k594j729J619J106n39r57m84R05J77r69L91l64
2769b15m90J158m26k128J121L301l383k757M225J228l775O42K349j206n41J019
$$ y = [2418, 1228, -1417, -697, 1432, 1333, -1487, -1585, 1556, 44, -2484, -242, 599, -1560, -530, 17, -2476, -705, 2004, -1411, -3334, 1148, 1603, -1809, -809, 1412, 1044, -251, -280, 809, 2080, 536, -264, 988, 1245, 607, 1861, 202, -1546, 1477, 2036, -2495, -892, 3069, -360, -3425, 208, 1505, -1423, -1495, -382, -966, -350, 60, -1359, -1095, -82, -154, -727, -1091, 539, 2090, -367, -2046, 1822, 3142, -1014, -670, 2790, 1140, -627, 1620, 1273, -159, 1049, 837, -1358, 84, 2195, -455, -1717, -92, 1080, -592, -1960, -1032, 1237, -439, -2692, -602, 1132, -1170, -1655, 238, -872, -285, 1784, -675, -1794, 2342, 2067, -1890, -113, 3223, 629, -1100, 519, 1625, 1086, 129, -355, 550, 727, -242, 149, -215, -705, 453, 27, -2101, -980, 2321, -1062, -3819, 406, 1634, -2141, -1499, 850, -356, -897, 122]
2785A22k37L44R88q17r00J293Q69m57j111m14K564K48l693N84L405k319k805L007
2803F71P36k491N49M40j646J520J500k565j427K899L15k258o1J865P75j823q00
2820a801J861K017k466p35K253k88r58J481q96j156K706k08l349J712L292l372
2836I3k057K622Q33j910l55J91O52k67q12k40J298m52p40O54j120J041J795k473
2854a247j596M046J071m328P39L773k420j408K257M41n29K65l09j169J829L37
2870A752j503o93P63R18m92k078O61K603k038l138L033J740l163n0J654j158L40
2887h49J421j464r01K776m94k183J357K140j153j410O65J576N60j860o15K146
2903A712o47j643J365M86j590J136j15k222J194K481l114j840L502N23k933m5
$$ y = [122, -115, 229, 1217, 400, -500, 793, 1662, 1205, 94, -320, 2244, 2492, -1201, -617, 2788, 469, -2336, 671, 1407, -1084, -535, -95, -1741, -221, 1279, -1286, -2713, 186, 501, -1757, -1818, 47, 822, -1001, -1801, 60, 2077, -389, -1124, 1129, 841, -117, 1364, 468, -688, 2018, 1810, -1539, 173, 3465, 93, -1964, 658, 1491, -419, -774, -583, 69, -198, -1010, -1250, 48, -404, -1144, -490, -1610, -569, 1226, -1247, -2843, 1203, 2274, -2054, -1315, 2458, 38, -1370, 887, 1328, 799, 1064, 755, -414, 1415, 1752, 249, -444, 319, 1237, 745, -1333, -672, 1931, -107, -3245, -212, 1528, -1635, -1685, -31, -1189, -849, 572, -892, -1793, 983, 489, -1694, -337, 1803, 650, -760, -95, 1481, 2041, 181, -434, 1712, 1065, -578, 787, 1273, -317, 819, 704, -1518, -324, 2157, -957, -2797, 705, 1228, -1705, -1750]
2919a750J929k50p71j93P23Q91q24j099Q09N77J09P83j317p14K700M25l351J343
2937B0L293k406k322K333J097k080M60J63j006J356J75k074j01J999j146p97l31
2954a367P27J297j539k016K914J589l209k96L281j499j128J932n94n55J720k38
2970A019k343J888K318k244j652J547J171r18j188K73J480n63k221J483J295j779
2986d34m76J108j472M53K081k768j147L289L91l735J163L087j708j215J199O65
3002D81L42j59q46J33J440m31n59l04M68P97j97k159R93K566k119k966L273J170
3020A923l023J20J537j239j16O65r41j41J787j178j710K052R12n58j238R0J680
3037F22O02k361J70L001r83k319K212O43j426O99K89j826J399J328k592o78K311
$$ y = [-1750, 179, -71, -842, -1035, -312, 579, -245, -1344, -535, 42, 151, 934, -383, -1097, 1603, 2028, -1323, 20, 3313, 907, -1415, 918, 2015, -65, 395, 558, -448, 908, 1083, -991, -1092, 907, -239, -1036, -1367, -640, 657, -882, -2898, 16, 1605, -1604, -1900, 1381, -118, -1246, 686, 92, -463, 1257, 1019, -1324, 564, 2882, 638, -1014, 533, 1704, 786, -402, -129, 1351, 788, -1433, 50, 1345, -434, -910, 198, -1274, -821, 1260, -1508, -2655, 634, 1025, -2710, -1547, 1540, -168, -1383, -184, 481, 823, 664, -182, -49, 1391, 960, 401, 97, 565, 1362, 1165, -994, -1, 2565, 446, -2520, 753, 1923, -1100, -980, 557, -682, -798, -133, -1074, -1215, 572, -606, -2316, -264, 648, 90, -1148, -1058, 622, 1224, -1137, -967, 2034, 1051, -1268, 944, 1587, 161, 860, 1149, -677, 722, 2050, -542, -1220, 1091]
3054A091rk130j2J481j24j043r85J184R77j434j100K038m7q23J056p43r93K689
3072A073K75l199J192L400k178j824J984R98j379L2K92l32J174r07p34O49J41
3089F57l31n20m02L28J557j921j715K659R14l121J80K588j187j524J557q7l20
3106f88J195p02q30J482Q85j231p14J233O45j67j783M52K412j185k385J921J858
3123B398k321k15Q00j283M37J259j904q73K743o99k705J342K029j402r71o3J116
3140c12O58q18r87J718M23j051L24Q65p96J019kk125J204K847k539k219L443J5
3158A667k424L63J191l56l77k81l79L55R41j743m34R83L20Q3q06q41J884Q92l140
3177b102N28L134j618j569J678Q92j293Q94j47q87J774M41j793q7J648j11j343
$$ y = [1091, 1082, -1048, -1060, 421, 297, -746, -1731, -547, 430, -1004, -2104, -66, -113, -936, 120, -623, -1616, 1073, 1348, -1851, -659, 2741, 563, -1261, 723, 1721, 342, 374, 666, 334, 1508, 601, -133, 516, 657, 326, -194, -596, -268, 1289, -632, -2347, 312, 1226, -1895, -1715, 873, -314, -1838, -281, -368, -688, 507, -195, -1025, 457, 1342, 111, -603, 630, 1275, 1108, -675, -223, 2189, 1004, -1381, 540, 2398, 77, -138, 662, -621, -184, 1075, -829, -1702, 1041, 342, -2363, -1021, 1008, -394, -1365, -1428, -312, 346, -472, -1459, 259, 682, -369, -45, 820, 24, 1043, 1041, -1084, 120, 2967, 428, -1791, 1652, 1667, -757, -394, 797, 441, 64, -217, -596, -241, 700, -1043, -1477, -494, -174, -91, -897, -1738, 146, 1038, -2102, -1574, 1560, -58, -1627, 51, 943, -350, 544, 397, -490, 1284, 1725, -68, -155, 1493, 1382, 39]
3194C9l07O31J150j228k090K105J299k427o94J891n41j114J101k62r54K004o56
3211e3k615J971K245k039j264K215N78o45q14J05J394J96j871J89K171j063n21
3228A79Q66j336O54J531k116j385K700M46k828o0K231r77j239N03K05N04P1j465
3246a516J44J729m09n96l04L91J336R2j825L17K880j518k535K449J618k328k00
3263b75J306p93Q5O10j559J26J940j015k023J156J064m83r80l83P12J029j717
3280a200n93K181p4j759P83J024j120J167j91j511J567J852k179j571K792K31
3296A399j543O0O54M25q1j076M1J531o56j615R16J28m45Q76j233j398K090P40
3314H13l216J045K489j529j941K006P16r12L62k74K03J221o77q72Q66O39k78n18
$$ y = [39, -268, 363, 1513, 285, -1805, 300, 1599, -828, -1522, 369, -172, -1286, -185, -447, -1401, 603, -53, -2668, -697, 1548, -491, -1755, 460, 1038, 393, -421, -316, 1078, 1274, -597, -408, 1763, 700, 179, 1045, -291, 363, 1894, -222, -1607, 1093, 1539, -1289, -1349, 882, -95, -1334, -831, -626, -122, -51, -1516, -1372, 357, -52, -648, -952, -561, 775, 867, -958, -641, 2239, 721, -1814, 635, 2253, -75, -275, 1031, 238, 323, 933, -626, -500, 1440, 425, -1598, -442, 622, 139, -841, -1224, -512, 517, -1200, -1793, 388, 314, -1445, -662, 362, -758, 409, 218, -1293, 274, 2126, -53, -1624, 1168, 1399, -144, -84, 570, 995, 914, -162, -121, 1410, 754, -861, 55, 183, -262, 614, -619, -2017, 73, 813, -2403, -1358, 1131, -398, -2339, -333, 383, -529, -167, -441, -238, 983, 306, -566, 300, 939, 661, 143]
3332A43k35O62J326j414k098K429J237k495l70J892q46r95P50n54k10J419j407
3349g66j052J294J306j319p23O40Q05k87j033K08J786l76j803J290J155q32l84
3366i1R58j148Q05J529j953q61K564m07k436O57J728q26j106P2K01R27q42j097
3384a326R80N88r80j65N70q74J248K3k243J198K742j803j940K434Q48j722K82
3401a40J065j91K66j80j094J077O70j069o92K23O15L47r94r32J501O74k513k07
3419a574K422q76j797J352N30q40M55j36j371J530J317j682l57J825j85q46k07
3436d40P63R33o04j536J057J932j494j038J410l95l07M92j224o2J727k99k713
3453a798J300J969j828j364J083O22r5p21j23O34M39r27p4J010j25K9J99r04R24
$$ y = [143, -92, 570, 1896, 482, -1616, 813, 2050, -445, -815, 1077, 231, -764, -14, -568, -778, 641, -766, -1818, -524, 782, -537, -1260, -620, 185, -102, -1135, -927, 859, 483, -1320, -30, 1125, 293, -91, 867, -281, 524, 2053, 100, -761, 1803, 1396, -1040, -383, 1345, 519, -587, -515, -314, 613, -229, -1326, -346, 242, -738, -903, -333, -1207, 41, 64, -2179, -981, 1761, -42, -1982, 452, 1300, -422, -140, 925, 734, 1000, 820, -274, 803, 1473, 404, -288, -65, 550, 897, -97, -1029, 472, 1146, -1367, -1574, 848, -28, -1825, -473, 57, -783, -328, -464, -1835, -305, 1012, -670, -1027, 798, 613, -233, -440, 323, 1256, 652, -884, 173, 2105, 611, -427, 983, 588, 281, 773, -451, -513, 1214, 915, -1798, -498, 1471, -357, -1721, -638, -16, -111, -832, -955, -321, 118, -809, -883, 127, 2, 31, 230, -674, 250]
3472B50J641j784j459K530P38k600L31J941o84q75J09j01K11Q00j179o91J336
3489E14k4j160l27K64O28K36j819J71K617j369j784J672O38o66k68Q78p24N38
3507A5J076j421J17K179o92j951P02J212k08q57n60R56P50j408j000J670O4j631
3525i87P94K02o60R34o98j409R65K165k162j132K425j52r54K81O47M1j0o09j82
3544e01J319J15j123O67J77k28P82q27j178J796L47k318K25K258j202j143O65
3561a69K44k76K82j159N0J129J31j334L03P77n2o18k53O82J097p46j715J785J354
3580A512j693l08J396n62J12N57j153j9J675o50j782J345J117j184j033L41P98
3597D69k91q99j98J247J19j841K90J393p01j00K46r38Q73J428j631p50K112K43
$$ y = [250, 1891, 107, -1352, 1178, 1916, -684, -353, 1588, 904, 29, 138, 37, 248, 1048, -131, -822, 514, 490, -670, -997, -733, -105, 131, -1688, -1517, 1100, -269, -2053, -381, 257, -409, -677, 201, -523, 15, 1091, -330, -213, 1966, 1274, -677, 25, 1237, 1029, 172, -388, 568, 1318, -90, -1090, 580, 644, -987, -193, 9, -651, 283, -415, -1824, -859, 1306, -856, -1988, 437, 285, -669, -388, 259, 300, 290, -319, -501, 818, 933, -190, 477, 654, 426, 1208, 381, -797, 999, 1346, -972, -747, 1511, 309, -834, -169, 75, -201, 81, -1078, -1028, 101, 232, -1102, -799, -22, -74, -692, -945, -263, 834, 88, -1627, 158, 1512, -181, -489, 907, 345, 457, 1014, -139, -158, 1517, 867, -915, 430, 1547, 363, -670, -329, 469, 178, -721, -919, 328, 447, -1394, -1104, 289, -412, -512, -266, -1204, -331, 1097, -534, -1284, 828, 1071]
3615A071k048K88J831l46n03N0l08J216m36q09K82Q51o42m72J36m81R72j23j687
3634a158K11K401j645j755J394J003j350j10P48l03L51K08j060O26J312p11q15
3651f53R02O24J2p80o73J395J019j879q51K025j84j440N92K19k59M43l94j349
3669a231R22J366j717p76J522K53j165l33M41L92M52j282M45J188l92p88Q90J51
3687C38j23P72j175n44J805N27k401O22J524p18j151N40M87k35m2q92N39O88j084
3706e23m70Q15k14K82m37n72L80J432j164j669K042J083j835j65J555k59k31K13
3724B63l86L88R99j022j014J559L33q92n31M08P53Q7j608k16K153o22k076J099
3742c25Q45q98k01Q8k90L33J124j659l03J799j20j392O29Q78j59j92o27M07J119
$$ y = [1071, -977, -689, 1142, 796, 293, 343, 35, 1251, 815, 6, 288, 1139, 497, 25, 161, -320, 652, 529, -1158, -947, 1454, -191, -1946, -552, 451, -899, -1009, -261, -564, -213, -5, -1065, -439, 873, 162, -653, 249, 873, 885, 105, -568, 827, 1846, -33, -884, 1141, 957, -483, 109, 328, 69, 512, 118, -1231, -309, 1057, -660, -1436, 86, 339, -826, -1159, -718, -326, 126, -1156, -711, 477, 85, -703, 187, 338, 215, 987, -188, -732, 1073, 1600, -801, -179, 1345, 627, -524, 16, 503, 268, 226, -666, -127, 561, -523, -993, -178, -392, -110, -547, -1119, -739, 693, -471, -2140, -98, 985, -850, -1015, 540, 281, 50, 263, -123, 265, 1264, 242, -772, 787, 1120, 228, -303, 105, 858, 945, -663, -879, 1274, 652, -1424, -325, 520, -378, -579, -491, -781, -448, 676, -983, -1286, 513, 393, -999, -370, 508, 349, 157, -470, -63, 1056]
3761A056p46r01J227M16p58P5L9j93R01p4k109J025J801k162p74J427J50p42k54
3780e96J80j26N58q07m24R44N63p53q0J18m8J028o50j067J857P42k338K50K360
3799A711q00j323P91J05l05Q36o79j019J238M63j495K01O34K49p70p56K70R86
3817C37l96j375Q47J227j232p25J376m09O3P01r29j75K023n00j748R39J473q40
3835F57p39N03K84J57k34j152J089L62j164m8N18k46J39k48p37M09J381j704j124
3854a897J953N22j961L84J010j92q4J64o18R54M05j049J60R35j11k65j68k41R58
3873H59J12j237k5J877p01j736J177P27q91m15L9l29O91Q8j090q4J201n03r25
3892a165K60J003K15n12j288J216J202j303p04J666J13j198M78M28m24J049l11
$$ y = [1056, 310, -591, 636, 1052, 294, 369, 408, 215, 1116, 1042, -1067, -42, 1759, -403, -1177, 250, 400, -342, -596, -416, -542, 16, -791, -1215, -271, 292, -461, -541, -423, -471, 557, -93, -1160, 697, 1439, -899, -649, 1711, 911, -412, 379, 484, 179, 1015, 336, -683, 555, 1018, -477, -276, 358, 607, -163, -919, -649, 337, -59, -1434, -587, 640, -592, -1317, 59, -350, -287, 414, -515, -690, 1333, 833, -915, 24, 1497, 657, -82, 421, 705, 862, 628, -524, 565, 927, -237, -285, 233, -13, 126, -122, -859, -450, 931, -773, -1897, 56, 578, -1383, -999, 11, -181, -265, -101, -719, 235, 640, -409, -249, 686, 575, 310, 142, -99, 859, 971, -266, -291, 1586, 885, -851, 326, 1053, 162, -253, -214, -543, 148, 236, -854, -938, 263, -240, -1165, -905, 98, 313, -199, -1487, -271, 931, -372, -1076, 590, 703, -495, -17, 411, -13, 1036, 725]
3909G25j779J551J161j733n40J435Jp37k63k71P05L87j517k4J224l89n87L74j92
3928d69q7Q90j144p56J889M28j969M88J954r74q23O86n6N33J08j177M80J182m09
3947G74j065k8R74k68J54o39j52J338p86j783J126J122j453k10J277n50J8P2r28
3966a007L64J406p68j241J406M24m57k90j6R66J21q12q04J723K15j189l3P21r7
3985F32k80r0q02P40Q54j876p7J656l89j191J33L15M72n08m34L8R93J35j483M72
4005f90R80o85N08O7m61Q55L81j788L85K187j326j239J463N53p87L6k70n1Q02
4024I20o41p95K04R43r32l92J01M11K13l23r62J036O49j321n75J767k69p08Q16
4043A42j56j29R79p88r13J427O20j091l93J053r5l45m42J62Q10j82j551P75P56
$$ y = [725, -1054, 497, 1658, -75, -615, 820, 821, 84, -179, -450, 255, 642, -875, -899, 325, -64, -651, -277, -469, -556, 334, -810, -1566, 323, 751, -1218, -730, 1224, 250, -573, 113, 57, 590, 698, -479, 1, 1183, 774, -291, -319, 655, 387, 541, -98, -250, 1088, 302, -1481, -355, 767, -686, -896, 381, -169, -151, -79, -1007, -643, 763, -5, -1246, 160, 584, 127, -163, -179, 787, 908, 96, -708, 1015, 1230, 41, 8, 729, 632, 352, 262, -540, 200, 1054, -822, -899, 757, 368, -823, -690, -375, 97, -411, -845, -807, 186, 321, -1162, -690, 290, -395, 113, 180, -281, 574, 955, -833, -448, 1739, 413, -826, 637, 1190, 403, 439, 169, 118, 920, 279, -516, -312, 631, -301, -693, -592, -181, 32, -291, -1253, -217, 432, -889, -1464, 303, 34, -674, 142, -14, -143, 836, 48, -865, 562, 1182, 91, -302, 751, 656, 311, -131, 31, 841, 659, -892, -117, 639]
4062F39o64p44Q60n54j02Q94j336n6J531n12j383O04J078m80m19K05N01N09k13
4081C58j054P37J021q52n10N06M78n5J9j058M48J538j605r61J719K26j434n5P95
4100B61m21J20L2p95O65M94j080k86J014K25n85k17N7L72Q14j483J43J709j78
4119H61j282L74P17l53J51L3n05O37N78j659L09J042m72p00j55O23K32l11j260
4138a140O46R98j005p20J271k3p48M91l01p7R36q7j485J008J458j048r42J281
4156E13J04k95j71k33P36O62j277o10J447m59k11ml42J30Q12j069j036J903N5
4175F55j575R6J266o22l75Q8j29O24R6r86R7J038j07n63M24l4N75j6p84L28J156
4196A252l33j317N61J297j219m15Q63m40k4K40r87%J290m66j348M97J024p94p1
$$ y = [639, -25, -769, 91, -463, -565, 329, -1007, -1063, 468, -44, -1427, -823, 255, -225, -644, -439, 62, 571, 358, -696, 41, 1062, 210, -300, 206, 684, 629, 648, -410, 38, 1576, -29, -990, 729, 955, -479, -534, 261, -160, -40, -8, -803, -138, 356, -724, -1010, 4, 229, -356, -573, -516, -144, 670, -813, -670, 1039, 861, -421, -47, 670, 317, 468, 501, -4, 633, 1211, -448, -139, 903, 431, -269, -424, 199, 431, 120, -1140, -494, 504, -501, -1221, 50, 27, -721, -230, -531, -608, 328, 241, -1244, -236, 1222, 174, -768, 513, 617, 322, 151, -82, 654, 1316, 39, -571, 876, 417, 206, 202, -140, -10, 802, -267, -1303, 600, 655, -920, -824, 442, -180, -555, -467, -596, 28, 124, -862, -765, 273, 166, -397, 27, -7, 568, 552, -232, 96, 1252, 919, -398, 163, 1460, 241, -174, 689, 249, 225, 465, -522, -522, 768, 302, -1046, -549, 475, -319, -390]
4215c90o19O72N24m30j132J517O75j622L01O64j29M74O6j304J080P00r23n35J641
4234A230p8j394r5P46j30O8m35m22J046J82j406L54O03o09K19n61j48J271m06
4253C5j165L41J450l38j498J087L22l98L81j3m21J125k48j175O80R04o53n81J41
4272b4J49R39r24m86O56P61j421p47J582l55l20J61k54k76J083q55j355J565N91
4291D70q52n91J033j6l7l45n53J354m3n90P3R57m17o41Q22m14j1O60j114q2J320
4312I83j35j724M55P26k85k58j08j67O84j64q97K36J189o28n35K29K34L37P7j045
4332g96L58J758r67j572J680P58q12j35K75j50J72k1p02M92Q03q53q52O32K76
4351C44l65j88k75M53M99j095k97J313j91j019L75M71k95L01k01m18N04P89j118
$$ y = [-390, -1009, -337, 187, -243, -1375, 142, 817, -805, -504, 160, 31, 505, 571, -733, 347, 1047, 124, -411, 1230, 1152, -242, -337, 409, 279, 347, -88, -510, 536, 718, -688, -334, 269, -340, -121, -682, -830, 441, 35, -1130, -789, 661, 323, -1175, -88, 234, -164, 217, 204, -217, 908, 660, -515, 165, 1069, 416, -165, -24, 125, 1064, 140, -346, 310, 1071, -350, -1097, 485, 130, -190, -29, -283, -559, 524, -331, -1686, -121, 470, -382, -973, 60, 44, 7, -338, -891, 463, 420, -170, -97, 860, 443, -198, 624, 210, 199, 859, -255, -337, 983, 848, -876, -421, 305, 20, -238, -346, -513, 171, 7, -890, -654, 535, -93, -628, -399, -165, 172, 249, -796, -438, 1320, 353, -1219, 461, 1219, 407, 272, 547, 397, 569, 548, -154, 338, 1141, 288, -564, 68, 344, -21, -209, -484, -31, 468, -627, -924, 389, 198, -821, -446, 25, -270, 31, -170, -588, -84, 705, -413]
4370d13j8J323k79m15m10N95K93j0p61r6J101n24q73Q56k23k83L02m14M1Q91l25
4391C58j412M14J347p89p95M59N18l29k17k64N84Q17j077k06P99L11n08K37k05
4410D2p9Q08m62j226J792L53j340j48J182n35m74O9k09k14J075r35m28P33Q0p02
4430f18j49M66L21K08j162J88J075J70j475P01J243j236k46Q00k91M27Q01j559
4448c36R3J568o18j345Q41K88j45n27MK26O61p86r19Q60P53r34m29L49L12j93
4468b77P1r34O96J142j222q04J689r4m05k60M63K81L06o81m00R39M63j096L4P93
4488G04m60P7k00l38M69N93j338l22J340l20j129R63J40n56K18m78l70J164J56
4507C13j044K92R94p56m5K67j84P62N2r29L50J338j118o74P92O9j18K02n95k3
$$ y = [-413, -431, 892, 613, 198, -212, 383, 676, 666, -95, -191, 910, 386, -487, 369, 146, -137, 165, -249, -208, 683, 358, -1054, -640, 707, -82, -877, -418, 100, -229, -446, -710, -126, 691, -386, -592, 207, 518, 10, 247, 42, -37, 771, 309, -917, 875, 1228, -112, -260, 922, 387, -87, -18, -227, -441, 634, -301, -729, 4, 84, -618, -767, -301, 20, 228, -934, -746, 329, 499, -976, -275, 968, -268, -514, 286, -5, 422, 1223, -336, -243, 1325, 707, -638, 203, 491, 346, -181, -177, 49, 710, -76, -995, -135, 618, -316, -745, -396, -84, -277, -206, -1140, -444, 698, -524, -1328, 361, 267, -138, -398, 65, 346, 652, -29, -429, 510, 973, -123, -89, 704, 244, 321, 121, -217, 252, 845, -493, -815, 525, 205, -924, 39, 179, -377, -159, -637, -1007, 157, 313, -731, -439, 555, -201, -246, 21, -163, 599, 651, -278, 72, 1410, 292, -382, 410, 479, 361, 563, -32, -55]
4527e5R55o67q16Q14M16j070m03O23L67j81n05o58J162O27j220m59J122ln29L33
4547a47k44M36M17n45p07J424N35j444R4Q78j60l55j9k54P95Q2j135rJ264r05
4567Ak12l24J99N90j90q70J27R43l01j007P14O83q43K44L39l25O90j08r37O62
4587G5J107o92r29O10N39k14l07l76K67Q13o74j015J293j8p52P1M86p82Q55l13
4607D4j246J002P75j461m14J514lr44M90O3J48K77p45r7J008N1j056O33N17m02
4627A54L61n76j83Q90J62j253K06J410n96r50L37L43l77J8p38L0O90P6j170O42
4647e24O81n49RK10j91P41m30j086J434Q21j266m25J146j15k02J63m41K14L48
4666E38j51p74J027j6q67K26O5J95O4m40m26R06J19j241J76O85l70l69N03k36
$$ y = [-55, 900, 233, -583, 231, 647, -423, -826, -203, 164, -17, -522, -1180, -18, 609, -611, -1070, 52, 49, -480, -147, -391, 45, 462, -83, -790, 634, 1169, -275, -181, 697, 537, 182, 163, -91, 704, 786, -349, -358, 906, 1, -211, -535, -336, 254, 64, -806, -679, 264, -37, -1044, -330, 353, -490, -246, 93, -232, 458, 350, -587, 75, 1182, 490, -439, 171, 710, 496, 189, -187, 80, 893, 219, -796, 497, 479, -273, -202, 284, -498, 357, 44, -1202, -200, 575, -886, -1300, 214, 211, -733, -243, -180, -32, 245, -500, -597, 411, 462, -594, 39, 556, 154, 515, -61, -244, 646, 808, -445, -239, 1171, 575, -375, -38, 305, -72, -54, -792, -762, -72, 4, -1166, -524, 157, -392, -383, -173, -364, 377, -53, -1139, 295, 1116, -150, -575, 571, 456, 254, 417, -24, 190, 538, 387, -387, 640, 624, -243, -17, 48, 243, 307, -133, -559, 347, 466, -775, -599, 86, -284, -653, -150, -386]
4686c86J28M08p34l27J751j76j593J184Q3k21k28K3J5Q54k51o95K70O80o92JR9
4707A93k63N73l7j050J65J379p79j417J385M5o33m2N0Q0L35j98o73P98L89n25
4727b25j29M16L7J39p3J1o9P76r14m20J228k14o61J21J00NM56o38p95J015K83
4748D49r72j93O55J69k30n25J03N88J55j120N49R18m84q58Q08m3m12Q50l71m86
4768d50J312r5j304Q61P37n73p87M14L44q1k20q35Q93O65j117l84N58O8k37p3
4788c04j48L4P08o48o94J078N72j384J8Q47n4j08p2o6J57R67o85p55Q60K13n39
4809cj61O16k74M56m78n93J319l56j095J59R75p36k84l4M6L95K74j078L09R49
4829D06k24q64K45N92k10k74m89Q98Q76m78j041J152J01o11L15k57m4L67J66j290
$$ y = [-386, -258, 150, -584, -911, 840, 664, -929, 255, 338, 117, -111, -88, -73, 781, 530, -165, 105, 785, 93, 94, 193, -70, 503, 466, -584, -419, 960, 181, -1236, 149, 194, -439, -481, -431, -351, -16, -214, -887, -89, 300, -225, -354, 62, 99, 238, 165, 176, 107, 883, -31, -451, 777, 563, -98, 23, 123, 128, 584, -54, -849, 166, 449, -523, -716, -61, 108, -122, -647, -544, 44, 199, -921, -372, 546, 62, -796, 12, -31, -443, 407, 36, -450, 862, 767, -537, 324, 1061, 488, -299, 115, 459, 378, 158, -677, 216, 881, -236, -620, -62, 6, -231, -304, -452, -418, 290, -358, -1052, 26, 598, -786, -768, 79, 25, -83, -155, -221, -64, 903, 218, -537, 323, 536, -3, -164, 452, 178, 634, 156, -437, 882, 526, -569, -410, 565, -171, -455, -489, -443, -48, 226, -852, -543, 406, 182, -682, -437, 155, -55, -329, -818, 80, 956, 478, -563, 589, 690, 79, 394, 137, 93, 460, 626, -664]
4849f64Q35P90j173p12J368k52m11J9l07N85J99p96l67J103J44r00j70O79L6J33
4869A39l86m40R52M62j622L37J067L3q24M31L79j96J82m53l44J165n46p03K72
4888i5M67o14L60l71j02N47j08j009M12Q76q19nJ50k6L81m38l34K20J189n47r61
4909h27R83L40m56N5J48j4L32k91l27O25N44r23l52N48K5l73j35k92N81M97j342
4930f54o7R94j78n26K5O36k15m19j05r8P09J74p50J57J009m93l79K69j90M99J19
4951E17j010N10R94n13j122J013L46r57Qj5K92J68p4p41K30N11o53L6J43l9R5
4972b61j64j60K67M94l67o68J338j18o46J58L46k41R71n61o95J070M19j424j29
4991c71J094o20K64m81J28M02J23q29m87J096j34p89K92L91n76K34j93k79J142
$$ y = [-664, 171, 961, -212, -924, 444, 192, -219, -200, -507, 78, 277, -519, -886, 217, 361, -539, -709, -30, 6, 139, -247, -687, 265, 727, -895, -558, 509, 542, -282, 149, 528, 332, 514, 61, -283, 882, 336, -367, -95, 372, -242, 118, -253, -355, 192, 84, -925, -513, 363, -456, -461, -311, -337, 44, -394, -728, -508, 681, 134, -827, 156, 496, 40, 95, 243, 229, 561, 270, -57, 568, 1112, 189, -163, 385, 410, 37, -98, -390, 191, 688, -654, -721, 273, 95, -431, -406, 230, 15, -404, -509, -607, 102, 276, -474, -317, 692, 199, -180, 89, -101, 398, 517, -493, 17, 1011, 498, -624, 389, 735, -222, -214, -229, 63, 231, 157, -584, -354, 157, -496, -460, -317, -356, -261, -425, -585, -318, 176, -191, -859, 479, 361, -285, -127, 219, -22, 949, 388, -307, 763, 1182, -242, -371, 723, 103, 367, -114, 14, 416, 539, -290, -777, 319, 185, -604, -312, 79, -497, -263, -456, -735, 407]
5010D07k80r53M37P05l75l17L94qJ64N7n25N72N00o24l34P05j41k4j39m40M79
5031B60M63m35j120Q28Q20j326j52M20K4Pq0m53N21M56r66k0Q80J12k83j52J01
5052i5M78j49n84o6J115P6j298R03K18n03J87k20l46P14K52p82m31R03k01p81
5072f10K33L18M0K0q44L88P12m59n29N88L82m77j01K35k82N70rp23K52J010l76
5093C38p28P19K68k38l12k6n4J096j046o08Q95M09j177K71M75m5j47k78n90Q42
5113F4M19j424O9J128m02k90Q4J87j05O20m75j09R08k0j015J61R57n51J90m68
5133g2J49P41j38j241N45J075j038m40M63j29L22l4n84l77R29k50o76O23P2Q1
5153B1l05O8rN57p21l54N34Q76p29m11Q12l6k46K4l30K96P80p27o01J145J51j056
$$ y = [407, 127, -826, -389, 316, -59, -376, 18, 10, 174, 231, -294, 278, 778, 154, -180, 525, 384, 360, 221, -219, 260, 723, 288, -832, -4, 816, -510, -662, -242, -218, -211, -291, -744, -223, 233, -733, -753, 127, 239, -44, -196, -95, 383, 234, -350, -416, 699, 775, -523, 380, 598, 95, 282, 62, -284, 430, 682, -100, -531, 372, 171, -610, -377, -59, -19, 1, -843, -455, 257, -202, -731, -143, 239, -238, -339, -104, -386, 184, 175, -548, -296, 714, 338, -390, 329, 597, 359, 47, 21, -33, 1063, 17, -591, 304, 713, -464, -193, 282, 237, 90, -188, -778, 64, 483, -941, -872, 256, -146, -436, -352, -165, -270, 350, -125, -234, 674, 654, -361, -200, 757, 206, 396, -72, 77, 818, 680, -561, -16, 1059, 21, -419, 44, -85, 237, 203, -381, -758, 171, -79, -755, -132, -60, 21, -284, -216, -225, 332, -389, -743, -209, 667, -62, -473, 339, 303, 57, 81, -249, 47, 827, 100, -501, 644, 795, -261]
5175b61J53L10J81j27o69k7O32Q4o57l2N40l4k86j94L05J40K41j123J95J006j13
5196B64o04O81K46l88q7q3q4R22k50j011L99J006r77j41K15j75L16J00j049O18
5216h2N05q11k61L87M62o98J31P1K73J72k60o09Q34M59j266N10P12P9k83o57J54
5237a78M75N05r94Q9R24k39l85rj99p8N31m10k83Q44k93q61J48Q11l41n48K44
5258b47K49J89j39o13R7P41l41o32K27N43J33j32l50L81O89l15o73M49L26m98
5278H4l92M77j36M16J51q34L75N88r44k10N20K53p00O1k70L92O4l22k54P66m3
5299D2o68pP10K8k4J6o18R05J84r69M18P24l04l56j85L28L21m16k26r5O00j8q09
5322d19L13M07m74J1l10j54R11m6r64L38R56n91p55P31Q7q0j89L21K9N38m09p74
$$ y = [-261, -108, 202, 383, 256, -413, -440, 192, 276, -381, -413, 127, 93, -193, -387, -82, 58, 299, -824, -629, 377, 264, -340, 341, 587, 199, 112, 29, -55, 867, 617, -394, 5, 1011, 34, -107, 108, -67, 249, 349, -700, -82, 423, -388, -649, -262, 200, -498, -367, -296, -23, 149, -111, -720, 114, 573, -693, -183, 529, 608, 325, -332, -178, 297, 802, -192, -103, 821, 582, 197, 188, -11, -89, 442, 32, -251, 593, 300, -561, -413, 398, 57, -491, -247, 2, 191, 52, -561, -464, 277, -64, -696, -469, 74, 207, 75, -275, 106, 795, 480, -193, 256, 582, 84, -308, 169, 33, 449, 600, -234, 141, 729, -215, -425, 95, 348, -352, -291, -561, -169, -105, -427, -681, 85, 42, -626, -633, 77, 105, 81, 97, -521, 384, 568, -401, 17, 741, 437, 81, -104, 224, 545, 129, -97, -192, 408, 390, -419, -106, 301, -173, -162, -472, -626, 285, 239, -725, -387, 569, -22, -777, -46, 41, -39, -228, 93, 122, 660, 251, -523]
5344e23P78M06n21k07L82o2N41o04n79P63J46p73o7O35L0m19n8J44L5K13m49l36
5366e25P15m9q29J54N00m3J70o2m76P47J87r74L38P47m54l06J25L74J84K3n34
5387A2j52O84j50j108O46O17k45o75J39J67L44m99l23L15J99m84M0L13O5k22L77
5408F0n29L41P61o70n82P16L81o58J29M43J0j6l09j19N30L24q70k62P00r4j87
5429I9l08l3K74L54q38j92J104k89o87N30j1o4m5n4kM52J24q45J36P30l68m59
5451c92K77K32j63K47o29N42P30p37j55L59j30k47Q9L4j70N04m71m23L44O06n42
5472i5n13Q17j86k51K19m14K34O78q32j69O52K04l16m23M59l10R61m25q94R80
5492C76K02j023L81M61m64J20J64p0k25M44q80L00P19k48p26O9M3K67l35o1M0
$$ y = [-523, 255, 661, 140, -67, 315, 253, 794, 190, -389, 374, 520, -253, -320, 315, 345, -74, -132, 12, 47, 260, -189, -525, 190, 141, -688, -534, -34, -77, 93, 31, -445, 302, 489, -485, -147, 600, 146, -160, -35, 339, 523, 546, 12, -140, 544, 394, -714, -68, 549, 304, -371, -232, -65, 279, -220, -543, -228, -29, -513, -473, -160, -95, -317, 60, -469, -128, 633, -37, -619, 97, 478, -180, -51, 392, 402, 386, 77, -42, 488, 812, -58, -320, 380, 286, 99, -209, -242, 32, 386, -452, -644, 460, 171, -516, 14, 3, -61, -106, -160, -162, 290, 414, -431, -295, 435, 67, -392, -115, 117, -46, 201, -428, 114, 844, 107, -48, 311, 181, -66, 23, 57, -113, 391, -80, -503, -159, 447, -95, -608, 209, 23, -228, -9, -423, -189, 489, -343, -512, 140, 344, 28, -395, 64, -246, 715, 290, -604, 376, 578, -445, -64, 397, -67, 53, 217, 147, -78, 366, -514, -214, 505, 257, -469, -400, -357, -90, -425, -486, -446]
5513d46O15Qr65R77M47p24k78M90Q3K07j53p97M32P96k50n37M36O2k45J40m86
5534a88L78K58p01j67L63L05o72k9L25L3K51l00k37L13L36p07j89Q02L20j148
5554f54N03K28J1J19k55l29P77L0p65J16O12m92J93j49j08N28Jp64l1J289r30
5575g0k65N92j98j41j56k06r7P65j95q05L47N96j48j21L5K99j55L42q07N19N21
5596F52r26j92O13K89k38l18K30j80N98j34q43P12L25o18k90K7L77q7j78m9K51
5617B1J42r51L60N79j53j09l33J21M21j05j10k18N52K01o24oN17j73K6j08P7M24
5639E51l31m32K60N92o04j41K03k13M49m68k37j5P88n79m90M01R11p88J8O6l16
5660c75O12j41n94N72N09p54l1M64K44m25j4j40M37J16r02P6J106m16k66k99K10
$$ y = [-446, 169, 177, -788, 189, 636, -88, -366, 124, 207, 414, 261, -536, -104, 692, 442, -95, 341, 403, 158, 298, -188, 190, 448, -253, -420, -57, 248, -424, -453, -128, -95, 156, -144, -381, -68, 268, -439, -628, 174, 494, -654, -151, 77, 88, 207, -48, -377, 400, 430, -335, -219, 393, -99, 94, -55, -163, 365, 366, -398, -429, 860, -70, -335, 257, 59, -82, -238, -444, -541, 224, 29, -776, -429, 167, 19, -102, -67, 232, 77, 419, -388, 131, 652, -274, -466, 147, 436, 198, -120, 110, -70, 528, 394, -449, 263, 588, -30, -320, -293, 84, -3, -181, -230, 21, 163, -788, -428, 151, -2, -111, -444, -323, 98, -7, -117, -335, 217, 418, -206, -212, 305, 132, 158, 50, 127, 551, 220, -212, 48, 640, 36, -105, 98, -115, 334, -134, -371, -386, 402, -177, -667, -266, 645, -143, -125, -59, -375, 237, 96, -498, 74, 583, -171, -202, 262, 506, 81, 67, -73, 364, 480, -422, -346, 760, 344, 78, -221, -11]
5681a1j15M22l18k56L50J28o68k9Q37j72m95M13j38j27J72o66N46K64Q7m41O79
5702D62j35k23J14j93k25R12k47p84k33J228l90l96n1K51J47k94k40Q7N81q24
5722d53l27N40N50p65J12N21l24M46m22m35N77N94j011J3N76l6K7k16m74M94O68
5743F55r80K33M79K67q29K65L2k62M47m73j6O01k33n84J00M35m22j22Q1j02K82
5764a46O1o49L22N75j20n32K27P25j27m92j46K74N24k87n08N12J84l49m8k2N47
5785E25l76k7l98L21M14n44q5M18o7m93j88K02j31K31j1m12N93K17n27Q7M67k43
5807b7K23l02p7M33Q4n50l6P93K4j123O59L78m61M31l72m79J034l64r49M35N51
5828C05m55q9K42k68L69Q1o92K53J90j42o23N76M53k88M72n42J43Q41m55p41O68
$$ y = [-11, -126, 296, -22, -278, 72, 200, -468, -497, 340, 168, -327, 86, -52, -179, -7, -673, -127, 137, 224, -217, 462, 327, 104, 218, 25, -200, 712, 465, -319, -552, 676, 286, -110, -161, 90, 237, -57, -297, -210, 371, -453, -780, -240, 310, -455, -343, 178, -146, 300, -122, -557, 20, 614, -397, -384, 192, 156, 183, -33, -507, -13, 655, -325, -92, 387, 654, -175, 90, 122, -140, 307, -166, -182, 419, 186, -398, -298, 137, -285, -407, -326, -428, -146, -85, -734, -412, 163, 43, -489, -262, 463, 336, -156, -302, -28, 496, 209, -299, 213, 397, 48, 0, -22, 525, 149, 122, -276, 45, 459, -85, -170, 248, 181, -312, -500, -298, -429, -198, -209, -621, -28, 189, -338, -251, 216, -27, 196, -106, -183, 250, 334, -216, -252, 541, 565, -558, 101, 479, 18, 449, 77, -402, 632, 268, -681, -246, 305, -150, -239, 3, -265, 104, 185, -507, -254, -64, -206, -829, -253, 200, -88, 384, -158, -15, 826, 371, -370, 298]
5849B98L81m80m17K32K49l2j05n45P90J34q63J46J50O0R8j08l84M24K93o07n21
5870h07R59l2l58k91N86j39n2K67l30M32K78r67M06M88k69k26R4k12N54N9m50
5891a0j28P32k37q05M68K53m55K04q2j03L41j14p17M07M32k80m45L63M72m77j79
5912c60k24O21N20n98l61O32L21m22J09J22k86J57L5p27Q63J87n18n09Q36j95
5932B03k24M8m38L57M74o58k68P41k4n84L47J3k4j31k94R3M92M02r17n9J256r58
5954a53L09m33M84K50j5n35J83O80m74p59O33L67k66n01K33l56M52j29p63Q07
5974A4O79j252J11L56J23k92L42l13J30O42q40o9L31K00k0l60Q7K21m1J33o08
5995d26P27L31r70m8Q58l99q3L17l22J01K21p32P3Q35j01p37J0M10l71m7J9k79
$$ y = [298, 679, 199, -218, 14, 263, 231, 126, -419, 371, 505, -358, -212, -62, -2, 96, -12, -396, 28, 321, -286, -807, 152, 120, -238, -529, 57, -82, -134, 133, -197, 235, 513, -454, -48, 440, 171, -55, 39, -173, 381, 440, -10, -138, 594, 357, -448, 20, 273, -182, 22, -60, -163, 178, 64, -653, -246, 186, -94, -539, -176, 296, -181, -360, -584, 37, 557, -41, -402, 230, 551, 129, 238, 360, 74, 231, 266, -461, 402, 589, 71, -438, 398, 203, -21, 27, -411, -54, 420, -238, -506, 235, 211, -373, -26, -13, -37, -168, -462, -369, 123, 525, -392, -451, 805, -153, 156, -277, 207, 457, 442, -93, 90, 770, 296, -463, 170, 537, 271, -230, 3, -353, 99, -30, -793, 14, 693, -559, -448, -92, 31, -261, 81, -232, -102, 540, -300, -369, -38, 162, 142, -218, -131, 90, 49, 182, -426, 301, 632, -338, -386, 472, 73, -10, 307, -15, 86, 307, -425, -352, 483, 382, -355, -345, 65, -306, -353, -334, -613]
6017f13O45J72p18J79J181p00k07K34M6K05j81k46Q6M81m41k10N46k77j43j88
6037a49J47j49K51K8k63K72L15p75j1N12k10j35J70m46K92O25q32l43J024k87
6057C6l33L90J62j08K42l72k34O07J04p66j92J038j50l40j62j53K42M07p51o9
6077d02J037q39m0N25m22n7K1jj54P39n90n46M87O25o34k77P35k86j9L06q76R32
6099B64M64l32p32L78J51k66L30k61J75p2n01p9N78L32n33k10M81N0j39j99j06
6120b27J21K30l73n72J059J31o43j04J01L80q6j38j56P07m7n47j47N55j35J06
6140B15j81j33O27Q0p76k07P35P9p60M33r0J32j75m47J86N54k73o71N97O9k23
6161b29N0P5J03J41j75l97N16L89n08l0L45k27N8j09p6K63M51p49j17O80J68p88
$$ y = [-613, 32, 204, -514, -335, 846, 146, -61, 173, 219, 424, 243, -3, 83, 564, 123, -87, 459, 182, 39, -149, -2, -151, 100, 128, -135, 137, 452, -323, -334, 178, -32, -167, 3, -443, -151, 474, -358, -701, 323, 36, -297, 93, 255, 147, 389, 17, -217, 390, 494, -272, -464, 574, 424, 84, -78, -231, 11, 418, -333, -402, 635, -204, -244, 281, -141, -198, -177, -178, -332, 407, -183, -729, -242, 383, -251, -528, 207, -79, -98, 208, -668, 264, 728, 396, -336, 42, 193, -73, 257, -4, 171, 99, -402, -481, 97, 429, -104, -314, 167, 217, 78, -121, -227, -106, 124, -249, -821, 238, 369, -274, -378, -277, 103, 17, -121, -277, 430, 383, -164, -311, 244, 109, 215, 34, -99, 528, 608, -168, -375, 360, 439, -321, 112, 22, 154, -21, -468, -282, 272, -1, -672, -75, -6, -229, -179, -104, -1, 140, -35, -432, 84, 473, -35, -65, 280, 53, 111, 2, -74, 189, 640, -109, -226, 454, 622, -166]
6183a66J17K22p8J9n81mN67K13q14qR02k44m20L01o1J62J7l47j80P58n7p36M77
6206E9K57O7j09j18N3nL75q27L36O86o78k02L69K37m06m41J99O4L94j07o85L44
6228a38M02m42l09J45J88L82o19k16O29L12o52Q3P58k71j15Q9m22L38M64m67l40
6249b01P42j13m24k19L10K60k55k18o3K69K99p26K03M46l05j50J72n50N55r5k21
6270b84j4Q11n59n40O25O0N6m86L57J59J18K88p95L60L76m10l24N05j09J85l32
6291D7k54p6O34m98k29N88j53m34J21J80j92N27k16n87N23K04l89k51K53O36m25
6312IJQ1L09j89k89K2L82l07m6O9P9M11j99p35j3Q54j60n41q9P34j59l71R7n3
6336a03N9J01j50l04N94m90m0L47R3p6p5l23K10N68p20j56N98J65j32j96M18n3
$$ y = [-166, -49, 173, 95, 114, -467, -471, 96, 309, -505, -513, 389, 145, -275, 26, -35, 127, 144, -203, -383, 375, 318, -418, 59, 316, 383, 274, 156, 209, 204, 579, -248, 88, 774, 96, -106, 263, 500, 94, -347, -148, -84, 310, 203, -482, -138, 264, -178, -487, -342, -154, 228, -391, -607, 22, 334, -318, -235, 523, 252, 137, 226, -196, 142, 606, 139, -201, 541, 428, 4, -215, 95, 355, 100, -118, -181, 88, 387, -339, -136, 310, 5, -145, 27, -523, 32, -63, -284, -298, 513, -46, -586, 39, 99, 155, -331, 26, 185, 303, 591, -204, 156, 532, 122, -202, 303, 194, 379, 47, -207, -283, 351, -147, -376, 212, 59, -375, -254, -74, -266, 261, 45, -542, -19, 185, -204, -455, -202, 434, 9, 10, 91, 400, 211, -78, -56, 326, 19, -27, 42, 121, 532, 333, -402, -415, 439, 279, -262, -351, 383, 224, -147, -50, -103, -44, 57, -93, -397, 197, -293, -333, 14, 107, 31, -44, -367, -157, 411, -309, -465, 133, 298, 166, -30, 388, 335]
6358C35K29k40l45O4L17n09l71L55N10m96p3J07J83J88m74k43O50j00j92j39N07
6379B63j83k17p8k5O51l2o24J67L40j8l34n8K03L6n2J64l70O30l11o37O52j53
6401A4J3l20Q3l58O81j86k97K16N36p28m5M36m6p9J55k30p0L79K62o32L90J00
6423B74l76J29r7J72J72R9k81L10n6l78o9O48k71m76M4o7K92J70o29q8N09r1l43
6446d03K21r1J69J8q3j80P39J18r11M92j45L92o20M53O1Jk95j58J35O10n0o20
6468a47P0N36k81o52L13J26J19j09n77P5J146r71p8M14k18P6m3l5k1L80j66l81
6490d24O96o4l97P9K20J44M3l18l53P23J19n79j26P90n0o40L85O1l68J13m01n1
6512c98Q41l99p23L45M05r8r4j96J83N40m64m39K89L30J87m09L7J5J51%m92M58
$$ y = [335, 564, 324, -21, 43, 360, -149, -520, -165, 345, -151, -224, -117, 66, 254, -220, -463, 187, 87, -105, -244, 263, 80, -137, -215, -240, 411, 379, -245, -78, 262, 244, -90, -148, 55, 91, 39, 203, -167, 463, 152, -485, 167, 14, 27, -293, -210, -568, 113, -73, -370, -154, 382, -346, -391, 45, -1, -80, 75, -155, -225, 154, 416, -216, 174, 274, -102, 27, -70, 102, 274, 373, 92, 402, 346, -32, -101, 547, 276, -200, -156, -223, 69, 239, -390, -478, 31, -60, -403, -182, -273, -104, -86, -169, -349, 390, 508, -403, 89, -56, 336, -284, 169, 230, 231, -64, -222, -87, 523, 473, -147, -77, 459, 178, -474, -161, -35, 84, -25, -602, -527, 619, -352, -430, -16, -234, -158, -201, -236, -257, 123, -43, -424, 272, 208, -189, -110, 110, 254, 297, -21, -374, 349, 468, -111, -237, 553, 503, -137, 248, 309, -59, 54, -347, -398, 443, 44, -679, -334, 71, -27, -121, -317, -134, 406, -58, -497, -208, 122, 309, -100, -63, -48, 103, 103, -389, 69]
6534F9K79j47n55R17j86l86O8k2j6L92n15q5k8O05n43q3K00k91M32m29k04M17
6556a11J92k37j93M07M64l82j70P3Q0K19l85j26M69K84p44K10M73j82l27o7j75
6577b28M80K97p12rO25p2p40J71K72j59j31N0j86M13nm12K30M12l24j45p6J73
6599g6K34n0l23K15O91l88m21J35L58l56l3j96K25J41J08k71J06L90p04n29Q68
6620A24j16j09j27j79P32j16l35j22L00J31j96l00L54r4L01n49J03L38J07q13
6640e66N13K26n51K90K85k63M96k51l72K14L57k78m13O65l12k9L31m92L3%K02
6661H5n20J12L69j09l29Q9J36J14N11n28M54J65n55j86N80o6k03l37N8O57m4j87
6683B66m62M67j95j91R7M01k92l08J2n5J23N62o93l68Q61o7o07M25j2k6L3j89
$$ y = [69, 348, 201, -354, 563, 377, -9, 59, 37, 21, 413, -102, -187, -215, 390, -153, -236, -36, -327, 105, -324, -528, -111, 81, -156, -349, 58, 522, 140, -30, 43, 123, 342, -43, -169, 300, 584, -160, 50, 523, 341, 14, -53, -228, 252, 549, -163, -172, 453, 381, -359, -188, 84, -75, -206, -156, -342, 71, 66, -346, -116, 296, -28, -173, -249, -76, 158, 108, -215, 0, 691, 303, -118, 17, 375, 19, -14, -210, 15, 156, 264, -7, 99, 489, -215, -744, 124, 8, -101, -228, -407, 325, 209, -126, -248, 52, 183, -13, -313, 41, -53, 248, -301, -198, 140, 247, -566, -53, 173, -378, -88, 197, -66, 430, 179, -193, 21, 378, 100, -313, 352, 40, 11, 342, -150, -117, -117, 85, -435, -323, 46, -63, -392, -303, -167, -53, 458, -70, 384, 549, -6, -192, 388, 322, 119, -218, -160, 497, 453, 266, -196, 271, 76, -115, -18, 383, 91, -217, -205, -260, -137, 425, -268, -636, 225, 158, -449, -24, -36, -62, -29, -218]
6705b18j28L75K64n08j02L43M12m38J47K67l8k09p59P69K86l50l00%R1K17l38
6726b17O5K55n2k9p16P45K91m68o0K21j37L61l79k69N82k15m2k70N24M8m74K91
6748E5J08L6K97o16kO31K61q70K12k4M9j08lk20M94k76m97J95O02k7m79J71J93
6771A82n3n4l56K6L28k0k66J32L90j44m9j74n6K97L7o09M3O12j38m99M25J33m1
6794A46NJ2k14j68l3l43P17K08n17J61P3k67K33m19M13L34k59J0n32O38p7k54
6816a33O7L9J78J90j86Nj4J27n69L28j59J51P6k49l96N32M00q37J14K87j18R5
6838g2j28j26L37J45l89o2N83l87j29p6K36K84m43O3K10K14m9k03J0K67l42p0
6860a27J50O14j36l55k49j81O34m28k77K41M48o26K30o4j5K14k68n95R27L0m80
$$ y = [-218, -346, 29, 293, -215, -317, 26, 438, 0, 147, 414, 376, 167, -592, 177, 463, 113, -187, -187, -96, 121, -217, -152, 103, 51, 22, -694, 51, 342, -126, -186, 35, -102, 259, -120, -389, 193, -22, -64, -334, 190, 238, -236, 55, 163, 199, 496, -120, -122, 509, 770, -100, 112, 88, 137, 29, 26, -194, 300, 24, -473, -278, 324, 297, -182, -11, 182, 129, 75, -281, -255, 73, 53, -213, -81, 309, 165, 116, -58, -114, 183, 220, -389, -346, 266, 128, -371, 54, 187, 146, 151, 163, -51, -219, -252, -595, 122, 330, -187, -26, 47, -220, 13, -406, 7, 341, 82, 92, -440, 198, 121, -133, -66, -27, 151, 341, 155, 160, 146, 273, -296, 32, -127, 24, 100, -149, -545, -13, 387, -450, -336, -49, -167, -72, -200, -326, 11, 156, -233, -295, 288, -99, -228, -304, -68, 216, -227, -164, 46, 260, 211, 8, 18, 285, -57, -127, 23, 637, 501, 146, -103, -284, 350, -78, -355, -114, 334, -292, -62, -126, -141, 73, -195, -790, 137, 167, -313]
6881c13J17K07N5j89K09j27K48q9l76k79P16J92n54J16M45Kl74o1k7M79k88m57
6903c48K80N00q46K78J41j37K99m3m93j47P44k02n15J29O53m32kq5K60L7K88n99
6925b40K86L50k43j82L70n7m33K43l77J00N78n18J10J45R9m12K89j99K7L48m31
6946a47p4N41J62o75k23N25j33o7k3j6L30m1l52k62J069m58m23L07K30n5m0k80
6968a05J52K40j15n82N68L36j88m76K71K16j69Lm97J28O48o33j57J93K34J00l20
6989a53j50K62N06q23K1N50J58l05R9n1j96N75m40l90N97o4k08j26K40L45q12
7010c65N34j46J53mk51l35L37M72o87P3K16k84QJ37r0J65J82q35N17L57k44J54
7032F4R6o7J65l45J47J26j44N4j35J20M00k55o14J49M45j12j73m60M22L93k31
$$ y = [-313, -196, 11, 66, -123, 86, -41, 207, 118, -258, -537, 179, 371, -183, -67, 378, 380, 6, -55, -82, 397, 109, -348, -68, 432, -414, -136, 5, -132, 167, 124, -369, -516, 228, 26, -489, -360, 293, -139, -141, -226, 34, 71, 359, -240, 46, 396, 153, -29, 341, 284, -149, 94, -283, -183, 395, -123, -13, 132, 231, -181, 108, -91, -64, 284, -147, -221, 320, 482, -193, -416, 109, -24, -91, -114, -130, 200, 159, -193, -455, 614, 156, -267, 40, 270, 215, 175, -105, 47, 287, 172, -410, 158, 494, 306, -170, 101, 317, 148, 151, -346, -218, 430, -203, -360, -167, 67, 167, -153, -303, -41, 465, -358, -337, 213, 371, 66, 165, 114, -82, 493, 53, -337, 260, 196, -12, -138, 102, 447, -365, 169, 23, 176, 172, -79, -414, -77, 395, -292, -219, -3, -287, -279, -142, -232, -67, 115, -720, -203, 154, -90, 64, 160, 93, 258, -87, 60, 186, 42, 96, -39, 81, 481, 226, -388, -239, 206, 94, -79, -539, -117, 276, 45]
7053D5k83L28L7l68M00l32J92L16m06k49N53L94q09Q8q7K82K72m23p1M99j96k39
7075e7k3N92l13m07N25m61M78m2n31J20M31l9q0l07K5M6Q6k60o3K75R5m47L72
7098A5K77l87k01L98J16j97K24k47r8N55k84m57M70k11P8Qj5l53K26L6j29K09
7120C3K28r0m05J36L1R8K20o39J93K79k42q9J37L65m78r3M74l1j15rk66M49L53
7143E39p82K62K58m48M46m11j74N11K95o18Q2J74k33J6n2L99l84K40n56M28L9
7164C1j6j41KL71k96k48j52N66K12m93k0J29K12j06l90N76l72L22l4k54J96J49
7186B44o3l73K32K83n47J13L5L63r0m47R1J59L46r16Q7L51J60j40J05k24L92j3
7208A48j76j99L14k71k72M29K64J16j28o1Q0J63j91k41l5N68n48n2J00Q8j51m1
$$ y = [45, -238, 90, 127, -241, 159, -173, 19, 335, -71, -320, 233, 627, -182, -94, -181, 101, 373, -50, -121, 378, 182, -57, -80, 512, 199, -208, 317, -144, 334, 292, -239, -119, 312, 273, 193, -114, -89, -43, 43, -217, -280, -5, 90, -357, 15, 292, -95, -296, 102, 218, 21, 245, -2, -100, 455, 171, -286, 184, -27, 51, 59, 44, -309, -83, -47, -176, 33, 261, 171, -234, -98, -67, 31, 251, -388, -195, 84, -158, -247, -110, 255, -223, -316, 158, 127, 12, 3, -263, 186, 539, -243, 19, 277, -171, 275, -136, -310, 201, 496, -122, -40, 134, -99, -83, -135, 264, -120, 120, -436, -8, 31, 15, -126, -124, 247, -49, -297, -449, 117, 329, -164, -184, -55, 157, 51, -339, 237, -135, 187, 153, -101, 95, 244, 181, -192, 40, 323, -224, -111, -76, 287, 197, -250, -159, 0, 346, -570, -483, -132, 28, -112, -7, -231, 161, 148, -28, -227, 87, -184, -456, -27, 237, 353, 225, 164, 244, 407, 216, -25, -60, 508, -40, -92, 8, 96, -55, -96]
7230i6j39Q9Q6j09k83O95j07l17j52K78l4Q9J4l84M86L10l91m08M26L2j79L42
7252B48l54J21L68m86k04O08j1l10j26J86K97l04k68K40J71J84m25K1K84l33m8
7273a41J26j15K28K14n10k2M17K42o84%L32N5K5k23N1k1R8l41M9M50l83k29N26
7296A44K6k9k23J75N7J07j93j06K96k67o4j89J86k19K22k5k07N0K51l28k2K25
7318a33j48L95l25L54j29J75m35Q5N50l45l53M35J1j26K37l58n1K51J68m39j53
7339c34L40m3j35J6k11M55J15n46Q3L82p8r0L89m21p3L22k74J20P20q03R6K36
7361B66K33n26l10J58L49J96k9k07P7K70m47k29M59l87o5O3P0j19L67l73k0K99
7383I5K1m17m5N59l32K4K96l09M38J58m14k92N05j33o35O76j65j83K48q4j66L57
$$ y = [-96, -235, -146, -60, -169, -452, 243, 136, -181, -333, -55, -89, 0, 14, -370, 116, 426, 35, -373, 53, 85, -94, 248, -106, 15, 383, -103, -307, 301, 290, -20, -146, 40, 337, 33, -235, 5, 176, 360, -65, -44, 240, -93, -141, -15, -130, 98, 312, -198, -220, 197, 439, -245, -245, 87, 142, 167, -56, -5, -26, 72, -269, -220, 230, -153, -382, 144, 170, 141, -82, 93, 150, 257, 64, -42, 254, -13, -77, -266, -80, -299, -77, -102, -309, -259, -8, -336, -358, -133, -281, 114, -211, 143, 14, 189, -246, -161, 389, 44, -309, 126, 137, 11, 248, -110, -161, 90, 258, -181, -334, 6, -37, -172, -156, -367, 88, 203, -343, -260, 122, 44, -46, 343, -78, -151, 171, -103, 17, 737, -66, 30, 266, 499, -27, -337, -179, 170, 366, 337, 130, 207, 477, 30, -199, 260, -127, -192, -129, -59, -178, 189, -184, -204, 95, 116, -301, -346, 213, -119, -95, 201, -108, 330, 488, 74, -218, 287, 154, -481, 195, 30, -153, 95, 11, -155, 202]
7405B02Q8m10j81O61m93k1K15k25J65j55m51M75P86p86K37n4J62m57J45j00M72
7426B75R8k94j3r8O31l54k78L03k65lJ71m26K79N09m01k50L86n18J65l59M06O6
7448C0j4k03nK89K3m73J74L72k56Q7j22n4O7L35o39L20N31l90r6M6J37p8l6j02
7472e7l4L02Q0n28J96k77L47k6L78o52M24l4m72L69M79m48m41L36J99j48k12l16
7494e35P32K51n14l13N48J8k69L8J08J27Q3r1l26J27L07m67j22J95K50k95P8J5
7516e5K78J28o95J79L04J8m62K23R0j34j74K42l47M12n1n19K41N96n22O8J76K71
7538B67k04qJ17j97Q8Nj04J63K34m98J93J45o5Q3n30J98J09J79r5r8P8K6k20k09
7562c43K65J04n3o2j58J62K00k20J4J34L07k84k4j59L12J05o67M56M58j85m40
$$ y = [202, 290, -120, -301, 360, -133, -154, 61, -164, 1, -154, -605, -130, 656, -130, 107, 53, 215, -242, -97, -197, 275, 373, 79, 66, -32, 599, 245, -33, 270, 5, 2, 173, -253, 26, 535, 134, -116, 270, -248, -83, -442, -36, 30, 16, -187, -192, 97, 120, -353, -179, 193, -63, 24, -98, -152, -85, 250, -389, -69, 462, 72, -24, 22, 159, 81, 45, -57, -91, 211, 291, -237, -41, -318, 29, 3, 381, -271, 153, 119, -353, 16, 495, 47, -394, -58, 141, -7, -219, -535, 197, 448, -66, -379, 169, 187, -82, -44, 64, 191, 274, 183, -143, -16, 291, -176, -298, -103, 147, -148, -70, -55, 223, 351, -344, -165, 139, 157, -305, -82, 8, -126, -300, -58, -405, 7, -44, -563, -322, 274, -248, -180, -4, 267, 63, 55, 172, -25, 63, 68, -36, 127, 361, -137, 56, 201, 136, 219, -311, -113, -4, 175, 80, -18, 60, 86, -134, -343, -78, 26, -27, -89, -247, -85, 115, -105, -91, 43, 350, 66, 42, -117, 195, 300, -367, 89, 547, 362, -78]
7583g8J60j66M23O2m59p3K49j38k70J75M81n92J48M8k66M45l38J29o0q4K64j14
7605e4Q3k81N06q6m25K39J63jo48O00Q9p3J09j98J18j59K40q6L5n4k00j31L92
7628A78m09J59K04k91o2M26k71l8K58qk26m9Q2J54n0J47k90L76J8k31k80M61k19
7651C9J29k31K28j07n7k87K31J08J61n96N07L9j35J54m58m9M54k98j40j08M58
7672D2p5k81L15l19O55l55k17mL62k11o9L96l8n9l69Q9R6K01k8l87M77R7l82k28
7696b92P8M34m5l90j54K11L05k99l36N35M0m19J42pQM10k43k67L41M7n8r3L45
7719B93l6k03J27l00J86N00o30L05j35K7l08K04J11l38K31j59NK64J83l13J81
7740A95L45n44j78J93J03q0J4j70R1J99k46p6K01J59l48Q6Q1j1Q4j20m11O71O4
$$ y = [-78, 82, -84, 339, 401, -58, -131, 118, -20, -290, -115, 366, -226, -78, -30, -296, 149, -189, -60, -120, -204, 60, -54, 29, -252, 254, 168, -257, -18, 145, 144, -504, 96, 185, 112, 221, 23, 141, -18, 222, 136, 171, 117, -83, -214, 178, -231, -72, 132, -159, -221, 205, -66, -104, 154, 146, -80, -129, -47, 107, 57, 204, -86, 290, 308, 77, -203, 258, 39, 168, -63, 165, 58, 1, -286, -55, 53, 214, -382, 125, 164, 29, 183, -275, -324, 130, -168, -308, -416, 42, -33, -314, 1, -318, 337, -18, -235, -239, 123, -88, -157, 239, 201, 142, -227, -138, -42, 159, 131, -256, 221, 318, -64, -292, -214, 220, 175, -215, -369, -158, 147, -152, -488, 47, 87, -332, -190, -197, -189, 221, -22, -289, 52, 99, 41, -52, 293, 257, 54, 181, -119, 67, 567, -63, 242, 107, 134, -174, 30, 141, -197, 34, -125, -120, 144, 327, 14, 195, 540, -4, -182, 11, 114, 34, 48, -122, -31, 168, -78, -154, 47, 206, -142, -56, 25, 14, 98, -22, -433, 238, 302]
7763C02k00j61J2J88k34l2J23N6Mj35l95P71m95K9Jlj3J19j1j29M03N1l50n6J82
7788B7J1k97L65k84J36J55l94K00N22m62k59J97L81j96o6k65J54P1l4o5M09j4
7810B92l99n2n9P8J08k6P4j1L64j18n30O49j46k71Q1p8M9J85L8m45N38p8m92K85
7834C6j07L1k02L42j74L60j60j72k62M95j69j84L6l2k9J95j59p9L32j18m46K87
7856a79K94n5K6k91J78J89k03Q8j98L03o0j40L69l03Q6K3K4k67L75m66k11O34
7878B16l5l66L93k31j15N08l80n35L21N80n96j63O37j56J22m09M24r2l1l11oL18
7900I3k1l40K71j2l0pk05K6M38j91L1q8N64n16k54K10K5N35l28l98j0N16j39n07
7924c37K50L10m38K48l1J88r3o8m45P4N31j42j37K71J19p62P31n35M97K76l67
$$ y = [302, 102, -59, -47, 141, -93, -125, -2, 54, 58, -77, -472, 299, -196, -167, -166, -169, -182, -63, -74, -203, 200, 251, -99, -155, 27, 38, -259, 106, -178, -42, 113, -281, -81, 441, -21, -280, -83, 298, 102, 36, -229, -75, -4, -38, -103, 306, 292, -107, -159, -218, -140, -32, -58, 16, 5, 369, 251, -279, 370, 224, -47, 34, -44, 5, 190, 228, -217, 321, 243, -249, 36, -71, -40, -242, 100, -74, 286, 126, -46, -308, 187, 18, -166, -130, -162, -191, 4, -155, -234, 98, -20, -466, -179, 115, 60, 86, -205, -27, 162, -41, 47, -151, 152, 92, -48, 321, 18, 104, 127, 151, -116, 259, -207, -418, 216, 181, -185, 208, -23, -138, 370, -10, -545, -224, 356, -240, -403, 234, 78, 200, -209, 215, 123, 92, -219, -225, 93, 72, -268, 3, -9, -39, -46, -251, -225, 213, 22, 53, -35, 529, 13, -241, -31, -6, 529, 201, -197, -207, 309, 170, -337, -87, 223, -215, 33, 2, 190, 97, 29, -416, -342, 189, 47, -90, 181, 300, -462, 269, -266, 231, 507, 140]
7945A40m87J93L59l63J98J66q8j08K62n70m6N15o75J89K18Rk32J74J76R2J4m40
7967c04J14L86m6k94j05L60K45l52k15K60K26q1m05K97K83k08n5lM4M04l9n96
7989h4j93N25k08m35M02o3J33l78K76q9K16K0k12L4K14m81J78K56q5N31n51Q2
8011H8j65N54m84j94L83L2m02J72O8j42L84m10l91O08J7j93j34J63L31m92r8j40
8033d45L12M89l44j40J34Jk52J22l7M95m00J67J49j96K29n50J89P0L0l83J25R7
8055a38M90j18p78N08K36j90k45L21J9l3k38J47j61J52j9l03L26M87l31j34q3
8076h5j64M57k28nJ6L48k53rj0K46m18j36L06k60L40k62N2O1L79o47L91k05p7
8099a63j17L08k60L30j33j52l5M88pk22p5J13J70q4j49j17M71k9l42LL75l43J16
$$ y = [140, -347, -154, 205, -158, 40, 206, 118, 10, 272, -298, -344, 171, -504, -315, -97, -88, -320, -146, 30, 122, 136, -304, -190, 196, 150, -144, -249, 111, 356, 4, -211, 49, 275, 194, -211, 86, 369, 161, 106, 103, 147, 551, 512, -84, -277, 248, 40, -395, 7, -56, 77, -301, -25, -114, 102, 122, -90, -56, 158, -323, -145, 111, 26, 557, 6, 88, -77, 477, -7, -201, 182, 214, -188, -16, 52, -90, 294, -116, -507, 101, 118, -75, -209, -46, 285, -207, -305, -445, -133, 356, 12, -128, 6, 7, -245, -123, -160, 335, -65, 102, 251, 55, 284, -266, -77, -7, 23, -360, -235, -138, 352, 234, -544, -36, 200, 10, -235, 86, 105, 72, -166, -19, -180, -28, -47, -350, -24, 463, 132, -2, -85, -249, 208, -20, -25, -9, 339, 86, 77, 67, 313, -105, -241, 65, -195, 145, -117, -65, -4, 375, -272, 119, -86, -163, -280, 28, -232, 98, -35, -187, -222, 266, 259, 37, -38, 75, 245, 161, 12, -105, 366, 337, -5, -2, 373, 30, 146]
8122A46m5l3K97l14Q3k61M57l70j86M0K37j55J0j29j22O06m66L0J60k7K41n3R3
8145B39k79mJ23m00K03L93l86K01J00n0l75P3N33j50J07j61r5l19K31k59J51M28
8167C04l71M3l67K45J74L13n08k43M17p5j59K25Kl08J20n1J95J73j46n4o9M47
8189C07k07l01
$$ y = [146, 101, 68, 365, 51, 134, -127, 330, -40, -226, -186, 51, -104, -94, -223, -345, 261, -205, -175, -15, -42, 199, 146, 239, -40, -44, 79, -321, -118, 275, -111, 90, 190, 140, -235, -162, 371, 221, 328, 167, 72, -247, -16, -275, -124, 304, -67, -24, -391, -146, 28, 341, -167, -410, 7, -68, -227, -2, 0, -308, -188, -239, -44, 129, -17, -71, -140, 307, 100, -201]
8191b01
$$ Imaginary data points
##PAGE= N=2
##DATA TABLE= (X++(I..I)), XYDATA
0@%%%%%%%%qJ5j5J6j6J6k4L2l5M3n1N9p0Q1r2J05j21J39j60J82k05K29k56K89
32A53l24L61m03M50n01N54o12O80p55Q35r23J023j134J258j398J559j747J966
50A042k225K541k933L431m093N016o392Q655j2989K4060r9382k04445L16688J69986
64A98960k38707j04228J94388L2918j51662o051J20564q65q0165k3945K5058L5329
76A594M7403p605o1747p814K6681m0803L185J09083l613j37066K3497J28121o2575
89A8341j00404R9310M8191j38660n833J64461r707j47655J9380R9748n3706o9328
101g5862Q0523N3555q8237l5882Q2833K1261n5783j248J1327k6672K2886L4031
113B2732l3870J4534O3322p6077r7675J15877J04662j36969q0313J54918N4749
$$ y = [0, 0, 0, 0, 0, 0, 0, 0, 0, -8, 7, -8, 8, -8, 8, -16, 16, -19, 24, -27, 32, -38, 43, -49, 56, -65, 74, -86, 96, -109, 120, -136, 153, -171, 190, -213, 237, -264, 290, -322, 358, -397, 438, -485, 538, -596, 662, -736, 823, -924, 1042, -1183, 1358, -1575, 1856, -2237, 2779, -3613, 5042, -7947, 16113, -83269, -287714, 28974, 198960, -39747, -143975, 50413, 83331, -68331, -74382, 46182, 45317, -34848, -58793, -33735, 1594, 48997, 41392, -20355, -28169, -1488, -42291, -39106, 69977, 66364, -70702, -47205, 80916, 18341, -82063, 17247, 65438, -73222, -79055, 85406, 75699, -71956, -52576, 47172, -6534, -75862, 4661, 58216, -30021, -65903, 16930, 38191, -17592, -18840, -7513, -34185, -11299, 22732, -11138, 3396, 66718, -9359, -107034, 8843, 113505, -23464, -103777, 51141, 105890]
124A05890j52891k2890J37638j7778j34505M2885J24849n0892r4820N7263N2166
135D6915o2808j3727M8461k4995k4942M5365p066l5827N8166K1345j00769j2616
147f2498J04509m890p7741M2132N5883o8388l1277Q7871N205j04740J2515J06681
159F5262k8793q3899O4919N8694j03837m6509J09487K2828q6271R136M8108m1067
171a1942j0933N6370j4632n0428K1701J2213l5288L2318O4834m7186p8568M3103
183a8438O2357m9619l1512P1597O875q6758K0591R2859l8369p4712M4159K5914
195B4944n6497K8996P1261n3933o3178N2155K1569n4416K1809N6959n3101o1631
207f5063O1669N6718n3979l1879M4680j2567n5993M4486O7605m9664m5039N0555
$$ y = [105890, -47001, -69891, 67747, 49969, -84536, -41651, 83198, 32306, -62514, -5251, 46915, -15893, -29620, 18841, -6154, -31096, 14269, 7203, -28624, 29542, 50887, -49882, -62498, 42011, 37121, -40620, 1512, 57395, -10993, -42270, 45601, 50806, -53934, -41419, 65262, 36469, -47430, 17489, 76183, -27654, -74163, 35324, 58152, -28119, -18983, 29125, -11942, -22875, 33495, 18863, -31565, -9864, 2349, -32939, -621, 64213, 17027, -61541, -18438, 43919, -5700, -37212, 34385, 41260, -45498, -24907, 67952, 29583, -45129, -970, 24944, -31553, -2557, 68704, 14771, -48407, 3748, 25317, -29099, -7290, 49669, -3432, -65063, -3394, 53324, -655, -32534, 12146, -421, -56414, -11928, 55677, 6013, -39026, 11529]
219A1529n54n3859M4241N0994o9256l2939P6186R098n7293K6400L3653o2821k4238
232d8859P5726J7486o3348K508M7521l3439m2129N7274L3540p3281k2866P0622
244B0755k208n1975L9710L1479p1045j8352P0549j170m4341L0672J8869m8217
256b5274N062N2368k2747m5644L4438K9769l9686k651N5177j7660o9079K9988
268a5939O4498m6555m5204O7304J8016q2045R819Q2781l4036p0309M1155L7871
280B7356m4256j740M4556j7487l5858K0379J4401j8970J0441J8068l2268j2883
292b8261N7225J2603p1903m622P4515j9821o8654N4703O4267p4691m9325P7657
304B3693J8163o8137J3943N1331m0639l7035N0896K5754m2143j3438J9658j1483
$$ y = [11529, 10975, -42884, 1357, 52351, -16905, -49844, 26342, 35440, -21853, 4547, 38200, -24621, -48859, 26867, 44353, -18995, -16487, 31034, -2405, -44534, 12740, 46280, -27001, -49867, 20755, 18547, -33428, 6282, 37761, -33284, -51636, 18913, 17743, -26598, 4074, 22943, -25274, -20212, 32156, 9409, -36235, -1797, 27972, -11714, -14365, 40812, 23152, -45927, -15939, 48559, 2004, -43200, 24104, 42120, -39925, -30106, 52675, 18639, -51670, -10515, 27356, -16900, -18640, 25916, 8429, -27429, -7050, 7351, -11619, -1178, 16890, -15378, -28261, 28964, 41567, -30336, -34958, 39557, 19736, -48918, 5785, 70052, -4639, -53964, 23693, 41856, -26281, -12338, 38993, -1646, -38681, 12215, 37969, -4174, -17612, 2046, -9437]
316i437q356L2508N296l9628K191L5167j8992k3340M1770M317o1060J5926O9155
329D5517l1975m8311N4635J6760p9159P175R1318j5496q0163K1333N6761l0105
341H290l4450L9842J8681m7939j5739M0522R615j6899N051j1967k7260L0283L2305
354C0335m3831j7243N5566j0016o2931L9006O2104n6035n0474N6999K8820m9705
366a7405L392N1452k4355n4987L0808M9049k9450k9016L2035L415l7325K0823
378a564L9158l7160l0298L6208L628l0516K6322K0885m4211p673M1949j6037l1862
391c1171M0074J9143n8332q525O9285L347o7548M485N8816k1198m7940M4145M3849
404D8430n5971l1887N4080J3019m0321R770J9432k6842K101L1402j9524k0010
$$ y = [-9437, -17793, 14715, 20011, -19617, -17426, 17741, -1251, -24591, 17179, 21496, -39564, -23638, 45517, 13542, -34769, 19866, 36626, -42533, -35358, 55960, 40464, -39699, -18366, 38395, 8290, -26160, 13682, 32363, -15576, -31315, 9207, 18822, 1923, 6974, -4993, -32253, -1970, 30335, -13496, -30739, 24827, 14811, -48120, -9114, 52990, -3045, -53519, 3480, 32300, -17405, -14013, 37439, 13084, -41903, -11095, 37954, 8504, -20512, 11523, 14938, -22387, -1564, 37594, 434, -29864, 6344, 9972, -20544, 5778, 26663, -17548, -25221, 16728, 691, -31171, 8903, 28046, -30286, -38811, 30474, 33821, -33727, -29242, 29574, 8376, -39564, 4581, 48430, -7541, -39428, 14652, 27671, -12650, -2880, 16552, -10290, -8189, 23213, 3689, -16321]
416a6321L1371j474m5166J6682N1159k4446m8411K7257L7137l3733k2683L9441
428A0813N485m7025J2203M8513k4259l2856L6752P668m8237J7432N3161l0840
440H810m1195L7307K1648l3709R26K7889j8409k2271K3941J2518k1230L997K0523
453B0745k5231k6179L9655K5842m9601j7667N1509k683m7783K7076M0018m6515
465a0814k9352M7220J2990l3211J1479J8952l0038p921L6861P88l0535J0876K0842
478A8137k3436j2651L9948R160m8615n031M3675q977l0825K9733J6180m7457k863
491b3022M7974j3918l5451K7069J3914m0102M701M5317j2778m0446J4510K4578
503A2346j8892p876K8778p44l3633P476L0962j4496j5911K6965l928l8133K2835
$$ y = [-16321, 15050, 13576, -31590, -14908, 36251, 11805, -36606, -9349, 27788, -5945, -28628, 10813, 16298, -30727, -18524, 29989, 5730, -27126, 9626, 17294, -30943, -13511, 39650, 8810, -32385, 4922, 26570, -7139, -6213, 21676, 3267, -19004, 4937, 17455, -3775, 222, 20745, -4486, -30665, 8990, 34832, -14769, -32436, 19073, 16390, -31393, -4317, 35701, -10814, -40166, 7054, 20044, -13167, -1688, 17264, -12774, -20695, 16166, 16954, -13581, -2705, 18137, -5299, -17950, 21998, 31158, -17457, -22488, 21187, 12210, -18615, 11118, 27298, -20159, -23022, 24952, 11034, -24417, 2652, 16566, -23536, -18835, 26482, 13704, -26742, -12232, 12346, -6546, -14422, 14356, 13612, -20021, -12545, 18417, 3921, -11990, 14975, 11047, -27086, -4251]
516d251M2377l3570l0438L8699P150m2517J3371M1065k4619l3048K4007J6785
528A5011k0914o76J7926j6636j8967K5326J8092k8642p570L0826j2245l3314L0753
541a030L3885m1256k1287M2505L343l4304J9060K3853l3440j1946L6373Q56k7465
554a0853J2830J7619k5127j3630L2809Q828l4586m470L0936p964k3648K2263J2809
567A7816l5307k803L4574j0738k3220K7840N972m0113R511M2794j9229l3484K5596
580g91J9914k8195n427L3128j866l3078N360K7202r014j4673J8659K73k7985J2815
594c678K9047k4678k0176L1193L67l6088J8863L5983l1067k9312K9839J2855k5949
607a2801N407K2275j7374j9424K2307J5507k2116m784K2564r343k4358K5760K7043
$$ y = [-4251, 38126, 4556, -25882, 12817, 19967, -22550, -9179, 31886, 7267, -25781, -1774, 15011, -5903, -6579, 11347, -5289, -24256, 1070, 19162, -9480, -17050, 13776, 1531, -31783, -1030, 32855, -8401, -29688, 12817, 16160, -18144, 916, 24769, -8671, -20617, 15756, 16612, -10853, 1977, 19596, -5531, -19161, 13648, 22476, -12110, -16580, 14356, 6392, -17256, 5007, 17816, -17491, -20294, 14280, 3542, -19678, 8162, 14134, -25979, -16468, 26326, 7097, -26387, -791, 19123, -9072, -14499, 18629, 16763, -16315, -10955, 16247, 7233, -7440, 11219, 11492, -16493, -3678, 25369, 691, -19485, 11708, 12075, -24013, -5150, 30833, -234, -29546, 293, 13148, -12801, -7394, 14881, -2493, -21917, 390, 15897, -6219, -11003, 11561, 2218, -22140, 3620, 30663]
620C0663l3374j9373L3334L401k9004J7081K0914k9469j1005L0415k599k1895
632a0911J7287Q961l1414l530L7048L44l4273L556K5583j4020k0298K5074J6663
645B0070l2336r697L0901k053j9590J8629O457l1085O246L4497j4492k3161K3907
658H293P845l0893M760L3201j0010k8820J0637J9531j3644p730J9495l453k7907
671a8695R301K6867j6983j6978K6203K8l4898J4755L4634k3772k5621K6178R992
684A1011k4050P701K1263j6385j5873J8328P425j4836N349J5898j6437j7728K5245
697F911J8096k9563j2101L0652k130l0163J8210K5702k8556j7568K7009K159k1177
710a2519J3627J0755k4301l496K7061m023k2116J0352J5188j8317r784K6499R055
$$ y = [30663, -2711, -22084, 11250, 14651, -14353, 2728, 23642, -5827, -16832, 13583, 10984, -10911, 6376, 15337, -16077, -19607, 17441, 17785, -16488, -12932, 12651, -1369, -21667, 3407, 20070, -12266, -21963, 8938, 6885, -12705, 5924, 12381, -18704, -12458, 22039, 7547, -15614, 8293, 16138, -14755, -9995, 23206, 13196, -15624, -4987, 14544, 900, -6830, 12665, 9212, -18695, -9394, 17473, 490, -16488, 9715, 9743, -25155, -10400, 24234, 462, -25159, 1019, 11011, -13039, -5338, 15925, -460, -16333, 1995, 9420, -5416, -67, 15831, -606, -18334, 6911, 25007, -4556, -16657, 13995, 11865, -18298, -88, 25614, -2942, -20510, 6499, 8658, -12519, 1108, 11863, -12438, -15934, 11127, 7104, -15012, -4660, 10528, -7789, -17573, 8926, 17981]
723A7981k8566n053K6566m124j7902J7923Q654k7854K279L0285j2772k0865K2709
736I261O110l1239N037L2812j1299k6959J1605J4920j3764n343J7283k959k0190
749a4725O598J7452j1338q129J8515m252k6454J6011K9124k2840k0314K7373N842
762A2863k7468J0427K5720j7849j9018J8744P846j3290M108J1190j4888j2163
774a3778J9252J0517k0515m742K0645p831k3143J8997K1602k6172j6030K5601
786D403J926j9534J4644J1430k5234l756K6095m507j8632J5062J1949k2436o801
799a5391K6927O727k5776l727K1741l518j5519J4615J0006k2451m154K2249o787
812D942j4929J8909K073k8500O830K9106j3553k2987J6949J0413j9561j344K0922
$$ y = [17981, -10585, -15638, 10928, 6804, -11098, 6825, 15479, -12375, -10096, 20189, 7417, -13448, 9261, 15371, -15868, -10831, 21981, 10682, -16277, -4672, 10248, -3516, -8859, 8424, 5465, -14725, -8127, 9325, -2013, -10142, 8373, 4121, -22333, -6322, 22802, -38, -20352, 7021, 12863, -14605, -4178, 21542, 3693, -15325, 3419, 11265, -2025, 2083, 13273, -1615, -13778, 5474, 15991, -4524, -9266, 11379, 3548, -19595, -598, 21004, -5168, -21198, 4403, 6329, -13205, 1439, 12869, -12365, -16121, 9974, 5467, -13165, 1897, 13846, -8590, -15391, 11536, 18263, -7513, -11240, 10501, 6983, -8536, 6079, 16085, -6366, -10520, 11729, 4942, -9987, 8922, 10995, -17505, -10675, 18431, 4878, -18109, -1160, 9253, -10308, -11652, 9270]
825I270k156j9028L201J3745o127m863J3307l120j8810J1781K1245j7836j3386
838a2777K3484R96k7149J1729K6443j8378j8694J8523N181j6121P093J1619j4853
851b904j0269J6562N154j5754Q82J5689j1015j8114J8358J8934k2540j3523K3626
864E086J874k0044J2977J4722k0741o418K1876l486j4423J4621P563k2220k145
877a0758K4489p04k0787L789J5223r572j2510J5622R533k1078n432J8643l426
890C032j2338J4304K997k4633N590K5347j2611j8127J8731P461k2136K364K2594
903A2575n068j7839N922J0426o119j922J1059l325j4259P193J4566j2213q513
916g517J8920k348k4533J1236K4811j7693j8427J8205M489j7202P870J2909j4187
$$ y = [9270, 7114, -11914, -8713, 5032, -1095, -5958, 7349, 4229, -14581, -2800, 18445, 609, -12777, 10707, 11703, -15446, -3717, 22726, 4348, -14346, 4177, 9358, -6763, 330, 11949, -2904, -13173, 3389, 8543, -7211, -6329, 9360, -1655, -19769, -1411, 17523, -5017, -18540, 5086, 6960, -13084, -107, 14615, -6126, -12544, 9332, 5846, -8577, 6044, 13607, -8613, -10758, 13731, 13027, -7760, -3971, 11252, 1680, -10830, 4792, 14325, -6753, -12185, 6458, 3032, -9306, 4998, 7995, -16638, -11048, 14299, 1688, -16439, 2292, 9753, -12383, -10019, 12575, 7507, -10332, -4410, 6016, -103, -2025, 9034, 5709, -8550, -1357, 13209, 996, -7517, 11403, 9055, -15478, -4242, 20569, 2876, -15551, 2654, 7143, -10059, -2189, 10720, -3467]
929c467r217J3981J633j1189O561J0797j3329j1957J7957J3147j9329p633K0374
942H329j447j9915J2637J8617j8641j0973J8917j017j2783J2681O298k1283p25
955i305K1970m766j7354Q042J1192j3618r267J6233P841j7161n365J4155j297
968A300j0138J1461M559j8701K664J9638j0108j2150J8845L249k3605N326K3577
981A5917q242j7354R961Q271j0191p74J1776l411j2552M838R577q163m558J3451
995H546l485k0489R858K0690j5785j4830J8978L502j9783O584J7403j1922j0798
1008a1531J2302J540q705Q096P672j3287o554J5866O071j5416j903J5983m277
1021E857j6840J1478J6354j6113j0934J5632k11j2833J1535O884j9055j474J7934
$$ y = [-3467, -12684, 1297, 2930, -8259, -1698, 9099, -4230, -16187, 1770, 14917, -4412, -12045, 8329, 6882, -13033, -396, 18221, -420, -11393, 7524, 6507, -6276, 6405, 12703, -8580, -9305, 12665, 7899, -9455, -1413, 9779, -3839, -13106, 3127, 10968, -6193, -11558, 2597, 1300, -8838, 2623, 7182, -11519, -8855, 10783, 675, -11475, 7370, 10619, -12986, -7660, 15917, 7675, -9679, 282, 8553, -1638, -2412, 9364, 5953, -6599, -1761, 7816, -347, -4905, 8546, 5061, -15428, -5570, 15120, -665, -15495, 3483, 6985, -12798, -6214, 11189, -733, -11531, 771, 2311, -6394, 1702, 9374, -3913, -10467, 5399, 11470, -3946, -5849, 10134, 5857, -10983, 495, 16849, 736, -10198, 5434, 5223, -7610, 3925, 10809, -8246, -9720, 8214]
1034H214n850j3301J2398O617j7205l606J8162L174j5933r13J2309k888r150J0574
1048B602O279j4575p57J5360o824r313J6468J684k2249M906K3085j0187j6114
1061i635J2062O788j4396r2J3068k856j0942K723N715n269n48R063m603j4415
1075a3337Q670J5397j3031j0013J7291J456j9958P487J9834j1967j1721J2279
1087B387K194r775P536Q114j2366m535J2432J051j0930L198J1050q537j3116J1923
1101F26J2866j4329r740J4222N70j3743Q639R509j4975l524J5049n680j0066J3919
1115C343N636j8940q27J8704r73j3689L347J0273n885p738J0399O509j1513l251
1129d605J0519l400o651J1845J345j8907L888J8756j0361j3204J4577M099j7579
$$ y = [8214, 2364, -10937, 1461, 8078, -9127, -12733, 5429, 8603, -7330, -8243, 4066, 1178, -7972, 2602, 8881, -5694, -6451, 8909, 2085, -7228, 9240, 10924, -11325, -6419, 16666, 6479, -9635, 2427, 9215, -5181, -5273, 7795, 4939, -6003, -3280, 2435, -2834, -3382, 5681, 1078, -13337, -4667, 10730, -2301, -12314, 4977, 6433, -13525, -6038, 13796, 1829, -9892, 2387, 4581, -5194, 2342, 10456, -1910, -6445, 5987, 7038, -3892, -694, 10356, 1819, -11297, 626, 13492, -837, -10577, 3645, 4215, -9528, -889, 8620, -6355, -9879, 5170, -510, -10576, 3343, 8979, -9961, -10788, 7916, 6943, -6746, -3399, 6874, 989, -6749, 3650, 10159, -1354, -4605, 5914, 2514, -4137, 7708, 9053, -9854, -5966, 12790, 2429, -10775, 3802, 7901, -9678]
1142i678J490J6111m625j0963M112M389m960Q48P365l437r392O418R408r100n060
1157g074J4859n57j8420P239J8814j1230j2503J3439K371j2168O420R098j1064
1170g76m662J0524k452q075O404P403j0885r061J1923Q832j2699o019J2925l55
1184C027j3593P758J1615j2045n297J2028l158q200J3189M074j7647R61J7484
1197A0196m401j1936P989P778j0729n674J1532N021j0782l554Q107k031n738Q071
1211C849K253j3993J748J4091q826j0212J5452K936j9120K789J7579n705j1259
1224h418P206M073o958J750P432k993o497M652M860o436q10J0961k590j5326O929
1239b165J5710j0779j1199J2935K716j4200M295J0970q631n729Q501k915o825
$$ y = [-9678, -8188, 7923, 3298, -7665, -3553, 836, -4124, -3276, 4089, 652, -8740, -2322, 7086, -2014, -7074, 7785, 7228, -11192, -3953, 14861, 3631, -8872, 4567, 6938, -5230, 1190, 10288, -776, -5438, 5086, 2634, -5441, 963, 8366, -2519, -11580, 343, 9175, -3524, -9543, 3382, 3027, -10566, -2808, 8807, -3238, -8535, 3493, 335, -7865, 5324, 9398, -8249, -7288, 10196, 5795, -6141, 1848, 9626, -1103, -6777, 4755, 9776, -1006, -4560, 3547, 1516, -4222, 3849, 6102, -7891, -6143, 7948, -878, -11090, 4362, 7298, -11822, -9033, 8546, 2841, -8418, -1212, 2861, -4097, -2347, 5085, 2092, -4405, 247, 5107, -1329, -2139, 8822, 6232, -9094, -2165, 13545, 2766, -8433, 4502, 7218, -6982, -2687, 8283, -348, -6077, 2424, -491, -7316]
1252g316Q746M746j1984m090J1823K674r972k33J0658l024j2186Q280J2299j0637
1266b16o825J1339q65q667R930M855j4515L62J4252o511r965J1157N057j3877
1280d489k895J2111K075j0075j140O260k428m942O354L072j0030J92J0244o320
1294b011o925J4126J742j7994L505J7882p075j1081R838M437j0048J350Q911l166
1308C491m789K621J370l985K014O721m317j0486O171J0638r878p588J2357J308
1322E648j5363M500J3738q776p629Q745j237p222Q565M717j0889j658J0713p83
1336C069q042L751Q635o104r303Q294R832q406o650Q708P03q509O813N691j1643
1351c161r82J1174o611q316J2374L567j5788o01J3918j997r661K676O267m726
$$ y = [-7316, 1430, 6176, -5808, -9898, 1925, 4599, -5373, -5606, 5052, 2028, -10158, -1878, 10421, -216, -7041, 4298, 3433, -5234, 4696, 9551, -4964, -4602, 9650, 3139, -6826, 4331, 9388, -4489, -7384, 4727, 6802, -3273, -4413, 1847, -581, -5523, 831, 3903, -6127, -5935, 4309, -2011, -8936, 5190, 6932, -11062, -7557, 10325, 3250, -7831, 2007, 6444, -3604, -2254, 6657, 3491, -1298, 1323, 2693, -1292, 722, 7443, 3126, -7360, -1189, 9449, -429, -8017, 4340, 5648, -9715, -5215, 8523, -253, -7882, 863, -374, -7596, 969, 5686, -5203, -6861, 3852, 3069, -4973, -1222, 7413, 1309, -7994, 300, 10132, 1726, -4924, 3784, 4487, -4022, 2791, 8482, -3161, -4143, 7031, 420, -7896, 4478, 8045, -7743, -8344, 5574, 3577, -6084, -3408, 2859, -1867]
1365a867m404O101M071o432j697O545l171m119J0248J658j4920L714J4974p897
1379B804r976J1986L595j2970J189J0827l501o194L248J63m169L035M549m877
1393b91o140N157N963p858m015J1344j25j4445M536J3870p624q130R308R52q440
1408e938O439O333r486j123R398l385o845P373N872r151n768Q393O277q347m325
1423d283Q187n9q990M098P420q277l442Q678m625o876J1204L303j5063Q83J3809
1438E967m183r346O807N602p657k467O754L234m963j646L719j083k352O816O98
1453E900j0125K370J0631p321p803J1983K358j4846J503J2685n003p263M984J072
1467A125n589K981M070m431l020M522J485n663O70Q745j969j1676M967J2520p085
$$ y = [-1867, -6271, -170, 3901, -2531, -4228, 2317, -854, -4973, 5275, 6933, -7987, -4273, 10701, 2804, -7172, 4814, 8409, -4561, -3372, 7455, 3954, -2240, 1008, 1171, -2998, 37, 4586, -291, -6431, -1274, 4689, -3169, -7184, 4160, 4035, -10410, -5874, 7996, 372, -7758, 1550, 2502, -5938, 501, 6834, -2652, -3775, 5623, 2238, -4607, 2766, 8638, -513, -6281, 2112, 8389, 42, -4283, 3904, 3845, -5145, -1047, 6373, -1904, -5346, 3332, -1293, -8169, 3035, 6338, -8725, -7842, 5967, 1784, -7562, -755, 4847, -2810, -5277, 1477, 4711, -252, -1898, 1821, 738, -1614, 5202, 5900, -4225, -1855, 8776, 1455, -6348, 5635, 7993, -6853, -5350, 7335, 2332, -4931, 53, 1125, -4464, -1483, 2587, -1844, -4864, -342, 1143, -4520, -3850, 4895, 2926, -8750, -3783, 8737, 1652]
1482A652q310R795K376j0313M418P922p117k368P136l785n606Q500L274j0314
1496b740l280R217J422q051j72P143k024q485L715Q543o577m699P125j968n844
1511f675Q654L364j2057J597J1792n506q162R870M516j0359j695R026P32m958
1525A39n46K836j672j755M122N55o366J153O450n918n541J1166J605j4795J941
1540f626J3327n674q623P175K608p202K245N507l464k263L547o40l501L238O014
1555E668m010p005M914Q201o495o111R526J755j0922K298R746o212m938O764k578
1570F01o178P783L513j0431j012Q578j373p274L463N980m248o546M603P022m552
1585g1m864N684M60m999N469L593q288O90R120n848o564J0926L340j2853j62J0382
$$ y = [1652, -6658, 3137, 5513, -4800, -382, 7540, 423, -1945, 5191, 1406, -4200, 4300, 7574, -2740, -6020, 3197, 4619, -3432, -3604, 3539, 1515, -6970, -3255, 5288, -1289, -5988, 1137, -831, -6675, 1979, 5343, -6714, -5117, 6675, 1169, -6993, 2877, 7393, -2966, -4661, 4365, 5097, 139, -407, 2429, 757, -998, 3124, 3679, -2687, -1534, 4916, -1002, -6543, 4623, 6228, -8567, -6626, 6701, 1027, -7596, -421, 2187, -5015, -2770, 2737, -727, -2990, 557, -83, -3584, -346, 5668, 1658, -5347, -433, 7768, 1273, -4838, 4688, 6443, -4479, -2181, 7565, 1353, -3585, 3179, 601, -5577, 2206, 5719, -4712, -5724, 2854, 1481, -5793, -2330, 3650, -598, -7144, -2541, 4481, -71, -4935, 749, 1209, -3790, 1679, 5272, -3016, -2326, 6794, 946, -5618, 5308, 8648, -4205, -4367, 6015]
1601F015j420o834K053K994l157k016L188J375m184r1L196l317l102Q284N49j1697
1617h164K346J1836n923p712R435K763r762K162P458l145k584L577j223l539M840
1632B365L591n352l846M971M131o612l044Q497K29j0880K116J0204n713o396O616
1647H77Q5o861N744L669q497L04Q348m604n641O885M793o501m378O382M508n060
1663E3l112N544N86n511L290M884n663j570O742m467n832R417K874j2553Q07J0115
1679E604l829o955N137L233n532j701L943J020k477m77J294j729p14N680pp870
1695e380K548Q880n750o276R628K963j0654J206R116l619m322M247p17m180M141
1710A831K440n043j404M355j54n440Q13O595j631r417K906Q950m718o430O715
$$ y = [6015, 4595, -2239, -186, 2808, -349, -2365, 823, 2198, -1986, -2077, 1119, -2198, -5300, 2984, 3533, -8164, -5818, 6018, 95, -7617, 1818, 4581, -5181, -3019, 4439, 1294, -1290, 2287, 1064, -2475, 2365, 5956, 604, -3242, 1729, 5860, -752, -3796, 4701, 4930, -5950, -3834, 6370, 657, -5739, 877, 962, -5899, -155, 3514, -4983, -4679, 3669, -935, -6576, 309, 5102, -1399, -5777, 605, 5113, 53, -3059, 2485, 3071, -2440, 850, 5734, 71, -1499, 5243, 776, -5056, 4361, 7235, -5318, -4511, 5604, 1775, -5180, -43, 3190, -2342, -4043, -100, 920, -1557, -2034, -740, -2469, -3183, 2497, 2490, -5380, -2832, 6048, 298, -5978, 3650, 6613, -4041, -2835, 6281, 2662, -1660, 2587, 1870, -2310, 1831, 4271, -772, -2176, 2179, 2025, -3415, -2602, 3993, 2362, -7055, -4149, 4801, 83, -6347, 368]
1725C68J548p355L790N198o195m34O729m152m769Q340L339q149k142P441J451
1740E008n757L8M554q05n284K126M694l760k803M463l067l988P203K130j0824
1755f072J351R645n347o867P997L160p610j128N904J86k610P83N48j150O52K816
1771B258j47l917J878M984n257l837Q901K180j1398J400R288l652o310N265O66
1786B302n591K988K658l713j191M135k302l961L516M617l606n877L790O305m585
1801e15m541O631J983p625J900O631m169k006N619l336m319P226L004q715l76
1816b608P688k300n937L147M296l537m537K342L986k021l455K707j83l661M111
1831C8K441p157J075P721n097n866R091L174r570N9P548j094l754K073J309k196
$$ y = [368, 1916, -5439, -1649, 3549, -2646, -3080, 3649, -503, -5272, 3068, 6407, -1742, -3884, 3557, 5008, -749, -711, 3843, 3038, -2246, -120, 4574, 814, -1989, 2474, -593, -4581, 2622, 4752, -6072, -4721, 4924, -423, -7290, 707, 3867, -3743, -4871, 1033, 1219, -1391, -608, -60, -1210, -558, 2258, 2111, -1806, 72, 5056, -201, -4038, 4863, 7043, -4355, -2955, 6333, 2681, -3629, 1636, 2302, -3289, -301, 2357, -1356, -2547, 1588, -714, -4675, -1159, 3458, -148, -6025, -2235, 4070, -515, -5056, 1575, 3558, -4067, -2167, 4464, 295, -1711, 3908, 572, -3747, 3479, 6483, -2232, -2608, 5080, 2780, -3157, -10, 4286, 749, -3788, -1446, 2540, 519, -2936, -229, -412, -4073, 38, 2479, -4678, -3603, 4118, -979, -6845, 2246, 5420, -4150, -4091, 3457, 2363, -1391, 682, 1991, -205]
1847b05R22J574o03j555J366J248l577j586O649L73r502J381Q991m783o401O734
1863A026J788p006J394M915l458j146L735k848k679M776K781m802k416M459K884
1878C403m587j571O074J156p518J170P381l023m234M764j190m764N250K549p728
1893b868N57O844m232n684N625L676n770l185L851K956k996j798K502K35k447
1908b734K072K769l637M6M928m253l873Q351K468r602N75Q437k801n614M538J914
1924C584m015k08K217n89q93Q25p60k471O81M130p62o686J915O569m609n115P044
1941H57K496p607N8O667k402k391L890j327l225M653K228n451J03M466k75m281
1957a541J087N072j103o206Q49O456k777m519M109K29n070K886L213n629L10N522
$$ y = [-205, 717, 2291, 1688, 133, 1499, 2747, -830, -2416, 4233, 4606, -4896, -3515, 5476, 693, -5708, 1026, 2814, -4192, -2798, 2117, -1341, -2487, 1248, -1600, -4279, 497, 3278, -1524, -3940, 519, 3403, -1184, -2755, 3319, 4475, -3043, -1873, 5508, 2485, -1749, 3015, 1825, -2939, 2311, 4860, -2868, -2311, 4533, 301, -5383, 242, 3918, -1852, -5037, -1186, 1770, -1226, -3024, -522, -287, -2734, -662, 2107, -1530, -1484, 3444, -809, -4682, 3669, 6137, -3465, -2890, 5547, 2746, -2868, 1670, 3584, -431, -639, 1578, 989, 96, 921, 161, -2310, -1629, 2501, 1739, -4947, -3032, 3537, -1072, -6187, 857, 3353, -4254, -4196, 2471, 69, -2322, 1568, 241, -2984, 1669, 3897, -1554, -1451, 3015, 2740, -1541, -454, 4618, 3515, -2691, -1842, 4614, 1837, -2682, 1427, 1656, -3414, -528, 2685, -2944, -2634, 2888]
1973B888m353m958P448K843o964j476N479N85l475J82K965R8k726Q32K818j302
1989H84p73K686k832k232O047J577q270O01P841l592o491O304K709o540o82L994
2005A231o82j636J045j331j310J203K533j781k697K101L677l921l315P386K170
2020D673q669O59P577k630l878M326m7l686L177K108m536O86M110l014l634L039
2036B61L990l041m907K293M428l058l872M132J650n423R34M123l195j014M645
2051A946l548l575P053K238p479N59N944j537l887K739K905j830k832J484K589
2066B769q41j405N44o79j853L529J158n932N31N989m225n266O897K565p408l34
2082c961N152j237k241K097m23j677J639J528j653m35K461O31l298o31N674O80
$$ y = [2888, -1465, -6423, 1025, 3868, -3096, -4572, 907, 1492, -1983, -1801, 1164, 1262, -1464, -632, 2186, 884, 111, 2797, -35, -2267, 3780, 5357, -2913, -2312, 5529, 1937, -4554, 1750, 4459, -2081, -2763, 1231, 549, -1087, -42, -1373, -2683, -1480, 1053, -728, -3425, -1324, 2353, -1568, -4883, 2503, 4673, -3996, -3337, 4240, 1610, -2268, 2058, 2011, -1675, 1502, 3610, -926, -240, 3870, 856, -2778, 261, 4251, 1210, -3697, -1404, 3024, -34, -3906, 226, 1876, -3547, -2613, 1510, -1685, -2699, 1946, -1602, -5177, 1876, 4114, -3365, -2806, 3138, 1601, -2286, 453, 3358, 1528, -1304, 180, 2769, 1928, 523, 1067, 388, -1465, 2064, 3222, -2710, -2179, 3810, -415, -5681, 1216, 3781, -3627, -3961, 1191, -46, -2287, -190, -613, -2290, -651, 877, -776, -1211, 1250, 1881, -1417, -2048, 3626, 4306]
2098D306o862O83P089k817n123M744J639n354J484K917l092m54L296l337l334
2113d215M367K599m276k147L186K055l642j616M266J337n145L31M717j615j650
2128a448K939j299l349N535J686o282M68O945l660m721N211K665m375k348K558
2143E25J264j180j451O64Oj327J568N30l107R07L769l971l877P079K191p773J17
2160d066O750k261l022L544O22k700J113J246j208N74J838j315k227R99M117j132
2176B872m946J156N095l350m598N360J807o070j32M521k610r10L074k951k523
2191d205M918J172m669J04L763m08l568J274M085n37l960L44M521j086k783K756
2207A721R3k929K733J909m609N62N186m504m180N931K412n993j354M163k65k483
$$ y = [4306, -2556, -1873, 5216, 2399, -2724, 2020, 3659, -1695, -211, 2706, -386, -840, 2456, -881, -4215, 152, 2751, -1525, -3672, -486, 1569, -2073, -3689, 577, 1914, -3231, -2900, 1817, 202, -1448, 1491, 192, -3157, 2378, 4064, -2218, -1750, 5195, 1535, -3186, 2025, 4690, 315, -2033, 525, 1789, 609, -842, -178, -172, -1499, 69, 599, -2508, -1601, 2168, -1803, -5680, 1399, 3590, -4183, -4066, 2684, 423, -2599, 945, 1567, -1133, -20, 1226, 18, 592, 2430, 1115, -1112, -113, 4004, 2872, -2074, -918, 4177, 827, -3771, 1589, 3396, -2674, -2806, 1715, -895, -1805, 1269, -1682, -4205, 713, 1885, -2784, -2680, 1083, 675, -2893, -1619, 2466, 1929, -2031, -1687, 2834, 1748, -1035, 1721, 1814, -1115, 1618, 3527, -1082, -520, 4666, 162, -4018, 1913, 4325, -1668, -3022, 1141, 876, -1607]
2223a607J78R99j39j152O4J168n04J13J697k859j545N239J544o377O05P106l299
2240A231m570N185J724m004m24K455j052L74J626k532j424K131J265j598k620
2255b233J720K602l181l187M926K213o429m23N457j720k721L442p10l010L787
2270E33J402m204J208M256k545l231K952L076j705l374J625L079j571k826K581
2285A256J324l280L84K240k731J32L336l604l634N661J912o295j86N214j757l065
2301c093J943J881j363q02L65J029K52j94M77j118l38L085R04m825J198N213l242
2318A372m714N439K687o091n12L917j634r22J760j862j164J879O02k785L32J752
2334E6N26l103r13M494R62n390J94N452j704l379L456J214l180J789J682l140
$$ y = [-1607, -1429, -430, -569, -1721, -1657, -489, -993, -880, 817, -2042, -3587, 1652, 3196, -3181, -2576, 4530, 1231, -3339, 1846, 3570, -434, -858, 1597, 545, 919, 2545, 13, -1411, 720, 1985, 387, -2233, -513, 2089, -1092, -4279, 647, 2860, -3569, -3992, 1465, -255, -2976, 466, -244, -3254, 533, 1935, -2269, -1061, 3195, 650, -2581, 371, 3447, 1742, -1632, -7, 3072, 1501, -1325, 1256, 2580, -700, -316, 1924, -807, -675, 2661, -943, -4577, 1084, 2996, -3299, -3485, 1729, -28, -3093, -1150, 731, -632, -1434, -1069, -40, 212, 18, 495, -623, -961, 2124, 3028, -1797, -599, 4614, 1372, -3342, 2097, 4784, -1307, -1819, 2098, 464, -458, 1302, -560, -1724, 155, 757, -2028, -1696, 56, 582, -2521, -3434, 1060, 2022, -3368, -3174, 2278, 574, -2805, 651, 1865, -1315, 474, 2156, -984]
2350i84J040L670l383k929M645J715l487j732K387J391k112j648J916J285l331
2365a557l56K136o51r68K191k245k367M710J115n552R97N213k480m035M210K251
2381B612k708j073J419M00Q05m95k07j79O5R07J27k366P83L465l596l435N059
2398A583K391o359l81M539k074k186K025M10j953J664K66j931J154K319j525k452
2414b510J421K875Q6l844Q95M100j709l658L440K514l980J76K305j998k31L255
2430C137l023k865M114J462m709j29L596j046k921L25K820P4k884j98K303K6j887
2447a805J940k45j919K725J222l872R97M373k980l959N194K588n011l12K706J39
2463A781j417L00j25k4Q8j82K2o85M74Q47k631j697L949J404n232M7M681j870
$$ y = [-984, 56, 3726, 343, -2586, 2059, 3774, 287, -1445, 942, 2333, 221, -1427, 489, 1774, -1557, -1913, 223, -428, -1396, 795, -1450, -3817, 893, 2008, -3544, -2547, 2666, 186, -3849, 361, 2612, -96, -1169, 250, 650, 1455, 960, 753, 574, 639, 1546, 1673, -693, 90, 3555, -41, -3476, 1583, 3974, -2385, -2766, 1773, -301, -2487, -462, -52, -2005, -341, -75, -2006, -852, 1467, -58, -2510, -1089, 1786, 1872, -1972, -1077, 3023, 1314, -2344, 1096, 3610, -370, -194, 2111, 113, -118, 3137, 114, -2751, 1363, 2825, -1884, -2013, 1583, 537, -2384, -2059, 761, 835, -2049, -2247, 56, 82, -1805, 135, -110, -2029, 696, 1918, -1954, -957, 3416, 436, -3523, 1671, 4259, -752, -1064, 1642, 1781, 364, 664, 539, 515, 603, 421, 443, -242, 232, 1079, -1552, -3249, 700, 2104, -3128, -3081, 1600, -270]
2481b70l514L488J592k661N39J213j597J268K176k476r76K417J311j884j549J737
2497H14K131j987k954L712J796m468q04L526j475j175J990j499k100L228P62m706
2513c209J095M158k607k969K332K471j413j913O81K047j18j698J099J525j843
2528c62J018Q66k261J015K858k739l176N173J662n374j82L883j479k444J149J102
2544G09j031j44n18l46R63O13q49j381K63K226O85l741L31M635k216l499L479
2561A79K740l602n49K870j376J43J868j633j418K533M77k773j10K202j50k319
2577i18p76K767J199m049q95L814r07k558K061N64k656J867J051l078J488L530
2593B504l319k764M385J843l209l39J471Q06p93r96J023J291j116r01J312k19
$$ y = [-270, -3784, -296, 1296, -1365, -826, 387, -1210, 58, 2234, -242, -1218, 1199, 2510, 626, -923, 814, 2945, 958, -1996, 1716, 3512, -956, -1760, 1766, 291, -884, 1106, -393, -2493, 735, 1497, -3209, -2114, 2044, -563, -3532, -1200, 1271, -142, -2055, -1374, 673, 555, -1143, -44, 1481, -362, 656, 1522, -739, 276, 3134, 395, -2781, 2392, 4054, -1320, -1502, 2381, 902, -1542, -393, 709, -322, -466, -984, -1330, -367, 246, -603, -1984, -1721, 505, 1190, -2551, -2220, 2415, 199, -3300, 179, 2919, -683, -1232, 1638, 262, 405, 2273, 640, -778, 1755, 2232, -541, -651, 1551, 1401, -918, -1694, 1073, 2272, -1777, -2672, 1142, 235, -2323, -262, 302, -2354, -487, 564, -2514, -1026, 2504, -815, -3579, 806, 2649, -560, -899, 572, 1378, 585, -411, 612, 1903, 787, -114, 1198, 979]
2609I79m10J439k162k309L937J415n099n6M366k016l525L133R46j778k07K87l11
2626a371J221N83j285k11O38R89m0j474Q32K979k458k978L936K505m371q51L891
2643B535j388j439J924q85j870K417k30k793J211K093j774k612J767J842ol028
2659b236J80L148j306k287J852K036k666M28J631j707P01L052k532k782M167J380
2675C059l737k61L192q87j627q5J458O64j908r30J040N31q52L55o45j657K450
2692A60Q82l886J078L740k165l920M064K317l285n51K044l09k08P27p69J97J140
2709A256p15l89P2J224P86k121j716K955J874m094q86L975j492k742K231O90k141
2726a233P06O32k138R34K682k646k067K560J183j586r42J567J583j183k189K593
$$ y = [979, 569, 2008, -154, -2463, 1474, 2889, -2210, -2266, 2100, 84, -3441, -308, 638, -1140, -1347, -1060, -1371, -150, 433, -852, -1063, -425, 564, 524, -950, -118, 2861, 403, -2575, 1361, 3866, -505, -1356, 2535, 1147, -292, 1632, 747, -1123, 1294, 1064, -1729, -518, 1575, -199, -2811, -1044, 798, 792, -2236, -2056, 1092, -214, -2501, -649, 1387, -1279, -851, 780, -927, -226, 2826, 294, -2488, 1679, 3059, -678, -939, 2253, 1366, -261, -346, 1112, 1776, -132, -1062, -22, 509, -343, 12, -633, -2290, 160, 1042, -2844, -1766, 1974, -191, -4111, -47, 2270, -1015, -1566, 478, 169, -39, 688, -81, 116, 1256, 541, 152, 224, 1448, 2234, 113, -1603, 1352, 3226, -868, -1754, 2221, 729, -2013, 218, 908, -1233, -527, 105, -2033, -1099, 1583, -1063, -3130, -570, 613, -973, -1915, -348, 1235, 52, -2137, 456]
2742D56K015k678p56K475q15n17J835j482k062L468N58l925P24L566k100k667
2758a905J391J662r73j187m82J166M32j009k18Q93r71L80J076k160R12K972k256
2775b77l042M191K123m150j61L243r82j105J269n8m51M08k70j045J182N50q91
2792E34j025m61J813O18l032m22L674j367l324K062K070k361k09J516j505Q88
2808e31J899k260j136K923M45k533M54K259k45j258o42J761J180k403r49K339
2824A303jj670J237k19j494J576N07l095O19L427k448l140L035J466k047q08J269
2841d83L10Q7j008R8J294L7r67N11N8K88J734j305k479L428J376l840k60L759
2859B638j217k441J538J229j763K59j05j045J060R78k032m44P58O24m18j501N91
$$ y = [456, 2471, -207, -963, 1512, 697, 180, 2015, 533, -1529, 1939, 2497, -1428, -704, 2862, 762, -1905, -514, 1148, 175, -1012, -1494, -328, 104, -905, -1123, -230, -1201, -821, 255, -1905, -993, 1979, -277, -3319, 872, 2995, -1155, -1316, 1927, 945, -160, 1109, 1051, 600, 1008, 738, -307, 875, 1425, 534, -491, -952, 861, 1479, -1553, -1975, 1699, 332, -2992, -930, 1140, -1221, -1430, 86, -1419, -531, 1368, -892, -2028, 895, 1340, -1193, -739, 1520, 1275, 17, -625, 1136, 2316, -87, -1036, 1303, 1302, -368, 869, 650, -844, 732, 1239, -1856, -1237, 2190, -258, -3398, -363, 1103, -944, -1752, -483, -173, -86, -1094, -996, 298, 335, -632, -121, -63, 225, 1959, 654, -1825, 1603, 2979, -861, -1121, 2638, 1421, -1020, 518, 1747, -16, 243, 138, -907, 153, 1131, -901, -1345, -587, 37, -381, -1882, -1291]
2876a291K511j443k936K549K451l063n11K441o97o27J870j398n65K081L40k642
2892i30J192K070j417j837N72J856j21j921n11K325j50k189L77J198j317r8J061
2909A60j914N36K745k325k642L557J827l720K47K550m02q55R6O01O49l38j047
2926b75M30J051kQ5q86j131K081Q69l308J05L649j940l310K500J687k457k69J004
2944a17j008P33Q66j802j81J798j78j437N06J222M28j038j682K261K125l308l90
2961a202K834n43j608J352N31j432J039N2k344J160K641k634j689K155J099j656
2977b45r94M17J053n83j753Q73J990j421q91J197l19J04J702j489j802L409P70
2994B018l456P38L308j635k160J698Q63J0j003o45L58O93l35p32K81J52K1R0j520
$$ y = [-1291, 1220, -223, -3159, -610, 1841, -1222, -1733, 708, 11, -616, 1254, -144, -709, 1372, 1712, -930, 262, 2332, 915, -922, -350, 1506, 1385, -536, -1047, 1278, 1128, -1061, -684, 514, -803, -901, 160, -1754, -1218, 1527, -798, -3440, 117, 1944, -1776, -1529, 1021, 619, -236, -140, 461, 1110, 772, -275, 155, 1206, 1204, 1289, 403, -728, 1353, 2222, -1086, -981, 2668, 728, -2582, -82, 1605, -852, -1121, -117, -1125, -392, 474, -1328, -1509, 289, 111, -1326, -820, 402, 830, -208, -1890, 371, 2496, -812, -1202, 1632, 1089, -519, 833, 1364, -68, 971, 1023, -1321, -161, 2480, -154, -1843, 312, 1411, -245, -1239, -822, 231, -352, -2105, -1232, 758, -663, -1554, -357, -676, -572, 1130, -359, -2161, 1248, 2018, -1438, -700, 2608, 973, -1187, 511, 1374, 1384, 381, -264, 94, 787, 452, -280, 1, 153, 174, 264, -1256]
3013a256R1K734j950k881L080J620l055m80K909j107n78O95n49M5J562o53j315
3030a088J294J192l82j179k40J807P47k571m41K646o3l012J391J610j680j41O87
3047E77j796R66J838k288j773K851M97k715K19J970l53q12l55J110J014j114j122
3064a286J281P40q39O24rr45J575Q00l049J235K623k028k282K311R93j712l12
3081b80J14o2N81o15q12N40L96q47J52R1j32J427j022k037K435J971l379k66L148
3100A403p56j791J438L64p95J070j99j439J768P92j464n78O77P56m70j276M01
3117i9J600j068k405J504J724j962j230K100o84m80J738j472j309K844O3k822
3133a958J154K264j102j616R59J408nj039n33J046J051j484K97O43o68K97M32
$$ y = [-1256, -1165, 1569, -381, -3262, -182, 1438, -1617, -2097, 812, -295, -873, -178, -727, -682, 880, 227, -1088, 206, 1398, 1016, -163, -403, 1404, 2151, -420, -861, 1785, 1722, -1290, 101, 1711, 31, -110, 577, -1219, -253, 1585, -703, -2476, 375, 872, -1843, -1624, 346, -7, -819, -1174, -64, 950, -164, -1286, -5, 735, -104, 520, 511, -434, 1141, 1941, -1108, 127, 2750, 722, -1560, 751, 1744, 32, -280, -166, -228, 353, -262, -1074, -534, -138, -985, -833, -742, -874, 553, -469, -2506, -71, 1900, -1479, -1745, 1403, 647, -1144, 294, 658, -137, 933, 734, -705, 1063, 1855, 391, -187, 490, 1246, 776, -500, -99, 1501, 433, -1972, -468, 1256, -706, -1936, 164, -520, -1000, 738, -734, -2043, 801, 864, -1958, -804, 1460, 358, -1258, -299, 1109, 1104, 65, -468, 578, 1629, 145, 442, 1085, 417, 714, 1146]
3150A146j760N04K163j926k405K743J131k905j79J679n30m77K9q1O31L24r91o71
3168a575J543L51m2n67o29J503J048k421j46L320j089k695J803J612j729j8N99
3185H68j321J023R09j825l57J765n70j439J18O17M55p00j602J567J719k291r82
3202b046K560l53j085P12K05p37J916j60k667J417K499j826j547J824P12p35m82
3219B07j04P33K29j219n62J925o52j192M64l00R5J131j379j881K851J112l498
3236b040K33K884j255j864J531R50j41Q1q56K15J044K15j124K46K73R49j12j618
3254c89p7K771j394k574J833J868k127r49J565n09q47J062q61m19J683p87j563
3271a714P61J460q75o13j33R42Q21j606n30K446N7j810Q61J382j203J94M55j413
$$ y = [1146, -614, -110, 2053, 127, -2278, 465, 1596, -1309, -1488, 191, -339, -816, -787, -868, -237, 87, -904, -1575, -32, 319, 277, -290, -919, 584, 1632, -789, -935, 2385, 1296, -1399, 404, 2016, 287, 269, 868, -453, 570, 1479, -346, -703, 1062, 492, -947, -829, -212, 243, -457, -2059, -492, 1227, -1064, -2046, 514, 161, -924, -212, -7, -744, 1172, 1012, -1655, -238, 2261, 435, -1112, 712, 1424, 689, 207, 103, 836, 1065, -154, -716, 1209, 557, -635, -171, -471, -376, 755, -624, -2505, 346, 1458, -2040, -1807, 1077, -178, -2042, -511, 439, 298, 379, -477, -262, 782, 997, -127, 119, 392, 1341, 1229, -389, -466, 2305, 911, -1663, 170, 2038, -89, -1038, 527, 18, -829, 233, -628, -1047, 636, -151, -1714, -953, 507, -368, -981, -1114, -172, 649, -957, -1487, 959, 1016, -794, 67, 1449, 246, 440, 895, -518]
3289e18O37K251k256j595K461O73k015k50J401j88p28j103J38J678l39j690P66
3306f77N25m99N87p41p45J697P54k725O77L049j308k078J593J293j104k42K80
3323C36O7O66r6j341K74R18o20k89j45M58J098j024k242J888J602k436r02K135
3341C47l13j438Q37J00q99J790n68j579J566J519j555j043J434J018o97q66J47
3358b00J656q2k151J121J183r25q16Q09k84j24J011j364j138K008M89k708M73
3375a042J664j055r88N90K93O76m93j098P40J122j149j29J153J6K70J27j191K96
3393a98K326j449k255K382J300j958q70J491k59m32N45j092O36R41j642o53R32
3410b55M38l29p74o01J518R99k317n52K832p03j766R89J127r86L72L13p95J023
$$ y = [-518, 119, 2370, 114, -1481, 980, 1653, -362, -612, 789, 601, -127, -1230, -1092, 586, 247, -1443, -677, -152, -651, -64, -805, -1550, 147, 901, -1824, -1147, 1902, 594, -1484, 109, 1402, 298, 56, 336, 403, 1069, 973, -368, -94, 824, 204, -85, -230, 228, 1326, 302, -1940, -52, 1550, -886, -1788, 347, 34, -1404, -567, -467, -1366, 424, -144, -1723, -157, 1362, -193, -1236, 198, 1216, 519, -347, -200, 1456, 1374, -777, 344, 1527, 602, -214, 595, 311, 187, 1198, -166, -1304, 704, 1193, -1515, -1042, 622, -433, -1421, -831, -538, 138, -355, -1453, -713, 409, -740, -869, 284, 300, 570, 697, -494, -198, 2128, 679, -1576, 806, 2106, 148, -722, 769, 510, 78, 623, -469, 167, 1108, -534, -1187, -255, 183, -146, -920, -1521, -3, 996, -1321, -1873, 959, 256, -1510, -521, 606, -380, -8, 305, -490, 533]
3428E33J425j983o82K126j9j401p5O35O86m43j799P70J581j304j520J518M45j439
3446i46P76k98q19J620J42k549J102K377j429j791J692Q14o42l14m41R60O16q06
3464F4l17R32M85j008L72k65k45J406j047j654K029J344l112j67K560r25j461
3481a009M15N20q0K25r10o91J224N79r50j38N91N28p7j328L37K332p24k011R40
3500b27K131j823p05J466l24l43Q74r26p00J926k82j973M76J301p30r32ON07P21
3519D43p66j123J199M87j149j35J162o03J44N17j135M61K037j513j504J876J032
3536A430j819l9J095J32j98m34k51J091K60j346O3M75j91K84p91r58J171J029
3554A003k599N0K635o50k128J046R13q63K26k08m37J140O15j708O75R40or48n2
$$ y = [533, 1958, -25, -707, 1419, 1400, -1, -76, 559, 1245, 802, -997, -227, 1354, 50, -1470, 48, 493, -946, -170, -468, -1287, 333, 475, -2074, -972, 1405, -24, -1815, -123, 691, 49, -265, -706, 254, 870, 64, -253, 679, 1164, 156, 528, 263, 18, 1424, 377, -1277, 752, 2096, -1016, -1183, 1377, 452, -1009, -594, -74, -154, 71, -839, -1530, -306, 273, -677, -815, -224, 304, 227, -1101, -764, 1568, 844, -1167, -227, 1904, 81, -624, 842, 518, 175, 1049, 123, -577, 1349, 1067, -906, -430, 871, 141, -791, -785, -278, 443, -323, -1446, -247, 240, -909, -1044, 118, -485, -341, 176, -959, -498, 1539, 26, -1478, 398, 1430, -389, -428, 667, 799, 601, 167, -84, 1007, 1267, -79, -16, 459, 268, 552, -239, -1197, -26, 1003, -1596, -1546, 1089, 439, -1689, -643, 270, -593, -367, -575, -1012, 128, 743, -965, -290, 650, 644, -304, -356]
3573c56R94P59p24j520J055J922k047j001J843l14j025O33l97l07R43j63k047
3590a752J123J514j182j405J207N87k46o68m9J233J47j576J98J511j50p86L43
3607D9MJ85J313j325j117K220O12k432J05J850p05j224N06N6L02%j284J22J226
3626D63q73n74O53l04L90J00j374N43J715n19k055J532J462j375m76J226k55L26
3644F05j86m61J07J323q08j137R38O22m19l90n33Q37J070j992q05J917R7j932
3662a147L92J030q87M67p9j153O39J465j457r42K253J16j165k77N87P65k50j094
3680g37N09J595m82j250J058J01n21Q86j034n22J408J48j924j49K302q59k051
3697a522J248N21m98j45n64N64N56k72j079R58M90p74L4k05M26J266p61j365J344
$$ y = [-356, 638, 1397, 673, -847, 208, 2130, 83, -918, 925, 611, -414, 219, -178, -485, 458, 295, -1752, -629, 885, -297, -1702, -495, 92, -154, -822, -871, 362, 509, -1067, -869, 642, 492, -294, 49, 53, 238, 1551, 226, -891, 1329, 1941, -491, -386, 1464, 759, -465, 41, 97, 399, 399, -885, -763, 463, -410, -984, -331, -635, -245, -145, -1519, -976, 739, 220, -1835, -303, 1159, -216, -692, 534, 279, 605, 419, -42, 65, 1388, 580, -557, 381, 1003, 584, 194, -339, 498, 1568, -424, -1229, 688, 785, -1147, -755, 275, -612, -145, -224, -1377, -738, 727, -730, -1672, 581, 697, -468, -745, -158, 607, 357, -737, -228, 1367, 885, -365, 693, 794, 273, 1159, 125, -397, 1011, 1159, -765, -914, 1388, 529, -1522, -274, 247, -251, -396, -960, -396, 160, -112, -1191, -233, 257, -517, -483, -688, -262, 1004, 243, -1122, 222]
3716B22J427j794p16K328m53o62P6k93M7J001j029q28J167L29j355n68R83J44
3734B6L98j464l62J811o2k168Q39J796j060o34Q18l28j41J447j430k58J470K38
3752I36j471J79J809n78m65k17J73O17o15o80P44M52j150k39N52m62K66M74j560
3771a235N53J727j125j544J352J118j598l78P63K83L97m10m70R65N82j306o6R52
3789E60j13O05r56o10J096R72j984l49K396r59j314P56M67q39M49m94o83Q62P25
3808E87j569j24J169k05p19k3L90J187n18j427N28J806j057q24J370O1p82N68
3826D18J1n42J304K4j857M87J954j654n91L08O80j69r99P2O17M31j189k97Q48
3845a44J64o36K45l30r7J507j204j215K175R64k152k81K185n26j124M63L58N75
$$ y = [222, 1649, -145, -861, 1467, 1014, 352, 428, 135, 182, 1183, 154, -674, 493, 822, -533, -1101, -118, 26, 424, -1040, -1402, 409, 347, -1821, -982, 814, -246, -880, -62, -390, -531, 916, -514, -772, 698, 936, -535, -356, 1453, 875, 410, 193, 366, 983, 368, -312, 432, 884, -266, -505, 47, -415, -149, 325, -1235, -682, 1045, -80, -1624, -272, 846, -752, -1130, -367, -84, 313, -97, -567, 398, 980, -326, -392, 560, 447, 1052, 96, -514, 582, 1554, -430, -779, 1617, 658, -656, 100, 567, -272, 177, -317, -1000, -138, 587, -982, -1106, 63, -142, -861, -884, -494, 693, 175, -1252, -724, 1082, 25, -799, 571, 632, -150, 418, 429, -113, 1191, 1215, -642, -155, 1799, 145, -446, -138, 542, 373, -626, -554, 63, 494, -695, -992, -144, 20, -616, -371, -701, -798, 709, -495, -1710, 465, 1429, -723, -1004, 1181, 655, -469, -6, 352, 927]
3863I27M65j466K87Q28k92o93K20k43M65L81j747J11J734n44j875J026Q42j056
3881f30j03M38m83P33k2j182M89J450n69j357J025R23k80l01p72Q69J015q10j212
3900g79J645M73j264J21N05n84M87j20j305L05J676j463r93J339K05p71l70L44
3918e49M40K84r86n67J688k7r06N8O25N9L81m25o66J264N81j795J93K270r82j196
3938b56N93J71j8pn22p3P47k37j179N63N51l41l94l58K68Q63n80j527J277J080
3958F21j025o32J364No84M22j89j62J446o12j138O52J038n74o30J84Q42J1j109
3977a70j81J201R3j643K2J327p67n51P13p49M51P41j248m92J454N48j894O08R12
3996C75l95m66n40P14P37K97j248O26O93m65k80L53l52R93k60j451J14K022q89
$$ y = [927, 1392, -74, 213, 1041, 749, 56, 276, 33, 498, 879, -868, -757, 977, 433, -1442, -416, 426, -630, -733, -295, -778, -45, -67, -1249, -760, 690, 121, -1236, -211, 712, 432, 131, -641, 228, 1243, 433, -779, 866, 1339, 75, 196, 701, 117, 604, 484, -821, -516, 1160, -303, -1296, 43, 248, -523, -893, -549, -109, 175, -811, -1378, 310, 283, -623, -565, 60, 119, 500, 75, -591, 673, 1254, -541, -348, 1922, 940, -256, 337, 508, 490, 483, -39, -112, 635, 398, -781, -218, 333, -8, -402, -760, -492, 371, -209, -1736, -459, 621, -404, -1036, 328, 333, -351, 71, -118, -280, 1166, 554, -584, 68, 1106, 532, -98, 86, 928, 939, -170, -351, 850, 943, -700, -678, 649, -118, -669, 44, -705, -254, 487, -761, -1253, 201, 749, -1145, -537, 375, -20, -486, -1026, -312, 425, 722, -526, 100, 793, 328, 48, 401, 49, 1042, 782, -669, -555, 1467, 578]
4015E78j871J192J010j371J05M18p56P57k65p44P97P27j033m21N76J87L45l82
4033a51j127R36J339j450m42J840j73j265N25O30l91L66j13j079J205P33j374
4050Io26J018L85j190j08K58J055o15j319M19J098k59j311P76O2j83M40m91m72
4069a054J643k8j735M89J853q63n88N22M28k91Q7n64O24O42r54q32J043N1k79
4088A94j15m08J7J100r88j479J696O67j264m98J065j56j58q1k35M57P94j059l72
4107h23J360L31j077j3M41M30J7p99l60J775j59j470J0J380j003l24N44l50K92
4126B02K81j030k82J216k62j482P98M39K47l97r18P53Q37l00j462J286M32p64
4144d06M21r4o6J143k99j664J186J341q70j489J312O07j053K5Oj09O55r88q85
$$ y = [578, -1293, -101, 909, -462, -357, 61, -695, 62, -203, -947, -150, 577, -456, -877, -301, -114, 231, -151, -1278, -342, 997, -453, -895, 945, 772, -493, 32, 662, 271, 637, 524, -555, 650, 1383, 9, -617, 401, 786, -404, -512, -254, 801, 186, -1133, -714, 384, 125, -1186, -410, -348, -531, -91, -582, -1054, 589, 561, -1174, -685, 1168, 305, -283, 239, 667, 376, 463, -101, 523, 1165, 211, -621, 422, 473, 194, 79, -329, -312, 788, -200, -1679, 17, 684, -580, -1078, -13, -169, -327, -408, -643, -186, 608, -451, -823, 537, 868, -209, -222, 219, 649, 666, -133, -493, 1282, 1123, -347, -337, 1043, 40, -284, 260, -90, 202, 483, -547, -829, 387, 125, -1357, -559, -120, 127, -270, -1188, -435, 402, 102, -1360, -74, 358, -406, 15, -79, -145, 998, 699, -965, 221, 1562, 692, -797, 515, 1122, 69, 94, 100, -9, 646, -342, -1227]
4163a227J440K21j339M53L01k02L44n90n94J523K76j614k9J609l53j025O49K63
4181A06L57Pl16n53J255q1o52j97Q29l76K37k69n22J293l52j919R91Q84p94r04
4201i76P89N3l69M84n26k14R47n08j146J309N48q57k30M35K25M47n08n38J111
4220D76N91j210k5J223p25k13M07m63J91J116j190j082J703K3j846K64Q14J67
4238B21l24m68k21P61J56j101L65P46j42l89R4o6Q99J60j224j79J862n87j392
4257h29J164N99m12l22K49m33O18K6j016J37J120n66j103O47M19l76k23o28O06
4276c23P85r49p87J367L98j366L59M77j61N81k36q08P07R39j034n04R30M98l49
4295E24j89m63O80O75j471o5Q71J66r61K13J7k10N54p41n19J258P4j783L01J812
$$ y = [-1227, 213, 434, -905, -452, -151, -353, -9, -599, -1193, 330, 606, -1008, -1037, 572, 219, -806, -157, 106, 463, 470, 154, -399, 856, 775, 123, -74, 755, 379, 616, 347, -175, 1118, 766, -1153, -162, 722, -72, -976, -187, -134, -503, -19, -545, -759, 188, -320, -1466, -157, 391, -466, -696, -261, -36, 411, -97, -635, 476, 1067, -143, -168, 1055, 330, 117, 524, 61, 252, 1368, 178, -904, 799, 822, -1024, -760, 54, 221, -103, -571, -792, -31, 125, -976, -611, 135, -7, -396, -302, -368, 531, 691, -533, -712, 1150, 563, -829, 335, 934, 522, 200, 449, 16, 634, 660, -356, -219, 901, 335, -768, -121, 298, -78, -301, -929, -323, 462, -487, -1274, 93, 491, -875, -516, -39, -200, 381, 145, -663, 44, 983, -51, -555, 375, 873, 524, 335, -128, 552, 1227, -244, -309, 562, 728, -233, -20, -3, -213, 341, -400, -919, 339, 413, -1370, -1069, 743]
4315G43j023l89L26J66K27L1n92M1J031l02p63N32O57k65k45k46j16J717p76j380
4335f26J086Q79j437k54M80O4J27p35r9L81P73p05j010R47L53o82l54J73L40Q98
4355E99j082l21J382K86j370M69R16r46K56J22l63L62R36j264l74J268K29j383
4373b78K4K96K34j77q50K6J428n12j233P56O66p67n8j12J25M05M72j244M68J206
4393H75n67j385J359M04n07K7m29M23P42m43r14P34N58q59J72K94k27O22m94q88
4413e03N92Q09j303p74J576j53j354Q02l21N23M00n53q33J102M06r97N2P85K31
4432D87j95n31M4R44J13j190K11J341p66o12N39j49j36O56q05n01J374l72j395
4451i43N60R85q62l17j7M91L52p00m67R12M59p27k62N40P2k04L93o74K24J375
$$ y = [743, -280, -669, -343, -177, 50, 81, -511, -470, 561, 259, -504, 28, 685, 420, 175, -71, -187, 1530, 754, -626, 460, 1339, -98, -352, 128, 192, 319, -416, -515, -134, 639, -66, -1076, -129, 224, -458, -812, -639, -299, 599, -483, -804, 578, 864, -506, -37, 879, -67, 189, 311, -52, 310, 1246, -18, -392, 876, 1105, -278, -254, 42, 276, 99, -751, -725, 703, 191, -1042, -286, 380, -387, -445, -557, -432, -27, 445, -799, -331, 875, 308, -1077, 282, 686, 179, 206, -223, 200, 942, 499, -415, 319, 877, 18, 190, 484, 257, 879, 385, -503, 89, 898, -405, -1179, 397, 244, -1110, -308, -629, -106, 294, -259, -1092, 10, 416, -581, -529, 256, 487, 292, -239, -195, 749, 862, -328, -117, 1224, 458, -154, 385, 236, 100, 756, -49, -550, 824, 452, -943, -383, 602, -260, -577, -594, -103, 249, -451, -918, -6, 453, -274, -536, 4, 76, -128, 265, -409, -185, 1190]
4471A190j025p80J042P03j180j42P54N5m7j49r26Q99M04j150j27R64m94l27N9
4490b77m57M84N98j569K57J322l19j465J064M12j36N2J7o16Q48O12j270J21J312
4509I90o56m23L18j31M95J21j180M66J004p18r84Q51K16p30l6K14m40N30Q0j138
4529a151P75J024j083o76P75M45l55j93j10P96M32j124J29P13L1n16J04J71N2
4548B39O71o05q70J235L63j394k53J250l24n85lo4J80M30p05j88J142n79r22N87
4568c95K92p9J64p68K47R31k68q99O23J118r14m95P96R8M5M01j185N06R38q86
4588B70p85P63N81n90k65l00M0N58n61p93J105J81r56J84M21K1j69K79q19N06
4608c29J232j239o41J288Jo40m6Q84n5j22m21j28J241m18q93K37M70L5o40K35
$$ y = [1190, 165, -615, 427, 1130, -50, -192, 562, 617, 570, 421, -505, 394, 798, -352, -479, 485, -9, -336, -277, -734, -250, 348, -1221, -964, 358, 39, -1426, -362, 50, -86, -34, -17, -633, 215, 827, -443, -322, 990, 334, -89, 229, 98, 593, 714, -466, 0, 1004, 286, -698, 153, 369, -361, -397, -183, -623, -93, -13, -1151, -376, 648, -435, -1111, -336, 109, -246, -439, -549, 247, 679, -445, -316, 397, 428, -88, 16, 187, 239, 910, 305, -565, 670, 1033, -361, -614, 636, 312, -273, -276, -340, -160, 270, -435, -623, 519, -60, -982, -395, -103, -182, -18, -786, -539, 392, 124, -775, -152, 966, 52, -443, 353, 451, 496, 897, -288, 218, 1156, 270, -515, 248, 829, 239, -26, -326, -286, 272, -289, -1082, 23, 204, -752, -568, -147, -126, -295, -16, -835, -329, 903, -336, -977, 311, 312, -328, -374, 510, 455, 333, -88, -216, 1025, 607, -286, -49, 421, 456, -184, 51]
$$ [...]
8191G1
##END NTUPLES=NMR FID
##END=
