##TITLE=1H_EC-3186p2
 CDCl3, 8 sc, 
 4.4.2019
##JCAMPDX= 6.0         $$ Bruker NMR JCAMP-DX V2.0
##DATA TYPE= NMR FID
##DATA CLASS= NTUPLES
##ORIGIN= UXNMR, Bruker Analytische Messtechnik GmbH
##OWNER= root
$$ XWIN-NMR		Version 3.5
$$ Thu Apr  4 13:56:43 2019 Russian Standard Time (UT+4h)  she@DPX200
##.OBSERVE FREQUENCY= 200.1316
##.OBSERVE NUCLEUS= ^1H
##.DELAY= (6, 6)
##.ACQUISITION MODE= SIMULTANEOUS
##.ACQUISITION SCHEME= undefined
##.AVERAGES= 8
##.DIGITISER RES= 18
##SPECTROMETER/DATA SYSTEM= spect
##.PULSE SEQUENCE= zg30
##.SOLVENT NAME= CDCl3
##.SHIFT REFERENCE= (INTERNAL, CDCl3, 0, 15.7039)
##AUDIT TRAIL= $$ (NUMBER, WHEN, WHO, WHERE, WHAT)
$$ ##TITLE= Audit trail, XWIN-NMR		Version 3.5
$$ ##JCAMPDX= 5.01
$$ ##ORIGIN= Bruker BioSpin GmbH
$$ ##OWNER= she
$$ F:/spectra/data/she/nmr/H-F/1/audita.txt
$$ ##AUDIT TRAIL=  $$ (NUMBER, WHEN, WHO, WHERE, WHAT)
(   1,<2019-04-04 13:55:32.79 +0400>,<she>,<DPX200>,
      <created by zg, POWCHK disabled, PULCHK disabled
       configuration hash MD5:
       00 E9 B6 7A A2 85 ED C7 34 08 36 98 17 FE 4E 26
       data hash MD5: 16K
       F5 83 14 2D 70 7B 99 D0 D0 A1 9F D2 8D B1 CE 95>)
$$ ##END=
$$ 
$$ hash MD5
$$ E5 D7 70 69 0B 22 84 1E CF C7 26 39 58 1E 04 77
##$RELAX= 
##$RELAX= 
##$RELAX= 
##$RELAX= 
##$RELAX= 
##$RELAX= 
$$ Bruker specific parameters
$$ --------------------------
##$DU= <F:/spectra>
##$EXPNO= 1
##$NAME= <H-F>
##$PROCNO= 1
##$TYPE= <nmr>
##$USER= <she>
##$AMP= (0..31)
100 100 100 100 100 100 100 100 100 100 100 100 100 100 100 100 100 100 
100 100 100 100 100 100 100 100 100 100 100 100 100 100 
##$AQSEQ= 0
##$AQ_mod= 1
##$AUNM= <au_zg>
##$AUTOPOS= <>
##$BF1= 200.13
##$BF2= 200.13
##$BF3= 200.13
##$BF4= 200.13
##$BF5= 200.13
##$BF6= 200.13
##$BF7= 200.13
##$BF8= 200.13
##$BYTORDA= 1
##$CFDGTYP= 0
##$CFRGTYP= 5
##$CHEMSTR= <none>
##$CNST= (0..31)
1 1 145 1 1 1 1 1 1 1 1 1 1 1 1 1 1 1 1 1 1 1 1 1 1 1 1 1 1 1 1 1 
##$CPDPRG= <>
##$CPDPRG1= <>
##$CPDPRG2= <>
##$CPDPRG3= <>
##$CPDPRG4= <mlev>
##$CPDPRG5= <mlev>
##$CPDPRG6= <mlev>
##$CPDPRG7= <mlev>
##$CPDPRG8= <mlev>
##$CPDPRGB= <>
##$CPDPRGT= <>
##$D= (0..31)
0 1.2 0 0 0 0 0 0 0 0 0 0.03 0 0 0 0 0 0 0 0 0 0 0 0 0 0 0 0 0 0 0 0 
##$DATE= 1554371732
##$DBL= (0..7)
120 120 120 120 120 120 120 120 
##$DBP= (0..7)
150 150 150 150 150 150 150 150 
##$DBP07= 0
##$DBPNAM0= <>
##$DBPNAM1= <>
##$DBPNAM2= <>
##$DBPNAM3= <>
##$DBPNAM4= <>
##$DBPNAM5= <>
##$DBPNAM6= <>
##$DBPNAM7= <>
##$DBPOAL= (0..7)
0.5 0.5 0.5 0.5 0.5 0.5 0.5 0.5 
##$DBPOFFS= (0..7)
0 0 0 0 0 0 0 0 
##$DE= 6
##$DECBNUC= <off>
##$DECIM= 24
##$DECNUC= <off>
##$DECSTAT= 4
##$DIGMOD= 1
##$DIGTYP= 9
##$DL= (0..7)
0 120 120 120 120 120 120 120 
##$DP= (0..7)
150 150 150 150 150 150 150 150 
##$DP07= 0
##$DPNAME0= <>
##$DPNAME1= <>
##$DPNAME2= <>
##$DPNAME3= <>
##$DPNAME4= <>
##$DPNAME5= <>
##$DPNAME6= <>
##$DPNAME7= <>
##$DPOAL= (0..7)
0.5 0.5 0.5 0.5 0.5 0.5 0.5 0.5 
##$DPOFFS= (0..7)
0 0 0 0 0 0 0 0 
##$DQDMODE= 0
##$DR= 18
##$DS= 0
##$DSLIST= <SSSSSSSSSSSSSSS>
##$DSPFIRM= 0
$$ [...]
##$SUBNAM2= <"">
##$SUBNAM3= <"">
##$SUBNAM4= <"">
##$SUBNAM5= <"">
##$SUBNAM6= <"">
##$SUBNAM7= <"">
##$SUBNAM8= <"">
##$SUBNAM9= <"">
##$SW= 24.9336934301222
##$SWIBOX= (0..15)
0 0 2 0 0 0 0 0 0 0 0 0 0 0 0 0 
##$SW_h= 4990.01996007984
##$TD= 16384
##$TD0= 1
##$TE= 0
##$TE2= 300
##$TE3= 300
##$TEG= 300
##$TL= (0..7)
0 120 120 120 120 120 120 120 
##$TP= (0..7)
150 150 150 150 150 150 150 150 
##$TP07= 0
##$TPNAME0= <>
##$TPNAME1= <>
##$TPNAME2= <>
##$TPNAME3= <>
##$TPNAME4= <>
##$TPNAME5= <>
##$TPNAME6= <>
##$TPNAME7= <>
##$TPOAL= (0..7)
0.5 0.5 0.5 0.5 0.5 0.5 0.5 0.5 
##$TPOFFS= (0..7)
0 0 0 0 0 0 0 0 
##$TUNHIN= 0
##$TUNHOUT= 0
##$TUNXOUT= 0
##$USERA1= <user>
##$USERA2= <user>
##$USERA3= <user>
##$USERA4= <user>
##$USERA5= <user>
##$V9= 5
##$VALIST= <valist>
##$VCLIST= <CCCCCCCCCCCCCCC>
##$VD= 0
##$VDLIST= <DDDDDDDDDDDDDDD>
##$VPLIST= <PPPPPPPPPPPPPPP>
##$VTLIST= <TTTTTTTTTTTTTTT>
##$WBST= 1024
##$WBSW= 4
##$XGAIN= (0..3)
0 0 0 0 
##$XL= 0
##$YL= 0
##$YMAX_a= 103319
##$YMIN_a= -223482
##$ZGOPTNS= <>
##$ZL1= 120
##$ZL2= 120
##$ZL3= 120
##$ZL4= 120
##$ABSF1= 10
##$ABSF2= 0
##$ABSG= 5
##$ABSL= 3
##$ALPHA= 0
##$AQORDER= 0
##$ASSFAC= 0
##$ASSFACI= 0
##$ASSFACX= 0
##$ASSWID= 0
##$AUNMP= <proc_1d>
##$AZFE= 0.1
##$AZFW= 0.1
##$BCFW= 1
##$BC_mod= 2
##$BYTORDP= 1
##$COROFFS= 0
##$CY= 11.3945322036743
##$DATMOD= 1
##$DC= 2
##$DFILT= <>
##$DTYPP= 0
##$F1P= 18.9103706918063
##$F2P= -1.10871071338519
##$FCOR= 0.5
##$FTSIZE= 0
##$FT_mod= 4
##$GAMMA= 1
##$GB= 0.15
##$INTBC= 1
##$INTSCL= 1
##$ISEN= 128
##$LB= 0.24
##$LEV0= 0
##$LPBIN= 0
##$MAXI= 10000
##$MC2= 0
##$MEAN= 0
##$ME_mod= 0
##$MI= 1.114404
##$NCOEF= 0
##$NC_proc= 0
##$NLEV= 6
##$NOISF1= 3.799351
##$NOISF2= 2.8
##$NSP= 1
##$NTH_PI= 0
##$NZP= 0
##$OFFSET= 15.70392
##$PC= 1
##$PHC0= -8856.124
##$PHC1= 21.60025
##$PH_mod= 1
##$PKNL= yes
##$PPARMOD= 0
##$PSCAL= 0
##$PSIGN= 0
##$REVERSE= no
##$SF= 200.130013532006
##$SI= 16384
##$SIGF1= 3
##$SIGF2= 2
##$SINO= 400
##$SIOLD= 16384
##$SREGLST= <1H.CDCl3>
##$SSB= 0
##$STSI= 0
##$STSR= 0
##$SW_p= 3612.71676300578
##$SYMM= 0
##$S_DEV= 0
##$TDeff= 0
##$TDoff= 0
##$TI= <>
##$TILT= no
##$TM1= 0
##$TM2= 0
##$TOPLEV= 0
##$USERP1= <user>
##$USERP2= <user>
##$USERP3= <user>
##$USERP4= <user>
##$USERP5= <user>
##$WDW= 1
##$XDIM= 8192
##$YMAX_p= 0
##$YMIN_p= 0
$$ End of Bruker specific parameters
$$ ---------------------------------
##NTUPLES= NMR FID
##VAR_NAME=  TIME,          FID/REAL,        FID/IMAG
##SYMBOL=    X,             R,               I
##VAR_TYPE=  INDEPENDENT,   DEPENDENT,       DEPENDENT
##VAR_FORM=  AFFN,          ASDF,            ASDF
##VAR_DIM=   8192,          8192,            8192
##UNITS=     SECONDS,       ARBITRARY UNITS, ARBITRARY UNITS
##FACTOR=    0.0002004,     1,               1
##FIRST=     0,             0,               0
##LAST=      1.6414764,     0,               0
##MIN=       0,             -223482,         0
##MAX=       1.6414764,     103319,          0
$$ Real data points
##PAGE= N=1
##DATA TABLE= (X++(R..R)), XYDATA
0@%%%%%%%qJ6j6K1k9L2m0N6o4P2q8J05j29J52j76K07k39K73l12L57m07M62n22
30b77N88o61P43q32R31j040J157j286J428j583J754j943K153k385K640k926L249
47A710l614M030m511N074n745O558p566Q858j0586J3027j6762K3267l7808J27387
61A03319l7696k15821J26312J07869l1568q8454J8368L0950P410l9997k8537m661
73e2506L7623J5607l2790l6496N4834O1626m1649p1736L1258M9002p930j095K1016
86B6764k4489j5926L5417J9368k6506q582P197r198l086K6958J4681l1374l6188
99b4964K0874L4683k6093l6490K2388K6092j5195j0750K340p124p33l143j5108
112c3223K0590M3181j7244n1909K100L1146J968LK0916M602l0058j4954L3567
$$ y = [0, 0, 0, 0, 0, 0, 0, 0, -8, 8, -8, 13, -16, 16, -24, 32, -32, 40, -48, 57, -72, 80, -96, 111, -128, 145, -167, 190, -217, 245, -277, 311, -350, 393, -439, 492, -548, 609, -677, 751, -832, 922, -1021, 1132, -1253, 1387, -1539, 1710, -1904, 2126, -2385, 2689, -3056, 3502, -4064, 4794, -5792, 7235, -9527, 13740, -24068, 103319, 65623, -150198, -23886, 83983, 52415, -36039, -17671, 13279, 20689, -19308, -47845, -52506, -14883, 724, -32066, -68562, -13728, 47898, 6249, -65487, -34229, 14773, 6843, 5748, 26764, 2275, -13651, 21766, 41134, 14628, 6046, 13243, 4045, 959, 27917, 42598, 11224, -24964, -4090, 30593, 4500, -31990, -9602, 16490, 1295, -9455, -7115, -14239, -14972, -18115, -33223, -12633, 30548, 13304, -38605, -36505, -5359, -3391, -3388, 17528, 22130, -7928, -22882, 10685]
125A0685K9268k5615k1583K4640N625k1686J3976J8542k9237j6081K2406m794
137F146k0078J7035J0982k4875j1218J5904L422j3697q08R310o657j0252K4865
150G9K3954l2546k8604L6003K0854l4166L876M4241j0094l5661J3272J8827j4944
163E091o229J3870K592p451P87M320r284j4104Q064J4433j1768p234J8693m885
177F895k8758J0459K2666j6244j0665J5312q398j4381K2381J5969k2780j4841
189b2385J4379J0417n987n18J4182K678j8324j311K3197k76j6489Q051M716j6293
203c963Q918K1770j5241j9154R478j820j0218J7011J2163k3376j8655J2523J4798
216D234o219j3243N964J1004j1196o493J9210K467j6293O625R820j4567L764K3748
$$ y = [10685, 39953, 14338, -7245, 17395, 23020, 1334, 15310, 33852, 4615, -11466, 10940, 6146, -13932, 3103, 14085, -10790, -22008, -6104, -2682, -16379, -17187, -7877, -14534, -24786, 79, 24033, -8513, -37117, -1114, 19740, -14426, -10550, 33691, 23597, -12064, 1208, 20035, 5091, -1138, 12732, 15324, 7873, 8660, 12980, 3696, -10408, -2344, 12089, 321, -6913, 11780, 6895, -21863, -11404, 11262, -4982, -15647, -335, -8733, -23114, -733, 15236, -7544, -22385, -8006, 2411, -3576, -4094, 10088, 12766, -5558, -6869, 16328, 16052, -437, 7614, 12330, -3963, 4955, 26725, 11484, -7670, 1808, -12, -10230, 6781, 18944, -4432, -23087, -10564, 4234, -1985, -15228, -9264, 1740, -9456, -15949, 3261, 5728, -10565, -3940, 5880, -8687, -4923, 18825]
230A8825r512k0198J3743J2494j2472n141P869J904j926J331K631l498j1269j022
244f241J2582o51o387O549o046j7941J1683J8591j8781j4266J8150N522j2838
257a0074M450Q498o569n349Q48J413P252R152M23r334j1338O723J9677l969j7964
272f161R455J2244j3333j524J4762p085j3380N755O06n871J0996N922j5339q815
286a1768P441M661o562n242Q566Q741j2448j0661J6636Q750j6682l398J1588j808
300b186J916J0292r079r633J5849O802j6566m347J4252O817n759q086K911O898
314A0081o509j0426O588O727l272J926l817j4708O032J5438j1948j2345J4671
327a562O656j2451k400O678J449k140m024J388R471L475n401j710q34JR495Q93
$$ y = [18825, 9313, -10885, 2858, 15352, 2880, -2261, 5608, 7512, 5586, 6917, 9548, 6050, -5219, -6241, 6341, 5690, -697, 5852, -194, -18135, -6452, 12139, -6642, -20908, -2758, 2764, -10074, -5624, 2874, -3695, -9044, -8196, -6783, 469, 9621, 10044, 710, -10628, -3905, 15772, 11803, -6161, 3294, 15538, 2205, 681, 15443, 8358, -5022, 733, 1339, -4532, 6464, 12386, -2953, -11768, -4327, 334, -6228, -11470, -2904, 5837, -6611, -17272, -636, 8114, -8568, -11966, -378, -2186, -270, 10022, 943, -8690, 7159, 13961, -2605, -6952, 7300, 14117, 8358, 272, 3183, 10081, 3572, -6854, -266, 6461, 3189, 5115, 1298, -13410, -7378, 8060, -3888, -16233, -1562, 5094, -7357, -9757, -3079, -1630, -3770, -7794, -6406, 3065, 6540, 1139, -571, -1405, -1404, 8091, 8984]
343H984r448M720Q739j0188n257J0886q03q350K492P99l597N204N87q600k276
358f108K338R4J248j600k062N931j90r762K420O589n709J330R285l050k566N731
374C919m528n948J0273N096o506N02L219j707J063Jl860K638L52m330L612J843
390E639o202P12K990r644o91J0921l570q603M399J548l996L495n0n129M072L501
406f08l475K075K631j447L292J99n690M028O342m153J395N689p042m379Q115n52
422F420n496L785J568n323n18q35k160M360l66q226O62M610j762N12n59o945L412
439f861P298m220j650P268j585n512M053K121j32M481j716l746N921K031n328
454B423O63K289k326K221J553o073J952M095p880l380P228j277n788K60J83J373
$$ y = [8984, -464, 4256, 12995, 2807, -2450, 8436, 7633, -717, 1775, 2574, -1023, 4181, 4768, -3832, -6108, -3770, -3676, -2428, -4028, -6090, -159, -349, -10111, -7691, -1102, -6811, -5481, 3804, 754, -1812, 3919, -609, -6557, 3716, 8812, 2306, 2808, 6027, 4320, 5383, 5384, 1524, 4162, 4514, 184, 3796, 5639, -563, 149, 3139, -6505, -7196, 3725, 155, -8448, -4049, -2501, -6497, -3002, -3052, -8181, -4109, -608, -4083, -2008, 623, -824, 2468, 2667, -3023, 1005, 7347, 3194, 4589, 10278, 3236, -1143, 6972, 6420, 924, 4709, 6277, 954, 436, -399, -2559, 1801, 1435, -6791, -6129, -1519, -3281, -2769, -3328, -10273, -6861, 437, -3783, -5433, 1835, 250, -5262, -1209, 912, 780, 5261, 3545, -201, 5720, 7751, 2423, 3086, 5375, 3049, 5270, 6823, 750, 2702, 6797, -1083, -4463, 2765, 1488, -4300, -4040, -3857, -2484]
470b484L264o595o823P788M269n168J161K134k437L782J937n275M581O819n903
485A050l290P402K688j570p69l967P17O449k528m488L616j181n336L087J61m795
501b754K786O7p189K379N874o131l395M879J21j445J663k437L11N337k290j575
517c799N603j88l307L465O54j141O681q09q248K942P585m253k676L679j900j942
533B346K360l856k050L705k312l379K677j502k475J033k992j807O185r1p154M348
549d964M754n555K58N308k363J833N591l214j344O121j136l570L736L415j014
564G856j462m382n69P739j554q301Q09Q95m624K823J703o994J713N002q493m504
580a2343Q537K768n128o75J350K847K694k898k205M747J750N23L462k491l932
$$ y = [-2484, 780, -5815, -12638, -4850, -581, -5749, -4588, -2454, -4891, -1109, 828, -4447, 134, 6953, 1050, -2240, 5162, 7850, 6280, 5511, 1544, 2261, 8710, 6182, 1694, 5310, 4129, -1207, 1880, 2041, -2754, 32, 99, -7090, -4711, 1163, -4968, -8363, -3484, -3363, -4808, -3145, -5582, -5271, 66, -2224, -3799, 1804, 1616, -1691, 1774, 2428, 1287, 7968, 7159, -1089, 1853, 9438, 5185, 2509, 6188, 4288, 2346, 4706, 850, -1200, 2505, 193, -3186, -509, -2011, -4486, -3453, -6445, -8252, -2067, -2158, -9312, -4964, -210, -5765, -5507, -199, -2562, -729, 4862, 1648, 304, 6425, 5289, 1719, 5455, 8870, 7856, 6394, 2012, 1443, 9182, 7628, -673, 136, 1031, -3593, -770, 933, -6061, -4348, 654, -7839, -12343, -3806, -1038, -6166, -6841, -5491, -2644, 50, -2848, -5053, -306, 1444, 1967, 5429, 2938, -994]
595i94P125K523p887L155P519p055n083O198N55m132J092j711k681J555m39k062
611b322o30k183j26M528l412m709M913k27n790O099P148n788l184M410p46Q78
627a141O792o72m257J963J716l03J468l05J20K176l882k586N606r58p561R41K899
644B016l731K430J366r275j914Q034j265m493K438L86k459J754L03K88L193l21
660a250k292K829J024l5N680j848n689N611N680o638j002N217k971j464N114j988
676E978o492O96J709k367P77j116o76k01m180k198M574O0l976L771O6n664N064
693d175O234o195k293O979L31k397M539J122k641J057J383K72K137j060j915K097
709E475j535j544M165j970o853K909K463p052J044O060n259n679L894L69k860
$$ y = [-994, 6131, 8654, 767, 3922, 11441, 4386, -697, 5501, 6056, 1924, 3016, 1305, -1376, 179, -260, -2322, -2952, -5135, -5261, -733, -4145, -8854, -3941, -4168, -9958, -3859, 3289, -2499, -5683, -1273, -2019, -1141, 5651, 4979, 722, 2685, 4401, 4098, 5566, 5261, 5381, 7557, 3675, 1089, 6695, 5737, -1824, -883, 2016, -1715, 715, 2081, -7194, -9108, -1074, -2339, -6832, -4394, -4008, -6467, -4713, -4410, -4122, -929, -1250, -3542, -713, 311, 276, 5956, 4108, -1581, 4030, 9710, 3072, 2070, 7287, 4316, 2852, 7966, 5978, -514, 182, 1891, -476, 301, -815, -1491, -1692, -5872, -8070, -3496, -3436, -7412, -3641, -3575, -9239, -4175, 2059, -4136, -6429, 550, 881, -1516, 3023, 4145, 1504, 2561, 3944, 4216, 6353, 5293, 3378, 5475, 3940, 2396, 6561, 4591, -2262, 647, 3110, -3942, -2898, 3162, -2097, -7776, -3882, -3513, -6373]
724f373K412m67k223K866J895j392p6j157J736N666n98l610N376J063o208L507
740B417O298m021j480M569l878l530N853M05n971j131O71n15J495j661k399m40
756c318k648j494N313p3n653L629K631n939J369P823l094l694N053P36j451M495
772C685J326l343L68J397M26K053n44j910K388k423l086L333P44o304J316M133
788C559n154k018M311l344l611L591n10k693L228K76l247O73K067K98J256j052
804b370j104M983J601l657L127K000m885K304N843l415k302M375k626l314M182
819D742N31m926N62N69k599l16M26k56P82m757l777N718L642n662m67K950k997
836e835J268N589l626k013O086Q53m430L355L551j623j180p71K071M767j752n363
$$ y = [-6373, -3961, -4428, -6651, -3785, -1890, -3282, -3358, -4515, -2779, 2887, 2289, -1321, 4055, 5118, -1090, 2417, 8715, 4694, 3214, 7783, 3905, 375, 6228, 6633, 662, -469, 202, -313, 1182, -479, -2878, -3318, -5966, -7460, -2147, -2220, -7873, -4244, -1613, -7552, -6183, 1640, -1454, -5148, -95, 641, -810, 3685, 5011, 1668, 2036, 3433, 3859, 5912, 5368, 3458, 5846, 3423, 337, 3670, 4414, -1890, -574, 3559, -1595, -3613, 698, -2646, -6257, -2666, -3176, -5869, -2641, -2365, -5612, -4939, -2872, -2574, -1318, -2370, -3474, 1509, 3110, -547, 2580, 4580, -305, 1999, 7842, 4427, 2125, 6500, 3874, 560, 4742, 5273, 347, 909, 1478, -1121, -1437, -1011, -1267, -485, -5242, -9019, -3301, 341, -5321, -5788, -2838, -5835, -4567, 1022, -2604, -4617, 1469, 2322, -2108, 1247, 4798, 3175, 1995, 1224, 3295, 8062, 6310, 947]
852I47K045J583l241K119Q07n170N76K930n473j294N638k418o819K369L148l42
868b595k35k568k001M985J886k373J250M99j727L638J867k301L662J778o761N45
884d51Q292m83m509P97j245j147L845q71m340Q39N19l252O58J088j318k14k877
901d669k921N385L985o600k319M303o99R87L667k818k725N577R11l103K600K603
917D164k111L10L61N09K743j934m052K847K570l201M8Q12n336K1M821k059l027
934b514J907k581l289M281K103l253j307M79n23L283L68k628J914J576k696K807
950g3L678k561L08J862l137J795N966k786m839K591J449j976J285k27k648L96
966A083m68k930K205O49l680L39M04k420K078J388m712P30N508k464l161M056
$$ y = [947, 2992, 4575, 1334, 3453, 4260, -910, -334, 2596, -2877, -4171, 1467, -951, -7770, -5401, -2253, -2595, -2830, -5398, -7399, -2414, -528, -2901, -1651, -1152, -2879, 759, 2626, 325, 3987, 5765, -996, -451, 7841, 7358, 2849, 3646, 2401, 1254, 5099, 4228, -112, 727, 1246, -2006, -1348, -260, -1578, -1792, -4669, -7590, -2205, 1780, -4820, -7139, -2836, -3535, -2548, 1119, -1699, -4424, 1153, 2064, -1039, 1561, 4164, 2053, 2363, 2724, 3233, 5976, 4042, -10, 2837, 5407, 2206, 2254, 3066, -2270, -2249, 2572, 513, -2514, -607, -3188, -6477, -2196, -93, -3346, -4653, -4174, -4697, -1414, -1046, -3674, -1760, -184, -2880, -73, 3605, 1044, 1352, 3214, 77, 1872, 7838, 5052, 213, 2804, 4253, 2277, 3562, 3335, 687, 1083, 615, -2315, -110, 539, -3141, -2802, -2398, -4818, -2740, -1352, -6064, -5334, 174, -2290, -5451, -1395]
982a395R20k960L109J216m87K559n56k958L042K480j540K86m19j356K081J142
998E164n265N08M165l681k826L119j162k975J759j763j849L567K49m349P64J543
1014c032n96J432L66j816K607J721l768J876M296j684r02K789k018J37M282j816
1030C874l235L375N21l203P44Q28j714M55m55l071J900O49l383n90K081k197K95
1047c126K251l439p45L834j470k028L953L25k589K315J431j124K343K64k385K898
1063B708J854k282J21J749k364J116K108l294k80K488l721k781M450n13l204R70
1079h75j250k622L054M87l157J100Q88k591J940K023j939Q17J708j999J735L522
1095B841k481j539M407Nj586K013L02j910J947l03k633K863P39m122l69P98j487
$$ y = [-1395, -475, -3435, -326, 890, 403, 2962, 2406, -552, 2490, 4970, 3430, 3716, 3297, 1941, 4022, 5164, -101, 407, 4572, 891, -1935, 1184, 22, -2953, -1194, -2957, -4806, -1239, -990, -5339, -4575, -3032, -3628, -2196, -1830, -3646, -1039, 682, -3086, -1210, 3086, 1402, 500, 3289, 1271, 1408, 5690, 3874, 639, 4014, 4535, 1332, 2076, 2904, 1190, 1645, 1190, -1881, 19, 668, -2715, -3305, -1224, -3421, -3126, -875, -4314, -5059, -1225, -2695, -4723, -770, -445, -3034, -719, 712, -412, 1931, 2195, -190, 2708, 4562, 2280, 2401, 4150, 1786, 2902, 5010, 1716, 1436, 3924, 203, -2578, 1872, 1359, -1845, -875, -2125, -4747, -1693, -1206, -4363, -3263, -2375, -4966, -3026, -1003, -2942, -2125, -417, -2416, -681, 2841, 360, -1179, 3228, 3233, 1647, 3660, 3962, 2052, 3999, 3696, 1063, 3926, 4665, 543, 174, 972, -515]
1112e15J164k08m236L56L241k791j634J819o44j637L475r62j457K640l15j860
1128c564L275K236j862J179P07j878K321J934k539J191J648l156l6L840j876k174
1144A246Q24k323p62L585j390m418J663K77k183J259j87k266J322J478k845J310
1160c410K949j845o21K011j579J683M186j863k354L024M36r31K615o95k730K564
1176C440J624k809K65O94l231J276R26k840L16J365l629j154K394j642m24K146
1192a283k340k109L697P69k244J611P8j883L854J715k366J269J250j857J980K666
1208D807k685L41K070k455l3L022j589k730J432j400j572L106n71l670N17J6k431
1225c825J939N81l649R86J867j641O51K114k835n47L942k64l15K672j127r78L163
$$ y = [-515, 649, 441, -3795, -3439, -198, -2989, -4623, -2804, -3448, -5085, -1610, -2572, -4029, -1389, -1704, -3564, -289, 1947, 85, 1264, 1971, 93, 2414, 4348, 1809, 3000, 4648, 1492, 1456, 5296, 3420, 1246, 2070, -253, -1015, 2570, 1180, -3238, -1575, -1298, -3481, -2222, -2409, -4675, -3353, -1875, -4720, -3410, -461, -2306, -2927, -916, -2495, -812, 3374, 1511, -843, 2181, 2617, 1686, 4301, 3606, 876, 3440, 5064, 2255, 2520, 3214, -17, 1259, 2185, -655, -339, 1026, -2603, -3757, -1363, -3005, -3429, -1283, -3623, -5732, -2035, -1266, -3510, -1899, -1821, -3704, 150, 1865, -501, 768, 2018, 161, 2141, 4807, 2122, 2463, 4533, 2078, 2045, 5067, 3478, 748, 2180, 780, -792, 2314, 1743, -1927, -1410, -1394, -3825, -1886, -1305, -4954, -3968, -2101, -3742, -3091, -977, -3812, -4359, -417, -681, -996, 1676, 549, -429, 2734]
1242B734j7j215K988M0l001J534J392j681R48m08m255Q84L172l124j472J193k314
1259b602l33K153k697j265K236o05j840K146J227j327J365m03j940M434K738l190
1275I7K40K119j213R65K238k259n5K555k021j345K334r81j935J093q83j643K296
1292A602j152l484R54J209k401N87R98k572N77J795j751O14K856j724j305K845
1308c52J30n72K919j228j342L619M07k756K447R13k178R15O97k308J373R25m027
1325d18J21K903k182j511J047k273r09K351j117k300K168o1k217K031M87j629
1341c509K116P65k253K529K236k343J067K155k198j53L904r05j384J933j773r18
1357A269L086o75l251J332q23j668K023l02l142R95K89l391J319K634k591r56
$$ y = [2734, 2717, 1502, 4490, 4530, 1529, 3063, 4455, 2774, 3722, 3314, -941, -57, 3115, -9, -1481, -288, -2602, -2935, -782, -3479, -4744, -2508, -3113, -4953, -2807, -1580, -2907, -1542, -1945, -3885, 549, 3287, 97, 337, 2456, 1243, 2208, 4446, 2187, 2132, 4687, 2666, 1321, 3655, 2674, 739, 1832, 949, -694, 1602, 450, -3034, -2080, -871, -3272, -2685, -1687, -4259, -3682, -1887, -3638, -3024, -168, -1892, -3197, -352, -222, -794, 2125, 897, -445, 3174, 3581, 825, 3272, 4185, 2007, 2922, 3619, 1311, 2684, 3609, -418, -297, 2606, 424, -1087, -40, -2313, -3222, -871, -1988, -4288, -2120, -2181, -4398, -2367, -1880, -3509, -1393, -628, -2881, -352, 1884, -459, 608, 2763, 565, 412, 4316, 3411, 2027, 3960, 2187, 1269, 4355, 3680, 429, 1761, 938, -730, 1293, 991, -2151, -1156, -867, -4258, -2939, -305, -2896, -3852]
1373c852J958j588LK823j208j414K894M8l84K741m19k148K608N84j168K388N55
1390D421l557J123K461k469m9J000k844l82K329j880j317J958k412k558K002L96
1406a778j263J376j451k270L249J747k531Q71Q23j371K894J784k392K29L278k606
1422E89r13M181l35j421J210j235j309K964m83l131R72K75j436J191l96l795J417
1439a655J091l172O96K895l241j093K357o7j019K226l85j660K632Q69p88J393
1455A079J45j496K111Q04j358K519Q09m131P43L096k080q21J160k222o17K481
1471B222k013j555J334j006j999J404j56j421J553l80k612K592J138k122R87J912
1487a22j614P08K755j793j07K541j206m45L300r27j947K315o88j205J304j17j949
$$ y = [-3852, -1894, -3482, -3479, -656, -1864, -3278, -384, -336, -720, 2021, 1602, -546, 2062, 2646, 1478, 3866, 4421, 864, 1987, 4448, 1979, 1930, 2930, 86, -296, 2033, 153, -1164, 794, -1618, -4176, -2174, -1778, -3041, -1665, -3116, -5386, -2137, -390, -2921, -2050, -1227, -2598, 296, 2080, -312, -83, 3195, 589, -324, 3857, 3522, 2101, 3311, 2076, 767, 3731, 3248, 117, 1089, 1364, -72, 1119, 723, -3072, -1655, -564, -3736, -3040, -145, -3386, -4479, -2122, -2189, -3208, -982, -1367, -3027, -395, 474, -314, 1079, 1224, -272, 1839, 2643, 1285, 3804, 4613, 482, 1225, 4321, 2241, 1420, 2580, 358, -259, 2222, 209, -1346, -12, -1018, -3017, -1613, -1769, -3190, -1637, -2017, -4629, -2037, -899, -3021, -2034, -122, -1736, -1028, 1727, -66, -173, 2368, 1162, 717, 4017, 3090, 1143, 3458, 2770, 1565, 2869, 2752, 803]
1504H03P48l21k195J588L65k833l9J310k689P44K378k807j301K746n29j772K611
1521a193J84j183J605M05o31J801M78j744K032R49j634K042R87l040O86K651k697
1538A698j043K475j671j728J422j114j648J367o79k063J485r1j387J338q36k209
1554d684K550J709k384Q98J886j781M01K895j186k81K454j026j066K985J49k059
1570A460J892l85j825J480o6j861J029j64k261O17J080l038K70J269k650M18K771
1587C6k550k127K847N7j583J920M56j336J676O64j205K060Q53j630J455J039j473
1604A159J446J450k947J15K657k028r00K241j427k570J620k66j738Q66n91k101
1620c014J204J28j438J400k38k142J590J471k139J278K451k633K96L195j031p76
$$ y = [803, 1551, 1230, -965, 623, 988, -1845, -1884, -574, -3263, -2519, -141, -2948, -4249, -1503, -2032, -3804, -1193, -1009, -2192, -587, -182, -813, 988, 1466, -278, 1754, 2703, 1069, 3111, 4098, 1058, 1744, 4395, 1698, 655, 3130, 1459, -269, 1153, 39, -1609, -242, -921, -2984, -1499, -1590, -2977, -1639, -2475, -4684, -2134, -425, -2809, -1911, -25, -1806, -1405, 1490, 304, 23, 2477, 1451, 385, 3370, 3519, 1460, 3352, 2967, 1142, 2622, 2556, 695, 1724, 1560, -701, -84, 996, -2042, -1772, -503, -3153, -2735, 36, -2514, -4641, -1794, -1737, -3320, -1400, -944, -2280, -604, 60, -1145, 915, 1768, 138, 1593, 2632, 1159, 2605, 4055, 1108, 1223, 3880, 1852, 952, 3193, 1766, -804, 816, 550, -1188, -322, -913, -3014, -1810, -1682, -3120, -1720, -1958, -4100, -2510, -1039, -3178, -1900, 551, -2082, -1786, 1409, 378, -398]
1636c98K549K9j377J970M89k209J939k39j439J330J83k278J087R5k728R30J301
1653A234l065n91K698k490j156K259j500j392K357j76j648K127R18j477R27R81
1669Fq04K025O25j997J767J751k036N53J753k092J30J840j901r15K465j293k748
1686h71J333K57j911O84l59j524J046K58k641R59J453j932J147R30j889J258K347
1703E45k476j89L626n98j750K177P73r70J551k14j375J787Q07k186L01M43j348
1720I04L25O05k557N86J312k928l56K657j773k129J739k56j290J994p41j767K098
1737a577J110j357J077Q37p88R90J033j423J928J745k857J91K383r83l93J573
1753C489j913j470L167j055k480J011J36k314J047M09j967M37j11k029J286J160
$$ y = [-398, 2151, 2180, 803, 2773, 3262, 1053, 2992, 2753, 1314, 2644, 2827, 549, 1636, 1731, -997, -67, 1234, -1831, -2422, 276, -2214, -3370, -1111, -2611, -4003, -1646, -1822, -3470, -1343, -425, -1902, -975, 6, -798, 1227, 1852, -145, 1622, 3373, 1337, 1890, 3643, 1551, 1681, 3521, 1620, 705, 3170, 1877, -871, 462, 719, -1192, -508, -867, -2391, -1345, -1087, -3728, -2769, -1316, -3248, -2101, -1171, -3060, -1802, 545, -1931, -2120, 1506, 908, -842, 1335, 2108, 1138, 2689, 2475, 1100, 2887, 3694, 1508, 1809, 2252, 904, 1229, 1834, -723, -137, 1175, -1753, -2109, 548, -1225, -3354, -1615, -1871, -3161, -1167, -1908, -3675, -1577, -467, -1824, -747, 90, -698, 292, 1325, -98, 1830, 3575, 718, 909, 3292, 2309, 1916, 3489, 1576, 106, 3273, 2218, -262, 749, 885, -1429, -382, 27, -1940, -1503, -1614, -3643, -2357, -1197]
1769a197j682K64J756j552j98K853o35j255K368k51j233L126M01j774O18R88j006
1786A591J660L4k571R79J149k097k74J140j683n36J324k034n44K116j830k449
1802d025J910O54j053J223n98j643K021J203j565J248J239j329J001J720j318
1817F88J108R88j963L63K612j024j726J934p84j579J266j64k148J193r0k710R27
1834a109J860j892q18M7j261J225J620k656k19K298j088j61K091p96p83K382l39
1851D01j392K883R34k218M56J032l74J067O45k416N32J335k288NJ534k192j026
1868a082J668j137j029J276j107k317K040P78j905R48L64j381P06J447j236J550
1884d17J031j558J89K692j010K9J418j546P6K477q16j168J311o29j820J436K42
$$ y = [-1197, -2879, -2615, -859, -2411, -2609, 244, -391, -1646, 722, 471, -762, 2364, 2765, 991, 1609, 2597, 1591, 3251, 3285, 714, 1693, 2842, 745, 471, 1611, -72, -608, 716, -1318, -1862, 254, -1576, -4025, -2115, -1461, -2514, -1291, -1889, -3532, -1511, -308, -1873, -625, 614, -715, 286, 2006, 688, 1796, 2784, 821, 1184, 3796, 2772, 1046, 2980, 2196, 617, 1883, 1719, -429, 764, 674, -2036, -1109, 751, -1141, -1959, -1912, -3173, -1948, -328, -2984, -3203, -905, -1993, -2154, -63, -859, -1642, 740, 401, -991, 1892, 2826, 608, 1064, 2096, 1722, 2789, 3434, 1018, 1550, 2885, 597, 602, 2136, -56, -1082, 586, -551, -1580, -304, -1411, -3728, -1688, -910, -2815, -1867, -1503, -2884, -2178, -731, -1967, -417, 614, -944, -755, 1937, 927, 956, 2374, 828, 904, 3381, 2565, 1397, 2708, 2079, 259, 1695, 1937]
1901A937j740O15k21k224P93J134k069l68R86j614R7J915j466j64J309j042n24
1918b646L058l00j474J467L32m88J859N39j985J066J134j479J402R88j620n19
1934A334O10j391R8J970k434j424J658o45j379J441j652j448J337P40j571J190
1950a566J026k170L75J793j008J441R02j576j03K801o26n18J592j146p39K327
1966B805l22j170J178n42j962J460P39j791N4j41j790Q39J107k137m61R62j695
1983b867k66K327p13r46J252j340J26K634K87j634R03R38q62J410J292k049O75
2000A167J483j461P51J478k053n40R68r59j55J524j490j607P86n77j068J328l60
2017g85j981O14J012j021J205j16j999P06K315j215K93J474q80j4J955k30q14
$$ y = [1937, 197, 812, 591, -1633, -840, 294, -1775, -2143, -1157, -2771, -2674, -759, -2225, -2389, -1080, -2122, -2646, 412, 112, -1362, 105, 437, -51, 1808, 2347, 362, 1428, 2562, 1083, 2485, 3473, 1853, 1334, 1944, 553, 651, 2621, 187, -1237, 421, -224, -1603, -162, -1814, -3262, -1925, -1185, -2756, -1566, -540, -2710, -2335, -542, -1550, -109, 793, -783, -886, 1915, 1289, 771, 2363, 1217, 478, 2805, 2483, 1313, 2491, 1949, -13, 1447, 2186, 395, 449, 308, -1482, -643, 464, -1673, -2134, -1172, -2867, -3133, -806, -1519, -2465, -1213, -2553, -2427, 207, 494, -1140, -237, 701, -161, 1249, 2541, 492, 1167, 2650, 1189, 1940, 3418, 1365, 825, 1793, 834, 679, 2203, 713, -894, -108, -685, -1753, -425, -785, -2766, -2152, -1140, -2161, -956, -1072, -3071, -2365, -50, -1265, -972, 502, -378, -392, 1563, 1333, 519]
2034E19K031j056j164K083M32r64M39o02j426J119J025k084K48j15j759J48J518
2051C92j704r04J227j415n02K243k89j650J055j53j91J883M35j549J332O54j191
2068c27J618J282j701L23J540j677K45J977j716r75J262n34j047J183j339j037
2084i23J028n18j507J250J00k270Q99Q65j259P39J082k042n9K069l41K17J362
2101F92j317J63J967k78r19J848J19k022J852L88j367R30j76j355Q15P30j982
2118H8O12K01k265J23J086j317k39J318j610q73J547J57j071O76L26o32J349O65
2136A41j170J130M18j045J672J231j679M73J450j513K56J799j318j338R73j78
2152A302r07P28l35j253P8m54r42J462j48k280P83Q83j282Q24Q28j858N44J674
$$ y = [519, 2550, 1494, 330, 2413, 2845, 1881, 2320, 1718, 292, 1411, 2436, 352, 600, 485, -1274, -1126, 392, -1312, -2216, -989, -2404, -2906, -663, -952, -2602, -1547, -1700, -1891, -8, 427, -1122, 210, 864, -327, 1291, 2573, 872, 1195, 2735, 1058, 1303, 3280, 1564, 589, 1851, 1317, 270, 1453, 114, -923, 105, -413, -1920, -670, -570, -2840, -1941, -1076, -2335, -1596, -514, -2556, -2615, -546, -887, -670, 692, -625, -462, 1505, 1227, 308, 2156, 2275, 253, 2105, 2493, 1126, 2056, 1880, 525, 1340, 2070, 88, 700, 901, -1364, -1241, -155, -1472, -1711, -393, -2003, -2876, -1329, -1172, -2243, -1567, -1241, -1873, -524, 141, -1029, 101, 519, -526, 1146, 2377, 698, 1171, 2621, 1108, 1364, 3163, 1845, 507, 1480, 1302, 395, 1123, 788, -465, -387, -841, -1783, -321, -469, -2749, -1966, -1083, -2365, -1541, -713, -2571, -2027, -353]
2170c53o52j02J423p20m15J487M40l36J255k6j448J216M64j306J139mj718Q17
2188A161R21j425j66O36k347j29J436j024r19R59j096r16J991J13j643R86L03
2205a159r45J250J103j225R91P58j403J274J529r73L0J049j072j36J940r60j754
2222B97J548j28j659R65n1j601N04l67j093Q62K80j683L46P07j188K13J325j546
2240b269k20K339r28l26K123m19j129J324O16m03J172mj162J206M52j115L76M02
2258B035j314J66R79j483l93J167j714j115J580m32j122R31r69j084J630Nj174
2275b307J011L41r46J278O63j116J045P59j120Q20J854j134l68J391o56p76J688
2292B427l85j642J316j12j434R40K16j695mm2q02M01R0j395L03Q80j340L01J130
$$ y = [-353, -1005, -1107, 316, -404, -819, 668, 1108, 772, 2027, 2001, 553, 1769, 2233, 927, 2066, 2062, 344, 1161, 2082, 657, 491, 1127, -1220, -1349, 87, -937, -1856, -897, -1993, -2909, -918, -805, -2448, -1462, -1159, -2104, -854, 249, -976, 15, 773, -630, 644, 2173, 1200, 1230, 2279, 1207, 1071, 3011, 2051, 297, 1845, 1717, 58, 1023, 972, -629, -125, -492, -1585, -723, -443, -2126, -1780, -1073, -2261, -2048, -723, -2269, -2489, -150, -1078, -1404, 719, 300, -829, 495, 1111, 708, 1880, 1876, 714, 1920, 2372, 1257, 1633, 2035, 721, 887, 1866, 383, -10, 1157, -557, -1672, -92, -524, -1646, -715, -1684, -2768, -1138, -1133, -2307, -1296, -955, -1901, -623, 40, -1076, -31, 728, -392, 428, 2282, 1148, 780, 2171, 1515, 739, 2427, 2042, 400, 1716, 1604, 170, 1110, 1326, -369, -373, -415, -1217, -816, -726, -2121, -1818, -938, -2278, -1977, -847]
2311h47p34o22J664k29o97K028k08j254J647J13j41J145K6q17O43M52q25M61O14
2330B419j756K38Q12j551l07R96j281n48Q76o54j274J396m66j331R06J06p00Q99
2348a220M14j088J197O23p24L52J609q93L79J195p27n13J343n53o50J043N35j371
2366I51Q33k22j523P33K07j477K06J86r98L6P63j579K63P99j441Q9J433n13q19
2385b073J562m50m29J701p6q12J135M33n07J044O05j244M81Q82j136M57P40j572
2403G41q8J190j317r53J394j133p83N88m54j294J233R4j657O78O78r89R04O12
2421e56r28L83J340j131L70J483r39K40J686q78n17J578r1j280J308L5j638R14
2439A379L1j438M09N61j208J02K95j423K7Q92j198l60R69q15n43J706q28r65K077
$$ y = [-847, -1581, -2203, -539, -768, -1465, 563, 355, -899, 748, 861, 720, 1865, 1891, 1074, 1717, 2169, 1344, 1805, 2419, 663, 901, 1713, 162, -145, 851, -430, -978, -102, -756, -2030, -634, -1100, -2431, -1525, -1419, -2119, -1220, -806, -1894, -697, -74, -798, -446, 1163, 270, 649, 1844, 1117, 604, 1947, 1394, 744, 1787, 2322, 951, 1784, 1562, 39, 772, 979, -498, -292, -106, -1104, -1068, -305, -1884, -1621, -822, -2263, -2174, -741, -1254, -2073, -511, -961, -1390, 311, 235, -577, 558, 991, 484, 1528, 2133, 889, 1370, 2252, 1116, 1573, 2313, 741, 653, 1843, 526, -427, 967, -166, -949, -361, -815, -2109, -876, -782, -2439, -1761, -1083, -2072, -1168, -556, -1484, -1101, 239, -892, -522, 961, 22, 262, 1948, 1070, 553, 2131, 2040, 760, 2068, 2103, 465, 1379, 1410, -28, 381, 942, -266, -164, 131, -1292, -1265, -373, -1571, -1931, -962, -1777, -2320, -614, -1442, -2407, -330]
2458c30R5r60J103K72l95J167L24j078J071P82j047J70P67o83J0Q16j296k68R73
2477A493p17j124J113r27r86J087m85j279M25L16r43O33O04j376R08J088j073
2494a243p4J519j085K72K054p26q99J675m59k81J102N1j209J004N61j274M36J46
2512A570j387L14L68j701N89P93j621k10P84q83m06J389j183o09J239Jo14R50
2530f17J61j100J552N90j078R80R19j138L46J425q14K68R02j463j46J389j148
2547A028o36J229o28j450Q28L93j693K87j41j393N44P70j041M69M86j086P44Q89
2565d01r11K2J365n33p3J620n02o48J184j52m45J135J20r78L97M15q09N77K98
2584A681j317j48L90r53j26R57j491l48P94q22k77R35q83r32J778l9q67J354Q
$$ y = [-330, -235, -1195, -92, 180, -215, 952, 1276, 198, 1269, 2051, 1004, 1174, 1941, 1258, 1268, 2084, 788, 520, 1493, 776, -348, 765, -162, -1148, -61, -546, -1825, -1400, -1084, -2027, -1394, -790, -2166, -1258, -170, -1243, -1317, 202, -883, -611, 1443, 717, -182, 1493, 1034, 753, 1855, 1906, 697, 1701, 2262, 988, 1424, 1570, 183, 497, 865, -836, -247, 546, -1075, -1285, -501, -1384, -1790, -401, -1584, -2193, -954, -953, -1567, -617, -456, -1556, -4, 586, -492, 488, 1407, 269, 615, 2040, 1226, 1494, 2396, 933, 787, 2176, 1028, 392, 1621, 993, -457, 371, 764, -929, -642, -783, -2176, -1632, -862, -1903, -1434, -948, -2034, -1290, -401, -1312, -1290, 75, -458, -531, 1089, 587, -61, 1123, 971, 526, 1661, 1781, 803, 1200, 1615, 806, 1383, 1681, 364, 216, 606, -347, -473, 484, -1007, -1355, -561, -1383, -1660, -725, -1608, -2540, -762, -801, -1668, -314, -306]
2603c06r02P93J164j072Q43N44p25L06J190p55J20R06q71k56O38n80p72J261p66
2622G60j255R68J06j486K36o6j317J043O02j355K4P49n82K50R36r93L38J117q73
2641g98L77J560m95o04J217K24j037J437j29r55M35M64j155P90K02j602J81Q61
2659I73j086m5O25j414p07J257n45j004J520p37q23Q59K08n02Q66N53j213P61
2677d54P37k89K74Q64q11K32J421p99M3P15o26q64J500o73q22O19m38p65J43L40
2697C47j298K28L28j138L96O72j236J70N17q25L47Q96j66n65J340m03n23J963
2715A050k42p29J131K43r40J084L23j321Q84L69j119L50P51j168p17R64j227j38
2733d52N70q49p81R76l13r54J124j70j497J052Q54r63P74O27j131P99R75q97L39
$$ y = [-306, -1208, -415, 749, -323, 520, 1064, 339, 645, 1835, 1080, 1200, 2106, 1235, 979, 1617, 1037, 265, 1526, 760, -495, 473, 579, -907, -671, -737, -2054, -1011, -409, -1764, -1740, -991, -1573, -1323, -387, -1380, -1042, 75, -798, -421, 1139, 644, 40, 1257, 1481, 444, 1881, 1752, 797, 1232, 1696, 541, 1331, 1533, -69, 112, 973, -113, -158, 467, -947, -1654, -397, -942, -1946, -426, -1163, -1986, -1127, -919, -1421, -555, -2, -1215, -454, 283, -6, 268, 1132, 321, 553, 1974, 1175, 1218, 1933, 1307, 443, 1943, 1270, 448, 1067, 629, -136, 7, 347, -951, -723, -395, -1533, -1137, -465, -1701, -1531, -1014, -1839, -1492, -596, -762, -1327, 13, -390, -913, 1050, 808, 79, 1210, 1453, 513, 1597, 1920, 599, 1483, 1852, 733, 1083, 1834, 666, -51, 913, -314, -452, 118, -731, -1512, -536, -849, -1803, -679, -849, -2346, -1294, -440, -1403, -629, -2, -1133, -334, 641, -256, 83]
2752H3J545j388J27J035k64k22J013p49j094J604l00j125O77m72j204J192K05
2769F63j575M08K04j303J93J068j247n9R38j140K63J142q7o82J214l33l35J347
2787F79L54j051Q99M21q14J182K75q62j30P32j272L82J075j479m12J063j013m85
2805d56O66l79j097N59k60q69J008J16r98N49Q72j038P29L77r97M78J492r25L43
2824A70J131j187M49J099k8q45J079m55p64K83L79j045N88Q6j212K50J97p67m2
2843f34N28j234j51R64r51l21Q37m17k62J212m16m54J068L82r71J530K20r61N52
2862E21Q64n81O48O03j210J31P59r42k44J060j195j96N20n29r94R46j81j313M03
2881i30M64j338O58N40j410R89N11r15L83J050j114P67P16o55JJ675o16l63J303
$$ y = [83, 1628, 240, 367, 1402, 1138, 916, 1929, 1180, 86, 1690, 1390, 265, 942, 470, -734, 458, 663, -912, -504, -300, -1603, -1410, -342, -1589, -1648, -710, -1850, -1587, -445, -532, -1214, 0, -333, -668, 679, 1033, -18, 881, 1302, 488, 1670, 1945, 1083, 953, 1685, 413, 795, 1870, 391, -21, 1042, 29, -456, 210, -169, -1266, -707, -967, -1836, -828, -712, -1710, -1161, -289, -1327, -598, -221, -1218, -740, 752, -173, 170, 1301, 114, 563, 1662, 1634, 789, 1868, 1413, 649, 932, 1311, 266, 854, 940, -272, -22, 175, -592, -634, -106, -1340, -1491, -527, -1478, -1799, -962, -1379, -1641, -429, -845, -1299, -231, 151, -820, 710, 930, -31, 521, 1385, 804, 1452, 2055, 845, 976, 1735, 793, 549, 1609, 414, 218, 738, 209, -785, 161, -20, -1333, -930, -466, -1804, -1146, -606, -2016, -1027, -516, -1431, -1048, 2, -1112, -345, 371, -284, -283, 1392, 776, 413, 1716]
2900A716p52l00Q45j75q75J061l7j158O81J40j275L0N37j421K23L91r44l87J205
2919d95p44n12J028m30k19M12K40p77J432K9p30J047M57q21R26N38q90M49J092
2938B032j320M14R83j175j63O53n01j131P72o4j306M52J89j047O81q5j054O19
2956a051N93j115K37P98j235R98J227j305J35J366n04n26J356Q7r74J166k43k65
2974G45N94K21j024M10N72j291L71N58j108j64N63q69k48N80q28q45J107q22j52
2993a630Q14n2m96R25Jp83J058J85r93J061Q29p89O68O98r36K41Q82q34l4J136
3013A951j111j57O63p35o90N73j13j356R37R9j110P0L48j110R00J86j061O70O38
3032d08r48J49J020l89j35J281n33o5Q71J83r25J345M8r74R04L17j026K12J28
$$ y = [1716, 964, 664, 1509, 1334, 459, 1520, 1483, 325, 1006, 1146, -129, -99, 438, -983, -760, -369, -1313, -1700, -495, -1239, -1751, -723, -1153, -1372, -960, -720, -1497, -65, -36, -766, 281, 738, -83, 843, 1381, 491, 940, 2032, 712, 1126, 2109, 934, 771, 1424, 923, -208, 564, 500, -806, -354, -165, -1212, -531, -616, -1670, -1051, -458, -1573, -1336, -538, -1773, -775, 452, -853, -718, 648, 144, -382, 974, 1061, 87, 1253, 1010, 745, 1339, 1560, 536, 946, 1518, 227, 598, 1156, 48, -116, 447, -422, -670, -90, -918, -1763, -656, -1478, -1630, -816, -868, -1364, -439, -438, -1221, -163, 22, -971, 90, 919, 130, 798, 1496, 560, 801, 1683, 849, 815, 1951, 840, 683, 1346, 611, -79, 494, 381, -975, -38, 61, -1049, -979, -631, -1741, -841, -655, -1716, -1046, -408, -1356, -1207, -187, -576, -711, 570, 37, -28, 843, 1026, 101, 1446, 1494, 520, 1424, 1741, 715, 927, 1055]
3051A055n58L52L04j464J03O80j336j9N71m23o38P65n96o24J339l09j017R78J47
3070f90o90J066O48r02O94P86o65L39R56j002l03J080k50k39Q60p80p45J139o52
3089F50q49Q12k04j188N93J33q57K67M36j373L12P04j084N72R01j325K91J210
3107Am89k31J142k11j63Q73K96r17O83J11p14J029j43q87P13L31q95l2K27p80
3127e6j31N00j194k12J126n75p37N45m31o31J362n43l96L30P97j055J028O64r50
3146e59P32K73k10K77R97q36j27R87l99n76R28m37p57O02k21p18M54J46j065J66
3166c43L3p37J87O55j611L75Q23p90K55P31k19o58J069J95n44R65J6n78R80J1
3186H15l15O06L07r20M48P66n21m22P69j393J57Q05j020l23Q69j047m00R71p14
$$ y = [1055, 497, 849, 1153, -311, -208, 472, -864, -883, -312, -735, -1373, -608, -1204, -1828, -489, -798, -1815, -837, -690, -1380, -314, 334, -568, 126, 912, 247, 586, 1542, 540, 237, 1317, 1067, 828, 1688, 908, 163, 1302, 650, -199, 613, 409, -779, -186, -53, -910, -643, -207, -1580, -1268, -564, -1648, -1076, -175, -1500, -1209, 1, -488, -719, 423, 212, 49, 922, 1218, 301, 984, 1095, 381, 1410, 1267, 380, 1093, 1424, 529, 497, 724, -56, -187, 313, -881, -1093, 33, -542, -1279, -734, -1165, -1796, -434, -977, -1373, -1043, -246, -1301, -273, 391, -559, 173, 446, 236, 513, 1510, 674, 547, 1534, 1135, 559, 1487, 1050, 293, 895, 674, -44, 410, 556, -509, -343, -310, -1047, -860, -205, -1816, -1441, -618, -1408, -1153, -422, -641, -1299, -230, -35, -579, 386, 402, -176, 804, 815, 500, 1106, 1413, 493, 941, 1707, 1186, 764, 1533, 140, 297, 1102, 82, -241, 628, -419, -819, 152, -562]
3205e62j059J271r76n81J208N0o92L63P30o93K91J083q02K03J003r49P33R01n62
3224I60n60J009j05q29J007k97o19K80J42r87M95m6j182N14P4j073L31O27j014
3243a273K04N66j080L68J001p71j67J125j56l32R72l3n36P60O38j269J102L12
3261A431q43P65K90j035M92J08p70k03J132j232n47Q20o79q58N67K43q45P69m04
3280g99n89M46L32o39O17M16j024O04P91o82L55R61p33K35P30P8o42O01o5n75
3300D18P05J65j149R45k53r81N08K00j162K60J85n01q5M86r77j3P27m04l11J136
3320a01n98n97Q99J83l95Q09K87r63J124L81p06M88O62p71J73P42p09j26N14j086
3340B10m91J142o11n42L89n90o16Q60m05p62N49R5m96K73M01l95K06Q12p68K56
$$ y = [-562, -1621, -350, -1326, -1907, -699, -649, -1341, -978, -248, -941, -650, 433, -369, -166, 837, -112, 621, 1522, 960, 400, 1409, 1304, 475, 1482, 1185, 566, 846, 988, 1, 496, 450, -732, -218, -144, -1217, -886, -259, -1273, -1069, -503, -1583, -1215, -214, -985, -1152, -27, -183, -515, 457, 424, -112, 648, 1286, 17, 1119, 1431, 588, 1353, 1643, 608, 1100, 1208, 438, 235, 1367, 135, -412, 408, -271, -1129, -562, -319, -1164, -395, -799, -1388, -942, -610, -1249, -632, -216, -1240, -636, 155, -527, -172, 789, 56, 291, 1021, 1099, 457, 1058, 993, 418, 1123, 1288, 139, 1084, 831, -150, 358, 558, -604, -344, -159, -660, -745, -259, -1236, -1249, -522, -926, -1237, -101, -699, -1296, -397, -214, -609, 200, 487, -476, 648, 1029, 323, 811, 1473, 702, 875, 1617, 908, 782, 1296, 210, -281, 861, 250, -292, 97, -493, -1109, -249, -654, -1416, -867, -772, -1268, -995, -594, -989, -783, 29, -739, -483]
3360d83Q51l89K06M57n54K5J192r1m16N30m39l84R20n06q06N27K52n65O8K98j077
3381c84n4N99j126J53L12p00j06P09m76l91J347n63l92O49M22n34O46N01r08P52
3401D56P32p91P21K78j102N98K23l86k87Q38o49o64Q26l93o45L30l73r31Q64K77
3421g8r17M1N23p48M0P80o49K08L45m24L73R28m05q57J747j46o89J153j58m93
3441E74N88k00o14O93J28r36M37J35j180M64P31j247m95R40p04k69O91o84n90
3460a538Q98k96r0R98o31m48P63M85p47Q33J33l60L96M81o26K74R78j134L37L93
3480A099m68J14L42n49p38P50k83n80K54j21n51J48J40q26L95L03r12L93M92n13
3500a111K40N61l07o2J021k95rN02k09k00R73l5n26N50J50r32P22M90j146L50
$$ y = [-483, 368, -21, 185, 642, 88, 113, 1305, 1214, 798, 1328, 889, 505, 1425, 919, 113, 640, 892, 327, 395, 693, -384, -438, 161, -965, -812, -500, -1200, -1306, -597, -1073, -1464, -117, -680, -1072, -423, -1, -535, 111, 612, -296, 456, 1188, 397, 1118, 1396, 294, 892, 1115, 729, 442, 1280, 631, -33, 793, 400, -245, 85, -288, -1219, -355, -78, -995, -954, -431, -1179, -1139, -359, -1008, -800, -455, -879, -506, 422, 17, -840, 907, 761, 72, 1225, 1067, 574, 1162, 962, 348, 1041, 1169, 233, 670, 805, -375, 89, 820, -427, -922, 18, -686, -955, -264, -948, -1538, -640, -936, -1026, -28, -659, -1107, -344, 141, -606, 227, 360, 0, 396, 877, 251, 525, 1503, 369, 706, 1099, 631, 745, 1087, 538, -200, 550, 267, -313, -59, -180, -731, -583, -443, -1269, -874, -571, -1483, -1090, -598, -1111, -871, -310, -617, -679, 342, 47, 38, 540, 331, 131, 1104, 1069, 543, 1093, 1243, 311, 1033, 1523, 377, 727]
3520G27Lq53J91L02n76k04K54m64p68J009l73o81Q32r3q31J072Jo50O12K00N1
3541b39K73N28o27K71R86p45K39O21n15j60M73m17m30P50m21m60M88J17j161N38
3561A09J27j142O53J40j021R3K57n24K68M92l35j76J149o31O3P19n67J21J061
3580H56l07m60Q85l1m97N49M04r95L08L09o46k77M88p19K58N81q05k90N13p95
3600f71m61P15n4n73O04l9o74M68K80o22N16N42o07P13O44r61M1J057o93L45O43
3621A213o37r5M30J57p76O58Pj216J150p47n56L48K16j051K99J79n46L35M37p88
3641i83Q5N58l20j67M69M0l92R61k16n00J053J57l77M23K50m67K45K01n24Q9N42
3662A127p28M03k3q32O7M23n86l92O84n58n22N81o5r16P26K6o24M04N07m81L33
$$ y = [727, 730, -123, 68, 370, -206, -410, -156, -620, -1388, -379, -752, -1433, -601, -694, -1525, -453, -452, -1102, -490, -290, -239, 34, 562, -65, 206, 1192, 447, 686, 1307, 792, 632, 1105, 688, 258, 1008, 587, 127, 615, 732, -429, 109, 236, -906, -253, -113, -1134, -1041, -784, -1308, -1040, -548, -883, -1059, 90, -541, -478, 241, -326, -205, 856, 549, 89, 974, 943, 446, 995, 1399, 404, 712, 1021, 375, 98, 586, -133, 125, 706, -99, -389, 124, -671, -1132, -417, -471, -1044, -440, -479, -1153, -685, -405, -1027, -511, 31, -576, 137, 781, -180, -139, 918, 225, 570, 1213, 576, 481, 911, 1068, 292, 950, 957, -259, 891, 144, -412, -64, 152, -899, -600, -421, -967, -632, -195, -983, -898, -340, -660, -827, -358, -318, -710, 251, 35, -465, 588, 745, 368, 791, 1041, 574, 819, 1020, 496, 585, 1127, 399, 802, 779, -53, 14, 437, -149, -541, 143, -415, -937, -356, -421, -1337, -611, -585, -1209, -805, -298, -779, -446]
3683d46Q83r17M62M14l10J87P01m15j8N94k41p02J034l92n92P61j81q07M74k52
3703B37o06J22K45q25L5L88o29L30M63q80K72N25l79j1P11n21N2O93n8j79N33
3724E18J34m18L14P7l26M21L63o84K99J31k98p5K01o78m47P36j55r95R19n15o57
3745a135O27j97m54M39j43k14N86K06n88M93O14n96J91R99n77J53L64n14K1R07
3765A182l36l35O08l07n85M94k19m19N04J78p75j30K76j027L23K30o50L31M21
3784b36o67o8O21m11J24P13l43n30R92k03m02P03L57n63L80M42n55M14N26j068
3804B26M10O62p58m64N06n63j25M74o27k70L56L3p95P48m92k89N82l96n52O80
3824f54M35n60L28O17n30J71Q51m86j63Q62K8q41J038j95n63L48O2n92M31K03
$$ y = [-446, 437, -480, -18, 396, 86, 273, 974, 559, 541, 1135, 894, 192, 1226, 834, 242, 1003, 822, 15, 489, 237, -369, -247, -2, -827, -792, -404, -1033, -703, -240, -1120, -848, -323, -702, -713, -2, -523, -471, 222, 164, -15, 518, 652, 234, 548, 625, 299, 720, 1083, 399, 698, 829, 531, 456, 657, -21, -468, 268, 113, -882, 37, -478, -1135, -508, -705, -1159, -720, -863, -1077, -491, -285, -873, -380, 234, -362, -171, 828, 251, 404, 768, 254, 275, 1182, 846, 511, 1119, 812, 227, 721, 502, 83, 587, 765, -10, -140, 136, -891, -568, -338, -988, -657, -236, -903, -971, -350, -761, -637, 76, -267, -797, 195, -8, -410, 293, 650, 87, 467, 909, 354, 768, 1294, 226, 636, 1298, 540, 76, 582, 19, -106, 368, -259, -529, -173, -140, -935, -187, -679, -968, -386, -782, -1334, -654, -219, -779, -451, 166, -364, -193, 658, 172, 9, 871, 899, 58, 1096, 901, 338, 686, 748, 156, 587, 790]
3844G90n34l9K82p96M01K71r86M8K31o87J85O06l56m42O68j08k62L56K83m77N18
3865d8K15k63K97N51n41L00N20q49N60J47n83k52O72l66k51N02m29n69P20n80
3885b47k71L57k60k89kN45p47%P81r49M41M00m99K17P56q22J45Q73m07j8P98n33
3907B69J78N60P3q98L33M24q84M35M89p86j58L07n59j40M77q32J05M24p47j66
3927a096N88l26k14N75j5k35K91L05n78Q35Q7o70O93M73o44L96J83l86N6Q69n57
3948F30m72Q35k34k89J72j11q57L52K22o54L90l48o99K85N20o93M43M89q32O3
3968g88O98m52R2L03j39L04N29m88j73R61j84m09N75J2n63O21J81q54M39J07n94
3989A78o6P7j84l85O06n49k32M57m98k33P78o21j66N03k95k29Q14l60J7L88L11
$$ y = [790, 256, 217, 499, -297, 104, 375, -611, -563, -332, -1019, -834, -228, -584, -1026, -358, -466, -728, -372, -89, -566, -48, 167, -96, 201, 752, 211, 511, 1031, 182, 742, 889, 306, 54, 726, 360, 109, 611, 182, -387, 333, -247, -518, -161, -421, -710, -712, -167, -914, -914, -133, -1082, -641, -241, -740, -523, 233, -589, -444, 429, 22, 4, 802, 269, 447, 1007, 1080, 182, 515, 939, 55, 490, 979, 193, 35, 342, -217, -357, 120, -712, -607, -183, -930, -1096, -508, -834, -1048, -473, -488, -723, -432, -127, -705, 130, 217, -453, 240, 713, 69, 465, 648, 262, 318, 1187, 630, 158, 993, 759, 470, 642, 531, -326, 26, 248, -406, -16, -364, -1063, -778, -258, -951, -508, -19, -851, -788, -90, -542, -450, -147, -286, 18, 547, 59, -114, 847, 663, 254, 829, 841, 278, 899, 1080, 226, 665, 772, 178, 112, 189, 5, -380, 226, -323, -555, -98, -596, -829, -51, -672, -838, -335, -630, -859, -45, -405, -388, 0, 311]
4010C11n34K28O62p05L45L19j31m2P56o34j44L76k98j75L04l89m10J72K3p99P99
4031C4j97j001P88K33o80K23R9r4m0O22l79j89P54m24J59L81q7n6M66k6k70L54
4053F70L81n63J25j33j42K74j26ol53J51l10m70O22q8n46K81m16n22M66L37n44
4074i12M41Ok73N19L07j140J009L16m02J01Q04q05M87M31n3m57K26k33M52J79
4094A003k41r36O46Jo29J47p7n81N23K54o41j89P22n56k67O47n90j41O59j68j86
4115f00P19j21l04O59j56J9J82K91n85M48K08p51O66K06o49K42L40o07j43M79
4135E43m73n58O70m84m63O29l43l98N62m9o18P39k06p5K13M62n55M57L02k94j72
4156a11O67j70j67P13k5n55P60l96l47L48j45l49K18j12o90M78J24l95k25L70
$$ y = [311, -223, 5, 667, -38, 307, 626, 495, 453, 1209, 575, 431, 807, 509, 334, 638, 249, -161, 11, 34, -765, 34, -163, -1164, -376, -143, -823, -600, -501, -595, -635, -13, -392, -581, 173, -251, -92, 289, 202, 146, 612, 586, 316, 670, 1051, 488, 613, 480, 338, 612, 486, 480, 127, 278, -32, -502, 120, 32, -514, -233, -649, -1171, -705, -368, -912, -471, -465, -738, -219, 88, -1052, -43, 273, -129, -28, 776, -29, 458, 889, 836, 379, 605, 372, 824, 1003, 762, -174, 472, 473, -156, -9, -86, -667, -144, 110, -531, -720, 2, -554, -821, -174, -764, -905, -246, -414, -600, 119, -2, -306, 353, 197, 216, 398, 689, 104, 552, 760, 9, 675, 881, 232, 474, 814, 207, 64, 543, 70, -488, 182, -302, -765, -136, -479, -877, -315, -364, -982, -243, -449, -524, -311, 151, -404, 53, 355, 61, -111, 556, 386, 219, 932, 907, 352, 1112, 716, 369, 717, 572, 223, 441, 329, -361, 117, 241, -154, -379, -9]
4176ip89J08M19m28J78K60m43m0L82k32l6P93j72k53O06J90q07O46N26n47K31
4197E83L12k11q8L85p91L5M01k63j50J34m23k29M09m83m67P54l53m79P50l37j24
4218f35J82J21m39O12L34o26J61M69n11J29O25N2k54P07m4n67N96l14l57K42K6
4239E09n99M45L21q72L66k2o12N9N49n78j52M42m39k23P41m53m18P38R6m87N39
4260e0k54N9N76j27q3K78J33n29N80K90p15M17O8k72J7K23j02o35M68l59k05J46
4282g6m18k83M34j78m19L86J35m76K96L26m97P65k1n3J21L30k98R0J21J2j50N21
4304F68r7j14J31J15j79K06j40l58J22j77n48M49r9o95M29N26m97l37K35j82J4
4325e28L23k69n1K98q5l08M78L03m13L99M73n53M22K09l38K7M19n58J40N15m41
$$ y = [-9, -798, -690, -271, -699, -521, -261, -704, -744, -362, -594, -630, 163, -9, -262, 344, 534, -273, 373, 899, 352, 583, 895, 684, 596, 981, 190, 225, 626, 363, 213, 347, -76, -305, 104, -379, -846, -92, -445, -924, -174, -511, -635, -453, -332, -771, -159, 175, -451, -290, 179, -332, -203, 422, 474, 220, 927, 883, 316, 912, 598, 241, 483, 509, -90, 355, 676, -196, 170, 148, -464, -405, 144, -434, -586, -144, -583, -806, -65, -518, -936, -198, -102, -589, -50, -304, -245, 331, 204, 121, 399, 532, 3, 583, 873, 158, 575, 643, 371, 388, 611, 509, -126, 342, -17, -222, -76, -494, -777, -343, -521, -940, -554, -419, -895, -599, -273, -770, -5, -26, -79, 42, 372, 74, 164, 285, 297, 147, 668, 571, 457, 588, 703, 524, 730, 590, 232, 354, 177, -371, 78, -21, -716, -287, 239, -258, -595, -360, -542, -528, -205, -474, -525, -227, -312, -620, -142, 161, -252, 147, 620, 67, 489, 698, 360, 387, 806, 248, 388, 903, 462]
4346D62o3K01k65j49K23n59P1K31J49j070O28Jp20O26K01p42K80K78j91j00N80
4367G2l47QM67j08m57Q69k88l26J009n08p5L22r1j29n3M07p48L10k3l15K68j52
4389A12o21k83N42k31j72K72m81K51K3J2KL70j7l63M99L85l95M32K15o60M12K75
4411E79n08L22K63m38j23Q47n86j44L30n81p0L77k77m12M51n09k21L39J69n27
4431g19J18J97q6L06P4k06l40Q30o35N5P39r7j06M00j83j48M02J09l93M97j02
4452G12n99M22j45l26P0L57j83m55L65o25L00n1k21k35O82l57l17L99o3n20N26
4473b64J46p23P60R3j72M65R8k43N0N87p83O03N90p65M1L03k37o47O64j03n52
4494h9K86j6o09N92n59q5J09j9j44l40O90l30K59L52n28L3M97l27J62N54m49n
$$ y = [462, 399, 600, 335, 186, 409, -150, -79, 152, 301, -769, -141, -140, -860, -234, -33, -775, -495, -217, -408, -508, 72, -275, -267, 200, 92, -365, 504, 216, -110, 899, 391, 316, 638, 547, 418, 365, 772, 24, 334, 311, -4, 264, 112, -509, -792, -250, -481, -653, -381, -862, -611, -588, -576, -574, -204, -221, -584, -85, 300, -95, 337, 552, -108, 304, 579, 71, 393, 656, 218, 95, 942, 356, 212, 542, -39, -109, 268, -9, -421, 30, -479, -700, -361, -192, -719, -601, -404, -490, -184, -110, -316, -656, 174, -461, -406, 333, 236, 130, 530, 347, 199, 601, 710, 317, 814, 712, 113, 535, 390, 64, 134, 491, 308, -147, 218, -407, -107, -158, -379, -614, 68, -289, -606, -207, -270, -790, -264, -118, -841, -81, 12, -160, 305, 403, 160, 210, 797, 14, 617, 1207, 442, 483, 786, 549, -98, 566, 463, -89, 197, 181, -428, 164, -395, -480, -371, -390, -534, -874, -184, -514, -255, 97, -431, -398, 99, -228, -66, 488, 39, 34]
4516C4P36k15n35L69L82n13M16k5j97j61M61o89j19M59o25J07L31l36m10L75M
4537a51m60L32J2n01N54k55q6L39K72o83K94L76o5J76K93m82J4O84l03r8O49m72
4559D39k90P13k70m63J83k13j06M65n34k66J50O9p38O07n7m01N33k03m49L72M77
4580A8n77k0M69Q7l23N43J70l29J93L79n46K91M45n75L84J5l44M2L75n16J82K23
4602E86p58L40K42p97J38L5k13p2J86p4m70M48K10m09J91J66m19N20l2k36L15
4623a03L87k86K03L61m14N2O40m22k0L65Mp27L59L04o40j25L85n43k0K00o02J43
4645d99N93m63l6M51p36j01M63n8J83L68j25m52N05K06k52M34j06k39L36M58m43
4666D87K20j27l44o2L90k64l03N25n27l79Q25n33o96N64p5p7jj61JL17J75o45
$$ y = [34, 770, 555, 20, 389, 771, 258, 674, 649, 452, 291, 752, 63, -56, 403, -222, -115, 216, -120, -530, -155, -151, -611, -279, -267, -768, -214, -469, -555, -216, 56, -627, -333, 43, -22, 154, 447, -35, -21, 663, 360, 262, 911, 439, 149, 862, 592, 129, 312, 99, -7, 458, -76, -342, -192, -123, -861, -254, -311, -712, -179, -382, -831, -459, 18, -559, -579, -110, -23, -346, 197, 367, 38, 231, 610, 64, 355, 800, 225, 609, 624, 280, 322, 697, 181, 363, 586, -172, 168, 410, -387, -249, -214, -427, -499, -313, -387, -857, -409, -199, -608, -417, -251, -670, -150, -182, -418, -103, 284, -2, 201, 562, 148, 200, 840, 418, 398, 763, 767, 40, 399, 703, 63, -62, 323, -220, -240, -40, -642, -499, 94, -369, -405, 46, -690, -791, -328, -386, -203, 165, 40, -412, 93, 299, 47, 481, 375, 136, 472, 930, 487, 707, 580, 236, 174, 564, 300, -3, 522, -5, -384, 441, -92, -788, -224, -299, -376, -377, -538, -537, -220, -45, -690]
4688f90N12J16l60J70J04L0N5L43k35J08L14q7j16L16o8p05Q37j26n72N33j52
4709C27k17K20K65j186M77p7m98K81M88o37j71O88m03l01Q35m58k67P13j63l2
4729a16J53L22j75l4N08m49K02L30p34L57J36j1m32L37r4k81K43k47l92M26Pl59
4751c03J94m42p2O13k49m80L66J14l17L77P1m11J71M46k59K07P66n56l20P16j63
4772D69k23K39m07K8M00P2m53J21O1o28K83r4j43k1K71o62L75J20n96N50Pk80
4794e11k02O45J77o01P91p66j5O77J78m95O42k74j45N04J47m95J80J08m19M0K80
4815D46l64l28L42J23k29o3l1k74M3J04m34M83M9k45j39K01m1k07L22KK00J9o0
4838h1j22O75m14J42K62n0L5K22k09k14L72J2o47N71r0q54M32j93J70l67N25p25
$$ y = [-690, -178, -62, -422, -252, -148, -118, -63, 280, 45, 153, 467, 380, 264, 580, 512, -193, 644, 518, -54, 479, 327, 110, 330, 595, -591, -114, -191, -689, -408, 80, -557, -728, -40, -443, -744, 91, -367, -634, 79, -84, -116, 37, 359, 184, 150, 658, 209, 411, 741, 7, 364, 500, 489, 57, 394, 300, 19, 262, 15, -377, 49, 56, -303, -109, -551, -623, -10, -259, -739, -373, -259, -576, -199, -128, -539, -368, 78, -181, 26, 792, 236, -84, 632, 469, 246, 485, 78, 106, 506, 578, 125, 246, 307, -321, -38, -132, -275, -296, -25, -687, -312, -192, -788, -238, -231, -511, -713, -68, 109, -492, 299, -467, -482, 195, 373, -122, 520, 246, 101, 605, 752, 257, 437, 545, 126, 166, 446, 82, -246, 96, 219, -10, -73, -104, -378, -335, -231, -665, -182, -133, -378, -517, -316, -357, -564, -242, -240, -40, -21, -81, -203, 472, 58, 200, 462, 412, 447, 669, 460, 246, 618, 630, -17, 554, 464, -390, 42, -151, 19, -348, 177, -548]
4860e48J56K62j22k59p8Q5j05N56k29l21M70J83l15L83M0m18M21O36m62j6L12
4881F31l35J05J99m74j66J70M87o53K94Q3m86K74j90l62M49k35n73M92J96m01
4901d95K63J93n69K21L96l11p3M55jj14N00k20k94M98j77l4N5J30J96J28k29m69
4923D9mm1j01L28k57k49K53O4n83MM61l28k33K28j88r6J62L91m27P83j92j98M7
4946a27K60L0qM40q18O92N4j61k03M22l30j38L43j10n52N05O4o53M72m25j26J10
4968b59J83p25M10L28l48j04O24o39K8P87l99l9K43k3l07M64l9j3K20r0l26L32
4990C08L49n22K96L1m45K69L70o73M0K00m04M1N8k78l4K80k76Q6l6L58o33K59
5012c56J87p0K5J50k50N74J2k07L22M8r6j21L55k10k26L16j52o6R4J11m35L18
$$ y = [-548, -392, -130, -252, -511, -589, -504, -609, -53, -282, -603, -133, 50, -265, 118, 158, -260, 161, 797, 335, 319, 631, 296, 401, 600, 126, -40, 130, 617, -36, 258, 341, -145, 129, -61, -423, 26, -209, -782, -290, -94, -495, -232, -39, -608, -387, 9, -302, -375, 80, 79, -35, 465, 245, -49, 449, 272, 238, 293, 423, 619, 747, 518, 49, 45, 4, -97, 231, -26, -275, -22, 42, -541, -537, -76, -404, -637, -409, -597, -693, -531, -140, -567, 216, 24, -174, -127, 133, 163, 155, 595, -223, 469, 523, 362, 159, 581, 251, 113, 456, 346, -206, 299, 363, -290, 182, -243, -369, -259, -76, -801, -391, -63, -411, -515, 109, -530, -502, 285, -114, -153, 90, 67, -240, 224, 185, 172, 392, 302, -24, 308, 657, 135, 431, 462, 17, 286, 656, -17, 23, 223, -181, -140, -82, -360, -394, -114, -390, -304, -340, 18, -615, -356, -169, -239, -214, -64, -314, 260, 272, 65, 387, 435, 339, 218, 573, 363, 137, 453, 301, 235, 329, 440, 5, 323]
5034C23K7q34Q28m69k09N2M41p61L67j84k83L28M05m22L04L41n41J67K41j82R7
5055C6J89Nj4M18j99n51P51j78j25Q0N5m12K57Q8o96n7M89m04J03J5m8k89L62
5078a25L0m49L26J06m30M59j15k45L86M11l99K86J38m22K91J43k92k82Q30l24
5098C23j23M74k32k70k36J22J04j79N7n68P4L81L1m35N97o32%J94j5j83N59o29
5120e86K64O62j56p05N53J36M7q5k2N6L71k96l22L31Q2k00J96M4k70r0K90k07
5142I3m05L22j37k0K6j6j16Kj05K30K9k98Q6l19K80K19J4K22M2j87M24n72K67
5165H1L27k41J16J98l7k81K39o1l51L06Q8k68o4J45j008Q06J28n38R6M15m58j69
5187e31M27l52Q9K23k64j27M41J08o29O17JL0K13R6k85K30N6p2nL96m47q8J10
$$ y = [323, 350, -484, 344, -125, -334, -282, 159, -602, -235, -419, -702, -374, 31, -391, -87, 254, -287, -120, 121, -61, 36, 225, 230, 216, 634, 435, -116, 635, 457, 332, 412, 467, 55, 312, 400, -296, -353, 136, -268, -165, -150, -198, -487, -125, -95, -544, -218, -112, -542, -83, -198, -443, -57, 354, -45, 241, 379, -43, 248, 391, 99, -183, 647, 323, 200, 674, 442, 172, -64, 58, 162, -17, 40, -528, -454, -73, -42, -477, 120, -512, -512, -318, -333, -516, 43, -586, -322, 340, 184, -521, 32, 168, 215, 130, 108, 164, 535, 239, -83, 248, 330, 130, 326, 370, 100, 10, 300, 93, -312, 10, -127, -147, -121, -137, -253, -251, -356, -126, -97, -395, -309, -628, -348, -129, -115, 107, 149, -38, 386, -186, 81, 408, 167, 283, 481, 444, 163, 402, 341, -10, 296, 384, 116, 52, 197, -811, -5, 123, -415, -319, 96, -362, -531, -104, -456, -367, -144, -408, -535, -94, 14, -615, 2, 3, 33, 246, 342, 57, 287, 343, 271, 266, 662, 215, 127, 237]
5210B37l61L09L29n24j00M88n40j3L8n5l71M32M8l93J01mL8L21K01n58r4Q92m72
5233e1p8K41j01k57L36K02n3j6J72k05J37r6j94J80Q9j81m7K19k50k46K63m90
5255d26k0M56j85k69K84Q8j67J38j77N2J22k7K25O5j95ol0N20k51J37m10K34K80
5278D38K30l18k43L12m66QM25l48l5J98l16k41N69j91q6o7K63p10K59K51k24j2
5300c04J90n4L3K07l65M1N03%N3lj53P7J57j09K54j19j8k32K03m18nL20k5o73
5324d40L98J69n75K48K74j57l61K41j31q8K53J0l68N77J13m52K36N0N5J03K52
5345D07j97j4L2K3Q0K87m33k09O2K20k22j8j81K38P7j10k30J24j23k60L00j01
5367b48j68o1M01j89p5R2j74K58J85j98J42L72j19l54O00j81k50K72R4j54j68
$$ y = [237, -124, 185, 514, -10, -110, 378, -162, -175, -137, -192, -563, -131, -83, -476, -375, -379, -341, -20, 181, -377, -471, 421, -51, -129, 112, 11, -246, 90, 292, 239, 223, 395, 190, 327, 231, 37, 217, 306, 125, 78, 297, 47, -199, 64, -426, -446, 10, -175, -444, -160, -72, -239, -101, -278, -226, -104, -131, 94, 159, -36, -42, -72, 448, 197, 334, -76, 158, 438, 668, 350, 107, 419, -47, -39, 386, 38, 3, 201, -115, -356, 213, 22, -64, -131, 132, -578, -319, -68, -292, -304, -114, -168, -135, 72, -293, -252, 251, 251, 304, 301, 148, 225, 382, 273, 527, 408, 390, 158, 361, -57, -62, 258, 233, -440, -42, 127, -448, -200, 74, -83, -444, -203, -334, -422, -169, -159, -527, 50, 163, -289, -53, -3, 52, 155, 407, 210, 196, 228, 251, 331, 618, 185, -24, 38, 258, 36, 18, -163, 75, 152, 42, -188, -64, -187, -447, -147, -248, -416, -477, -76, -265, -340, -248, -422, -164, 21, -177, -35, 337, 218, -136, 464, 283, 33, 305, 399, 245, 77]
5388G7J27j11J8K76k30J99Nn44J38j47k09J13L33n56N3L53j78P6j16MO6rL80j58
5412d0k0N76n69K09r3J82o6O4m5J58K78m33k2j14l10J70J06M12o69L60l1p67P54
5435I0l24j4Q5j63K57k81K85k43J14J92l41o3M34m5k29M04j60P7K8K87k04M68
5457F54m10j83L36j36K2O1k9l41J46N9o05O92k01k59l5K35l34L6M17m42k1J16
5479b22K13l68L83p3j6L22k7l70M84J62l85l18O32m32J02M61l01j24K07j57m93
5500c20N49M1l39J43m4l92L65qk98j37N24n08K57J04M8j95m1K5N6L53k06k24K87
5523D0K99j59J45Jk43L30J67n46M25r5l18K16j8j1k71M27l56k06O6o1k12K16J05
5546e9l14K1J83n29L14L72l00J09M58o82K33L85j26j09J96J93r1K18j95j86L03
$$ y = [77, 204, 93, 111, 387, 157, 356, 361, -183, -45, -192, -401, -288, 45, -511, -458, -105, -283, -207, -323, -319, -253, -262, 118, -40, -60, 516, -53, 156, 63, 245, 179, 243, 198, 356, 634, 201, 179, 65, -245, -75, 31, 443, -226, 134, 103, -664, 90, -234, -248, -163, -326, -69, -350, -65, -308, -194, -2, -343, -406, 28, -17, -246, 158, -2, 75, 103, 390, 186, 654, 244, 61, 397, 261, 283, 344, 315, -26, 120, 179, -426, 266, 65, -194, -229, 6, -328, -292, 125, -317, -338, -222, -9, -377, 6, -67, -83, 239, 212, -158, 326, 488, 103, -215, 417, -15, 87, 548, 247, 123, 330, 173, -320, 229, 270, -69, 74, 30, -362, 3, -5, -303, -440, 84, -424, -167, -63, -15, -210, -251, -226, -170, 183, -23, -247, 40, 339, 180, 325, 326, 83, 413, 580, 34, 459, 364, 46, 262, 244, 233, -38, 389, 33, -173, -107, -168, -380, -164, -59, -373, -352, -169, -698, -384, -12, -312, -203, 255, -427, -194, 191, 65, -44, 152, 345, 254, 472, 277, 91, 394]
5567C94K9j52k24OL25k47J80l05L60k93j82J52j40j15p0L54j19k19j45K53R1K90
5589B23k37l87K71J80O2J70k82j60N15l14k94N89j62O2pK16k25n3L51m34j14L33
5611C03l47k42M57j76o44M04J44j92p0lj43N5L34p1K18q9P3J12N7l29M8M83m85
5634a03L96L45n56M7L34m29M0L64J22o72K98o5l18J71K35m65j3q6J92n9j33l30
5656f85K38L18K6R8o2L7k81L44k26j26O09J48l64J30j52J6R6P7p4J14J67r7k44
5679A07K76j16n99L69l39J96J66j30j79M4N4k88K99J2j92K04M53n59P3K15k30
5700a64M2K39L0l64Q82n51j78M08J08l63N7K92k59J26L87n19j69J82j37j16K12
5721A45k44K7R7k61p8J73j14L52j49p5m95O19j62MpJ00r1L67J9n76K27O77l61
$$ y = [394, 423, 271, 47, 53, 378, 131, 311, 6, 366, 73, -109, 43, -97, -212, -282, 72, -47, -266, -411, -158, -67, 223, -14, -401, -130, 50, 112, 282, 0, -160, 355, 41, -253, 336, 174, 236, 229, 445, 220, 167, 518, 84, -30, 303, -44, -286, 171, -5, -649, -245, -101, -293, -363, -366, -509, -454, -120, -191, 27, -62, 11, 123, 180, -149, -101, 382, -103, 293, 638, 82, 129, 463, 34, 74, 438, 560, -112, 186, 121, -197, -26, 209, -256, -269, -355, -163, -222, -355, -685, -447, -129, -103, -5, -67, -30, -311, 33, -193, -319, 290, 438, 74, 204, 52, 68, 164, 241, 167, 281, 448, 351, 107, 383, 267, -332, 37, -302, -106, 60, -70, -249, -205, -151, -439, -140, -128, -320, -116, 337, -222, -149, 66, -164, -122, 117, 147, -217, 665, 114, -64, 344, 452, 89, 146, 438, 179, 305, 692, 173, 4, 186, 49, -67, 145, -99, -72, 25, -236, -314, -141, -255, 97, -52, -127, -622, -3, -165, -161, -168, -68, -159, 208, 227, -349, -122, 555, 194]
5744A94k98M27k74j11K54j37O8p4p2j1L52q5m22L17m25o7J57J28k84L53Q8o22
5766e44L71J77p6Q1j00l13L41J62m12M91O2j70l4M22j90o83N45O0l67K06J37j71
5788eJ23L3k94OJ82m9J81k42m07O32k49J2j50o4K42k67n8K14J19k59L05j54N83
5811D34l67l06L22J71L5j69K80l37J21jr3n1J82k31j3J79r6l76L34o9n65M64J63
5834A1n97M45J00o47N15J75j11M2J69k28J43K81j57J6K31m08j04K56J47j48J42
5855B73J45m53J98J97j54k80K19k94K15J64m64J22k4P6j69K77k57j89L41%n40
5876e97O38j66Q1p3K20J6J05j32j81L34J75j95j20K67l30K37j41Rj73K30l26j25
5898b47M35Jj82J39k75m20J73N06l75P4q2k01J66L27k98N6M37l21J86q5j17M0
$$ y = [194, -104, 323, 49, -62, 192, 55, 123, 49, -23, -34, 318, 233, -189, 128, -297, -364, -207, -79, -363, -10, 78, -544, -173, 4, -72, 9, -91, -404, -63, 99, -313, 178, 240, 70, 36, 458, 268, -415, 130, 190, -177, 29, 166, -5, 118, 151, -143, -137, 45, -4, 177, -65, -472, 160, -89, -77, -227, -291, -49, -316, -374, -160, -41, -300, 5, -149, 434, 67, -239, 83, 254, 289, 120, 400, 63, 184, 183, 90, 39, 221, -10, -23, 156, 60, -316, 18, -51, -616, -152, 11, -586, -141, -41, -688, -173, 2, -109, -67, 102, -126, 17, 298, 141, 157, 388, -20, -124, 132, 279, 131, 273, 418, -35, 163, 360, 206, -74, 145, -149, 66, 230, -234, -112, -136, -60, -229, 48, -209, -398, -57, -57, -597, 41, -125, -44, -117, 103, 119, 224, 92, -89, 245, 420, 225, 105, 372, 42, 279, 138, 147, -26, 204, -122, -247, 188, 189, 7, 146, -129, -549, -376, 130, -245, -171, -253, -454, -288, 39, -259, -203, 234, -87, 99, 14, -103, -63]
5920f3L14M2N4K4k19P4j0k8J02J15k20l44L8M23l92J40J10k92p9O1nl83M92k61
5944c07J06J82l51J97J45m1k77J74J60L11l76K24o1j51N79k83K77j04k54K20L7
5965D07l59J1J23j02n5O2j51N2J09l57k57M0O19o94N29j0l39OK05Q2J25J56j84
5988A8j21l3L06k08L45n5p9K11K6l00o4J48l69M02j90j14L77k06J43l02J04j76
6010a37j9l6q0m0L34Q4m63K28l1k09M52J28l35J76J71l79K58J51l09O1J42R9k59
6033a3K29j77J16J33k36O3J24q9j80j16K01Q7r8J02m54j9j14J94K13J09k15j7
6055a57L85m23R7K40q4k03J43k5K18jj18l2J81j16j53K15j48J84j67K82k05l5
6077G8j63J01l7l35N9j44N68k10QL1l35m7J91K83m59K32L30q3mJ23o83O75m0k4
$$ y = [-63, 251, 293, 347, 371, 152, 226, 216, 188, 290, 405, 185, -159, -121, 302, -90, 50, 160, -132, -211, -150, -155, -538, -46, -307, -201, -19, -370, -173, -28, -69, -346, -172, -12, 299, -77, 147, 86, -65, 514, 231, 508, 404, 150, 370, 407, 48, 59, 182, 80, 25, 87, -64, -12, 97, -260, -517, -477, 142, -552, -23, -33, -372, -366, -161, -79, 46, 202, 18, -103, -136, 170, -38, 307, 252, 173, 384, 410, 110, 46, 194, -175, 227, 37, -77, 300, 94, 237, -65, 39, -137, -156, -192, -272, -312, 22, 106, -357, -129, -160, -369, 83, 211, -124, 52, 223, -156, 102, 253, -56, 5, 147, 246, -13, 216, 39, 155, 288, 52, 115, 239, 150, -30, -146, 55, 142, 44, 146, -308, -327, -441, -247, -34, 75, -140, -157, 228, -195, -98, 142, 58, -145, -2, -27, 191, 190, 72, 40, 221, 105, -48, 167, 19, 203, 36, 318, 113, 78, -85, 16, -21, -356, -297, -441, 127, -83, -75, -44, -379, -426, -235, 48, -411, -179, 151, 68, 64, 187, -496, 179, 139, 115]
6101A15j6l7L87n85K19O6k40K75L74l51j93nl5K80l37oK0mK8j65K29j95oO9q9
6126b02r2M01j82l60L95L4m02N90Q6k32K42l80J88J87J37k89R9j13m1L63j83k6
6148B20l43R8J19l10K77j50m70Q54j50o83N04l1j59L3K29l28j6K60l15L03R4L0
6170F6M7P2kj6K72j44l09M47l41k21K27K34l26J36L9l77J95K98j30k23J71o28
6192e13K99j39j09J65L71j73k28q1M47m03K04J40l46O81j56l54K75K21k72J03
6212A32K72k08J32K92p61K99R0k88J22m3J46n22L79j08j40j8L64n30L71q3j69
6233b71K71j77k35K26O13k72kK9k07Q0J22k74J76P8l7j31M51k84j41K76R6m24
6255c7M07j18j52l79P9j37L71l8o9j14P5K4n46N64k68J77J42J48j95K73p5l03
$$ y = [115, 99, 62, 449, -136, 83, 149, -91, 184, 558, 207, 14, 9, -26, 254, -83, -89, -69, -73, -45, -210, 19, -176, -182, -113, -202, -294, 107, -75, -435, -40, -6, -408, 182, 268, 36, 278, -102, 86, 273, 410, 121, 220, 107, 66, 429, 246, 220, -123, -25, 94, -216, 61, -89, -559, 295, 145, -538, -34, -65, -224, -191, 38, -290, -306, -46, -361, -58, 36, 66, 113, 185, 183, 167, 439, 295, -14, 433, 92, -129, 98, 332, 6, 142, 181, -196, -1, 297, 167, -56, 115, -513, -214, -353, -462, -297, 74, -99, -327, -408, 39, -364, -160, -20, -366, 315, 159, -195, 80, 301, 29, 132, 404, 196, 328, 620, -141, 158, 248, -40, 82, 39, 185, -337, 42, -66, -206, -224, 140, -390, -19, -102, -271, 0, -177, -412, -186, 427, 155, 153, 182, -25, 55, 177, -97, 79, 157, 120, -11, 440, 156, 15, 291, 387, -37, 370, 252, 100, -279, -200, -337, 34, -4, -73, -187, -112, -88, -634, -70, -338, -161, -19, 129, -66, 207, 132, -171]
6277a71K09N3R1j92J78J44p3oj39J68L88n36M9L3j58R2J67k93j02j6K67k57k2
6300a26n3k51M64j67J24o17O55m83M65k29J74J1J32j1j57L63j36j91K72M4j87
6321I6k5K07k05J70R4l65oQ1L3l25M8q2j01J67Qj21L88j73k94L55k63K66j22K12
6345D3N5j39J22k64K94p6JJ06j55P5o3m5K03J03L17l23k60J57J91n16L45k8j42
6368AK3J27n31M91j88j77J60k6j51J62L45l81j79K18j16O4J92j3k92M83l1k25
6390d4lK63K03l46M2k02p4M44l11O6J31l84J45K06j84l9K1K9o1J01j9q4R3k7j26
6415a60k9K68j22J16l69J78q0K98j37J05k08J16M5M46l05k27K17k4J22N1l34j55
6437a88M28l04j33K39l01ML12j51J64k87M05o84R8J52QK30O1j14j96K16Q8j81
$$ y = [-171, 38, 91, 182, -10, 168, 312, 239, 233, 94, 262, 650, 114, 163, 196, 38, 130, 297, 4, -98, -114, 153, -104, -126, -179, -430, 34, -133, -9, -626, 29, -454, 11, -218, -44, -33, 99, 88, -69, 294, 158, -33, 239, 283, 96, 71, 278, 73, 243, 337, -28, -34, 47, 80, -245, -197, -279, -380, -213, -205, -326, 62, -111, -405, -50, -313, -47, -169, 43, 98, -41, 81, -183, 111, 35, 36, 142, -13, 62, -1, -46, 157, 260, 577, 254, -6, 151, 342, -174, 171, 143, 1, 24, 151, -380, 111, -77, -254, -94, -120, -271, -109, 236, -145, -324, -106, -222, -158, 34, 21, -271, 212, 181, -44, -47, 216, 419, 73, 115, -87, -161, 283, -28, 38, 169, -215, -70, 136, -48, -87, -66, -37, -98, 3, -16, -100, -7, -34, -160, -189, 79, -43, 73, -296, -118, -198, 100, -37, 68, -140, -24, 21, 467, 162, -65, 152, 128, 250, 301, -33, -188, 240, -64, -197, 42, -259, -255, 57, -94, 70, -217, 188, -496, -398, -246, -238, -8, 53, -61, -257, -41, 47, -134]
6459a34K16j87L31k19K02j50J49q9O2J75j87r2J75p2J42j48j51j02j47N95m08
6480c9J64k15j76K24m8l28J52K65j55R8J94j7m43K29M33l39M4M3j50N51m56J97
6502B28Kj43n4J14k58L23l0l8ok38L0l8k62J27J35l66L42K36k74l21M26q6J5K33
6526I7p8r8J74k73J98M8R2k92L53Nm04K52n4R6P5J88m92K44J06p33M55r0J73l65
6550c23K70l0q8Q3j2n52K39O07k51J74j04n3N6J68k26J98r8j91K53J99m11K76
6572A84k23L10n1k2q3J60l47L55k61j47K10J01m14K34J09l29M6J62r6M2l70K57
6594a73Q9m53L83K16Pn52N24j98J32J38O5k39N22k46k02l1l5nJ59qK60k11j30
6617A2Km2L4K48j7p22M87l0k14J95l05K51M7k59J41K01l6Q2R2k06ML25k16j49
$$ y = [-134, 82, -105, 226, 7, 209, 59, 208, 119, 181, 356, 169, 77, 252, 180, 322, 174, 23, -79, -226, 369, -39, 125, -90, -266, -42, -90, -418, -266, -1, -156, -58, 136, 119, -324, -95, 338, -1, 43, 86, -64, 487, 31, 228, 230, 87, 33, 147, -111, 212, 182, 144, 138, -100, -70, -108, -370, -243, -108, -474, -132, 104, -170, -491, -65, -151, -136, 97, 19, -79, 95, -178, 20, 68, 160, -132, 221, 226, -178, 74, 20, 116, 191, 379, -113, 131, 237, -496, -41, -131, 42, -323, -53, -83, -171, -88, -100, -652, -413, 194, -57, 117, 13, -40, 16, 184, -42, 156, 58, -133, 120, 319, -92, 184, -39, 271, 220, 198, 115, 275, -72, 283, 22, -125, 85, 186, -228, 6, 115, -214, -168, -6, -102, -60, -430, -173, -84, -537, -154, 62, 69, -483, 41, -157, -25, 113, 178, -61, 461, 215, 13, -18, -53, -58, 101, 93, 353, 142, 12, 14, -28, 6, 254, 237, -485, 2, -28, -242, -47, -352, -101, -54, -313, -172, 29, -7, 75, 167, -39, -35, 290, 74, -75]
6641g5L0J58O3N7kp8L0l73L64J83j78J39l65k7M0j50J27J6k14L3o9J05J31L7j38
6666a56J14m0j78L32j94J9J37l4J01R5l97M14p3J12m75O52l76j33j1L22J25k48
6688A08J02m04M33k55J18k70L0j61K76K77o67J13J01J16j29K53Q5j81k41M64j60
6709HR4K08jm14J90k53L11k67K24k28K22q4q7L12M8k3k43P5m50N31k14Q8j78l7
6733a68j07K97J34k57k33J90J11J30k56L71n61J81R1q0K75n8P2J21n2m10K37K74
6755C02o7J0l05J34J21k6j83j91K77J1k79N14o56J79J95O3k24J2L14l77L09O3
6777A96j11K9j85J94j11k02L09o8K22j33k01o7L37j4r4O0j91j45L96j18l73L11
6799D1l7p0P5k33O0O7K4p9q4O6J7j36L97n7j85L43m69L24K16rl12P1pJ62p7N1
$$ y = [-75, -45, 113, 176, 233, 231, 153, 183, -190, 174, 357, 179, 318, -47, -74, -34, -184, -57, -41, -255, -222, -291, -186, -55, -18, -156, -42, -82, -260, 72, -122, -103, 34, 0, 101, 196, -201, 213, 140, 252, -223, 429, 53, -80, -91, 231, 356, 108, 210, -194, 239, -16, 102, -168, -138, -299, -23, 254, -413, -300, -199, -83, -212, 41, 126, -55, -296, 168, 8, 102, 310, 309, -105, 85, -168, 143, -124, 100, -128, 94, 10, -77, 235, 283, 260, 17, 92, -358, 173, -41, 47, -131, -168, -275, 22, 156, -101, -334, -144, -33, 97, -159, 212, -349, -168, -77, -157, 118, 60, 132, 253, 201, -209, 28, 302, 235, 245, -60, 74, 195, 169, -14, -205, 72, 83, -196, 318, -338, -159, 36, 99, -125, -113, 201, -176, 133, 196, 85, 114, -71, 123, 12, -190, 119, 51, 273, 140, -61, -128, 209, 195, 101, 161, -30, -175, 221, 103, -270, 41, 4, -66, 9, -224, -164, -97, -73, -152, -236, -170, -153, -289, 108, 51, -134, 209, -260, 64, 280, 271, -41, 30, 23, 185, 108, 159]
6825A59J55K12o42N9J42J75l48J35j35k6N69m33j17J35p2%O4K16l84n1N2p1J83
6848b3r0n0K79O3j69K75l72J63n3J14j07k07L46J32j87J46J34l96k03L64K3j98
6870a6J06l0k98L10k60m5J33l34K22J98l77R5O8R9l57K98Q6O0K97k08Q9j78J34
6893I2j52j1K85l21L66M3k78J78N7q1k88J52J82j63l01J64j75K67N7l06Q8L11
6915A66k95J12l4j70O0K60J92m43j3k0M7Q8K01j38p3J1q9J31O4l5k7K0o4J77R2
6940B20k92j66L44M0j43J72l13qK87q6k80Q2l71N86Q4k66Kj5J39J14J31k14l28
6963b81K39O1n3K36qk72K2L11M8l34J73m54L32P5K76n60N4L65l64P3J81j34p4
6986h8J5j45J01j44J21kk69O65l48j06J62K06l92L10j18O31k55j93J30jo5k00
$$ y = [159, 314, 526, -116, -57, 85, 260, -88, 47, -88, -114, 455, 22, -95, 40, -32, -32, 32, 248, -136, -187, -135, -206, -23, -113, -163, 116, 179, 10, 285, -87, 76, 23, 137, 30, -177, 169, 301, 114, 260, 394, -2, -205, 159, 182, -16, 90, 60, -238, 72, -188, -233, -100, -434, -212, -14, -391, -296, -228, -129, -486, -188, -102, -42, 255, 47, 136, -42, 92, -60, -71, 214, -107, 259, 302, 24, 202, 259, 178, -110, 42, 224, 61, -240, -76, -251, 16, 73, -233, -145, 166, -129, -17, -51, -221, -161, 99, 291, -152, -165, -185, -138, -50, 151, 13, -60, -49, -138, -7, 57, 22, -5, 15, -49, 128, 220, -72, -238, 106, 146, 3, 175, -138, -146, 141, 55, -225, -143, -514, 72, 156, -110, -108, -123, 16, 130, 261, 47, -281, -42, 19, -34, 202, 194, -78, -56, 255, 303, -31, 142, -312, 20, 95, 371, -189, -135, 230, -134, -61, 120, -14, -88, -73, -218, -117, -261, -140, -142, -411, 254, -94, -200, -38, 168, -224, 86, -32, 599, 344, 151, 281, 280, 215, 15]
7008A5K30k99J74K79j89m52K84j87O2J43pj10l14N06j49J7Lk33OJ17J49j31L03
7031B17l45j38N07l32J5L59q1K1j45j13K5J88j02kO3p2O6J25J5o51L50O5R4k22
7055i3J24j98k86O09n84K27r5jJ57q3J53l77J01M24j25J08n2k05K01N9m77K93
7077a20K76j08J00J11q5q6K55m93K46j42p1M9N0j09J04l9j82J40J76N9q5k83N38
7100C01M2m36J29N7o9K42j29k35J95J0j11P0j09J55J25j08k37J96r0M6L4k43k2
7123a87J01l11K21q1M47l14l99M05Q9j5J38k87L05j38O2J83r1n1j91J42K40k72
7145dJ11L38m97K30k33J53L8j64L9KpN3Q5j78R7n1J62m65K40N6k18J88l39L94
7169C0k10J61K18l36j80M20l38J14Q8j14L40l77O4J24J96R2j99K42k42l0J16m5
$$ y = [15, 245, -54, 120, 399, 210, -242, 42, -145, -83, 60, 53, -57, -371, 135, -14, 3, 6, -227, -221, -104, 45, -86, 217, -128, -266, 241, -91, -76, 283, 202, 223, 78, -35, -10, 178, 76, 74, 137, 65, 131, 256, 271, -380, -30, 35, 129, -93, 31, -167, -453, 156, -428, -201, -296, -297, -140, -223, -70, -447, -346, 78, -47, 61, 9, -196, 5, 64, -413, -120, 156, 48, 148, 259, 174, 88, 343, -150, 96, -46, -117, -68, -18, -127, -23, -62, -244, -104, 72, 131, 46, -237, 301, 343, -93, 36, 93, 24, 266, 137, -98, 97, 107, -4, 66, -43, 112, 237, 129, -108, 88, -2, 44, 78, -165, -187, -86, -397, -176, -257, 190, -124, -523, -118, -29, -44, 94, -193, 112, -26, 36, 219, 128, 77, -114, 28, 268, -4, 107, 445, -52, 178, -55, 98, 136, -28, 11, 13, 6, 59, 144, -34, 63, 12, 174, -291, -51, 5, -213, -25, -364, 30, -180, -19, 199, -137, -317, 103, -235, -121, -33, -147, 193, -184, -120, 4, 200, 292, 93, 335, 93, 63, 179, 134]
7191A34R2j16J7q5J03l80K38J3J6L0l24K08R3J8L9k56q0K80l0m32N71j14J6j75
7215a24K05k06M30j15k50J43K18l39J17n0J9j05j11J00Q4J82r1J32k19q6L6O8
7237C8k9j62L42l19K33J28n73K61k04M15k95J89l7J34k15L19m6j82j35j31L18
7258D9M6J47k61k2L95m19Q6k37M02n29L08k93M13j58M3j6J15p4r3K45k96K22r5
7281b2J63m31K23k28J99j04L46kQ9k29J1j5J38l87L67J40m36K12q9N5k5J13j78
7304i0L4k30L66k01K25o2l40L0J06pJ15j89M30k53n6P9l7L76k02k69l9M72o86
7327d28N36J47j16j01L1j05L9J20N5k44P7k11L07J63l45j2K66j54m3J63j00r0
7349d5p8Kj32M57l82J52O3K29k95L15j34j26M0j73K25P1p1K3k64K84J05n7k97
$$ y = [134, 226, 110, 127, 42, 145, -235, 3, 16, 32, 62, -262, -54, 39, 57, 96, -160, -240, 40, 10, -422, 149, 35, 51, -124, 81, -125, 305, 190, -60, 83, 301, -38, 79, 29, 48, -57, -168, -68, 16, 198, 107, 239, 20, -66, -30, 38, 9, -153, 189, -130, 103, 231, -342, -81, -285, 130, -165, 24, -13, 121, -94, 225, 179, -3, -138, -269, 49, 95, 242, -19, -41, 354, -65, 21, -216, 186, -343, -35, -328, 85, -73, -30, -46, 69, -5, -98, 147, -149, 73, -22, 141, -290, -67, -295, -96, -200, 146, 144, 233, 4, 15, 0, 138, -249, 118, 258, -178, 34, -55, 0, -25, 88, -90, -56, -286, 80, -121, 104, 42, -298, -268, -162, -169, -54, -243, 187, -66, -122, -43, -80, 296, 94, -175, -214, 258, -428, 108, 255, 139, 38, 69, -36, 3, 123, 178, -66, 11, -200, 107, 270, -75, -87, 179, 25, -18, 145, 45, -45, -123, -121, -253, 204, -178, -26, 37, 266, -29, 286, 152, 26, 66, -107, 118, 189, 118, 141, -123, 161, 266, 209, -88]
7372h8Q2J20r2j06M2O6j99j08J40Q7j17J63l9N0m06K97j79J50J73R7n59J61L42
7395G7J04j39J58l54J56J85q4nJ53n13M20j98J38k72M0K13j44j10O42q54K43q2
7417b26K48L5k22R1j2n5J69l82L87m3Q6O2m3k72K22j52J13K68j12N3J47k07j92
7440c7j2M5k77K70m2m8L04j75j69J29J02l37J30j42M12l92M72j82k4k6J96j12
7462H5O2k41R4Q7O8k81K45m0k50M19r8j9k8N1j49n0M2M7k68J24K44q3k21J77l11
7487b94K66P6j04l16N61m39K27k84N73n46L98J03j36k25J61pJ10Q5r3K20j49j96
7509iJ04j29j43N20n73L55l56M92o49M05J0r5K28l71k3J96l44J19L85M8k53l49
7531d32J52J88J61p1k6j7j05J89j26J22J68j61k74L07O1j74J12J43j07M7j37Q2
$$ y = [-88, -6, 114, 22, -84, -42, 24, -175, -283, -143, -56, -173, -10, -49, 1, -405, -108, -287, -137, 36, 133, -426, -265, 77, 181, 42, 200, -154, 2, 187, 103, 98, 251, -262, 158, -40, 98, -174, -134, 79, -65, -175, 467, -387, -144, -226, 22, 57, -165, -74, -86, -141, 28, -354, 33, -10, 76, 138, 95, -177, 45, -107, 6, 274, 162, 215, 362, 155, -37, -49, -4, -281, -11, -53, -101, 203, 28, -141, -12, 90, -247, -117, -259, 153, -239, 233, 51, 27, 1, 197, 85, 147, -94, 0, 87, 155, -126, 119, 79, -171, 248, 150, 131, 103, 154, 5, -45, -3, 44, -224, -100, 144, 61, -160, 17, -294, -28, 48, -56, -372, 189, -250, -23, -307, 266, -280, 118, 221, 85, -140, 21, 14, 124, 209, 116, 336, 187, -9, 95, -34, -177, 343, -230, 125, -231, 261, -388, 17, 27, -68, 160, -211, -234, -38, -382, -263, 122, 170, -83, -432, -280, -92, 69, -2, -28, -45, -150, 39, -87, 35, 203, 42, -232, 75, 136, -38, 74, 217, 110, 157, 20, 102]
7553A02l8L4l55n1K96J22J0m33O0J17J78j01n1L8j57K54K81l34J66l2j30p6Q8
7576a2j78L75m3j09j52J96P0j85L31l81J66n2k49L28j84K14l96N85m83M2R5l75
7598c97M03j86K49J08k03k54J76k13K93P7R1j30K18n76J87K67k24K65j10M5N1
7619A37J70k10j37L85k39m4k2j22J89j39j66K1J39J25m76M47J8k49k5K5J15q2
7641a40j2j54J66L85m05K37J01l45L6R4m8P7M11l97J06Q3k32J12j47M1kN4k96
7664b75l66O66J19k45J37j10j19J87j9l92J73K01O1p6jK89j90J14L6j85O7L07
7686C79k10o1j17L5K04N2j65o0p9L75k89K9K1O9nl24K24j37O3j82K3Lj54KM89
7711A85j95p7R6j47M7K91m38K68J35R9l29J18l9j2J96l48L49j43Q2j57J7J43l33
$$ y = [102, 64, 98, -257, -308, -12, 110, 120, -313, -253, -136, 42, -59, -110, -72, -229, 25, 306, -28, 138, 106, -24, -100, -12, -190, 185, 142, 33, -119, 77, 147, -38, 293, -88, 78, 26, -223, 105, -79, 135, -261, 324, -159, -117, -22, -397, 6, -180, 69, 177, -26, -280, -104, -317, -24, 53, 144, 14, 232, -344, -157, 110, -114, 151, 41, 86, 137, 307, 97, -40, 345, 106, 62, 40, -82, 107, -32, -198, -177, -38, 87, -389, 58, 76, -173, -198, -173, -58, -140, -152, -306, -140, 245, -160, 77, 178, -167, -131, -37, -85, -8, 403, 6, 112, 195, -37, 75, -72, -31, -33, 21, -275, -641, 25, 144, -101, 36, -74, -193, -6, -25, -417, -244, -43, 18, -58, -59, 230, 40, 154, 190, 5, 72, 379, 169, 108, -9, 26, 230, 282, 117, 57, -22, 353, 64, 93, 114, 183, 178, -146, 78, -59, 4, -178, -155, -152, -306, -304, 185, -10, -87, 9, -138, -91, 200, -238, 30, 165, 264, -65, 53, 14, 2, 198, -150, 199, 56, 138, -19, -2, 141, -192]
7734a92J78J58j16j39J61j0j70J8n1K1J17K85n06K76k15N17j91j5p1n4K05j63
7756D3K0K15j29k50R4L20Rm51j21N39l10Q7j82q5L24Nk62J79l68L64k77K02P3
7779C9kk5J96k78R3o4K67l73K53j71J75pr1P7k63L48m8j54O0k8K7p7J61l81K30
7804c6N2r1J94k03n5K44j36o2j75K7K56P2m3j66J61j63M3K9J36K42k11j34j00
7827a19J65J4o5M4j3q1L6J61k15J62k11M28l57K17k40P4K05m52L04r9m4o6L5j79
7851b96M04o1k06J94O4k46J59j30nPJ82o8r7K87O0l86K40q4k38L2K78k63K42j68
7875i9K36k10m8J43K62l38l9J09l83K98k9j0k97P56q9j82J25m77N06l22J30j31
7897h9J17M7j06K73j11k77J41J59k24m3p9n6M13k70k35O96j14j27j04j48J26j71
$$ y = [-192, -14, 144, 28, -111, 50, 40, -130, -112, -163, -142, -25, 260, -246, 30, -185, 332, 141, 126, 55, 1, 206, 43, 63, 278, 149, -101, -7, 313, 322, -129, -250, 289, -21, 66, -116, -201, 123, 128, -134, 45, -323, 41, -236, -34, 39, 37, 12, 208, -70, 23, -41, 226, -147, 106, -65, 110, 103, 12, 89, -174, 174, 126, -28, 32, 4, 31, -46, 115, -266, -36, 16, -75, 119, -84, -139, 105, -31, -93, -268, -241, 15, 87, 44, -122, 39, -124, -81, -52, 84, 326, 115, -19, -119, 46, 60, -5, 39, 26, -55, -19, 142, -73, 89, -122, 306, -51, 166, -74, 0, 205, -247, 57, -42, -86, -152, -117, -296, 108, 47, -159, 35, 99, -147, 12, -118, -123, -116, 66, -2, -99, 188, 248, -138, 102, 18, -220, -188, 90, -173, 69, -99, 137, -73, -121, 22, 284, -54, -93, 16, -367, -69, -98, -108, -405, 351, 262, 80, 205, -272, 234, -88, 42, -89, 28, 75, -31, 242, 131, -146, -5, 154, -70, -113, -192, -248, 165, -105, -340, 356, 242, 115, 11, -137, -11, -182]
7919a82k65M22j11QJ79l41K77J55M0j7k58r5K34r7q4J05L2j02K4L29k61J8K80
7942B90j80l76J87J1J77O3m02K42j11q0N0J52R2j45k40K93K0k05R0J17j79oJ48
7965Hj46P0J54K21q3k93j05J66j7K57m62N50m41Q6J78l2m49K23K62L1k81J53L85
7988D35n45Q4N5r0k30O54l25J0O0j80J60J29j40J17j47M4p7n0j90K03j93K19p1
8011f8J07j92J61j31K18k95Q8k0M3K93l16J9j15P8J87lj68J17L4j97J68l48L48
8034HQ9j77L62m35J88j30n7K19J07m50J02NJ95J38P9j46J0o3nK5L00l20k27K59
8058G6l21J58K50n1k21N5K40N1j82N4j09k17N01k37Q0l35J56j71K44k2J4Q6R7
8081A96k93Q9L62o82Q04n79j8R2K74j71j61j64J63K69k18oJ77Rk35qK89l54J22
$$ y = [-182, -447, -25, -136, -128, 51, -290, -13, 142, 182, 165, -93, -188, 46, -51, -135, -30, 2, -100, -76, 253, -8, 10, 290, 110, -266, -79, -68, 109, 172, -230, 12, -99, -179, -129, 23, 115, -30, -270, 23, 43, -162, -72, 45, -134, -140, 8, -138, -68, 86, 307, 224, -69, -174, -8, -25, 232, -230, 320, -121, -35, 143, 111, -338, -115, 147, 178, -103, 50, 435, -110, -26, 29, -61, -291, 363, 38, 48, 108, -72, 88, 217, 77, 194, 47, 91, 14, -36, -226, -23, -216, 3, -68, 39, -153, 8, -123, 95, -200, -112, -132, -89, 204, -112, -93, -208, -130, 57, 54, -114, 3, 37, -160, 8, -340, 8, 97, -80, 282, -153, 35, -95, -152, 67, 174, -276, -174, -169, 26, 164, 243, 97, 107, 44, 39, 64, 364, 44, -183, 76, -245, -87, 163, 112, -109, -54, 186, 237, 55, 109, 0, -217, 284, 47, 127, -208, -52, -223, 21, -1, 13, 99, 196, -97, -8, 354, -328, 476, -103, -121, -29, 245, 74, -87, -251, -88, 181, -37, -43, 134, 143, -92, -100, 189, -165, -43]
8104d3L6L3j78j22J69l48M52K81l51J72J05J7j34j51J19J89j34p5r7q8K44m14
8126c18N77l82k44L64R8j71M3j77M01j32n4K19n23L64R5l11K42k06j2J04L2J91
8148B00j74l1n3L7j32J51k2o0j96K69K03m35L94l50K55J4j10M48m61K05n39K72
8170a15r4R8L18J4k98J16M6k18K57j99J90O2j53r1L21j89l84L01j65K24j13
$$ y = [-43, -7, 26, -152, -274, -105, -453, -1, 280, -71, 101, 206, 223, 89, -62, 57, 246, 112, 37, -60, -148, 96, -318, 259, -123, -367, -3, 95, -76, -33, -210, 191, 59, 5, 224, -299, 65, 160, -151, 91, -115, -127, -23, 9, 200, 26, -5, -58, -21, -153, -2, -24, -84, -280, -11, 192, -243, 151, -199, 56, 70, -40, 408, -53, 152, -387, -115, -209, -111, 207, 221, -77, 39, 85, -133, 124, -75, 115, 177, 24, -67, 254, 65, -319, -18, -183, 41, -72]
8191g2
$$ Imaginary data points
##PAGE= N=2
##DATA TABLE= (X++(I..I)), XYDATA
0@%%%%%%%%%%qJ6j6J6j6K3l1L2l9M7n4O3p2Q4r7J10j24J42j61J80k03K29k54K82
34A49l18L54l94M40m86N38n96O58p29Q09q95R93j104J230j377J547j751J997k295
53a230K676l182L880m911O589r771J7830p1621j63742J70817J50151p1571j13361
66h7446K2294N5889N602k9197j3116J3544L1266Q273k7273j4547N7905N5149n0243
79B8100p7182L2351O3362j1480j7020J8887j6816k6809K1739J1920l3473j0641
91a7062K1786J432p253J0648K13l3154k3330L1867M0020k3811m1124J9245K9771
104I248j6787j3742J2680K171k514Q48o890J5357L5303j6010m8007R901M1436
117B2994l46j3653J1348L972k4288r663K9457J9013l3762k7403K6650J6971k3977
$$ y = [0, 0, 0, 0, 0, 0, 0, 0, 0, 0, 0, -8, 8, -8, 8, -8, 15, -16, 16, -23, 24, -30, 33, -39, 45, -52, 58, -66, 76, -85, 95, -108, 121, -133, 149, -169, 185, -209, 231, -255, 283, -313, 345, -384, 425, -470, 523, -581, 649, -728, 819, -932, 1065, -1230, 1446, -1736, 2144, -2767, 3822, -5949, 11881, -59740, -223482, -52665, 97486, 25915, -87446, -65152, -9263, -3661, -32858, -45974, -32430, -1164, 7109, -20164, -34711, 23194, 78343, 28100, -49082, -16731, 46631, 35151, 18131, 37018, 20202, -6607, 15132, 27052, -6421, -17062, 4724, 6156, -1097, 9551, 9764, -23390, -46720, -14853, 25167, 1356, -39768, -20523, 9248, -7539, -21281, -8601, -6430, -8944, -8096, -14986, 371, 35674, 19664, -28343, -18442, 22994, 22648, 8995, 20343, 24315, 27, -9636, 19821, 38834, 5072, -22331, 4319, 21290, -2687]
130b687R93J4997k9088k0825K7729Q709j9727J1930J2606k4790j2358K3067J1427
143A983j0108R30J1780j941q583J6486J8793k6122k5910L5470K5673l6447r057
156g053L8999p835m0148J1576K5366j6881j3117J3958L867j0651j097L055p563
169g524j1403P125J5803p994j0323J5270O65k6392P721K7616j1920j5116J8147
182A675K968j4823J5832J4984k3501j3205K1171J4600r392o099P786Q85j5523
195b642j001K2139K31k3376J156R211j2849K558J9478j3938k4334J0427Q147r089
209a3882J1663J2484k0690j5885J7704J6992q196j2266P885J3960o924r045J4262
222H062M897j7851L436J6053r685m169J8366q615k3691J2250J7458j3082r380
$$ y = [-2687, -1694, 13303, -15785, -36610, -8881, -172, -19899, -7969, 4637, -20153, -32511, -9444, 1983, -8125, -7195, 4585, 2644, -5939, 10547, 29340, 3218, -22692, 12778, 38451, 2004, -7053, 31946, 24111, -16037, -4461, 20905, 4024, -9093, 4865, 8732, -1919, -3016, 39, -7524, -18927, -11802, 4001, -3993, -14316, 954, 1619, -24773, -17052, 10564, -1356, -16472, 1675, 4643, -10180, 5652, 20636, -2865, -16070, 5101, 19701, 10309, 4210, 11996, 12881, -2642, -3643, 18496, 18727, -4649, -3493, 5718, -7131, -4573, 14905, 967, -23367, -12940, -4793, -13882, -2219, 10265, -10425, -26310, -8606, 8386, 190, -12076, -4191, 9769, 2845, -6200, 8062, 12959, -4892, -1456, 14597, 4912, 743, 19109, 10494, -13197, -947, 16511, 3429, -5951]
235e951Q182J034n740n41J807k366o820K81J1259N75j0291L872J668j1820R046
250e805J8169j6444j7183K1088J2496j4169N06R299p221o877N314O240O476M857
264A6746n701j1982p561P618J7132l815j9091N152J3636j3443q804J4427k886
277A428j4662P192O575o798M661N676j3638p099J2620O722o462m784O874Q485
291F790q624r387J5949J0572j8335o819J6023K861m075P207o137j2578J1995P825
305A3267j6758m478J6198N273j1380r098J651O693m199q344P125Q930o322m364
319e806p73q614N791J7085q108j4223J3990R146j3428k934J0996K464l405j637
333E44J130P154J769q372k641L091O27N311K35j0911M75R389p960p805J0084M99
$$ y = [-5951, 2231, 3265, -2475, -3016, -1209, -3575, -10395, -10114, 1145, 1720, -8571, -4699, -3031, -14851, -5805, 12364, -4080, -21263, -175, 12321, -1848, -1342, 7957, 736, -6141, -827, 5413, 11889, 16746, 11045, -937, -8498, -880, 16252, 12437, -6654, -1502, 12134, -1309, -10113, 4314, 1428, -13234, -6042, 533, -6265, -1604, 4072, -9566, -16665, -4045, 2677, -3785, -8569, -1695, 6790, -1834, -11221, 4728, 15300, -3035, -9854, 6169, 9030, 4955, 12162, 6025, -6553, 5442, 13267, -3491, -7969, 8229, 13502, 2122, -6976, -5325, 1368, -2831, -11175, -4050, 4880, -1442, -5806, -6579, -15193, -9402, 7683, -425, -14648, -658, 8488, -4940, -7874, 3122, 5586, 2181, 544, 1674, 8828, 10597, 2225, -416, 2675, 3302, 8613, 8848, -2063, -1588, 7801, -159, -7964, 2120, 2619]
349B619j1048J863M791l363K694J606p897k454O049J900O53J331r51L940R99q870
365f138K125R398k469j627Q774k493p206L752j493n005Q534O100q905l713L755
380C389k919r57L11k687J201J897m859J22L556n730o23N507m779k395J0177j259
396d8r809N799O301l554J548J477m851L243N561k430J11L837k858l71O07n106
412e43K276P159l873l630L631n861o566P840K462p213K035K733o618k115K755
427e528J9L317J335o585M72O440j414r29J967l149K608Q496m142m977O564Q06
443E300n381L742L893l127J045j458m302M034L431o937k058L092l109kK056m493
459d274l85M966n854n020P845J285o024J764L602K17R59l951m535R263O763n810
$$ y = [2619, -8429, -6566, -1775, -5138, -2444, -838, -8735, -11189, -5140, -3240, -2587, -1256, -2207, 1733, 2732, -6138, -4013, 5385, 2916, 1289, 10063, 7570, 364, 4116, 2623, -2382, 6152, 12252, 3347, -366, 3389, 470, -487, -176, -2863, -1662, 235, -4624, -4502, -946, -6676, -7299, -1792, -6571, -8966, 1211, -48, -9857, -4058, 2243, -1311, 237, 1714, -3137, 106, 5667, 3237, 3348, 7185, 4327, 3956, 4563, -543, 1733, 8892, 5019, 1389, 5020, -841, -7407, 433, 2895, -4318, -2283, 450, -6168, -8283, -5528, -5509, -2192, -857, -7442, -6970, -530, -1944, -2873, -906, -4055, -1447, 7049, 2907, -2070, 4494, 5300, -81, 3661, 7554, 4427, 5472, 4014, -288, 3746, 7177, 240, -1818, 1274, -1835, -1837, 219, -4274, -4659, 307, -5547, -10567, -2722, -1437, -7461, -5697, -2095, -1878, -919, -4870, -9405, -142, 6621, 811]
475H11n09L378j988J325L298m005J863O830o051o223O946K019m771j755j914m43
491a189M245k449o924L124J707m712J696K309m717N50L542m820K141P533m002
506a966n236N989K977k232K104L00n69M095j201l621M552J301l928J812J538l035
522B880K166j23p939J944Q083n544n749L431r65l137K343j030l010L449j197l491
538g889K915J388k217K020O66j605N551J852n808L515P143m559j817M726o45r95
554D241M810k378m235M041p43o227J899L423k462l073l071j178N632j123q846
569i290Q63M805k786Q89K762m967K75P427m165l792R529L797o940p10M470L256
585E423J382k683l117M005K522k106J144j419m539L866K436q842n1P944n932o761
$$ y = [811, 302, 3680, 1692, 3017, 6315, 2310, 4173, 11003, 4952, -1271, 5675, 7694, 2923, 1168, -746, -1189, 3056, 607, -6317, -3193, -1486, -6198, -4502, -2193, -6910, -6360, -2818, -7638, -5497, 2036, -1966, -7202, -1213, 1764, -468, 1636, 1936, 1367, 5462, 4261, 640, 5192, 6493, 2565, 4377, 5915, 2880, 5046, 4923, -3016, -1072, 7011, 1467, -4282, -851, -1816, -4953, -2610, -3640, -6650, -3201, -4398, -7889, -4974, -3586, -5803, -3783, -3117, -4722, 829, 2681, -3127, 388, 7531, 2972, 1155, 5881, 5236, 4241, 9051, 6673, 2438, 6479, 5736, -491, 1408, 4831, 2369, -704, -3775, -4953, 679, -444, -9290, -8427, -3622, -6408, -5519, -2757, -7724, -7449, -22, -4187, -7979, 1550, 5347, -1593, -2303, 2167, 5423, 6805, 4122, 1005, 5010, 7532, 5426, 6570, 5151, 612, 4478, 6914, -1928, -1979, 5965, 33, -6728]
601f728N664J284o154L83J263k103K558P86k765J54J5J138M928p48m402M347L217
618B837n410M112Q331n932m957N847J101j844M428j293n715J573K392k753o04
633B113p90j632P99j622l733L963L7q318J359N620k245L99K494o721j990R309
649i58J551n130L286K812k610J669J696l09K661J57k381K225J634j985K218j384
665E152n666L790N716p494m588M910j575l771M404j332p059J174K664j656pJ482
681c856o68L14j517p56M637K400l578K775L006l855K668O486n268m481Q060J818
697H185m515K310O09m430k30K000n90p3j492l101O04m86k776K638l3o385J721
714f044M596n314j195P695k593o220N561L339l291J794K284j546K618K767k084
$$ y = [-6728, -1064, 220, -5934, -5551, -4288, -6391, -3833, -3047, -5812, -5658, -5643, -4505, 423, -325, -4727, -380, 2837, -2573, 1539, 9870, 3938, -1019, 4828, 5929, 4085, 8513, 7220, 1505, 3078, 5470, 2717, 2113, 1323, -309, 490, -1132, -4865, -902, -865, -9183, -7824, -2204, -4449, -4050, -1556, -8277, -10267, -958, 593, -4537, -1251, 1561, -1049, 620, 2316, 2007, 4668, 4825, 2444, 4669, 6303, 4318, 6536, 5152, -514, 3276, 8992, 1498, -3090, 1820, 245, -3526, 878, -454, -7513, -6339, -3675, -5331, -5338, -3856, -4524, -4210, -5727, -6483, -1846, 554, -3024, -249, 2757, -1098, 1570, 8056, 2788, -1693, 6367, 8185, 3670, 5980, 6589, 2159, 1929, 3929, 3339, 3266, 1774, -1327, -723, -1209, -3985, -1347, -1380, -7765, -6044, -1448, -6762, -7957, -262, -2855, -9075, -3514, -175, -3466, -1672, 612, -934, 1684, 4451, 2367]
729B367p15R88J379L598m37m873K103K373o572L09O631m169m886L619k210m998
745e493M394J611o786q03L046K76K32o18k364J162L17K78N126J295n126K200N082
762C829m075L14P538k164n261M125K247l053J939J527n101j213J792l12O65r56
778A841l340N74l87l973K078K734n875N37N544l767l316M980o84l133L795K372
794b0k992K605K124k812Q71L570o63O80o31q55L196J675m045L51K729m602Q4M954
812F219l759n040L826j331m443L242J319m965k80K291k176j7J522l63N62j556
828d949j489N895M199n307j579N358j199j67N405j966m313N222J679n352J600
843C037L755k795l416N47J293K217k544o034J223K887l163j39J863l977o90M374
$$ y = [2367, 1652, 2640, 4019, 7617, 7180, 2307, 4410, 6783, 211, 520, 7151, 2982, -1904, 1715, -495, -5493, -1099, 512, -6274, -7077, -4031, -3755, -3523, -4141, -6505, -5343, -5026, -4748, 378, 1673, -3453, -1253, 3829, -246, 68, 7606, 5442, 181, 4306, 6553, 3500, 5439, 6966, 1865, 652, 2444, 2132, 2797, 1841, -1499, -925, -1312, -5285, -3207, -473, -6348, -5811, -267, -4034, -7350, -2370, -3054, -6187, -2392, -20, -3012, -407, 1717, -1095, -224, 3346, 2683, 3363, 2732, 1877, 5073, 6748, 2703, 3054, 5783, 1181, 1265, 6219, 2460, -2580, 1246, -85, -4528, -1286, 33, -4932, -5212, -2921, -5097, -5114, -3592, -3955, -3393, -4949, -6438, -543, 3656, -1651, -3230, 2128, 929, 762, 6167, 4201, -112, 5110, 6789, 1437, 3037, 6792, 3997, 581, 1128, 2421, 4638, 2094, -3940, -2717, 170, -2993, -3132, -1269, -5246, -5936, -1562]
859a562k839k235N558l93n841L508N619j039j233j226l82M771K970l281k23J561
875C733j230J727J950k873J93K124n885j140P318q62p258l17Q20j521K409Q1m958
892e689P40K179k037N25K115j139l33k77r86N195M289o074l249O392J509j034
908B126K637j701l087L760K579m301J059K364l072j368Q06k67R46j481m539J728
924a811L264l401k057K085l424n7N186j197m414K336L65k593M441L809l645j520
940b633K188Q08K349P44k607J120K197k392J316L015k800k142K632k232n43M686
956E706l286o212K098L410k860q18J88k276L15J050j988J472J862k807j50K520
972a776q42J114K630k868l51N808j106l787M042J969l040J284K167j981M60p3
$$ y = [-1562, -4401, -6636, -1078, -1471, -7312, -3804, 1815, 776, -457, -1683, -2065, 2706, 5676, 2395, 2172, 3733, 2503, 4230, 6180, 3307, 3500, 5624, -261, -1401, 5917, 5055, -2203, -2520, -1700, -3221, -812, -731, -5689, -4949, -2770, -4807, -4282, -2167, -3306, -3639, -3916, -4902, 293, 4582, -1492, -4741, 1651, 3160, 2126, 4763, 3062, -25, 3735, 6314, 2013, 3072, 5436, 2364, 996, 1802, 1535, 2481, 1000, -3539, -1811, 1453, -1948, -4005, -1920, -5344, -5401, -215, -1412, -5826, -3490, -3125, -5718, -1277, 2532, -1113, -2633, -445, 363, 2712, 3456, 849, 1969, 4166, 1774, 3090, 6105, 3305, 1163, 3795, 1563, 1020, 5706, 2420, -3792, -1694, 1716, -1144, -1962, -1774, -4050, -3735, -2685, -4673, -3201, -1339, -4146, -4296, -1776, -2618, -1504, 1126, -1742, -2093, 3715, 2609, -1178, 2864, 4833, 1793, 3077, 5244, 3263, 3723, 3650]
988C650l250J730K507l031j460M48k142J364J160m520q80M445k098l899L266J058
1004a652l137J549O39j624L287J599l499O33L318j72L67J417k043J874J979k915
1020A620L40M053k042l216K380p73j851L283j414m557K034J755m270J11J882j763
1036b428o73P75k479J665K108k884l80L377p57r76K974j740q46M808k87k749L368
1053B876J203l392J516K632j873P9P10k261O85K062l040j482J842k010o20J959
1069H86k720j697K604j873k944L562J478m001R01J492j393K163J892k902P90K578
1085H16j264P23K959j894J5K480j610J31L440k154k929L095K19l590J575N22k994
1102d60O21M02k997J218J237l861j052K768p35k98J110k973M32M527j976k126
$$ y = [3650, 400, 2130, 4637, 1606, 146, 594, -1548, -184, 976, -3544, -4424, 21, -2077, -5976, -2710, -1652, -4789, -3240, -2601, -4225, -938, 661, -2838, -2205, 1113, 941, 1308, 2725, 682, 2556, 4535, 1620, 1960, 6013, 3971, 755, 3135, 2362, 511, 3794, 2380, -2177, -143, 1612, -2658, -2547, -665, -2428, -3101, -2326, -4805, -3140, -1032, -3916, -4296, -919, -1676, -2652, 322, -1418, -2264, 2544, 2257, -492, 2876, 4079, 687, 2203, 4835, 2962, 3041, 3751, 1490, 2175, 4237, 1197, -285, 1557, -453, -1073, 886, -1834, -3531, -927, -2800, -5744, -2182, -704, -4705, -3804, -2312, -3705, -1542, 350, -2552, -1762, 816, -448, 275, 3234, 1340, 1355, 3835, 2225, 2356, 5796, 3642, 713, 3808, 4027, 437, 2012, 2534, -460, 161, 563, -2434, -1216, 21, -3840, -4892, -2124, -2859, -3157, -2047, -5020, -4588, -61, -2037, -4163]
1118d163L760M94j400K729R28k518K346Q88k127K744J973k860m76J403j745L83
1134B359J539k981n40J946l317r75L011j354l586J297k01j689L673m81m303J484
1150d118K584j591M27J811j771J310K697k082J052L332j982j200K400j76k36L499
1166E956j961l209K122Q97k275J048J16l874J485J880l480q55J036k633M28K321
1182i98k352p89K533k045j229L308J77j238K669m59k191L746J820k607Q39J515
1198B699j827K395K387l123p91K182j730k30K025k348j880J778j458j502K185
1213G62j047l603J322M78j688K270K50l845O33K249j381J253K536k569K44L365
1229A229j148j4K347j685p91M190L50j991J337j49k381K284N45k559R75K30l887
$$ y = [-4163, -403, 91, -1309, 1420, 2348, -170, 2176, 3064, 937, 3681, 5654, 2794, 2318, 3721, 1976, 2359, 3898, 917, 377, 2323, -994, -1969, 1042, -312, -3898, -2601, -2802, -4491, -818, -1299, -5602, -4118, -1534, -3125, -2698, -887, -2658, -1348, 1349, -733, 319, 3651, 1669, 469, 2869, 2693, 2457, 5956, 3995, 786, 2908, 3805, 1530, 2578, 2694, -1180, 305, 2185, -1295, -2150, -1114, -3747, -3319, -998, -3350, -4139, -1606, -3651, -4880, -1572, -1395, -2633, 36, -423, -2614, 1132, 2952, 345, 1184, 2699, 872, 3267, 5654, 2531, 1740, 3922, 2192, 1962, 3987, 1639, -241, 1537, 79, -1423, 762, -285, -3888, -2566, -2088, -3776, -1506, -1256, -5101, -4468, -2219, -3600, -2347, 189, -2380, -2136, 1229, 81, 67, 2414, 729, -62, 4128, 4478, 2487, 3824, 3675, 1294, 3578, 4123, 1564, 2539, 2769, -1118]
1246a118K25K579k429q55K43l137K50L984k461k288J631L52j160K679k39j876
1262c620L161P34j815K777K070k345P06J086j280K704J949l427j528K708j109
1277B771j066J929k494j520J910j309k783J935l39k583R93L24j631J768L04l261
1293e052J264L120k042L82K353j607L34K707q75m73L034j377j734L395N00j916
1309B013J595m91k205K370L89l442J289J222l395q6J316k312j21J614l228o42
1325d114L370p40k839J662k62j210L134K38k308K419J333k321K192J426j201J067
1341A846J735k473J367K873l013o16K217k041j380L002p82l245J015k03j668J512
1357A46K7l728N93J427j870J313O50l021R36K100k245Q82L769j779j570K779L54
$$ y = [-1118, -893, 1686, -743, -1598, -1355, -4492, -4242, -258, -2719, -5007, -3376, -3024, -4184, -1505, -1744, -3620, -459, 275, -1540, 1237, 3307, 962, 1668, 2754, 1474, 4178, 6127, 2700, 1172, 3880, 2771, 1705, 3634, 1140, -380, 1530, 221, -2562, -627, -966, -3549, -2556, -2232, -3863, -2095, -1791, -5052, -3788, -668, -2710, -2328, 25, -1582, -1248, 1459, 584, 111, 3145, 1768, 34, 3429, 3929, 2013, 3608, 3117, 912, 3282, 3671, 229, 1518, 2740, -655, -741, 575, -1737, -1858, -244, -3472, -4114, -744, -1484, -4323, -2661, -2923, -4133, -999, -761, -3069, -650, 683, -1638, 554, 1980, 779, 1846, 3581, 1108, 2475, 5348, 2335, 1719, 3936, 1895, 515, 3517, 2735, -510, 505, 302, -1366, 146, 173, -3555, -2962, -1535, -3405, -2092, -1442, -4463, -3527, -1427, -3672, -2790, 979, -800, -2370, 409, 763]
1374G63n74K527m63j913K466J175j762R52L27k905J718J159k333J023M86m021
1390a375j36K953k161j999J728j775j282K864r62k193K418n99j775K413K241j917
1406a557P76K89j656L066K712k943n9K076r71R00K297k950q86K756j602k460L290
1423C078J64l391L03l67j789K176L4l329J51J655j292M54L68k724J608K580k034
1440b355l43L358j971j412L589M99j027J716P4j968K665J345k122N38L64j658
1456A292J114P12k216J044J024m114n13L702k168k656J756j041j260K167n65k206
1472c928J257J070k154J994J013j014J190O70j749J636K798k161J29K598j484
1487A865m42K762j674j386K293m62k126J935o48k931Q78R04k454P72N76k625M21
$$ y = [763, 189, 2716, 2253, 340, 2806, 3981, 2219, 3171, 3498, 593, 2311, 3470, 1137, 2160, 2646, -1375, -1511, 1442, -719, -2718, -990, -2765, -4047, -1183, -2145, -4338, -1920, -2519, -4294, -1881, 360, -1557, -781, -492, -2148, 918, 3630, 687, 628, 2704, 1733, 2633, 4930, 1980, 1094, 3850, 2248, -212, 3078, 3242, -149, 154, -213, -2002, 174, 208, -3121, -2970, -1315, -2607, -2153, -1785, -4509, -2901, -321, -2355, -2698, 660, -1311, -2723, 866, 1365, 338, 2054, 2128, 160, 2825, 4170, 2048, 2586, 2950, 1292, 2406, 3118, 902, 1946, 2970, -1144, -1657, 2045, -123, -2779, -1023, -2064, -3324, -1157, -1722, -3928, -2671, -1601, -3755, -1761, -748, -1762, -572, 98, -1651, -15, 2783, 622, 751, 3349, 1865, 1423, 4185, 2511, 1125, 3418, 2956, 830, 2765, 2117, -814, 64, 968, -1486, -714, -138, -2763, -2342]
1504b342R36j916N38K060k836JK533j456J14K945j449j777L397M03k080K664J017
1521B752j723J181R85j425J346K45k180Q97J075k175J57J024l079m24K723k102
1537g23k404K756o70k717J625M95j953J114P71j483J285J490j344Q21R53j343
1553a327J811K493j964o07K982j557r19L150j280j564K167q63k111J760O78l001
1569a52K16O39k054N77R08k813L18J359k584L40K252j841o16K127n29p52K999
1586C94j273j610L043J396j995J388J270j789J425R01j648J255Q18k121K76J209
1602B939j606j12J056k925p66K537j414k360K042m27l049J781J273j967M86Q68
1618a644j617J253J446j316R37J163j381J151K694k041L00K414j275j443K890
$$ y = [-2342, -1406, -3322, -2784, -724, -3560, -3559, -1026, -2482, -2368, 577, -872, -2649, 748, 1151, -929, 1735, 2752, 1029, 2210, 3195, 1770, 3116, 3361, 1181, 2078, 3153, 978, 1135, 2159, -920, -1344, 1379, -723, -3127, -371, -1041, -3758, -2133, -1638, -3591, -2477, -1706, -3189, -1904, -414, -1758, -937, 16, -1327, 484, 2977, 1013, 406, 3388, 1831, 912, 4062, 2782, 1218, 3385, 2522, 411, 2171, 2849, -152, 64, 703, -1351, -774, 134, -2679, -2361, -1002, -3586, -3246, -994, -2835, -3451, -1324, -1853, -2605, 394, -879, -2489, 554, 1950, -45, 1343, 2613, 824, 2249, 3150, 1502, 2757, 3575, 1454, 1730, 2939, 1333, 1221, 2277, -648, -1414, 1123, -291, -2651, -609, -1036, -4085, -2304, -1031, -2998, -2512, -1644, -3261, -2008, -562, -1878, -941, 222, -1159, -8, 2686, 645, 945, 3359, 2084, 641, 3531]
1633C531j99k231J691M37k651J262M72k740N59O61j961K76P34k050oR19k079L25
1651c050K267j927p23K526n19j656K762N4j717K355J013j686J583J565j778O04
1667A673J238j025P11P02k321L46K234k471j342K008j471j456K278j581k034J909
1683f02q1l378J459J534j621J9J262j470J086J617k252O31K912j394j79K211j087
1700F67J35K751k069j326L269L32l087J593R86k010K09M06k179Q58J266k501n97
1717a297R57j439j64Q41j871j43J965j430j118L155o84k184K199J081p66J419
1733E21Q38k039J563J968j884N73J463j005K27J286j732K33J576l022j257K658
1749A967o29k158J082r90j736J768K19k747M71J264j726J003R39j256J59J463
$$ y = [3531, 3332, 1101, 2792, 3229, 578, 1840, 2312, -428, 131, 792, -1169, -893, -159, -2209, -2215, -1296, -3375, -3050, -783, -2710, -3433, -907, -1426, -3082, -320, -266, -1983, 372, 1385, -301, 1282, 2847, 1069, 1673, 2911, 1886, 2597, 3299, 978, 1324, 3558, 1087, -255, 1753, 282, -1174, 1104, -477, -2511, -602, -683, -4061, -2602, -1068, -2689, -2670, -1408, -2878, -1792, -175, -2427, -1796, 1116, -278, -457, 1754, 667, 802, 3553, 1484, 158, 3427, 3759, 672, 2265, 3251, 1241, 1450, 1856, -323, 535, 1801, -700, -1297, -340, -1779, -1943, -1102, -2973, -3116, -1151, -2581, -3699, -544, -1228, -3412, -1213, -132, -898, 521, 1359, -680, 883, 2851, 967, 1540, 3003, 1998, 2225, 3511, 1779, 2012, 3588, 566, -691, 1967, 1338, -820, 262, -728, -2464, -696, -477, -3224, -2753, -1489, -3215, -2212, -1273, -2529, -2370, -907]
1765i07j345R03K696j492j26J860l73j021K784j81j859J747J18j635J702P59l010
1782F20K3J059r60j82O14k934L45J754k109q08J387j085j217J891o22q21K535
1799e10o28k803K683K090j650J070N17j202J313J965j597L35J208j215j2J705
1815C269j077q53J191j777j020K642j125k758J489o1k111J172J87j731N11Q00
1831a252k146P70K465j539j072J196j07J123K000j587j072L018n82j121J883P67
1847B744j886J583L66k037J813J086l100k35J612p73l82K24k355k24J534j736
1863a766p70J897j320j472J927k38j168J439j7j688K164J860j905P01J405j038
1879A1P26J305p44O85J171j671k59K447j099j448J124j395r74K404j040k206R64
$$ y = [-907, -2252, -1349, 1347, -145, -271, 1589, 1216, 195, 2979, 2798, 939, 2686, 2804, 1169, 2871, 3630, 620, 643, 1702, 742, 560, 1174, -1760, -1415, 339, -1770, -2578, -1191, -2276, -3493, -1602, -2224, -3045, -510, -1138, -3941, -1258, 832, -818, 252, 769, -433, 880, 2845, 1248, 1583, 2791, 1576, 1564, 3269, 2192, 1339, 2530, 753, -267, 2375, 1250, -1508, -19, -80, -2191, -1019, -832, -2563, -2052, -1252, -3398, -2628, -163, -1702, -2774, -1578, -1685, -562, 1438, -149, -1221, 1797, 1215, 94, 1977, 2744, 858, 2441, 2807, 770, 2583, 3669, 569, 334, 1946, 1173, 791, 1015, -1340, -1564, -30, -1766, -2536, -639, -1959, -3431, -1504, -1742, -2910, -1471, -1488, -3176, -1012, 848, -1057, -356, 1049, 11, 737, 2042, 1298, 1983, 3154, 1483, 1224, 3671, 2572, 1124, 2248, 853, -121, 2283, 1243, -963, 1]
1896Aj16k074P63J061j965l01R27j476P71J855j428j037K351n64J95J979o15q10
1914d83J685j63o33K396L57k227J142R83j706R07O90k618L13J410j708k34R12
1931A023j637j277J179r65l86J871j656k051J963Q18j261O84O81j639J572J609
1947E28j550R47J374j641K52J774j05J54J425j883m97K397o94j368J120j222j156
1964a45J661k86k257N88K45k062R18J408k166n84J064j186M91J693j280p02J958
1981f42q02m20K789m3j524J386J52m20J887K63j969J026P77j062R12Q09k560k99
1999B60J831j327o97J259j931j179J313o22j003J513q37k070J693O88j124J084
2015a149M05j958Q30K326n58l80J463j175K12K565q58o53J384q55q49J870j70
$$ y = [1, -115, -2189, -1426, -365, -2330, -2631, -1704, -3180, -2409, -554, -1982, -3019, -668, -1232, -1037, 942, 327, -483, 1202, 1039, 406, 2802, 3159, 932, 2074, 3057, 1351, 2258, 2948, 330, 643, 2053, 345, 111, 1023, -614, -1891, -712, -1677, -2063, -192, -1848, -3899, -1936, -1118, -2379, -1695, -1014, -2653, -1081, 528, -1022, -75, 1299, -342, -90, 1684, 1579, 1733, 3158, 1275, 778, 3175, 2481, 1113, 2233, 1011, -145, 1516, 1230, -1027, -439, -194, -2256, -1338, 70, -2096, -2680, -1616, -2802, -2311, -618, -1898, -2600, -642, -1444, -1864, 925, 882, -642, 744, 896, 476, 2363, 2626, 657, 1683, 2460, 1398, 2310, 3119, 559, 260, 2091, 764, 67, 1326, -605, -1784, -471, -1093, -2096, -583, -1420, -3490, -1797, -1109, -2233, -1149, -744, -2702, -1872, 454, -104, -484, 979, -196, 16, 2581, 1723, 1070, 2454, 1599, 750, 2620, 2450]
2032B450j532J216l79j896R64O66j590l13k56j392J160J144k335n20J297j054
2048b370J41J647j248p73J917k20m88J949J39j427J533J04j70J318P68j917O85
2065A588O72q53J34J310j568q71J276j270l36J110j616j490R56L89j330O24n84
2082a859j193J221P13j528J318Q76j505M08J719r34Q77J214j297J15J819K24j304
2099H84J602q42q02J762k76j386O25O7j750R83R33j884l38r8j229M94J060j585
2117a780o98J154r79n04J976o10o76J473k46r43J880R54j381O06R74p05J149Q40
2135B484j181l44J514j396M08J101j453o26J098j028r36J306q82j684R90M23j853
2152b059Q02K13j288k79J174o27O04J029j806R70J325j028O76J540j152k38K061
$$ y = [2450, 918, 2134, 1755, -141, 823, 1489, -101, -414, -670, -2062, -902, 242, -2093, -2613, -1316, -2370, -2229, -582, -1830, -2603, -686, -906, -1394, 555, 694, -733, 800, 904, 734, 2052, 2820, 903, 1588, 2260, 1407, 1541, 2851, 1283, 412, 1688, 418, 82, 1192, -424, -1914, -958, -569, -1899, -1275, -1859, -3052, -1831, -1118, -2646, -1328, -452, -1957, -1549, 170, -764, 113, 1327, 30, 145, 1964, 2188, 884, 2486, 1644, 842, 2604, 2328, 942, 1567, 1634, -116, 867, 1800, -84, -422, -520, -1749, -1255, -195, -1780, -2478, -1324, -2303, -2807, -831, -1441, -2117, -644, -890, -1833, 47, 1001, -380, 226, 1200, 495, 1644, 2484, 1303, 959, 2473, 1077, 1485, 2586, 1133, 507, 1605, 577, -359, 947, 65, -1619, -629, -206, -2059, -1257, -1044, -2332, -2611, -1437, -2064, -1460, -431, -2237, -1267, 58, -970, -294, 1246, 94, -144, 1917]
2169A917q2q46J012K69j665J428M97j527N53M35j901M74O21j598Q5N38j973P6
2187a687J378j263p47J106r84n47K044m1j390J139K64r38J878O20j050O03R68
2204A353p88O78J108j236J44J114j624L88J896j402j532J370j005q12J410r09
2220A53k124J311Q40k280R52K35j645N35R99q83P72N90j457K24K039p64j25J803
2238A175j057m86K411l31j279J809l4j686J388P09j684M92J8j512O17J089j599
2255D0o40N31j206r6J057j473n36J289o23j361J668P73j395P56M10q32J504R59
2273H25j123L35J397r41O72R00r14j7J233j086J16J132j380r89J431o77j397J230
2291G47m07j753L41O42j447N01M81j428N6J199n16k1Q40o67q4J653m38k95J544
$$ y = [1917, 1835, 989, 2001, 2270, 605, 2033, 2530, 1003, 1556, 1991, 90, 564, 1185, -413, -328, 210, -1763, -1687, -309, -1572, -2319, -1213, -2197, -2744, -700, -741, -2131, -992, -728, -1666, 212, 832, -218, 385, 1353, 565, 1243, 2351, 1115, 1259, 2373, 749, 1137, 3033, 1631, 99, 1469, 464, -348, 1062, 153, -1971, -660, 180, -2100, -1148, -913, -2558, -2023, -1024, -1907, -1135, -545, -2002, -1778, 261, -503, -628, 1175, 118, -368, 2043, 1712, 433, 2242, 2208, 522, 1910, 2619, 935, 1427, 1445, -67, 550, 1639, 40, -600, -69, -1275, -1371, -314, -1787, -2323, -1034, -1657, -3018, -1350, -577, -1972, -1216, -806, -1638, -134, 825, -298, 37, 1434, 493, 1165, 2065, 1151, 1134, 2367, 1281, 1397, 2529, 1149, 160, 1591, 914, -483, 747, 340, -1413, -1072, -430, -1877, -1376, -895, -2323, -2267, -1068, -1584, -1605, -765, -1432, -1516, 137, -301, -596, 948]
2310I48o49n69J826J54j034R22P25j587P00J334j559K52M1j260K82M61j302k33
2328e48O18j173n02J115p81j107J317m81j060J489K43j435J328N79j263J325J051
2345G15q99O58J022j005N63J076o57m54R43l91m28J345n96j978J558m72j694J012
$$ y = [948, 299, -270, 1556, 1710, 676, 1598, 2323, 736, 1436, 2770, 1211, 1463, 1504, 244, 526, 987, -315, -548, 70, -1103, -1605, -490, -1271, -2378, -1061, -1542, -2602, -1113, -870, -2305, -977, -398, -1661, -336, 715, -184, 474, 1496, 491, 1054, 2130, 1473, 1019, 1962, 1571, 1143, 2488, 1892, -86, 1472, 1000, -694, 318]
$$ [...]
8191A05
##END NTUPLES=NMR FID
##END=
