##TITLE=1H_EC-3186p1
 CDCl3, 8 sc, 
 4.4.2019
##JCAMPDX= 6.0         $$ Bruker NMR JCAMP-DX V2.0
##DATA TYPE= NMR FID
##DATA CLASS= NTUPLES
##ORIGIN= UXNMR, Bruker Analytische Messtechnik GmbH
##OWNER= root
$$ XWIN-NMR		Version 3.5
$$ Thu Apr  4 14:03:18 2019 Russian Standard Time (UT+4h)  she@DPX200
##.OBSERVE FREQUENCY= 200.1316
##.OBSERVE NUCLEUS= ^1H
##.DELAY= (6, 6)
##.ACQUISITION MODE= SIMULTANEOUS
##.ACQUISITION SCHEME= undefined
##.AVERAGES= 8
##.DIGITISER RES= 18
##SPECTROMETER/DATA SYSTEM= spect
##.PULSE SEQUENCE= zg30
##.SOLVENT NAME= CDCl3
##.SHIFT REFERENCE= (INTERNAL, CDCl3, 0, 15.7039)
##AUDIT TRAIL= $$ (NUMBER, WHEN, WHO, WHERE, WHAT)
$$ ##TITLE= Audit trail, XWIN-NMR		Version 3.5
$$ ##JCAMPDX= 5.01
$$ ##ORIGIN= Bruker BioSpin GmbH
$$ ##OWNER= she
$$ F:/spectra/data/she/nmr/H-F/1/audita.txt
$$ ##AUDIT TRAIL=  $$ (NUMBER, WHEN, WHO, WHERE, WHAT)
(   1,<2019-04-04 14:02:17.07 +0400>,<she>,<DPX200>,
      <created by zg, POWCHK disabled, PULCHK disabled
       configuration hash MD5:
       00 E9 B6 7A A2 85 ED C7 34 08 36 98 17 FE 4E 26
       data hash MD5: 16K
       09 57 6C 11 0F 7D 19 3E AE 3C F5 54 70 A8 59 98>)
$$ ##END=
$$ 
$$ hash MD5
$$ 27 17 27 93 E7 31 B2 8B 7A 3B 7A 94 23 7F B8 94
##$RELAX= 
##$RELAX= 
##$RELAX= 
##$RELAX= 
##$RELAX= 
##$RELAX= 
$$ Bruker specific parameters
$$ --------------------------
##$DU= <F:/spectra>
##$EXPNO= 1
##$NAME= <H-F>
##$PROCNO= 1
##$TYPE= <nmr>
##$USER= <she>
##$AMP= (0..31)
100 100 100 100 100 100 100 100 100 100 100 100 100 100 100 100 100 100 
100 100 100 100 100 100 100 100 100 100 100 100 100 100 
##$AQSEQ= 0
##$AQ_mod= 1
##$AUNM= <au_zg>
##$AUTOPOS= <>
##$BF1= 200.13
##$BF2= 200.13
##$BF3= 200.13
##$BF4= 200.13
##$BF5= 200.13
##$BF6= 200.13
##$BF7= 200.13
##$BF8= 200.13
##$BYTORDA= 1
##$CFDGTYP= 0
##$CFRGTYP= 5
##$CHEMSTR= <none>
##$CNST= (0..31)
1 1 145 1 1 1 1 1 1 1 1 1 1 1 1 1 1 1 1 1 1 1 1 1 1 1 1 1 1 1 1 1 
##$CPDPRG= <>
##$CPDPRG1= <>
##$CPDPRG2= <>
##$CPDPRG3= <>
##$CPDPRG4= <mlev>
##$CPDPRG5= <mlev>
##$CPDPRG6= <mlev>
##$CPDPRG7= <mlev>
##$CPDPRG8= <mlev>
##$CPDPRGB= <>
##$CPDPRGT= <>
##$D= (0..31)
0 1.2 0 0 0 0 0 0 0 0 0 0.03 0 0 0 0 0 0 0 0 0 0 0 0 0 0 0 0 0 0 0 0 
##$DATE= 1554372136
##$DBL= (0..7)
120 120 120 120 120 120 120 120 
##$DBP= (0..7)
150 150 150 150 150 150 150 150 
##$DBP07= 0
##$DBPNAM0= <>
##$DBPNAM1= <>
##$DBPNAM2= <>
##$DBPNAM3= <>
##$DBPNAM4= <>
##$DBPNAM5= <>
##$DBPNAM6= <>
##$DBPNAM7= <>
##$DBPOAL= (0..7)
0.5 0.5 0.5 0.5 0.5 0.5 0.5 0.5 
##$DBPOFFS= (0..7)
0 0 0 0 0 0 0 0 
##$DE= 6
##$DECBNUC= <off>
##$DECIM= 24
##$DECNUC= <off>
##$DECSTAT= 4
##$DIGMOD= 1
##$DIGTYP= 9
##$DL= (0..7)
0 120 120 120 120 120 120 120 
##$DP= (0..7)
150 150 150 150 150 150 150 150 
##$DP07= 0
##$DPNAME0= <>
##$DPNAME1= <>
##$DPNAME2= <>
##$DPNAME3= <>
##$DPNAME4= <>
##$DPNAME5= <>
##$DPNAME6= <>
##$DPNAME7= <>
##$DPOAL= (0..7)
0.5 0.5 0.5 0.5 0.5 0.5 0.5 0.5 
##$DPOFFS= (0..7)
0 0 0 0 0 0 0 0 
##$DQDMODE= 0
##$DR= 18
##$DS= 0
##$DSLIST= <SSSSSSSSSSSSSSS>
##$DSPFIRM= 0
$$ [...]
##$SUBNAM2= <"">
##$SUBNAM3= <"">
##$SUBNAM4= <"">
##$SUBNAM5= <"">
##$SUBNAM6= <"">
##$SUBNAM7= <"">
##$SUBNAM8= <"">
##$SUBNAM9= <"">
##$SW= 24.9336934301222
##$SWIBOX= (0..15)
0 0 2 0 0 0 0 0 0 0 0 0 0 0 0 0 
##$SW_h= 4990.01996007984
##$TD= 16384
##$TD0= 1
##$TE= 0
##$TE2= 300
##$TE3= 300
##$TEG= 300
##$TL= (0..7)
0 120 120 120 120 120 120 120 
##$TP= (0..7)
150 150 150 150 150 150 150 150 
##$TP07= 0
##$TPNAME0= <>
##$TPNAME1= <>
##$TPNAME2= <>
##$TPNAME3= <>
##$TPNAME4= <>
##$TPNAME5= <>
##$TPNAME6= <>
##$TPNAME7= <>
##$TPOAL= (0..7)
0.5 0.5 0.5 0.5 0.5 0.5 0.5 0.5 
##$TPOFFS= (0..7)
0 0 0 0 0 0 0 0 
##$TUNHIN= 0
##$TUNHOUT= 0
##$TUNXOUT= 0
##$USERA1= <user>
##$USERA2= <user>
##$USERA3= <user>
##$USERA4= <user>
##$USERA5= <user>
##$V9= 5
##$VALIST= <valist>
##$VCLIST= <CCCCCCCCCCCCCCC>
##$VD= 0
##$VDLIST= <DDDDDDDDDDDDDDD>
##$VPLIST= <PPPPPPPPPPPPPPP>
##$VTLIST= <TTTTTTTTTTTTTTT>
##$WBST= 1024
##$WBSW= 4
##$XGAIN= (0..3)
0 0 0 0 
##$XL= 0
##$YL= 0
##$YMAX_a= 97658
##$YMIN_a= -187776
##$ZGOPTNS= <>
##$ZL1= 120
##$ZL2= 120
##$ZL3= 120
##$ZL4= 120
##$ABSF1= 10
##$ABSF2= 0
##$ABSG= 5
##$ABSL= 3
##$ALPHA= 0
##$AQORDER= 0
##$ASSFAC= 0
##$ASSFACI= 0
##$ASSFACX= 0
##$ASSWID= 0
##$AUNMP= <proc_1d>
##$AZFE= 0.1
##$AZFW= 0.1
##$BCFW= 1
##$BC_mod= 2
##$BYTORDP= 1
##$COROFFS= 0
##$CY= 11.3945322036743
##$DATMOD= 1
##$DC= 2
##$DFILT= <>
##$DTYPP= 0
##$F1P= 18.9103706918063
##$F2P= -1.10871071338519
##$FCOR= 0.5
##$FTSIZE= 0
##$FT_mod= 4
##$GAMMA= 1
##$GB= 0.15
##$INTBC= 1
##$INTSCL= 1
##$ISEN= 128
##$LB= 0.24
##$LEV0= 0
##$LPBIN= 0
##$MAXI= 10000
##$MC2= 0
##$MEAN= 0
##$ME_mod= 0
##$MI= 1.114404
##$NCOEF= 0
##$NC_proc= 0
##$NLEV= 6
##$NOISF1= 3.799351
##$NOISF2= 2.8
##$NSP= 1
##$NTH_PI= 0
##$NZP= 0
##$OFFSET= 15.70392
##$PC= 1
##$PHC0= -8855.847
##$PHC1= 20.80025
##$PH_mod= 1
##$PKNL= yes
##$PPARMOD= 0
##$PSCAL= 0
##$PSIGN= 0
##$REVERSE= no
##$SF= 200.130013532006
##$SI= 16384
##$SIGF1= 3
##$SIGF2= 2
##$SINO= 400
##$SIOLD= 16384
##$SREGLST= <1H.CDCl3>
##$SSB= 0
##$STSI= 0
##$STSR= 0
##$SW_p= 3612.71676300578
##$SYMM= 0
##$S_DEV= 0
##$TDeff= 0
##$TDoff= 0
##$TI= <>
##$TILT= no
##$TM1= 0
##$TM2= 0
##$TOPLEV= 0
##$USERP1= <user>
##$USERP2= <user>
##$USERP3= <user>
##$USERP4= <user>
##$USERP5= <user>
##$WDW= 1
##$XDIM= 8192
##$YMAX_p= 0
##$YMIN_p= 0
$$ End of Bruker specific parameters
$$ ---------------------------------
##NTUPLES= NMR FID
##VAR_NAME=  TIME,          FID/REAL,        FID/IMAG
##SYMBOL=    X,             R,               I
##VAR_TYPE=  INDEPENDENT,   DEPENDENT,       DEPENDENT
##VAR_FORM=  AFFN,          ASDF,            ASDF
##VAR_DIM=   8192,          8192,            8192
##UNITS=     SECONDS,       ARBITRARY UNITS, ARBITRARY UNITS
##FACTOR=    0.0002004,     1,               1
##FIRST=     0,             0,               0
##LAST=      1.6414764,     0,               0
##MIN=       0,             -187776,         0
##MAX=       1.6414764,     97658,           0
$$ Real data points
##PAGE= N=1
##DATA TABLE= (X++(R..R)), XYDATA
$$ [...]
3238B112o900J860O734j575o232N49N407J389m730m285M539O188m129o443L796
3253a720O016k115n481P31M908J894n382l480N876M523n528m909M180N129j892
3268B750n298q71N667K019o532k619O325L127n870l817M343M244k181n347K68
3283c792O439P62o620j476O652J998n257k698L674M810k220o400J323P469n14
3298D150p136p1N980P85m159l062L374N171l370o611K534O647j688o319jN624
3314A848J667m642m121M674M976m620n329M427N254k677n299N59N213K304n538
3329a304l502O194L843n171l914M055M282k220n262K74O218J312o650l049O695
3344A801L064o133k858L935L714k327n162O84O372L28p128r69O517K077n121k966
$$ y = [2112, -4788, -2928, 3806, 2231, -4001, -3452, 1955, 3344, -1386, -5671, -1132, 5056, 927, -5516, -1720, 4296, 2181, -3300, -2569, 2339, 4233, -1149, -4629, 1247, 5770, 242, -4667, -487, 4642, 2750, -2548, -3419, 2248, 4267, -2265, -4884, 1441, 4568, -1302, -5119, -776, 3468, 1287, -4060, -3792, 2647, 3409, -3211, -4687, 1965, 3963, -1294, -3992, -318, 4492, 2272, -4128, -2805, 4664, 4150, -2986, -3057, 2923, 3708, -451, -3513, -139, 5032, 1662, -4949, -2415, 4232, 2544, -3775, -3776, 1848, 3515, -1127, -5248, -574, 4402, -218, -5547, -1120, 4134, 1457, -3842, -3283, 1930, 4234, -1304, -4806, 1388, 5231, 60, -3854, 201, 4483, 2263, -2999, -2725, 3493, 4805, -1845, -4894, 1801, 4865, -1268, -4126, -191, 3523, 1196, -3966, -3282, 3090, 3418, -3710, -4679, 1838, 3915, -1206, -4172]
3360d172L790M106k438n474K047O399r68o747K59O337J136n084l120L971N091
3375E133l432o052K861O036k372n719Q76N023J113n043l563M990M629m580n160
3390e260L731N247k815m129K77N077J554n739k803N986L996n467l971M339M266
3405D289k371m575M90N535P20o412j196O519J617n923k756L989L894k225n273
3420c678R07N838k11o177o26O141J278n194k610M062M230k640o163K233O710j275
3436B825o311J267N149M59m661k359M306M633m138n768L940N196k078n374L48
3451b566M744J169m486l030M918L665m874n124M816M822k793n170O88N047J596
3466C422n564k456N914K931n531k939M598L757k802m405N40O236N16o374j331
$$ y = [-4172, -382, 3724, 1286, -4188, -2141, 4258, 3290, -3457, -3198, 3139, 4275, -809, -3929, 42, 5133, 1701, -4351, -1490, 4546, 2174, -3545, -2669, 2354, 3467, -1576, -5139, -149, 4480, -100, -5260, -1529, 3718, 903, -3226, -2949, 2128, 3682, -2057, -4860, 1126, 5122, -345, -4316, 23, 4289, 1918, -2657, -2167, 3368, 4088, -2324, -3520, 2999, 4616, -1307, -4063, -74, 3820, 1595, -3678, -2771, 3067, 2856, -3321, -3947, 2194, 3472, -1722, -4332, -270, 3960, 1320, -4843, -2610, 4100, 2825, -3486, -2219, 2930, 3389, -1272, -3631, 675, 5308, 1170, -4598, -658, 4538, 2460, -2914, -2566, 2178, 3347, -1139, -4169, 749, 4414, -460, -5584, -768, 4054, 1261, -3909, -3221, 1826, 3422, -2142, -4598, 1316, 4247, -1284, -4223, 375, 4132, 1330, -3075, -2535, 3701, 4217, -2157, -3488]
3481c488N941K170n411k527L760L079k181n291J730O325o86p124n26O563O83m771
3497a754k243L631L583k755n275L036O050k326o329J842N389O87m221l007M113
3512D21M004l672m728L286N511k824n095J288N098O52n155l100N045L909m982
3527c42m282M371L846l095m403J463N058J93n703j908O342K843n849k869M194
3542a41L579k728l837J061N599l09o127l16O256J479n778k349M137L503k397m724
3558c092J318N698j430o298J071N852Mn259k114M315L763l435m797K379N848k424
3574A399n423J467N307l17m346j762M229M219m412m985M200N131k907m695J108
3589a787M696J14m644j795N552K576o002l210M512M329l420m454Q83M931j1m978
$$ y = [-3488, 2453, 4623, -788, -3315, 445, 3524, 1343, -3948, -2218, 4107, 3421, -3703, -4229, 2334, 3017, -1754, -3997, -366, 3217, 462, -4813, -1777, 4273, 1947, -4382, -2540, 2849, 3536, -685, -3692, 421, 4425, 753, -3975, -689, 4822, 1998, -3097, -1809, 3289, 3941, -1214, -4314, 731, 4640, -342, -4624, -253, 3593, 498, -3905, -2442, 2616, 2809, -2894, -4802, 1540, 4383, -1466, -4335, -141, 3438, 710, -3127, -2066, 3533, 3224, -2903, -3219, 3037, 4516, -1262, -3611, 526, 4029, 1632, -3092, -1774, 3924, 2494, -3804, -2733, 3119, 3123, -2136, -4250, 65, 3828, 393, -4404, -2025, 3823, 1399, -4024, -2557, 2750, 2433, -1913, -3675, 554, 4773, 361, -4624, -424, 4707, 1800, -2895, -1787, 2909, 3023, -1621, -3416, 2136, 4712, -1290, -4500, 12, 4341, 921, -3533, -2650, 2281, 2270, -2708]
3605b708j179N484K277n965k331M748L419l069m538J542N797K76o614k14O125
3620C050O65n364j374M376L029l280m926K569N826j688o200P01N356O1m335j619
3636c153L389L257l866m730L856N394k739n785J594N252J42m590j729M558L025
3651C875m408l521M621L883l625m548K539M127L77m462k218N043K704n243k771
3666c627M251L205l334l754J360M947r9n838j384O037J981n984j826M424K628
3681B987k821m201K243N624j458o332N66O341P12n171j512L582L245k567m203
3696b965K191N030k039n756J494N693l53n308j649M334L334l685m746L609M479
3711C663l200m807K415M505n28m366j755M559L278m309l622L827L991k852l855
$$ y = [-2708, -3887, 1597, 3874, -2091, -4422, 326, 3745, 676, -3862, -2320, 3477, 3753, -2861, -3075, 3050, 3715, -1649, -3023, 1353, 4382, 1102, -3824, -1255, 4571, 2883, -3317, -2616, 2740, 2801, -1534, -3153, 236, 3493, -373, -5103, -1247, 4147, 1408, -4377, -2783, 2469, 2611, -1979, -3708, 850, 3875, -533, -4054, 567, 4450, 825, -3723, -1184, 2943, 3320, -1142, -3360, 1683, 4387, -856, -3627, 624, 3829, 495, -3259, -1899, 3048, 2949, -2889, -4273, 1764, 3745, -2239, -4065, 359, 2987, 166, -4035, -1792, 3832, 2374, -3958, -3392, 2949, 3661, -1510, -3022, 560, 3805, 1238, -2965, -774, 4256, 2217, -3539, -2045, 3648, 3295, -2013, -3662, 672, 4006, 321, -4425, -816, 3663, 463, -4344, -1929, 2576, 2048, -2318, -4073, 486, 3764, -545, -4167, -340, 3651, 799, -3056]
3726c056J972M289l35m671j345N862J856n723k430M435L021l080l673J537M318
3741B977q39n492j5N964P50n886j326M483K589k751m562J969N039j011n528Q24
3757b815N587l19m449j180M271K783l243m361K520N825k690n024J567M661l76
3772B757m478r50L873K815m180m528M830M067l630m398J862M084m00m075r55M317
3788A011K338m787l182N018L378l591l881K153L968L16m679j082N478J515n345
3803a372j957M711K655l670l555K160M507q23n427l00N306Q61n430j021M328J862
3819B835l359l544K798M892j977n643J370N290l11m220j095L667K003k676l743
3834c713L425M607k759n242K124N077p48m272j105L749K609l613l675L589L989
$$ y = [-3056, -1084, 3205, 2870, -1801, -3146, 2716, 4572, -1151, -3581, 854, 3875, 795, -2878, -1341, 2977, 2138, -3354, -3369, 2595, 3345, -2541, -3867, 616, 3205, 454, -4108, -2139, 2900, 1889, -3639, -2815, 2772, 2453, -1996, -3176, 1095, 3878, 635, -3726, -1206, 4619, 1929, -3095, -1528, 3133, 2757, -1721, -2671, 1202, 4017, -163, -4691, 139, 4206, 576, -3822, -1960, 2124, 1724, -2351, -3306, 1011, 3349, -1438, -4620, 398, 3776, 185, -3696, -1543, 2425, 2741, -1938, -3020, 2458, 3973, -1372, -3329, 1382, 4037, 367, -3188, -1028, 3479, 2656, -2771, -3071, 2235, 3096, -2334, -3355, 973, 2835, -524, -4068, -1270, 3622, 1645, -3998, -2628, 2662, 2351, -1869, -2964, 703, 2706, 30, -3713, -288, 4319, 1560, -3682, -1558, 3519, 2771, -1501, -2606, 1143, 3752, 139, -3536, 53, 4042]
3849D042l811m250K702M258j186m003j228M600K308m706l087M821K848l738l003
3864c433J950M465j056m490m41N508J548n609j716M363K512l292k732J899L781
3879C257r94n207N37N870j22n477j385M284K366l063l387J879M152j570m981J381
3895b460N390j034m877j63L929K515l143m009L039M608k695m424K364M409j141
3910B308m404J33L810K045m218l499M075L930l368l857K221L396p31m442m16M424
3926A407J941n156k797N284K857l838l519K394L490k53m480L8N041O33m883j454
3942c295M684K033l237l517K752M269j160n035M77N351m06n289l02M471J432l426
3958a98l430K791M383k233n001J325M723j109l721k46L665J946l522l563L762
$$ y = [4042, 231, -4019, -1317, 2941, 1755, -2248, -3476, 1124, 3432, -1274, -4361, 460, 3308, -430, -3433, -1483, 2982, 1926, -2564, -3005, 2503, 4051, -1558, -3274, 1089, 3601, 309, -2423, -524, 3257, 2263, -2944, -2407, 3463, 3341, -2136, -3521, 763, 3129, 66, -3321, -1442, 2710, 1140, -3841, -2460, 2930, 1896, -2981, -3144, 785, 3300, 157, -3852, -813, 3795, 1100, -3324, -960, 3449, 2308, -2096, -1963, 1847, 3892, -326, -3825, 250, 4180, 812, -3045, -824, 2572, 1841, -2601, -3017, 1407, 3348, -1808, -4605, 679, 3536, -302, -3821, -1427, 2063, 1810, -2670, -2632, 2409, 3042, -1841, -3295, 1389, 3422, 185, -3332, -580, 3689, 2529, -2506, -2029, 3322, 2916, -2373, -2675, 1796, 3228, -198, -3628, -837, 3546, 1313, -3688, -2363, 2360, 1251, -2470, -2716, 949, 2895, -627, -4190, -428]
3973d28M470l766m195K491M317p27l950n81L792K204m238k580M126L349l882l878
3989c476K804L790q87m286o14M443J347m595k405M467K311m125k633K759L572
4004B472q34m946L75M851J013n162p63M035K001l592j935K413L443j312n149J224
4020a866N314l48m812l78L981J049l071k713K655L729k455m995K218M802j587
4035A523m432j24L825J826l474k863L432L644l106m001K903L812j418m055l7M439
4051A894J306l921k701M308L041l708k979K365L614j436l908l86M894Q75n248
4066a990j738M933K006l853k064J714L105p69m559N54N408l00m923q16M569J742
4082C019l385k729K613L758j633m463J556M865j189m927N54L903J404l140l334
$$ y = [-428, 4042, 276, -3919, -1428, 2889, 2162, -1788, -2369, 1423, 3627, -611, -3191, 935, 4284, 402, -3476, -672, 3118, 2231, -2055, -2669, 1774, 3121, -1474, -3879, 588, 2899, -1226, -3859, -1100, 2472, 1638, -3308, -2933, 1918, 2931, -2231, -2994, 1041, 3042, -550, -2485, -72, 3371, 2059, -3090, -1866, 3448, 3100, -1712, -2090, 1891, 2940, -131, -2844, -189, 3540, 1085, -3910, -1692, 3110, 1523, -2909, -3033, 792, 2618, -856, -3719, -287, 3357, 251, -3750, -847, 2965, 1547, -2508, -2545, 1894, 3200, -721, -3422, 886, 3927, 219, -2760, -395, 3219, 1783, -2125, -2511, 2383, 3258, -1990, -3728, 1205, 3211, -642, -2706, -992, 2113, 1344, -3215, -2661, 2747, 2447, -2476, -3292, 1277, 3019, -366, -3095, -482, 3276, 1643, -2820, -1264, 3601, 2412, -2515, -1961, 1942, 3346, 206, -3128]
4097c128K743L958k271m378J950M157j803l869M78L530J169l920k325L711L472
4112C474l647l728L072L146j299l076p2L771J260m255j684M429K490m051k862
4127c032K532L333j049l550n04M578Q58m987j134M604R83l373k153J951L638j618
4143A077m090L94M797l71m521j19M011J140l339k232K637L979j984m909J974N031
4159C475j531m021L5L654J560l505k601L413L443l042m332K649M624k741l386
4174b306J45L511J239l587k327L522K703l503k900K760L246j429l504l02M397
4189A665J448m650j625M224K094l948k145K983L052j780l403J83M648M28n054
4204a880n68M319J095l746j686K297K646j584l987J062M603m73m686l53M211J058
$$ y = [-3128, -385, 3573, 1302, -3076, -1126, 3031, 1228, -2641, -2163, 1367, 2536, -1384, -3709, 2, 3474, -173, -3901, -829, 2317, 1018, -2058, -2130, 1641, 2901, -1354, -3038, 1391, 3881, -170, -3032, -500, 2833, 1784, -1766, -2270, 2308, 3166, -1821, -2955, 1649, 2632, -741, -2894, -943, 2695, 1077, -3013, -2619, 2178, 1807, -2714, -2833, 1178, 2318, -1021, -3253, -616, 3363, 1379, -3530, -1556, 3475, 1944, -2077, -2042, 1612, 3172, -333, -2934, 479, 3922, 880, -3452, -803, 3821, 1080, -2306, -2161, 1350, 2589, -998, -3325, 197, 2900, -603, -3503, -743, 2503, 1074, -2430, -2732, 1665, 3113, -1537, -3162, 1062, 3156, -792, -2937, 46, 3098, 1318, -2085, -1902, 2746, 3174, -1880, -2448, 1871, 2966, -780, -2466, -169, 2477, 893, -3094, -2032, 2571, 2098, -2588, -2941, 1270, 2328]
4220B328l334k377K889L402k092m118K209M406j706m110M91M056L86k709k397
4235b676K971L325k908l670K696L305j994l107L79L423R57l674k812M259L002
4250C476l616l301K751L028j971k887M32L905O96m606j193M613J871m140k055
4265b997K809K434q05l482O92M413k35m481n17M312J338m075k096K480L131j607
4281A314m414J403M489j036m502P64L484L13l274j945L134L203k564l768K145
4296a254L852j253l760P66L511N02k785k340L404L031l442l240K570L846k181
4311A227l603P68L351R29l968j691L897K130l790k756L270K990k182k911J7M143
4327A821N31m493p98M266J209l717j781K878K515j509l507P83M611j42m730l54
$$ y = [2328, -1006, -3383, -494, 2908, 816, -3302, -1093, 3313, 1607, -2503, -2012, 2044, 2430, -279, -2676, 295, 3620, 712, -2958, -262, 3043, 1049, -2058, -1679, 1744, 2701, -973, -3785, 474, 3476, -140, -3441, -690, 2338, 367, -2520, -2088, 1817, 2513, -2093, -3286, 1327, 3198, -942, -2997, -188, 2246, 1441, -2041, -1349, 3064, 2829, -1652, -2169, 2143, 3481, -594, -2690, -210, 2921, 1314, -3100, -1697, 2792, 1756, -2746, -1982, 1502, 1815, -1459, -3404, -270, 2933, 369, -3399, -1254, 2598, 1345, -2415, -1649, 1862, 2364, -421, -2761, 643, 3674, 232, -3008, -438, 3408, 1227, -2376, -1608, 1743, 2672, -1296, -2987, 910, 3040, -750, -3506, -236, 2754, 572, -2339, -2322, 1821, 2352, -2141, -2939, 1327, 2536, -1181, -2962, -84, 2431, 922, -2585, -1802, 2809, 2667, -2063, -2417]
4343b417M302Q46l706j101K486K537k061l931J611M482j357l916K49L596K89k876
4359i67j552K178L050k962l080K280L697j910l240N73L741L57l258j694L250K856
4375C319l268k979L003K981j985l023O34L670L18m101j326M078J852l671k286
4390b784K813K167j944k670R00L256N45m532o74M322J067l621j664K639K415j440
4406G95l353J137M430p91m612L68M189M29l364j776K811K565j989l355J918L522
4422B924j504l954J031L398J14l121j571K548K803k047m113K499L775k308l405
4437b931J364K827N27l554j608M184K341l714k744L323K702j884k770Q25L428
4452B316K11l926q21M119J121l643k152L002K332k000k877O46L853j76m328j31
$$ y = [-2417, 1885, 2731, -975, -2076, 410, 2947, 886, -3045, -1434, 3048, 1691, -2225, -1976, 1620, 1909, -967, -2519, -341, 2709, -253, -3333, -1053, 2644, 734, -2506, -1933, 1808, 2165, -1093, -2787, 463, 3319, 51, -2928, 75, 3056, 1071, -1952, -1318, 2352, 2670, -1431, -2757, 1321, 3173, -498, -2784, 29, 2196, 252, -2418, -1518, 1738, 2283, -2249, -2923, 1399, 2466, -1155, -2819, -180, 2235, 795, -2558, -1421, 3009, 2218, -2394, -2026, 2163, 2592, -772, -2548, 263, 2828, 839, -2516, -598, 2924, 1420, -2534, -1503, 1895, 2009, -1112, -2683, -135, 2668, 621, -3492, -993, 2782, 474, -2931, -1567, 1260, 1787, -1767, -3375, 809, 3150, -564, -3308, 15, 2717, 833, -1937, -1112, 2316, 2527, -1399, -2220, 1899, 3020, -623, -2775, 227, 2559, 559, -2318, -1672, 2181, 2005, -2323, -2454]
4468b454M012N47l545j698K797K469j799l340J220M502q11m461P17L711K08l148
4484a073j178K845K349j859l592J438M338j657l839J286L042k21l102p53K390
4499D14K190l034l183L369L117k387l367J235L127r9k727j580L611K280l891k048
4515b973L080K872k454k458Q53L221L62l985n62L784R98l389j423L198J605k188
4531E41k360Q33L507q03m136l56M375L95l515r54K642J908k060k871J438M116
4547B700j248m301J043L574O8l044q76K579J976j983k952K214L271k170l073J260
4563i62L054J61l325j218K771K695l545k395K742K815k580k565J174K781j46l224
4579a767j149L599K418m220j719L363J964k293k218J085K939j70l379q13M472
$$ y = [-2454, 1558, 2105, -1440, -3138, -341, 2128, 329, -3011, -1791, 2711, 1900, -2561, -1844, 1867, 2075, -1073, -2251, 594, 2943, 1084, -2508, -1070, 3268, 1611, -2228, -942, 2100, 1879, -1223, -1976, 414, 2604, -430, -3613, -244, 2873, 486, -2881, -1646, 1481, 1382, -1345, -2925, 686, 2966, -925, -2973, 107, 2979, 525, -1933, -1080, 2141, 2503, -1482, -2044, 1740, 2738, -651, -2074, 1124, 2729, 541, -1819, -986, 2521, 1718, -2418, -2774, 1601, 1996, -1519, -2473, 169, 2077, 17, -2854, -1416, 2700, 1452, -2849, -1806, 1768, 1836, -1208, -2084, 495, 2471, 488, -2464, -250, 3021, 851, -2222, -962, 2092, 2253, -1072, -2290, 481, 3176, -369, -2764, -22, 2793, 213, -2352, -1178, 1603, 1457, -1767, -2916, 683, 3101, -1119, -2838, 525, 2489, 196, -2022, -937, 2002, 1832, -1547, -2360, 2112]
4594B112Q64l868j143K945J843j900k589P59L264o89l894M81M034k71l480r23
4610b455K533K107k115l048J656L565j392l762J108L524j97l191o09K828K474
4625C026k710l073K317L357k151l103J400L187m04k974q08K942J798l080k488
4640b764K833K626k320k436J017K660k6l071j180L693J348l736j596L336J923
4655B307k181k625J128L149j18l306k73L869L89l443q45L122J411k019k558J025
4671i68L779j064l969M26L855Rl317p30K602J457k348k319J724L535j946l465
4687b739J089L403k76l102m79K530J567j838k952K428L160k401k808J738K877
4702B197L3l073j064K865J962l116k353L223J991k371k747J858K655m40l537n99
$$ y = [2112, 2976, -892, -2035, 910, 2753, 853, -1736, -977, 2287, 1598, -2296, -1815, 2219, 1948, -1532, -2455, 78, 2185, 70, -2978, -1322, 2243, 851, -2911, -1803, 1721, 1524, -1667, -2276, 552, 3026, 316, -2757, -440, 2917, 766, -2337, -937, 2250, 1846, -1128, -1936, 1006, 2804, -276, -2764, 69, 2695, 375, -2061, -1044, 1616, 1590, -1481, -2661, 1032, 2380, -1356, -2952, 384, 2307, 126, -2499, -1371, 1778, 1660, -1646, -1919, 1950, 2339, -1104, -1949, 1173, 2584, 565, -1993, -968, 2811, 1747, -2222, -1796, 2059, 2068, -1249, -1979, 623, 2080, -268, -2587, -863, 2672, 726, -2739, -1650, 1753, 1477, -1625, -2104, 426, 1993, 155, -2797, -369, 2791, 390, -2418, -680, 2197, 2230, -843, -1907, 958, 2920, -196, -2549, 674, 2665, 294, -2453, -595, 2060, 1620, -1917, -2516]
4718b516L362J384l696r64K725J571k173j916J102L012l07l780j40M004L02l200
4734a230p87K973J235j686k603J486L216j129l723J205L548l53l451n76K605J418
4750B148j997k818J630L421k125l424J852K951l40k918n42K528J783k975j991
4765b817K483K676j811k698J677K642p92k497o81L307J137l163j987K955K180
4780B611k194k230J265K557p06k884l96L275J200m002q11K911J354k361j912J227
4796a096K747n14l315K55L691K98l888k73L118J315k287k265J848K746j244l191
4812b055P39L656o70l057j77K656J019k025k600K268L022k470l054J566K643n38
4828I23k609P8K379J091k877k206L188K668k310k879J744K661l14k789l17K924
$$ y = [-2516, 846, 2230, -1466, -2430, 295, 1866, -307, -2223, -1121, 1891, 1584, -2196, -2336, 1668, 1970, -1230, -2017, 956, 2191, 505, -2098, -612, 2604, 1475, -2248, -1043, 2505, 2152, -1299, -1875, 730, 2148, 151, -2667, -1037, 2384, 259, -3165, -1313, 1638, 1298, -1620, -2162, 366, 2149, -826, -2817, -334, 2342, 531, -2167, -490, 2152, 1360, -1137, -1818, 1489, 2626, -537, -2524, 431, 2611, 417, -1813, -548, 2009, 1303, -1581, -1977, 1298, 2498, -1504, -2315, 596, 1950, -411, -2323, -1096, 1651, 1137, -2178, -1923, 1768, 2066, -1822, -2095, 1023, 2338, 51, -2214, -366, 2380, 1136, -2055, -1316, 2340, 1670, -1387, -1564, 1092, 2111, 86, -2514, -246, 2776, 306, -2748, -1182, 1461, 923, -1686, -1608, 771, 1862, -1015, -3221, -33, 2635, 325, -2554, -810, 1851, 1537, -1252, -1569, 1355]
4844A355J144l417j376L454J459k402k163J350K835m92l329k92L246J116l594
4859a106j168K939J253k168j774J124K485l52l313J14L685j88l435k74K926J165
4875A913k344j816J740L170j749k988J174L313p11l021j78K605R43k159k304K439
4891B7K515k125k862J820K796q95k945j72K650R08k776j574L024J938k866k314
4907b851K108K623q18k510l98L361P42l257j369L322J334k399j872J950K187o98
4923A455l250K07L572j4l175r34L017R92k332j582J700K085p09l568R49L450o58
4940A205l054Q4K491J153k244j917J847K934j683l229J607L217j298k528J26K655
4956A366J139k926j952K612K661k528k271J695K140j241k405j4K801J126l400
$$ y = [1355, 2499, -918, -2294, 1160, 2619, 217, -1946, -596, 2239, 1747, -1582, -1874, 1372, 2488, -1106, -2274, 665, 1918, -250, -2024, -900, 1585, 1233, -2080, -1966, 1719, 1531, -1904, -2178, 748, 1913, -431, -2247, -507, 2663, 914, -2074, -900, 2413, 1702, -1319, -1497, 1108, 2051, -108, -2412, 27, 2542, 417, -2445, -625, 2171, 1276, -1669, -1841, 809, 1717, -1059, -2633, 391, 2329, -537, -2851, -743, 1880, 1062, -1448, -1846, 1515, 2257, -1000, -2369, 953, 2287, -112, -1984, -34, 2153, 1455, -1795, -1588, 1984, 1970, -1205, -2139, 878, 1870, -462, -2044, -344, 1741, 1032, -2536, -1587, 1863, 1205, -1849, -1765, 726, 1879, -365, -2282, -435, 2499, 816, -2413, -806, 2411, 1113, -1415, -1289, 1366, 2505, -421, -2373, 239, 2900, 372, -1899, -204, 1936, 695, -1710, -1724, 1077, 2203, -1197]
4971a197j311K858J674k331k241J914K271q68k376l35L277K84k928r64L300J345
4987B372k798j624K001K182j019k792M41L048K42l449o49L202R39k628j311J432
5003d11K284j061k941M63L475q33k854L59K514M31k289j476K304K338k060k751
5019b508J833K732j007k637J09K576R08k379j640K673J815k376k265J927K309
5034B070j137k593M05K450O69k976j118L115J232k881j693K250J892j029k591
5049a935L16L195N4l005n51L083N01k542q83J809K160j506k685N98L350j34k929
5066a104k29K616N96k080j570J772K586j970l005J290L455j034l425O23K508K97
5082A326j798j459J772K318k136k609J939K693j549k245N67K668M56k355j497
$$ y = [-1197, -2508, 350, 2024, -307, -2548, -634, 1637, 769, -1607, -1942, 1335, 1619, -1309, -2273, 1027, 2372, -426, -2050, -49, 2133, 1114, -1678, -1237, 1811, 2053, -1396, -2045, 1157, 2096, -532, -1843, -411, 1873, 812, -2129, -1666, 1809, 976, -1878, -1519, 995, 1426, -863, -2339, -35, 2303, 243, -2508, -675, 2057, 1050, -1587, -1478, 1098, 2006, -373, -2013, 660, 2475, 99, -2166, -239, 2070, 933, -1660, -1255, 1195, 1864, -1112, -2230, 885, 2117, -764, -2457, -207, 1685, 656, -1935, -1619, 1576, 1630, -1375, -1926, 1157, 1658, -884, -1767, 42, 2202, 696, -1989, -1391, 1959, 1825, -1104, -1333, 1283, 1879, -201, -1771, 1, 2587, 617, -2388, -1098, 2357, 1323, -2102, -1479, 1029, 1326, -472, -1931, -159, 2159, 23, -2586, -647, 2046, 497, -1748, -1181, 1487, 1943, -412, -1909]
5097a909K195K082k325k047K010K399j394k524K81L022J32l031j111K834J291
5112A905k570j294J563J966j160k351P28K713J77l379l21L102P01k337j415J810
5128a62K092j312k224N72L061n16l261M68K574P34k346j184J549K145j767k499
5144b076J084K934j067k533N53K295L77k488j223K259K124k486k303J850K167
5159A467j011k247N59K507K39k340j185K720J489k522j923K471J721r43k113J14
5175i97K615M44l263n26K972P03k784j136K232J356j542j863L37K907m48k911
5191a904M0K991M90k467j133J989J926j613k462J594K576o37l210P20K639K73
5207A812k529o74J690K063j893k722K040K331j086k560N03K040L79k184q10K269
$$ y = [-1909, 286, 2368, 43, -2004, 6, 2405, 1011, -1513, -1232, 1790, 1922, -1109, -2220, 614, 1905, -665, -1959, -396, 1570, 410, -1941, -1213, 1500, 1677, -1702, -2023, 1079, 1780, -557, -1972, -162, 1930, 618, -1606, -1034, 2027, 1511, -1750, -1282, 1292, 2026, -320, -1504, 45, 2190, 423, -2076, -992, 1942, 875, -1658, -1105, 1190, 1567, -921, -2144, 115, 2239, -247, -2550, -700, 1467, 456, -1791, -1232, 1275, 1514, -826, -2011, 709, 2198, -324, -2247, 224, 1945, 1002, -1111, -997, 1618, 2062, -1201, -1727, 1245, 1948, -836, -1972, 260, 1616, 74, -1789, -1452, 1455, 1007, -1904, -1864, 1127, 1617, -850, -1983, 6, 1932, 319, -2143, -549, 2027, 1390, -1820, -1100, 1539, 1812, -717, -1391, 299, 2362, 469, -2253, -213, 2118, 1032, -1528, -1025, 1015, 1394, -790, -1600, 669]
5223F69J226k253k114K243K312j490k446N06K434L91k516j131K941J307k872j204
5239a997K588J494j410j795L93K561m6k881n14K835P43k749p16J909J181j463
5255A33k106R03K868p11k965L80K554O58k700q27K000J670j456k381J375K453
5271A848j033k587R35K332K10k380r16J982J971k016k097J384K848j938k351J043
5287g65K361K12k785r18K462J618k695j460J973J713j612j830O23K262J18k626
5303a349p22K912J314k787j175J874J643j139j899P85K238l48k533m25K883L77
5319A649k622o46J999J603j341k230M54K869q96k430M02K484P1k798m77J964J602
5336A657j480k388J369K394j039k258O89K491l98j979p42K068J476j821k038K047
$$ y = [669, 1895, -358, -2472, -229, 2083, 593, -1853, -1347, 1087, 1478, -1038, -2169, 772, 2079, -793, -1997, 591, 2085, 675, -1120, -727, 1834, 1788, -1093, -1607, 1228, 1971, -778, -1494, 415, 1596, 133, -1973, -1070, 1798, 1087, -1878, -1498, 1056, 1714, -986, -1813, 187, 1857, 401, -1980, -605, 1848, 815, -1772, -837, 1495, 1705, -675, -1591, 391, 2362, 346, -1751, -367, 2481, 543, -1808, -765, 1596, 1808, -977, -1895, 567, 2185, -510, -1970, 3, 1716, 104, -1726, -1103, 1159, 1277, -1349, -2071, 841, 2155, -632, -1807, 67, 1710, 571, -1328, -543, 1695, 1347, -1186, -1611, 1272, 1649, -973, -1619, 380, 1983, 642, -1588, -1134, 1735, 839, -1591, -1189, 1295, 1366, -1432, -1909, 55, 1657, 177, -2211, -842, 1552, 513, -1745, -1056, 1435, 1037, -942, -1684, 384, 1860, 39, -1999, 48]
5352D8K229j650k209Q98K170M2k549o97K677O55j955j773K310J672j766j774R29
5369g43J927k70k461l4K486K43k297o13K178J245j415j835N90K650o7k628l47
5386a391K783J90k217p29K072R29j425j783J267K235q63k884M49K541Q7k402n61
5403a702K030J435j981j977J767K109j062k833J027K574k04k274m17K042J383
5418A917k006j762K072J796j586k041J135J750M3k198m91K160J009k103j622K065
5434A38J468j261j730O49J944J02k669l80K785L25k121j024J971J409j615j418
5450a427P97J958r3k945L18K925m6k268o26J863J289j354j983J453J926j227k235
5467a675Q87K316m05j946p69J939J128j594k142J803J934j463j913P64K252n29
$$ y = [48, 2277, 627, -1582, -684, 1486, 1528, -1021, -1718, 959, 1614, -341, -2114, 196, 1868, 102, -1672, -743, 1184, 914, -1547, -1581, 905, 1148, -1149, -1762, 416, 1661, 246, -1589, -999, 1651, 1584, -1044, -1391, 1392, 1582, -635, -1364, 708, 1637, 212, -1571, -304, 1931, 1068, -1816, -1367, 1174, 1261, -1141, -1702, 328, 1763, -218, -2195, -428, 1681, 619, -2214, -1187, 1387, 1183, -1091, -1508, 534, 1917, -89, -1851, 221, 2017, 431, -1610, -475, 1275, 1318, -880, -1371, 789, 1798, -305, -1927, 138, 1606, 345, -1385, -736, 1208, 1310, -1359, -1739, 1046, 1371, -750, -1774, 197, 1606, -9, -1427, -630, 1328, 1235, -1710, -1392, 1533, 1487, -781, -1407, 456, 1745, 391, -1592, -139, 1787, 560, -1675, -788, 1528, 1123, -823, -1592, 347, 1475, -119, -2261, -458, 1476, 13, -1900, -1136, 1116, 587]
5483E87j848l19K177J142k003j610J979J690j206j781R82J673j23k252k54K216
5499A050R98k805j035K380Q97j395j852J300J801k78k542J92K422J97k803K2J879
5516D28R13j633j203O92K359o00k519N67K205N9k330j40J862R86j472j651J305
5533a72K124q29k720R92K128m03k150lJ673J023k188j436J667K224j697j955J118
5550f04J475k7j700m89J911J083k152j713K170J960j786j502J012J659j19j950
5566g72n54K455M27k245r73K342J164j844j606J352J741m88k474J04K324O73k798
5583a172j88K105O30j954j092J180K232j207k230K37K738l30j933m06K171R09
5599A690j620j511J317K076j412k018Q15K309o73j905k59J512J223j349k122K142
$$ y = [587, -1261, -1580, 597, 1739, -264, -1874, 105, 1795, 589, -1192, -210, 1463, 1340, -912, -1166, 1050, 2048, -757, -1792, 588, 1485, 90, -1762, -462, 1339, 1061, -1481, -1289, 1133, 1330, -1473, -1451, 428, 1341, -292, -1495, -803, 1556, 956, -1563, -996, 1209, 1268, -1062, -1202, 660, 1646, 174, -1477, -172, 1952, 1123, -1597, -605, 1523, 1120, -1030, -1033, 640, 1663, -525, -1961, -294, 1930, 233, -1722, -604, 871, 844, -856, -1345, 566, 1649, -503, -2216, -46, 1914, 128, -1374, -362, 1297, 1178, -772, -1326, 1129, 1556, -689, -1662, 680, 1844, 0, -1606, -254, 1487, 999, -1475, -1371, 953, 1626, -1172, -1360, 745, 1375, -579, -1671, -491, 1741, 534, -1696, -1459, 1279, 949, -984, -1390, 781, 1690, 70, -1441, -124, 1952, 540, -1478, -663, 1646, 973, -932, -1191, 321, 1544, 195, -1927, 215]
5615B15J411j735j472J159J704m54k086l51K216P43k063j120K298J314j663j594
5631a478R02J733o49j646M6K346O64k657m46J861R94j808r35P57J866n47k455
5648a452K13K448R0k309l35J964N88j383j473J024K106j139j942Q90J776q8k309
5665a331pJ893Q78j660j316J488J824q26k551J254J834r17j477M15J167J100k026
5682b58j535K081J650j827j582J230J221m10j478k07J822M84k078r19K124J122
5698A440j581j561J524J102j4k106k33K702k17j517r47K268O44j658r67Q25K038
5715A742p25k465O46K090m07j833l2J687M84j662j077J423J663j041k151Q38J408
5732E88J99k187M00J546P71j685j255J853J462j550j847J306J827l70k021J12
$$ y = [215, 1626, -109, -1581, -422, 1282, 828, -1258, -1609, 607, 1350, -713, -1833, 465, 1779, 116, -1478, -576, 1157, 508, -1138, -1092, 1254, 1918, -739, -1185, 676, 1670, -138, -1073, -316, 1550, 1003, -1452, -1239, 1209, 1299, -1010, -1345, 619, 1207, -176, -1649, -625, 1481, 342, -1600, -710, 1066, 978, -1331, -1338, 555, 1433, -227, -1543, -55, 1769, 943, -1608, -354, 1480, 563, -914, -499, 668, 1768, -258, -1793, 288, 1938, 111, -1471, -241, 980, 570, -908, -1115, 707, 1191, -887, -1806, 318, 1440, -141, -1702, -178, 924, 910, -1196, -1429, 1273, 1056, -461, -1408, 860, 1504, -154, -1121, -296, 1742, 1017, -1448, -802, 1288, 881, -952, -984, 703, 1187, -475, -1552, -129, 1534, 493, -1658, -820, 588, 787, -1400, -1000, 546, 1317, -368, -1623, 230, 1692, 142, -1705, -399, 1428, 1058, -963, -851]
5748h51J510P18j651j081K063J007j564j470J502J065m50k027J54J875N48k207
5764h59q56K036J123j835j235J497J314n20j965L5K080O61k785J03J766N29j189
5781a00r53J193J313p46k312R57K033j21k680J29K030L61j180j539J488J602j175
5798C00k042J015K064o71k004J71J465J006j589j238J577J443j472j428J283J617
5814A497r44j615L49J470N32j710j258J871J175j373j231J058J515n95j865K90
5830h34J995L30k381m73J808P62j129j724J213J226l97j578M75J733j52j985l16
5847a427K118L35j388p82R71J532q24j807R91J365j44k014J28K061J5j071j777
5864a718J824J519j203j886J050J505o07j742M56J504M64j477j092J494J228j354
$$ y = [-851, 659, 1377, -274, -1355, 708, 1715, 151, -1319, 183, 1248, 798, -1229, -1075, 800, 1348, -859, -1715, 321, 1444, -391, -1626, -129, 1185, 665, -1300, -1265, 815, 1476, -1309, -1206, 560, 1089, -100, -1053, 140, 1453, 707, -1605, -648, 1385, 1264, -1416, -1287, 743, 1104, -76, -1615, -127, 1475, 300, -1742, -727, 1337, 666, -1338, -1167, 298, 1304, -285, -1523, 54, 1497, 25, -1403, -120, 1497, 553, -1062, -713, 757, 1289, -421, -1679, 192, 1367, -6, -1237, -179, 1336, 741, -1124, -834, 1161, 1491, -890, -1363, 445, 1207, 78, -1646, -433, 793, 396, -1182, -707, 1026, 874, -1111, -1427, 691, 1026, -362, -1144, -173, 1359, 535, -1272, -281, 1084, 940, -1074, -946, 1115, 1130, 59, -1718, 106, 1625, 422, -1464, -414, 1091, 484, -1258, -802, 702, 1166, -311, -1403, 91, 1319, -35]
5880c5j617J317J448n87j438J20J971j61j903m88J966Q93j618j295J624J225l74
5897A048j894l0J832J01j979o42J957P85j669p24J191J062p66j749M09J971o9
5914H34j830r9J587M13j577q39J413J683j098j488O79J854o87j554k49J917L72
5931A331j395j005J238J470j464j579J188J710j056j653O63J093L68j322q88J693
5947C92R49j867j003J473J154p26j484K62J625N20k011n45J895O69j641q60J111
5964h7J318n07j925O30J561L97k287j59J803M21j279o48N76J293o44j870M86K122
5982A201k81j857j02J668J71j147o72Q07J264r28j331R28J481m91j885N43J531
5999I00J43j099r83J340J322j226j763J397J232j008j003L13J271Kj540p70J531
$$ y = [-35, -1652, -335, 1113, 526, -912, -792, 1179, 1018, -885, -1373, 593, 1486, -132, -1427, 197, 1422, 1048, -846, -876, 956, 1057, -922, -1564, 393, 1178, -491, -1215, -24, 1038, 272, -1477, -1068, 903, 834, -996, -1095, 492, 905, -672, -1511, -98, 1585, 487, -1001, -322, 1532, 845, -709, -958, 959, 1331, -64, -1069, 169, 1639, 175, -1404, -216, 1494, 438, -1215, -552, 541, 909, -413, -1301, 392, 1341, -526, -1529, -56, 1098, 372, -1112, -850, 775, 1295, -716, -1261, 634, 1303, -338, -1198, -87, 1231, 724, -1201, -571, 990, 1387, -900, -1059, 744, 1165, -114, -762, -186, 1107, 463, -1407, -921, 1201, 920, -937, -1039, 629, 800, -347, -1019, -212, 1052, 124, -1207, -279, 1202, 711, -1174, -631, 900, 1043, -56, -1039, 301, 1623, 397, -1366, 31, 1263, 255, -748, -435, 836, 838, -702, -1472, 59]
6016E9J261j498j195J039J256q32j159K57J720j3j692n52K019O62j757q71J434
6033A38J329r31j645N48J766k74j646p1J732M71j731q41J423Q99p05j897O36J821
6051A022n68j714N36J587j29j169q64J522J249j602j478J075J728o77j716N92
6067f06J328M91j629o80J298J401j604j253J347J201q79j409P03J028J41j511
6083f33o67J915O34j552j058J085J049n64j530N36J580k26j796m12K113M94j514
6100e46m96J153J103r92q72K62J615j55k005O8K121j13j505m91P68J313p38j433
6118i43M37J949r79j269J99J259j0j195j34M20J294j190j261J065J466o58j619
6135a169N30J291p7p26j001J569P96j392r37J155J392j265j136N74J150K45k010
$$ y = [59, 1320, -178, -1373, -334, 922, 90, -1069, -812, 908, 895, -797, -1349, 670, 1332, -425, -1296, 138, 1467, 536, -1109, -561, 1205, 931, -715, -786, 946, 1417, -314, -1155, 268, 1167, 462, -1435, -799, 1022, 454, -1260, -724, 863, 734, -435, -1299, 223, 1472, -130, -1608, -533, 1195, 518, -1198, -606, 722, 1213, -416, -1096, 202, 1603, -1, -1254, 93, 1294, 415, -994, -291, 737, 878, -633, -1300, 615, 1249, -303, -1361, -276, 773, 209, -1321, -785, 795, 569, -1227, -1639, 474, 968, -546, -1042, 111, 1214, 222, -650, -388, 1227, 1072, -933, -865, 1256, 1143, -362, -853, -85, 1228, 490, -943, -506, 1443, 464, -805, -606, 653, 643, -552, -686, -266, 1028, -162, -1423, -358, 1108, 450, -1169, -639, 652, 575, -151, -1152, 417, 1213, -179, -1116, 39, 1431, 166, -970, -396, 754, 999, -1011]
6152a011j22J723O13j674o70J419Q28j205q92K38J486k59j553Q0J413M74j480
6169e92n54R58R94p58p17JJ886m25k102P75J298rq85p70J214J003j433q30K52
6188f94J899p28j202K43J317O2j290l31Q76R41j195j190Q90J254m37j643R92Q53
6206F17nj246n41J610P27j404q06J413J023r90j429P90J020L68j662l48J519N29
6224A185j807k64J213O69p54j185K64J344l4j466k66J408N48j509n43J277Q82
6241I62r48r96M06J603j14k086N62J400l9j545k98J427Q98j023j029P06J425n67
6259G44j729K84J679k76j259m9O94J062j620j244J533J136r08j198N72J145m71
6276I5r53m6J782L57j422p73J382Q62r99r14L90J237j16j763j8J359O95j315p38
$$ y = [-1011, -1133, 590, 1203, -471, -1141, 278, 1106, -99, -991, -753, 733, 474, -1079, -999, 414, 888, -592, -1146, -188, 806, 48, -669, -668, 1218, 793, -1309, -534, 764, 755, -130, -900, 314, 1317, -116, -946, -694, 1205, 477, -725, -482, 835, 897, -393, -724, 152, 1093, -102, -1292, -402, 852, 415, -1228, -236, 617, 612, -634, -1175, 435, 1162, -242, -1048, 365, 1388, 398, -1031, -241, 779, 1147, -515, -863, 656, 1185, -622, -886, 327, 996, 242, -943, -679, 665, 631, -835, -1101, 307, 855, -654, -1197, 80, 962, 14, -982, -576, 1027, 913, -1173, -611, 789, 750, -795, -1093, 334, 1232, 209, -820, -114, 1311, 744, -985, -701, 978, 702, -557, -606, 88, 1150, -470, -1714, -181, 955, 47, -1151, -579, 566, 95, -858, -904, 878, 1235, -187, -960, 422, 1284, 285, -629, -239, 998, 882, -881, -899, 460, 1155, -160, -898]
6295h98J251K75p56j008Q42J227k87j511K42J280L13j822PQ88N44q45q69N80J244
6314F97j47j769P45J416j66j301m26J228P19j003r17J086J070p66j533Q02J128
6331H63K80j725l52J123Q56j162j397J580R97j201r86N61J497m26j601l9J919
6348G87L11j143j136J196Q86q70j027Q37J113m78r98m19J737K39j591m25J465
6365D84O63j075q73N15J232j8j757qJ787o5j358m23J416O1p31j104Q19J287o53
6384A99j110L78J417j66j542J34R12R02j059j183J057J347p32j555R63P45j24
6401E83r36l98J293K61r61j136J380J039j234j008P84J087m13j051r4J331K71
6418G98j455k48J118P12r30j011N94J520l04j503m0J602k74j133J64J102L93j135
$$ y = [-898, 353, 628, -128, -1136, -294, 933, 646, -865, -623, 657, 970, -852, -845, 43, 587, -258, -1127, -547, 697, 550, -1219, -474, 942, 776, -525, -951, 277, 996, -7, -924, 162, 1232, 466, -1067, -265, 863, 1143, -582, -934, 189, 1045, -117, -1514, 66, 1063, -138, -1124, -563, 934, 508, -1093, -1132, 787, 1098, -45, -1181, 15, 901, 31, -996, -159, 954, 476, -522, -941, 796, 1035, -556, -981, 484, 1147, 72, -801, -286, 946, 928, -829, -837, 950, 885, -473, -896, 520, 581, -150, -1254, -435, 852, 199, -911, -533, 884, 718, -824, -690, 222, 1124, 65, -1118, -61, 1286, 554, -1001, -38, 707, 583, -353, -751, 542, 803, -158, -1294, 86, 1125, -109, -1117, -333, 754, 341, -710, -804, 527, 798, -657, -905, 213, 925, -5, -1016, -422, 1098, 794, -709, -749, 853, 579, -554, -390, 712, 1105, -30]
6436c0q63Q23J141o48j499L19J431P5j651L0J102Q24j085r92N83J455q69j077
6454i31L45J608k27j384k69J254M21p16j207J113J322j024j027N11J171l03j109
6471d52o17J453N45j223p14J187J087j251r40P64N96P5j326QJ208L20j222m08
6489i10J119M18r97o85Q36J305p19j105O2J510j34r72l42J064M67j322n94J116
6507A17R72o18j188K01J365j84j507L3J386J07r40o17Q13J373j006j373P90J056
6525G80j58j481L10R15N29j345m70Q99J244j074j033O99J079j55j454K51R73L72
6543H81j125n17J114O67j235l26N09O40j29j425K95J183Jj302j93J263P10j027
6561a6r96O94R96l03j130J36J388j79j491k2J196O62q86r53O91J236o92j056L56
$$ y = [-30, -893, -70, 1071, 423, -1076, -757, 674, 749, -902, -872, 230, 1054, -31, -1023, -440, 1015, 146, -931, -586, 1022, 795, -589, -858, 396, 817, 101, -1106, 7, 1329, 305, -722, -211, 960, 657, -452, -1069, 384, 929, -294, -1008, 179, 1266, 15, -925, -161, 435, 510, -816, -808, 400, 720, -502, -910, 209, 627, -370, -1055, -219, 1086, 367, -738, -676, 834, 700, -272, -614, 450, 917, -405, -999, 117, 1089, 471, -717, -516, 849, 665, -842, -809, 577, 684, -256, -873, -60, 1313, 307, -1066, -276, 780, 622, -859, -549, 366, 895, -450, -920, -21, 1223, 149, -884, -185, 894, 739, -715, -464, 509, 881, -244, -761, 353, 1020, -215, -541, -32, 608, 479, -946, -651, 532, 533, -769, -962, 301, 1011, -16, -1012, -318, 678, 375, -755, -619, 769, 590, -901, -923, 273, 935, 49, -904, -213, 1023, 331, -725, -369]
6580c69J205m97o50l74J150K34p75j059J032J137r00q83P43O66p11n97j48J099
6598C03K53q61p12J186J108j351o98N12R67l56r51K23J196J91j703j93J514L48
6616I76j404O1K79P21j82j150J44J179M41j504n13J381L80r51o91L97J142l21
6634C85j158K91J220p4j550K04J131K39p21p34O38J195r47j344J101J347r61r98
6652g36K97Q95J82r14m92R61Q07p19j274Q34Q31n19q21n6J291J77j234l53J189
6671C46M00o62j276J199N53j98r65O5J026M89j465m38J363P49j293p31J049N20
6689G31k57j115L92R93J16j712RJ491j96o51p30Q43R10p55r61L63J320l09j280
6708g98N5J030M46j007m12P54J069r34j019O99J187n82j029J5J093Lr46k62P18
$$ y = [-369, 836, 339, -311, -685, 465, 699, -76, -1135, -103, 1034, 134, -749, -6, 660, -51, -648, -796, 303, 556, -305, -1017, 169, 1277, -74, -772, -260, 707, 351, -600, -377, 819, 1010, -693, -886, 628, 976, -428, -367, -88, 633, 451, -699, -555, 624, 1065, -439, -952, 429, 809, -142, -833, -436, 706, 385, -773, -482, 738, 664, -886, -682, 449, 688, -33, -767, -129, 1066, 119, -1225, -124, 1223, 262, -736, -439, 456, 638, -276, -768, 193, 1000, 281, -993, -159, 672, 153, -668, -724, 567, 744, -490, -843, 346, 746, 84, -1192, 7, 560, 362, -603, -538, 488, 977, -488, -926, 437, 1186, -107, -838, 211, 731, 474, -641, -249, 744, 860, -852, -843, 648, 452, -199, -929, -86, 824, 69, -892, -529, 791, 482, -798, -743, 287, 733, -274, -686, 68, 1137, 203, -816, -117, 1070, 488, -541, -526, 567, 570, -376, -638, 80]
6727H0R23q97j036O92J015l83j091K10J212j62r35k32J181J87q55p64P08O82n28
6746Gn55L13P57J42j379l30J616K94j293l45Q79R00p20p43J36J212l93j198K07
6765d93J057r5r01j9L31Q02m47j324N72J086r0j275J30J020L43r30l80M55R05
6784G47p65q97O80P63k95n96K60O08J94r28j44R65J41p35n95O49O14n25p12K8
6804e43R90J55j169n60J333L75r03j45L92R53n80j398M61R98K6j091K23P58J00
6823C75m88l65O73O26n84j108P89R78n45q11m04J351J53r26l18O61R69p38j422
6842a134Q17J161m73j281K69P80K47p14m99Q21J133j338o22O81Q80o69p66L90
6860c17P03L40r43m77J258K64j061m62Q47M23n38o45K08J229k4j114m37J300L20
$$ y = [80, 1003, 106, -930, -238, 777, 394, -697, -487, 725, 563, -372, -604, 577, 764, -91, -855, -147, 535, 7, -548, -235, 522, 664, -715, -1045, 571, 865, -428, -773, 106, 1006, 286, -457, -321, 891, 498, -700, -493, 564, 469, -432, -451, -120, 682, 235, -1089, -517, 569, 479, -796, -666, 354, 697, -233, -613, -158, 747, -18, -915, -235, 528, 233, -363, -103, 505, 699, -229, -373, 592, 733, -2, -597, 52, 666, 141, -571, -543, 447, 602, -567, -1127, 206, 581, -322, -467, -75, 878, 298, -1100, -639, 359, 385, -706, -483, 275, 375, -113, -478, 195, 821, 237, -871, -82, 896, 351, -460, -864, 487, 640, -286, -604, 57, 1026, 288, -1134, -317, 844, 371, -910, -641, 139, 386, -328, -827, -6, 1127, -211, -833, -152, 728, 59, -707, -317, 386, 726, -217, -694, 564, 828, -233, -695, 152, 575, 37, -608, -400, 829, 805, -309, -746, 554, 874]
6879H74j219k53R38L52o28r42N29P40Q2j119k38J273J87q66m35N99N14Kj109M43
6899b76Q21j49q76j38J420m05o73r0N74O74o52j073N37J256p45r77L71P44J87
6918E30j142k56R25M50l52j105J159N06m88j068N69Q55L6r47k03O57P33r87l66
6937d94P10M71l23p35M39P23l31p37k47J071M18j567m10Q18Q11o75o26K05R19
6956D40J63j274L72R62k30q92m75J145P67r86o95O66Q09j85j194M08P26N6j243
6975f60P8Q00N99j040p76P57R28m33r74M17N64p3q48J05M64N81n97q54R68P00
6995G06q98o93L85R95l15o80m7Q47J54m85m49Q71L61p59m27L42O13r1j101J18
7015e53J330k87r63l43J055L87p42m68N36P01L7j438K75R13j03l61o04N81M51
$$ y = [874, -345, -598, 340, 692, 64, -878, -349, 391, 473, -646, -884, 389, 576, -290, -725, -126, 388, 390, -719, -276, 545, 396, -480, -618, 802, 397, -276, -366, 208, 882, 230, -843, -306, 950, 205, -772, -401, 343, 530, -612, -868, 57, 507, 155, -950, 209, 715, 227, -841, -272, 583, 619, -328, -531, 126, 859, -128, -494, 216, 687, 364, -371, 68, 791, 460, -277, -524, 547, 965, -602, -1012, -194, 617, -58, -684, -479, 440, 603, -671, -299, 663, 433, -459, -934, 211, 978, -8, -703, -37, 772, 587, -607, -199, 527, 583, -660, -582, 218, 817, -223, -999, -242, 686, 253, -721, -304, 260, 187, -661, -556, -92, 489, -108, -962, 6, 706, -192, -885, -500, 495, 180, -500, -547, 300, 454, -31, -480, 391, 752, -7, -434, -92, 521, 430, -671, -553, 777, 490, -473, -816, 239, 626, -116, -584, -48, 653, 690, -748, -473, 440, 337, -24, -628, -47, 404]
7034D04n66o81P13Q93m23j111M44P87n3n92m94P75M24p64o74R29P13n42p71J56
7054d33J116l98q14m01J281K51r14o95P77J012j138k49L1R46j41p30j87J243L99
7073I56j453l44R00O30o28p27M43Q20j19j105j90J396J14r27l32Q80L32p24m64
7092e42J90R40k57j299O83R56j92r51KM76O53p56o96M67J055n08n77K92Q48m37
7112C47m35m49J149K87q96p24Q36P85q81n82L51Q74k80o17k53O45M59j014n72
7131i70R81P11q13q23N12O78M9r81J26R22K30q58q40J474K57q17n13P56M11M3
7151E35r04k35J505m09p06m73J121j14m94n00N49O08l66r29O54O46n8p38j44M50
7171bO31q31n66O36J053q93q26N20Q22l96k96j7L42N09r45l59P29K75k25o85L28
$$ y = [404, -162, -843, -130, 763, 340, -771, -327, 460, 407, -185, -679, 96, 520, -244, -918, 11, 724, 182, -589, -433, 683, 285, -529, -930, 351, 602, -312, -1007, -230, 782, -356, -605, -574, 372, 231, -499, -686, 557, 956, -497, -841, 59, 689, 61, -666, -223, 597, 478, -627, -817, 579, 693, -234, -566, 314, 646, -78, -542, -352, 588, 331, -968, -285, 671, 479, -472, -470, 6, 659, -97, -793, -326, 729, 221, -356, -64, 784, 347, -88, -537, 612, 899, 3, -721, 115, 900, 19, -563, -212, 662, 382, -235, -488, 157, 616, -398, -970, 11, 722, -91, -914, -402, 276, 325, -656, -530, 392, 622, -236, -1076, 398, 655, -162, -675, 81, 492, 535, -369, -604, 901, 492, -214, -687, 434, 320, -174, -674, -125, 483, 117, -812, -158, 488, 430, -308, -452, -2, 629, -202, -768, -132, 921, 28, -798, -278, 544, 148, -148, -165, 177, 686, -259, -618, 111, 386, 161, -524, -196]
7192a96R88m00o22l66J085K22r05k36M67L29m30n21L68O37L7r69l63J233K1q64
7212d85j10O94N69j038j51L84O35j85j037K61J030k37n87k61R76K20p13k48K24
7231e9Q08m02j090L68Q31Jq06j25O09K60k98o55L65O24m79p43O91O78l34o68j95
7252f19P43L71m97o28N21Q02r64j33P5J004l99p11J71M90L35q69m05R21M86j217
7272e23k58P12K29J0n56j02P60Q9j319J98P90L78m66m98N27R04n85p45K90N31
7292C66m2n40j88P09J43n95l1j75J015j73j309M33J017k12j091L01O64p2j89o47
7312f16M15Q81r99k48K36O52p3o16j03P06J74q03m95J162L67q68k77N84N17k77
7332C19n83k4O94L08j244j60J004J70p21l76M35P93n91o95M27Q76k48q79j08N01
$$ y = [-196, 792, 392, -230, -596, 489, 711, -194, -430, 37, 366, -64, -585, -217, 420, 457, -512, -875, 358, 379, -485, -595, 99, 668, -370, -521, -137, 498, 313, -724, -463, 567, 330, -257, -518, 458, 678, -35, -283, -59, 749, 347, -743, -375, 456, 457, -349, -474, 135, 395, 97, -558, -193, 431, -48, -791, -100, 578, 244, -424, -619, 124, 495, -2, -630, -109, 693, -271, -404, -329, 675, 276, -435, -264, 226, 561, -308, -713, 208, 694, -523, -781, -69, 160, 170, -386, -488, 272, 361, -958, -760, 30, 408, -58, -556, -29, 875, 290, -455, -165, 366, 324, -216, -404, 305, 448, -147, -178, -353, 662, 489, -820, -387, 630, 418, -673, -372, 292, 220, 31, -616, -201, 680, -319, -567, -331, 321, 248, -368, -471, 235, 409, -394, -889, 273, 640, -228, -505, 79, 596, 319, -264, -288, 406, 714, -530, -690, 314, 484, -237, -613, -178, 615, 24, -671, -244, 632, 384, -495, -603, -102]
7352a02M45o23l68Q13L69n36q84P50M59L1q06j1P26J64m71o61P21O87m64p35P39
7373B43L71k16o99o2M68M12o42k98N37N25p10p05P41N81l47p02PQ86N7n26m60
7394e39P01L70p86n68P61N50k55o20l4J016K01r53j83P86jq25k67Q73L5O5j093
7415g66O98P76n44n04j59Q60M5m35l86n3J224o90o25M01M67k7q02K93K87L75o46
7436b11o91P16P42m27n80O31M60m86o28J40N80J91q89K0N11N51o53m74M22P93
7456G18p25l80P1N11J49m85m65J084K55r46k42K35O71l88p10L40Q17M9j014nO14
7477A54J83o22k99N05N29l71m40R1O31k52o20K60N99Qm71m92N42O31p18m73N57
7498f8PK20q40L97N77j09k21l02N12N85p84p63O86P28m96j41l6N34m4l69k89J00
$$ y = [-102, 343, -280, -648, 165, 534, -2, -886, -136, 323, 354, -452, -463, 263, 427, -44, -705, 16, 703, 239, -496, 243, 614, 398, -301, -363, 105, 517, -125, -423, 114, 639, -71, -776, -35, 546, 199, -503, -496, 390, 447, -79, -539, 162, 532, -254, -822, -61, 489, 234, -386, -420, 596, 797, -156, -339, 447, 446, -379, -646, 227, 262, 327, -766, -68, 708, 164, -340, -499, 361, 406, -29, -415, -468, 756, 66, -559, -158, 309, 282, -520, -227, 60, 435, -211, -902, -186, 556, 129, -451, 180, 640, 154, -474, -334, 246, 437, -452, -432, 79, 630, -23, -497, -75, 718, -7, -387, -316, 195, 344, -141, -606, 478, 733, -213, -455, -220, 451, 63, -647, -307, 510, 559, -455, -460, 154, 337, -285, -584, -79, 450, 79, -361, -270, 361, 109, -511, -251, 348, 356, -115, -607, -65, 566, -152, -625, -68, -61, 159, -681, -284, 293, 184, -37, -339, 173, 758, -26, -789, -103, 625, 129, -12, -48, 486, 442, 73, -216, -116]
7520a16P22m42j052P70P54m36l46k25O82M2o22j33N12M65q02l73M26L52l00n46
7540f68L34P46Q7j123L43N25L23q18j67L95L21k01o19K94P72l58q95L12Q23J13
7560E39q83k13OR26m74j52M67K99l00n24JP60o3m54k94N76J02k20n64K93R81q18
7582io92O32O11l39n10m26J131J78o27o45Q72L68n42l24K19N65k12p79k1R51K06
7603F07n88n29M82L54k41l24k18N36K37p41L49L76J87p05l47P07K32j16o53K77
7623a18L88r4n60K92L10q9m51Q1M49M26o14n26J10R84l45p92K55L01K01l12k39
7644c43L00N33k57q57N84N10o70j03j40O09L42o11k98O27K24o63l11P39K27l07
7664A35n04P4P50K56j147K57M04lj93k94O04J22l17n12J58N89j71p34M47L49l5
$$ y = [-116, 606, 164, -888, -118, 636, 200, -146, -371, 311, 353, -269, -402, 110, 575, -227, -600, -174, 178, -122, -668, -334, 412, 499, -624, -281, 244, 567, -251, -418, -23, 298, 97, -522, -228, 544, 186, -709, -397, 426, 539, -344, -557, -551, 375, -99, -251, 216, 515, 215, -309, -308, 452, 389, -65, -359, 217, 319, 99, -465, -172, 809, -9, -701, -69, 542, 203, -307, -733, 398, 576, -51, -696, 176, 544, 2, -322, -103, 462, 250, -529, -550, 401, 607, 19, -510, -28, 326, 85, -239, -457, 79, 316, -425, -76, 300, 487, -218, -565, 142, 374, 258, -395, -118, 270, 176, -384, -92, 218, 129, -322, -241, 208, 634, 20, -506, -396, 588, 243, -549, -294, 7, 208, -104, -343, -43, 490, 233, -624, -40, 470, -200, -303, -443, 166, 508, -103, -401, 226, 450, -213, -524, 215, 442, 135, -369, -295, 455, 711, -436, -179, 225, 222, 29, -265, 339, 461, 144, -368, -210, 379, 208, -526, -79, 270, 235]
7685B35m66N9L42J2m3m92K85O58l37n89K02J59L66k71m02L93L07m71n07P67K81
7706D88o06l46J0O06J89o73j92N70K92p47Q0J96M98l96n76K30Q34P0q06k4M86
7727A83N39j028pP04L3k64m25K61M43J93q88J36O38m7r44%O04J39l95m56L52Q05
7749E76k80o98K02N58j45o75J33M68K80j54q18M78M93k37l01L6L05Mm68M0M24
7770B21J38j68n09K56N46l70m82L19K80k82j27m07N24O29p61n21P02L88n41m11
7790e76J73P61o6p88J75O49Rp50p3O45L28n59l89M34L05R7n49l50R10O7m76l83
7812d06N31L35n67j98J42N36Jo96K09P28n33m13k59O59L37l92n31K91O62k35o98
7833d97M78J39K92m91k51P02R4n84o01R18K29p68j29K60M40J8m53k58P21P1o13
$$ y = [235, -231, -172, 170, 182, 139, -353, -68, 590, 253, -336, -134, 25, 391, 120, -282, 111, 418, -53, -560, 207, 488, -118, -464, -454, 152, 341, -332, -524, 46, 338, -409, -329, -133, 365, -31, -607, -377, 457, 527, -279, -303, 183, 722, -306, -313, 391, 424, 160, -265, -4, 439, 632, -256, -120, 518, 471, -473, -473, 131, 270, -125, -581, -229, 576, 296, -402, -200, 358, 213, -462, -329, 139, 419, 265, -553, -75, 418, 181, -120, -84, 221, 225, -243, -203, 221, 359, 191, -318, -62, 484, 114, -368, -49, 231, -51, -178, -585, -61, 568, -193, -714, -12, 376, -165, -576, -403, 358, 292, -496, -321, 328, 337, -413, -486, 159, 487, -72, -461, -27, 278, 375, -174, -524, 386, 453, -23, -406, 125, 460, -107, -305, -163, 373, 374, -322, -113, 615, 82, -331, -590, 69, 406, 14, -517, -226, 436, 201, -497, -19, 120, 412, -79, -330, 372, 466, -118, -719, 199, 428, -340, -469, -209, 231, 249, -204, -462, 259, 330, -283]
7854b83l53O25L59n46l11O02M94o05Q6j19L75N6o15pO10Rk11l31J00O27l57p41
7876e36O30K80j11n41j97N24L21q12J6P17K86p29m45K34P78k38m25k88M36M37
7896C37p61J68J05L95k68n42L03M74j52q8j49M26J99n67k30R39l12n40k6M62j55
7917A8L8k27l81Q39O0j71m35J62N14m53l44K26M06n1q93L59O72k00l69L59k6L61
7939D64p62M8K71M88j31o82l4K66L39m33k33P60j79k94l91N86M83n70m76L83M92
7960C95j21l36l52M35J51m32J37L02J68o86Q5Q6N54p8n72k32O33J96m74j76M22
7981A05L58n59l78L39L47J88n83k71N01j09j49j95M27L37o50Q4r7N28k22m95M99
8002EK83k3n33J9K40O2j11j27L38K55j8n97J23N56j20o23j06N11mm4n45R34n6
$$ y = [-283, -636, -11, 348, -198, -509, 93, 587, -18, 68, -51, 324, 380, -235, -242, 368, 377, 166, -165, -65, 562, 205, -536, 94, 374, 263, -278, -475, 49, 370, -442, -426, 291, 577, -152, -597, -363, 415, 177, -248, -536, -100, 337, -424, -256, -151, 244, -24, -566, -263, 211, 59, -29, -178, 248, 447, -120, -350, 589, 277, -263, -289, 173, 18, 56, -171, -552, 287, 347, 176, -259, -97, 417, -36, -380, -154, 252, 201, -692, -333, 339, 139, -230, 129, 103, 464, -298, -250, 21, 509, 378, -304, -338, -72, 267, -166, -399, 361, 182, -112, -503, 83, 566, -4, -480, -97, 395, 274, -62, -414, 21, 172, -260, -123, 179, 347, -339, -254, -168, 386, 308, -264, -496, 137, 333, -141, -317, 105, 463, -96, -474, -135, 212, 400, -183, -454, 47, -62, -211, -406, 21, 358, -292, -208, -305, 223, 1, -494, 5, 288, 265, -268, -249, -9, 53, -58, -185, 153, 408, 390, -207, -84, 472, 352, -271, -377, 134, 130, 86, -459, 475, 419]
8025D19m02l11J78M65l20j76l09M70K79m16k50N87L07o93k54M24K94j23l05l34
8045d70M54J92k14m77P43K48o74j64N17J88j02m18j36K00L81k07j28L73j70k35
8065i9k11L63L59m47l05l2L44J46l77%O20J77n41m22K95O30m56p21K07O66k67
8086g1ql68N81K77m49n0r7N93m35j12J66k30K16l21P2N75j84m5n61L15L10l48
8108a74l43O49K22k25m11J6M17O5l88J2L12L92o48m2J31J24L06o36p6O29j68n67
8130d03L16N25q6n34J7R1O08n68m66K52L98j05m56p7P67J90o75M1R6L58k31k17
8152a59L07M3k2k01r0J0M10j14m73L27L78n27k65P41L78n25n67J45M84k9m05j8
8174a72M41O0k51m93N62K7N1q55N09L81k11k58J1L72J06j32k16
$$ y = [419, 17, -294, -116, 349, 29, -147, -456, 14, 293, -123, -373, 214, 521, -172, -426, -2, 292, 169, -136, -470, -16, 176, -38, -515, 228, 476, -198, -362, 155, 343, 241, -177, -313, -113, 268, 61, -67, 306, 136, -99, -310, 53, 412, -35, -340, -372, -28, 118, -259, -259, 361, 538, -3, -425, -130, 500, 44, -677, -470, 196, -71, -79, -447, 134, 411, -38, -88, -185, 408, -27, -139, 27, -203, 13, -308, -236, 339, 155, 110, -451, -136, 174, -174, -517, 132, 354, 129, -282, -266, 151, 216, -172, -160, 152, 544, -104, -146, -15, 109, 415, -221, -297, 332, 164, -403, -87, 438, 352, -182, -165, -74, 534, -34, -500, -248, 150, 45, -411, -488, 279, 469, -206, -165, -69, 289, 58, -159, 148, 191, 169, -32, -122, -112, 298, 184, -289, 38, 416, -111, -376, 365, 743, 218, -349, -204, 280, 251, -154, -172, 269, 329, 78, -415, 147, 174, 225, -630, -121, 260, 49, -209, -198, 174, 280, 148, -68]
8191f8
$$ Imaginary data points
##PAGE= N=2
##DATA TABLE= (X++(I..I)), XYDATA
0@%%%%%%%%%%qJ6j6J6j6J6k4L2l3M1m8N4o3P3q5R6j10J26j42J59j78J98k23K51
34A32k78L08l44L83m23M68n20N78o40P08p86Q72r68J079j206J356j535J748k010
53a078K344k785L394m292N753q518J5495o1619j36470J53509J31925p0941j10911
66h4194L2212P2676n411n8623r565M6663L4919k2784l6358Q701N3435J9315n0319
79F67l2866M5561K6103m0799n117M7642q599n2948K444L9022j922l0198j2081
92b3091J6313K1612r24k4293j6128J0232K0681M18k1188k519K6003K545k3466
105a3805O960J9884j8910j9000K0253K1652k313o714q466k476O630j0836j4855
118b1996L1951M4448k6472o6190j60O7204J9748o1050k8208N5729K7155n0999
$$ y = [0, 0, 0, 0, 0, 0, 0, 0, 0, 0, 0, -8, 8, -8, 8, -8, 8, -16, 16, -17, 24, -24, 30, -33, 40, -45, 51, -59, 67, -75, 84, -94, 104, -119, 132, -146, 162, -182, 201, -222, 246, -274, 304, -336, 372, -414, 458, -510, 569, -637, 719, -816, 932, -1078, 1266, -1519, 1875, -2417, 3336, -5182, 10313, -51306, -187776, -34267, 97658, 26717, -84194, -51982, 20694, 15283, -43340, -52905, -6242, 28677, 5893, -30465, -21764, 31671, 50986, 667, -32199, 13362, 39465, -1334, -6451, 41191, 32592, -20356, -17912, 21110, 19188, -11010, -23091, -6778, 14834, 13910, -10383, -26511, -16279, 4402, 4820, -16368, -18887, 7116, 9661, -13805, -6845, 13039, -5871, -24871, -4618, 17034, 14721, 8007, -459, -2935, 3695, -7141, -21996, 9955, 54403, 27931, -38259, -38419, 28785, 48533, -12517, -40725, 15004, 42159, -8840]
130h840k1411M0049R815l2260j1674J2183J6088J0400j4590k4997J0067K3134
142G964j0322j5537J9709J8943k5616k7120L5365M6165l4447n7414K7956N4246
154C9892k1156l5814K2204K2771j9539k0899K30J3048J3153o169j9720L757K2139
167A3897n785l2493o600L5898J9603l2110j9976L5999J6699m5006j9755M3610
179C981K7362k4162k8729J747L2273K1554l0990l9378K4769M6499j2360m1207
191a8641Q828M0486o340m8817l626N3809J3082m8365j9593L2949J7465j6098j7855
204a2716j248J6010M712k8251q567M6167K1343n1305l8032L6522M3642j6939l4786
217b3448J5230L6621j3457l5846J0089L1478m451j7039N40P835Q691p83k2462
$$ y = [-8840, -30251, 9798, 19613, -12647, -24321, -12138, 3950, 14350, -240, -25237, -15170, 7964, -2358, -17895, 1814, 20757, -4859, -31979, 3386, 49551, 15104, -42310, -14354, 39892, 18736, -17078, 5126, 27897, 8358, -12541, -12311, 737, 13890, 7721, -11999, -8242, 13897, 8112, -24381, -30981, 4917, 24520, -7590, -27566, 8433, 25132, -19874, -39629, 3981, 31343, 7181, -21548, -19801, 12472, 34026, 3036, -36342, -11573, 34926, 22566, -18641, -9813, 30673, 24333, -24484, -28110, 25699, 38781, -9584, -29177, 3772, 21237, 5139, -12716, -13964, 2046, 6758, -21493, -30060, 16107, 37450, -13855, -51887, -15365, 28277, 11338, -23448, -8218, 28403, 14946, -20900, -10811, 20667, 16216, -823, -283, 7552, 16243, 15460, -7002]
230g002p972K2789M077k3139L782K4180r703l1190K96L1450P090l1934j2228L3874
244D370J8823k7467j9053J6579J6705o58j1238q472J5620J7190j9352k1332K4387
257F102K3305k5605k8264J5473K8404j443k1460l140J3838r543k2048J3199L1622
270B0440L52k5366j6297Q003K2762K613k7282l364L4258M076l5097l461L1406
283A3043L691k8951j0309K5779K0523j6522k2577J0299J5220r793r128R031J0779
296A1085p73j4598j1885K0535K3254k5710l1843K4495L3788k0892l2854J4171
308a1227L4021m552l9126r245L6285J7462k8758j8109K3038K2399j2467l3655
320b3934o509L9676K5053l3257k6419L0773K1884l2140k4309K7104L3288j2357
$$ y = [-7002, -14974, 7815, 11892, -11247, -7465, 16715, 7012, -24178, -23882, 7568, 14658, -17276, -29504, 4370, 23193, -4274, -23327, -6748, 9957, 9299, -1939, -10411, 5209, 22399, 3047, -18285, 6102, 29407, 3802, -24462, -8989, 19415, 17972, -3488, -6628, 7210, -2333, -24381, -11182, 20440, 20792, -4574, -20871, -12868, 9894, 12507, -14775, -18139, 16119, 20195, -14902, -18363, 13043, 16734, -12217, -22526, 3253, 23776, 7254, -15323, -5024, 10196, 403, -8725, 306, 11085, 10312, -4286, -16171, 4364, 27618, 1908, -29935, -5440, 28348, 7456, -25398, -11227, 22794, 18242, -20884, -30129, 6156, 23618, -5140, -23249, -211, 22188, 9721, -23934, -30443, 9233, 34286, 1029, -25390, 5383, 27267, -4873, -29182, -2078, 31210, 18853]
332A8853l7997j500L6941R666l4056j6932K2979J9546j0616j9445L219K2693k468
345A0883l3619j242L9396R036l2929j3777K0268J4346q289j2260N401J2839q658
358A395j6467J1298K2073m899k0519n951J2685J1152r994j2932J4806J8553j8872
371B328k2933J4735J9033j1616j4599Q704J8943R19k4140j3502K0812J7206j4547
384A343j2803J2330J3531q255j9340r09K3778O419k6888p490K9686R411k6285
397e472j4072J4675J6523m834j5826J200J8968j899k3490J195K5619N146k1402
410c669j4512J2413K0944m370j9856N749J7832j4378k2821J4379K7501k544k3512
423f844r416J5953J3776j6017j7040J8621K1774j5123k2795Q007K2041j735k5957
$$ y = [18853, -19144, -20644, 16297, 25963, -8093, -25025, -2046, 17500, 6884, -12561, -9342, 13351, 10883, -22736, -23978, 15418, 24454, -8475, -22252, -1984, 12362, 4073, -8187, -2786, 10053, 1395, -15072, -3774, 18299, 13400, -7119, -13070, -385, 10767, 773, -12159, 2647, 21200, 2328, -20605, -5870, 13163, 1547, -13052, -4348, 14595, 15514, -8626, -22128, -1316, 15890, 1343, -11460, 870, 14401, 6146, -13194, -14103, 9675, 16094, -10794, -18284, 11402, 20813, -5472, -19544, -4869, 11654, 6820, -9006, -7806, 11162, 9263, -14227, -13032, 12587, 17733, -3669, -18181, -5768, 15176, 10806, -9050, -3301, 14531, 153, -22668, -8289, 19212, 16668, -6844, -16260, -307, 13469, -2548, -19588, -967, 20807, 5684, -17111, -9104, 12937, 11202, -14755]
436a4755p714L1199K0370k9175k5107K1062K3098j5286k2011R609K6333O57l0217
449a1937j0010L0800J4744k8496j8143K2449K3047j2200k7530O97L1058P401l2395
462a0515j3515K9720J4272k4211j5947J9409K2450j2200l3107l16L5827J0121
474B1988k6456r589J8851O149j5187j1378J2372K0829n545k5178J177K5906P97
487A4736k3806n150J7302R852j0576j1544R839J3538j5514j9769J4778K2600p593
500H693j8107L59J1931M396j1197q461J4130J1860j6164j4632J6047J7013j0293
513E575j8508K039J9026L820k0576n988K4956R480k2927j1134J5378J0829r528
526B442j1275O335J9934j588k7308p336K4244R940j7697j0069J2349J1338j1087
$$ y = [-14755, -22469, 8730, 29100, -75, -25182, -4120, 18978, 3692, -18319, -8710, 17623, 18280, -11937, -21947, 8853, 23597, -4899, -23042, -593, 22454, 10254, -17276, -16579, 14479, 21880, -10515, -24030, 5690, 19962, -4249, -20196, -787, 21663, 9463, -23644, -23960, 11867, 21988, -4468, -14057, 4794, 10943, -4244, -15622, -3250, 17579, 12034, -13144, -11967, 13939, 14736, -9070, -14220, 3082, 12934, 2358, -9186, 653, 14191, -1323, -21092, -6314, 16286, 8693, -9414, -9055, 2876, 7272, -3925, -12386, 1744, 13604, -2560, -17192, -1145, 15868, 5575, -12933, -10894, 8132, 11952, -8624, -14612, 10344, 19824, -3103, -14237, 1141, 11970, 2442, -8833, -2498, 17436, 15848, -11460, -18796, 5448, 15388, -2309, -12378, -29, 11309, 222]
539B22j8231P357K2202o896k3794O586K4033L25j8320q588J2033J4976o787j5044
553i926J1008J8951j3092k2305J0549K3779k008k2812q153J8983J3005j7745j5181
566a4947J6643J2055j8105j6955J1288K1275J295k3548j2195K3485J6649k4259
578g319j8242K5577K3599j6769k4591Q845K5260j611k7248k402L0036R994k5823
591f94j5832J4699J7456m865k1970l438K5926Q605k8297j2471K6365J2062k4055
604f509j5072J8662K1552j1157k4579L251K3668k6j9164j41J4494K596j0305p704
618a0434Q767J6485o961k4102L550K5423J374j8553m64J3411q3j3919m418J5238
632E314J0726j4652j3198J2095J1621r404j2791J908J1266M758j2136o795J5019
$$ y = [222, -18009, -10652, 11550, 4654, -19140, -12554, 11479, 11804, -6516, -15104, -3071, 11905, 5118, -9926, 1082, 20033, 6941, -15364, -4815, 18964, 16956, -5856, -14009, 4974, 17979, 234, -14947, 1696, 13751, -4354, -21309, -10021, 11254, 12549, -10999, -23194, 291, 16940, -7319, -25561, 16, 23615, 6846, -17745, -8900, 16360, 14749, -12499, -14901, 15135, 25129, -694, -16526, -1827, 15629, 10764, -11206, -14644, 11282, 19887, -8410, -20881, 5484, 17546, -6509, -21581, -2919, 18633, 7476, -17103, -13852, 9816, 9790, -9374, -9515, 4979, 7575, -2730, -10434, -1667, 14818, 7857, -16245, -12695, 12728, 14102, -4451, -4915, 8496, 8413, -5506, -9924, 5314, 16040, 1388, -11810, 285, 11906, 2502, -10289, -8381, 2885, 7643, -4493, -11288, 3731]
645C731P271k2453r652K2194J3954j4575j3991Q179J4942k803j6289m76J9392
658I424M603j7192o220J3483J1233r048j7808L770K3457m75k7490j092K6516J855
672A5016k3124m474J5592N542j3371r543J3035J5649j1362k0004M467J7292K762
685G477j2189o968J2440J3451j4088j8601J7013K2231j6801k3046J5090K5629
697B1638n682k3394n711J8370J0737j5945j0567J6736J1941j6285j9056O911K2713
710A2406K924k5923j2316K5157J4624k4127j5026K0739J4392j5563j5136Q930
722h919K0953J528k1753p268K1883J1497j8086j4047J3831K0147n880k3564k18
735i896K3695J43k5820L68K3980J023k0452o562J1274R823n457j3691O42J5833
$$ y = [3731, 11002, -11451, -21103, 1091, 15045, 470, -13521, -5342, 9600, 6797, -9492, -9968, 9424, 14027, -3165, -9385, 4098, 15331, 6283, -11525, -7755, 15702, 15227, -12263, -13355, 13161, 15016, -8108, -12582, 3010, 8552, -4819, -14362, -1327, 14322, 2960, -17044, -12577, 4715, 7477, -4712, -11680, 760, 14211, 123, -18478, -1465, 20766, 3965, -19081, -3991, 21638, 15956, -7438, -13149, 5221, 15958, 13, -10554, 6182, 18123, 1838, -17218, -10307, 12406, 15330, -10593, -22909, 2248, 16872, -7255, -22281, -1542, 12850, -2713, -17849, -8919, 12034, 13562, -8191, -15459, 6424, 17921, -165, -14212, -381, 19766, 13886, -9678, -9896, 13799, 13942, -11878, -11510, 12470, 13493, -6959, -13521, -2247, 7576, 2119, -11572, -10930, 4903]
749D903J897j3382k297J2216L162j3595q320J6906J8026j4100k1782J2021J8495
762A4150j1345j3470J1562J2662p315j3720m33J4179P890j3779j3379R993J4316
775A1311n144j3403J491J3519J018j8948m690K2197P873k2323q450J8510Q750
788A1711j3650j1165O125J3563N24j4805j647J7172K096j8145n026J6377J2196
801A5326j1743j5542Q595J9346o683k0639M500J7751k792j2720R93R348L244j0932
815a948j2841R400J8951o611k1930L231J9985k85j8813l140J9329O946k0868r712
829a8306K3564J4869k0910j6120J2711J5757j965j3379m770J4077J1134j5926
841G36j5837J5688J8622j3785k1922Q612K5271j496k8126o630K5269P484k2222
$$ y = [4903, 6800, -6582, -8879, 3337, 6499, -7096, -15416, 1490, 19516, 5416, -16366, -4345, 14150, 2805, -10665, 897, 13559, 6244, -7476, -7909, 6270, 14160, 381, -12998, -3005, 11311, 6167, -7236, -5745, 7774, 8792, -10156, -14846, 7351, 15224, -7099, -15549, 2961, 11711, -1939, -13104, -6979, 6584, 7108, -7697, -9344, 7828, 9924, -8221, -13247, 3130, 15326, 3583, -11959, -3364, 15982, 9299, -11340, -6840, 10911, 8119, -4601, -3608, 5740, 8984, -1948, -14789, -5389, 13562, 6951, -14979, -11748, 8237, 7952, -10861, -14001, 5328, 12274, -8594, -18306, 5258, 20127, -783, -16903, -4192, 11565, 9600, -3779, -8549, 5528, 16662, 736, -15101, 587, 19209, 5424, -16498, -7886, 17385, 15889, -12237, -18867, 6402, 13886, -8336]
854h336o125J9009P419j4258j2787N223J8465K738k0339p116K0898J0667j7489
867b031j2513J2776J5009q038j6359N958K0599l965k0891Q34J7719J920j3713
880b695n708P768J0728m298j5090K988J4984n580j6126N981J6540j337j6266m422
894a2533J3208Q806j1388r979J0740R511p723o832O154O873k655j1110l570J6830
908F332J1577j6775j4702J3625J2126j2762j0029J1821J2321q823j7340M133K0138
921A1642r21j9963l218J5445O323q772r248L448J3212j662j8359L94K1615J620
935A1556k1154l670J8702Q309j5318j2735J1179J6043p839j5683Q103J4663n968
948F188j4513l72J3926R011j2724j4991J1623J8322j1076k0321P407J8142l555
$$ y = [-8336, -14461, 4548, 11967, -2291, -15078, -9855, 8610, 11348, -8991, -16107, 4791, 15458, -2031, -14544, -1768, 13241, 5203, -11156, -5198, 15401, 11436, -9455, -8621, 9098, 11018, -2695, -8403, -635, 10093, 5795, -9295, -6307, 8677, 3097, -13029, -7048, 9492, 8155, -8111, -12533, 675, 9481, -1907, -11886, -1146, 8365, 642, -6190, -36, 6837, 4182, -6928, -10498, 6332, 17909, 1134, -13568, 57, 12183, -579, -10608, 1213, 13534, 4711, -12629, -8496, 11642, 10721, -9242, -12460, 2985, 9308, 536, -8712, -5264, 7948, 6286, -12073, -11679, 9936, 11556, -9598, -13268, 5434, 13743, -1575, -14310, -3131, 12912, 5073, -10610, -2507, 12156, 6188, -8325, -8697, 5229, 14240, 1516, -13475, -1852, 16470, 5394, -14927, -7520, 10622, 7067]
961G067j5393K9J5049L798j8326j0141J8084J4344j1595j5225N117J3665J068
974G541j3713m991J7623Q312k0902j0442K2278J4090j7552j6930R167J7328p11
987A1098j7997k441J7309L752j6865o693J3776R103r444j4498L804K0058P26k2299
1001a0611m652K0000M319j6127k641J3516O392j0911j1652P790J5373m559j5766
1014i529L565J5187J20j2424n800Q815R805p490j1623R703J3554j1340j5512Q776
1028d193J4236l408j2495k238J0871O692j1046p813J0219Q229j1108r475Q720
1041b809J2351k606j5968l276J6750O867j7209o312J6231N981j2408n753R492
1054A331Q960o241j4725K371J8821K947j6739n395J2011M944r114q045Q599J3232
$$ y = [7067, -8326, -8297, 6752, 10550, -7776, -17917, 167, 14511, 2916, -12309, -7192, 6473, 7541, -6172, -11163, 6460, 14772, -6130, -16572, 5706, 19796, 2244, -14686, -5519, 11809, 11098, -6899, -9340, 7969, 11721, -5144, -11837, 1939, 11042, 1598, -12900, -9096, 10962, 11688, -10611, -15263, 4737, 9056, -7071, -9712, 3804, 10196, -715, -12367, -4577, 10796, 6237, -9529, -5964, 9223, 9343, -3081, -8881, -66, 9739, 2249, -9374, 329, 13883, 2543, -12969, -4193, 10043, 6635, -5860, -8098, 2773, 9465, -1581, -9394, 825, 9054, -2054, -11529, -2809, 9542, 6936, -9032, -12308, 4442, 11309, -5900, -12212, 4019, 10000, -2408, -8161, 1331, 10291, 4050, -10675, -8304, 10517, 13464, -3275, -8670, 3341, 8285, -829, -8874, -275, 12957]
1068A2957q329j8794O237K0107n349j8700Q06J5723M350j1686r330R368J2641
1081A0001q901j4931Q739J7170m478j6318j155J6018Q273j5211j3383J4532J5440
1094A5796j2596j3841J0271J2376p082j4481R81J5930N428j6681j0892J5765J2386
1107A3360j2873j3740O420J4533j124j5014j704J8279L849k1053p381J9423J1312
1120A4287j1859j2581N040J3485n56j4491j547J6772K561j6640m490J5155Q033
1133A3169j1219j3001N570J5983k105j6566Q96J5690j438j4397j185J1130O006
1146H533r535j1160P928J5019o360j5563L724J2964j378r878j92J0170M638j1072
1160b162q433J1967J0495j0952j0587R309J0710m193j0616j675J0795M059j2255
$$ y = [12957, 4628, -14166, -7929, 12178, 6829, -11871, -11065, 4658, 9008, -2678, -12008, -2640, 10001, 1100, -13831, -5092, 12078, 7600, -8718, -9873, 6145, 14418, -793, -14176, 356, 15796, 3200, -10641, -370, 12006, 4924, -9557, -8576, 7354, 12782, -3899, -14791, 974, 13360, 487, -13253, -6833, 7700, 6576, -8438, -10142, 8137, 11986, -9067, -16448, 2975, 14287, 2428, -10153, -5113, 8372, 7816, -6675, -8222, 8550, 11111, -5529, -10019, 5136, 13169, 1950, -11051, -5481, 10502, 8397, -8169, -7273, 8417, 6979, -7418, -8603, 2527, 8533, -1002, -12162, -4234, 10785, 4425, -11138, -7414, 5550, 4172, -5706, -5898, 4272, 8910, -2162, -10595, 1372, 11867, 915, -9672, -363, 10347, 6154, -4462, -6137, 4658, 8717, -3538]
1173c538n060J4582O006j5102r351J0605J1680n183j4121j13J5635J917j5682
1186g725k624J4944K653j2580n675J0395J1433m976j6840K215J7801K88j5611
1199f302j063J4021L352j1032o883R943J1249r704j6195P813J8457m827j6438
1212g609m84J1767L807j1628q099J1663J2540j1992j5104R665J4649n840j3993
1225a0658J023J4234O086j3279r630J3907J1244j2910j0690J1537J2625o754j3993
1238g258L31J6133M690j7897q809J5963R545j2834j0310Q261J0958m775j5960
1251a1962O89J9111K956j8998o286J6704Q018j1059r835O325J2338k062j3440
1264g501J733J6074j046j6581k118J3342P688q254j0859M407J2620m401j4162
$$ y = [-3538, -8598, 5984, 11990, -3112, -12463, -1858, 9822, 4639, -9482, -9595, 6040, 7957, -7725, -10349, 4595, 7248, -5332, -11007, -612, 10821, 5845, -10995, -8780, 9021, 9309, -6302, -7365, 6656, 10008, -1024, -7907, 2036, 13285, 3581, -12614, -4801, 13656, 8829, -7609, -8093, 3674, 7481, -4147, -12246, -583, 11957, -35, -15139, -5474, 9175, 3335, -10658, -9635, 4599, 10685, -2594, -12224, 1683, 12927, 17, -10673, 864, 13489, 6735, -7258, -6927, 9206, 13896, -4001, -12810, 3153, 12698, -136, -10446, -2185, 8773, 3998, -11962, -11273, 7838, 10794, -8204, -14490, 2214, 10232, -827, -10662, -4337, 8001, 5939, -7501, -5768, 10306, 9260, -7321, -9439, 3903, 11591, 3337, -7522, -3115, 9505, 5104, -9058]
1277i058M489J4010l753j2827J339J1259K882j1173q000R333J0976q097j0930
1290i550P175Q905n114q882J414R739L633j1679o689J3448R274j2552j0152R430
1304a600J0321n028j0047K158J2637O43j5485k533J6227M358j4541o063J0090
1317A137R026n341j3058J297J3996p15j5174M46J5375J639j4080o463R610J1351
1331I046n855j4352M094J6248k636j4942J293J3579J786j1521n744J1716J2039
1344A4751j1014j5250Q148J5575n810j2944K655J0430R06j0706o159J1383R149
1357A1114j1957j3004R547J4443n083j3963q69J3243M739j4744o817J6715R281
1370A2645j5621r834J2569J0732p115j2076K338J4978L129j4739n862J3351O391
$$ y = [-9058, -4569, 9441, 5688, -7139, -5800, 5459, 8341, -2832, -10832, -1499, 9477, 1380, -9550, -2375, 6530, 1416, -7466, -6052, 3687, 7320, -4359, -11048, 2400, 11674, -878, -11030, -1600, 8721, 3693, -6354, -4196, 8441, 9084, -6401, -8934, 7293, 11651, -2890, -8953, 1137, 10163, 4822, -8236, -6939, 7057, 6342, -8832, -8386, 6989, 8628, -5452, -11915, -2305, 9046, 3191, -11161, -7067, 9181, 6545, -8397, -7104, 6475, 8261, -3260, -9004, 2712, 14751, 3737, -11513, -3365, 12210, 6400, -6544, -3889, 6541, 7447, -3259, -9418, 1965, 11114, -843, -13847, -4300, 10143, 5060, -8903, -9772, 3471, 8210, -6534, -13351, 3364, 12645, -2976, -12810, -241, 10491, 3376, -8700, -6362, 8616, 11745, -2994, -8856, 4495, 10886]
1383A0886j0654p981P240J0601l895j5111L97J7668N15j8484l562J6002N189j0652
1397a841p699O938R278n315j2776N432J5501k420j4537p38J1770M686p770p910
1411g401O244J0398o117j0893P168J1093o007j1149J351R878L445q408p178Q410
1425H34Q118r823r207Q907R655p025r706L377J0938P06j3914m250J5435N187j3085
1440c853m911J0243N770o505p327K255J1385M48j4040j487J5268M421j4111p566
1454a0010J0180J0130o204j2341N125J4207n326j6461M183J5299o19j3673m867
1467a0377J0493R077o683j3553M944J3961m087j3345L105J3076J344j2906o260
1480a1211J1896J1287j0675j3111J0901J2601o926j1916K928J0703J374j1124
$$ y = [10886, 232, -7749, -509, 10092, 6197, -8914, -8517, 9151, 9666, -8818, -12380, 3622, 8811, -1841, -9540, -2602, 6676, 1361, -11415, -5983, 9518, 7098, -7439, -8177, 3593, 8279, 509, -7401, -1157, 9241, 3124, -7769, -601, 10492, 4485, -6664, -5313, 4565, 8010, -398, -7576, 834, 8952, -871, -10078, -1171, 8484, 1459, -8247, -4870, 6068, 6774, -7140, -11390, 4045, 9232, -3853, -8764, 1479, 7249, 744, -6583, -4328, 7057, 7505, -6535, -8022, 7246, 11667, -2444, -10010, 170, 10300, 4096, -8245, -3120, 11087, 5761, -10700, -6517, 8782, 8163, -5510, -10377, 116, 9193, 2510, -11043, -6099, 7862, 3775, -9570, -6465, 6611, 7955, -4951, -11211, 685, 11972, 1297, -11814, -913, 11688, 4762, -7154, -4226, 6477, 7851, -3273]
1492c273n404J2746R058j3828j1675J1345J1727p178j2155K124J2402J527j3983
1505f567m297J4838M712j3211o515R970R455m231j1296q97J3613L148j4345l692
1519i315J5005N190j3128o500J0122R426p385j2330M165J5037k383j4025N21J0456
1533D856Q21q432l720O047Q143n552j2202M750J3670l772j3648J350J1902K195
1547F408r481m876R167O686j0023q257J1465R567q419r934L784J0000J520r827
1561b220n473J0766P006j1305p003J1099P035r399r159M247J1260K59j2950k748
1575h585J2938L252j1963m823R108O517n867q968L243J3198j566j6515R49J6285
1589G203J785j3241l312J0368O062p507r164N885J1725m726j2479L181J1671O16
$$ y = [-3273, -8677, 4069, 13127, -701, -12376, -1031, 10696, 3518, -8637, -6513, 5889, 7416, -6567, -10864, 3974, 8686, -4525, -11040, -1070, 8385, 4154, -7142, -8039, 5574, 8722, -5623, -9315, 5690, 10880, -2248, -8748, 1374, 10800, 3415, -8915, -4750, 10287, 7904, -6121, -5600, 4856, 5677, -2755, -6475, -428, 7715, 2163, -10039, -5289, 8381, 4609, -9039, -7689, 4213, 6408, -3073, -7949, 1218, 7904, -2119, -10376, 1089, 10656, 2237, -7697, -3913, 6087, 7607, -2220, -7693, 3073, 10079, -1226, -8229, 2870, 9905, 506, -8653, -4406, 6854, 7113, -5837, -8585, 4353, 7605, -4358, -9181, -73, 6444, 577, -8391, -5148, 8050, 6484, -10031, -9082, 7203, 8988, -4253, -7565, 2803, 8865, 1358, -7806, -1921, 9804, 5078, -7401, -4220, 7451, 8067]
1603H067j0936n754P972J0457p316j2476P209J3197q362j3462O437J2735k088
1616E680j2615k902J1836P802j1000r178Q937R622o799q342L929J0366J102j3014
1630d576n823J4303R217j3992r902J2049J0127q520j0287L289J1079r35j2972
1643f943r37J4415K930j3995n971R490Q655m751j1324J443J3632K94j4537n55
1657h154J3810Q17j1699k772R445P644o341j0969L305J3198k274j1264Q97R926
1671E569O25q556l671Q292P035r075j0564Q697J2454p446j1064L842P923o85p678
1686d302k107Q249N353r684p527R959P946p345r023L664J0396P92j0833l018J2396
1701D916L386j3073l420J3108N226r435p468N124R717j477j2171r13J2423K081
$$ y = [8067, -2869, -8623, -651, 9806, 2490, -9986, -2777, 10420, 2058, -11404, -4967, 7768, 5680, -6935, -9837, 1999, 9801, -1199, -10377, -1440, 8182, 1383, -6959, -3030, 7336, 8438, -4576, -10399, 3904, 13121, -871, -10773, 1276, 11403, 2883, -7404, -4115, 6964, 6029, -6943, -7880, 6535, 9465, -4530, -10501, -1011, 7644, 2893, -8431, -6988, 6644, 6938, -7599, -8154, 5656, 6473, -5226, -7998, 1447, 9091, 2750, -8219, -4914, 8284, 6010, -5254, -4357, 5569, 6194, -2362, -6033, 2259, 9294, 219, -10345, -1648, 10806, 3360, -7704, -3862, 4061, 3376, -4302, -6409, 1840, 7193, -2491, -10018, -59, 7887, 542, -8481, -4817, 5579, 6371, -4462, -7480, 4916, 8302, -4771, -8191, 4917, 10143, 708, -6760, -1636, 8081, 6604, -5567, -6480, 5943, 8024]
1715H024j2282l245R852N349q713r600N782J3814l838j5428K422J3768n62j1293
1729e950j516R222M713o857p832P116J1717o079j3637L485J3495J021j1140m886
1743g128R477P369r045r839R639R959r205j0181O387R777j614j0538m928J0284
1757D14P665r200q400Q776P741p005q938M951J0874j021j2791k451J5068M834
1771A0517j3263n867J0493O275o847o721L803R643j548j2868j029J4390K314j2772
1785c480n146R706P385o521r670K806J1552l458j1881L147J2010j174j1069k083
1799g876Q491O501n788r821N499J1037m418j0830M025R664j727r162j602J0345
1813D338N774j0026r064Q825R277p110p837M142P199j432q254k037R712M656j2167
$$ y = [8024, -4258, -7503, 2349, 7698, -1015, -10615, -4833, 8981, 5143, -10285, -7863, 5905, 5343, -5950, -7466, 1756, 6469, -388, -8220, -1104, 10613, 4534, -9103, -5618, 7877, 8898, -2242, -7128, 2349, 9718, 673, -9166, 473, 10432, 1227, -8954, -2567, 7210, 5596, -4942, -9870, 414, 8079, -1121, -9521, -745, 6996, -9, -8947, -3996, 6878, 5857, -6934, -9385, 5683, 10517, -2746, -8613, 1880, 8155, 1308, -5413, -1610, 8033, 6485, -6383, -7412, 6978, 9292, -3480, -8626, 1080, 8465, 1944, -7726, -4920, 6632, 3174, -8707, -5560, 6450, 5276, -5793, -7876, 615, 7116, 1328, -8493, -2994, 8043, 3625, -7205, -3180, 6484, 4757, -4405, -6007, 4338, 10112, 86, -8978, -153, 9124, 2014, -5823, -1681, 5518, 4086, -4168, -6205, 3507, 8163, -4004]
1828d004o570J1193Q044q209q295M202Q574k110r539M81J2477M05j2475j986J1427
1843C615N310q832p578M652J0993j245j2333M50J2206m36j1971p98J0736M262
1857I031r450q517O928J1180n643j2423L360J1202j971r226o87P777L987q027
1871b479p939Q474J1720p057j2619N428J1841j388r908k040R619M708r410o770
1885g820J0901P702r517r582O095R754p42r936m299J0668M856j1115n795J0185
1899A355O235q827p803N797J0060j832j2477j746J3327L320j1118l482R748L909
1913F466p029o368N059J0218k806j2653J491J3229N15j1260k564P435M738n524
1927I47p164N160Q850n122j1072L759J1216j574j0225j866Q300N154p080p572
$$ y = [-4004, -10574, 619, 8663, 454, -7841, -3639, 4935, 2825, -6714, -6233, 6244, 6649, -5826, -7812, 3615, 8925, 93, -7485, -2833, 8160, 6915, -5418, -4968, 7238, 6802, -5169, -5967, 4769, 9031, -419, -8936, -2008, 9172, 3529, -8894, -5534, 5668, 3697, -5529, -6216, 1561, 5548, -2479, -10418, -1944, 9776, 2719, -9900, -4472, 7369, 5981, -3927, -5967, 3652, 8360, -1050, -7820, 3081, 10783, 1266, -8316, -2221, 7533, 6791, -3145, -7444, 3224, 8080, -3035, -8830, 1355, 7590, -1237, -9040, -3243, 6817, 4985, -7492, -9238, 4089, 7409, -3709, -7191, 2557, 6466, -563, -6931, -1872, 8346, 5540, -7113, -5622, 7607, 8122, -3138, -5702, 1733, 6471, 947, -6217, -1057, 7793, 2671, -8401, -4642, 6574, 5000, -5225, -7091, 1209, 6363, -717, -8289]
1941h289O277Q602o906p713O437Q941m072r045l95R703M755r409o258Q884O515
1956H027p238o282N437O726l290q913N84J1450K053j2744m822J0994N270q011
1970g59o128N014P565l080j0251J712J1911l61j3106j108J1427M602p850o942
1984g354M675R464l079j0359L244J1391k163j1165J08J0047L445q189q157O771
1998a321J0600n128j1311M104R663l074r505J40R320L884r801q031R118R412p763
2013C07r465N532Q896k156p992m26R111L088j0694m551J1277P097r453p704N502
2028a631Q706j372r855j124J0427K498j1344l276J0894M339r847p420O432R448
2042F875k408j1326M7J1434L05j0271q46Q828K091o763n275N913R197m216j1108
$$ y = [-8289, -2012, 6590, -316, -8029, -1592, 7349, 3277, -5768, -6163, 3540, 8295, -1114, -7372, 1512, 8027, 789, -5493, -56, 6670, 3380, -5533, -4949, 6501, 8554, -4190, -9012, 1982, 7252, -759, -6887, -1873, 5692, 2612, -7639, -5927, 5984, 5623, -7483, -8591, 2836, 7438, -412, -7354, -2679, 6785, 3706, -6653, -3409, 7982, 5819, -5346, -5238, 4809, 8254, 65, -8092, -1321, 9279, 4151, -7160, -3056, 6607, 3533, -5972, -5832, 3488, 7372, -2429, -10460, -1342, 8070, 307, -9158, -3626, 5270, 3114, -4878, -5304, 3807, 6895, -3799, -8350, 2927, 10024, 571, -7133, -1631, 7075, 5703, -4152, -5276, 5151, 7649, -3695, -6971, 3923, 8262, -1585, -9005, -2573, 6875, 4467, -6859, -6812, 4622, 4927, -5344, -6190, 2638, 4729, -2034, -7309, -1396, 7801, 3585, -7523]
2057g523K451J1237m46q996o99P323L378p453o036P380Q784p034j0147N837R672
2072G728l569q902j54P146L096p234m905P480N980p959o867O403P378l300q098
2087e777m37R267L608r666m496R254N022q540m849P734O889m814r417J329J1527
2102F634J555j1934k571J0337K911p978m374N486O397m246r675K381J1941j036
2116E828j1878j296R057L351o341n784N441Q280m836j0403M580J1376k895j0936
2130f456Q64J0090L043q447o112P655P853o646q410O416P888m429p792M76Q226
2145D219K600q451p012Q677Q314p382q721N515P291l270q734J756R962K051j1903
2160e088l844J1497M849q599n829O175O219j897p893N39R402R00j0638k261J0594
$$ y = [-7523, -5072, 6165, 5719, -3277, -3976, 3347, 6725, -728, -6764, 616, 9400, 2366, -7781, -1944, 7728, 4159, -4743, -4897, 2249, 5345, -1889, -6794, 686, 6666, -1293, -8160, -1757, 5621, 2321, -5777, -6214, 3053, 6661, -3005, -7501, 1753, 6775, -1765, -6614, 1120, 8009, 3195, -6222, -4893, 6634, 8189, -3745, -6316, 4021, 6932, -1046, -5420, 66, 6463, 2217, -7458, -5077, 6864, 5828, -6050, -7346, 1711, 5062, -1279, -7063, -1622, 6658, 1822, -8581, -4001, 7375, 4480, -6456, -5592, 4498, 7541, -906, -7018, 637, 8490, 1844, -6566, -150, 7738, 3309, -4483, -4007, 4219, 6819, -1632, -8644, 33, 8347, 965, -7756, -2241, 5050, 1780, -6954, -5198, 4764, 6815, -5088, -8932, 2565, 7414, -1185, -7014, -839, 5380, 3483, -4410, -3871, 5531, 6431, -4207, -6468, 4126]
2175D126M494q730o288N380Q020l294r791J793R972q52j0604O83Q983J369q139
2190b878n244O394Q618n217r540L980R506k778q301J322P793J372p270l966P832
2205A623O676p092q121N480P925k890o642L0O897K061q458m423R601N457r334
2220a210o958P693O954m705p951J213Q730P26r153j954R575K635q671l936O671
2235c41O576l522q517N30J1009Q34j0841j421R962K139q226l655O877O351n448
2250B307r376L738J0661k494j0193N06Q277J506o806m715O030P151o446r070O085
2265b839J0088m277r739J271Q317K074o958m337P233O566p297p081O325P904l948
2280C302p905M99R303K608r541n165R225N820r007n597O459N985m618p064J485
$$ y = [4126, 8620, -110, -6398, -1018, 7002, 3708, -6083, -4290, 5682, 4830, -5774, -5091, 3892, 5261, -2878, -8122, -1728, 6890, 1673, -7867, -3887, 5619, 2841, -5460, -4138, 3655, 5027, -2243, -6209, 1623, 8299, 1207, -6914, -1434, 6491, 3601, -3041, -3011, 3886, 5947, -2511, -6934, 2667, 8124, -1210, -8168, -475, 6479, 1774, -6177, -4964, 3766, 4492, -4661, -6615, 2960, 5595, -3076, -7012, -341, 6235, 2713, -5804, -5274, 5735, 6569, -4272, -5693, 4269, 6408, -1818, -5473, 1404, 7755, 2307, -7069, -3331, 7330, 4836, -5357, -4851, 3426, 4932, -1874, -6589, -559, 6592, 146, -8924, -2839, 7249, 2972, -6767, -5496, 2821, 4895, -2063, -6400, 833, 7399, 102, -6979, -654, 7250, 3302, -4603, -4104, 5199, 7807, -1734, -6899, 2326, 8146, -861, -6458, 1, 5986, 1368, -5696, -4211]
2295d211Q391R12j0030k886R679M294p493m787M143O246k508p804J775J0535r76
2310E280j1096K87J0197K123q388l644N775O096l799q057L673Q314l336q797J366
2325d006Q364J260p128n129O047P125n417q618M953Q855m525p901K186P250P14
2340D030p794l348Q212O126p600o761O322O716l769o569J298P836R32q510k751
2355e630R796L871r376n094P104N707l890o776Q14P936K26r701j290R399K507
2370E603q619m350O771O238m413q652K711J0019j339r658J260R151k35p004k262
2385d779O109N559m425q093L333R390j953r572P50P799J470p188m002O788O295
2400G481q182p666O840Q462n533p686K361O887J054o864l337P129N057p473n749
$$ y = [-4211, 4180, 5092, -4938, -7824, 1855, 6149, -1344, -6131, -1988, 4258, 1750, -6054, -4279, 6256, 5280, -5816, -5529, 4668, 6791, -1597, -5241, 534, 6630, 2831, -5226, -1553, 6761, 3425, -5372, -4006, 4358, 5618, -1510, -6639, -592, 6533, 1116, -7502, -2549, 6306, 1781, -6120, -3934, 3316, 4030, -3764, -7112, 1100, 7226, -374, -7135, -813, 5903, 2134, -4435, -3137, 4699, 5631, -2879, -5630, 4166, 8037, -1339, -6433, 671, 6378, 2488, -4288, -3474, 4462, 4688, -5013, -6303, 3096, 5603, -3016, -7366, -595, 5643, 1230, -7422, -4711, 5308, 3969, -5689, -4429, 4722, 4487, -2517, -4779, 1330, 6889, 2464, -5629, -2296, 7094, 5141, -4431, -3681, 4118, 5588, -1600, -5602, 1186, 7481, -701, -8367, -1527, 6935, 1402, -6284, -3923, 2964, 4018, -2846, -6183, 946, 6003, -1470, -7219]
2415g219P086P042m924p482J582Q657J635r216k890R448L489q795l670O969M564
2430F276m866o191J829Q119J33r547j921R076K387p769l500N693N129m177p534
2445f863L336R290k594r705J389Q817J089o471l174M802N616l814p363M358Q463
2460G176l617q705K240Q005M65p450l359O585N429o701o158N800N845n066o043
2475e554K868O239N38p562l558Q165N067q135n398P229N535m971n488K556P408
2490D939o15q743r61R666K791q786l453O453M445l559o488K228P659p22r845O70
2506d321R322O46r018k961O802N025m528p780L986Q082k988q527K189Q059m87
2521C501o691k596O381N893n605p835M481R214l636p890K633P195k29o736k836
$$ y = [-7219, -133, 6909, 1985, -5497, -3915, 4742, 6377, -2839, -5729, 3719, 7208, -1587, -5257, 1712, 6276, 1410, -4781, -2952, 5167, 5300, -4247, -6168, 2908, 5295, -2474, -5974, -281, 4848, 671, -6863, -3527, 5763, 3169, -6536, -5147, 3670, 4759, -1712, -4886, -84, 5532, 1718, -5645, -1287, 7176, 3559, -5146, -2906, 5099, 5564, -1886, -5245, 1340, 6769, 68, -6090, -290, 5555, 489, -5554, -2686, 3553, 4091, -3471, -7029, 1136, 6203, -1932, -7330, -101, 5434, 463, -5025, -2469, 4939, 4324, -4419, -5380, 4286, 7077, -1709, -5162, 1291, 5736, 2177, -4311, -2083, 5576, 4854, -4991, -4321, 5001, 5647, -3371, -6332, 470, 5495, 967, -6813, -2827, 5255, 2267, -6260, -4071, 3988, 3501, -3190, -5786, 595, 6488, 883, -6952, -2471, 6743, 3107, -4783, -2150, 5045, 4816, -1920, -4756]
2536d756P527M401p470o441O850O392n124o321J716O319M51o942k724Q199L796
2551E873q879m779P785N337m797o343K245P568J26p942j067Q499K007q268k092
2566d727O871L862m262o664K444Q421j146r000J37Q464L36p572j697N951L894
2581E312n393o530M436Q602l889q944J673P933po037k297N589M831n683o329O226
2597e07P207n352p036L253O961J53o485k489O530M179o470n259O545N285n403
2612A112o206K900O866n16p654k340Q346L492q490l932P190L662n803m430L702
2627b101O380j405q166l27R383J474p766k447O169M426m469n527L009P717k600
2642C750r288K081R484m27q421j874O098M008m912o076M202P065m135p664L407
$$ y = [-4756, 2771, 7172, -298, -6739, 111, 6503, 1379, -4942, -3226, 3093, 3544, -3398, -6122, 2077, 5873, -3006, -7785, 0, 5337, 540, -5803, -3558, 4010, 4136, -3806, -4873, 3626, 5633, -2635, -4727, 2144, 6006, 1744, -4920, -2476, 5945, 4799, -4201, -4064, 4400, 4736, -2836, -4533, 1418, 5312, -81, -6611, -2175, 6427, 2538, -6406, -4733, 3200, 3193, -2844, -5141, 448, 5279, -404, -6733, -507, 6700, 1348, -5688, -2435, 4526, 4679, -1806, -4295, 2235, 6414, -56, -5315, 1230, 6515, 1112, -5094, -2194, 4672, 4156, -3498, -5838, 2508, 6000, -2490, -6422, 768, 4430, -1373, -5803, -2101, 4279, 2874, -5292, -5619, 3764, 5238, -2528, -4975, 1194, 5620, 1151, -4376, -1367, 6350, 3750, -5538, -3457, 6027, 5600, -2821, -4695, 1403, 5411, 499, -5577, -1375, 5690, 1555, -6109, -2702]
2657b702P057r47o943k575O779M826n689o966N864O949m835o409L548O745r61
2672C741o765j822P990M149q218n383P142N706n050n704K658N751o66p066j118
2687d655Q408K157q661l720P550M104n068n681K365O920o96p836j06Q822M87q181
2703c791j462O749M363n052n777K894Q041k364q238J866P505n52o836n42N476
2718B280L420n220o530M603P762m114p380K187O989j318o045j315N900L378o227
2733a630n473O852O566o087o154L513O213m60o051j460O643K937p339l391P747
2748B426L740n850n095L260O637p81p052j583P701K070q505j730O805K987n759
2763g29n001L575P121k092q362M62Q984J22p736j356O337K776m764m546L999P037
$$ y = [-2702, 4355, 3408, -3535, -6110, 669, 5495, -194, -7160, -1296, 5653, 818, -5591, -2043, 4702, 3741, -3024, -4846, 3144, 7293, -925, -6308, 834, 6540, 1490, -4214, -1556, 4195, 3529, -3537, -4655, 3753, 5910, -2751, -6471, 1079, 5183, 115, -5566, -3201, 3719, 3023, -4813, -4919, 3903, 4390, -3791, -5253, 1496, 5859, 807, -4970, -2076, 5965, 3601, -4637, -2771, 4734, 4182, -2654, -3196, 2280, 5700, 480, -6050, -1447, 6315, 2201, -5179, -2992, 3997, 2679, -3366, -4681, 1219, 4597, -1630, -7103, -251, 6315, 228, -5926, -2413, 3800, 3340, -2711, -4171, 2472, 5409, -1930, -5321, 2426, 6166, 316, -4779, -1519, 5118, 4337, -2715, -4298, 3403, 5473, -3032, -4762, 2043, 5030, -729, -5730, -2155, 4966, 2874, -5488, -5026, 3958, 4080, -3656, -5012, 1325, 4101, -663, -5209, -1210, 5827]
2779E827l006q202K422Q108r00o500j417N542L471m915n328M878O289n098p267
2794f096M130P279j591p190j856O575L768o332m803O103N223n943n457M617N986
2809D413k074o338r49P190L586p114m004O858L821n370m221L343N573j282o870
2824c438o22Q712J437r029k434P389L272n309m599L142O162k538p771K074P959
2839D407j449p084r41O089L393m303n565L369O482k614o987K813P285j544o774
2854c423o56O893K970n689n311N205O395m993n922L872N341k449m988o57N997
2869B585K640p204m369O088N405n337n287L563N365j315n795o76O600K343p818
2884c212k672P847L814n617n220L817O026j423o230j26P668K29p910q27P242J664
$$ y = [5827, 2821, -5381, -2959, 5149, 4249, -2251, -3668, 1874, 5345, 430, -4898, -20, 6269, 1171, -6096, -1966, 5313, 3722, -3468, -5324, 1251, 5019, -1313, -6116, -13, 5210, -733, -6190, -1573, 4413, 2339, -3999, -4948, 2242, 5828, -1286, -5290, 1568, 5389, 19, -4202, -859, 4714, 3432, -3438, -4060, 4652, 6089, -2940, -5374, 2015, 5287, -22, -4621, -1479, 4683, 2145, -5626, -3552, 4407, 2958, -4126, -5067, 1022, 4415, 112, -5453, -2084, 4398, 1784, -5203, -2390, 4895, 3351, -3423, -4079, 2814, 5784, 95, -5216, -11, 6384, 1391, -4531, -659, 4682, 2233, -2755, -3412, 2585, 5225, -1979, -6348, -260, 5145, -192, -5479, -1916, 3449, 2134, -3661, -4337, 2263, 4606, -3212, -5884, 1963, 5777, 160, -5060, -1243, 4783, 3360, -2870, -2996, 4672, 4901, -3009, -3836, 3406, 5070]
2900E070n947l821L244O419j940p559Q88P475n67p326j13N903K119n049n164M908
2916a460P183l847q073L284P849k151o465J148N085K258n915l752N809N883n588
2931A248o279M095N928j719n911j139N764K836o018m498O835M176o295m899M348
2946a528N843k385o209q97P828J448p254j987O987K332n234l528M016N519k114
2961B837p362N93Q670L03p638j414O652K138n268l184L480N581l118p704K620
2976b814P598j316p335o41N932K860n153m378M160N957m585o386M331O565k992
2991A803n729N57N441K652n489m039N225N060m837m874M204M946k188n926k64
3006c458O838K572p954l506O917L875n877m012M175M054k480n384N81P232M80
$$ y = [5070, -877, -4698, -1454, 4965, 3025, -4534, -3646, 3829, 3262, -4064, -4177, 1726, 3845, -1204, -6368, -1460, 5723, 1876, -6197, -2913, 4936, 2785, -3680, -2532, 2553, 4811, -1104, -4856, 953, 6836, 1248, -5031, -936, 4992, 3273, -2638, -3777, 1987, 4823, -1195, -5693, 1142, 5318, -977, -5876, -1528, 4315, 1930, -4279, -5176, 2652, 4100, -3154, -5141, 1846, 4178, -1056, -4584, -568, 4951, 2837, -4525, -3932, 4738, 5041, -2597, -4011, 2641, 4779, -489, -3673, -193, 5388, 2270, -5434, -2814, 4784, 3468, -3867, -4508, 1424, 4284, -869, -5247, -1087, 4870, 285, -6101, -1770, 4795, 1803, -3926, -3369, 2072, 4724, -765, -4804, 421, 5481, 644, -4230, -26, 4920, 2732, -3194, -3458, 3380, 5952, -2002, -5508, 1409, 5284, -593, -4605, -430, 3624, 1144, -4240, -3659, 3573, 4053]
3021D053p919j985P068L130n473l300L194N269j798o828J711P802q84p749O4O681
3037C036J980n098l780L183N776k592p287L045O787k160o651L73O070J533n884
3052a669m292N436O006n078o438M193N903k812n113R68M841J933n703l424O012
3067G63N422n814n774M663N795k149n646j40O346J400p087k221P292L114p006
3082a042l861M113N009k060n897OO550Q80p337j220O706K048n821l037L916N239
3098D192k128p028J205Q313j323o727N09O449Q31n370k979M624N127m182o372
3113d859K866P476k252o789N64N134J633m992l724N025N041n328n958M430O432
3128D699l294n661M83N320K233n512l094N860M010o196l864M934N038l140n109
$$ y = [4053, -3866, -5851, 1217, 4347, -1126, -4426, -1232, 4037, 2239, -4589, -2878, 4924, 4040, -3709, -3645, 3036, 5016, -82, -3862, -679, 5097, 2505, -4782, -1737, 5050, 2890, -3761, -3388, 2682, 4215, -1669, -5961, -525, 5481, 403, -6035, -1842, 4061, 1249, -3864, -2896, 1945, 3878, -1825, -5249, 763, 6185, 371, -5403, -740, 5055, 2906, -2740, -2880, 3466, 4866, -2221, -4442, 2850, 5964, -1042, -4903, -790, 4219, 2159, -3738, -3732, 2818, 3698, -3639, -4859, 1847, 3895, -1926, -4963, -1047, 4192, 2064, -4964, -3759, 4554, 3231, -3496, -2987, 3462, 4293, -1077, -4056, 568, 5695, 1513, -4859, -1993, 5483, 3231, -3558, -2994, 2140, 3773, -1219, -4943, 82, 5123, -205, -6163, -1733, 4699, 1405, -4256, -3773, 1547, 3780, -1732, -4826, 1034, 5044, -1152, -5016, -82, 4956, 1816, -3293]
3143c293N46O576J200o838k600P123K167n845k877M226M108k850n913O21P723
3158D074K9q148j258P299J552n541k753M141M162k706n898K429P497k160p166
3173d447Q72O163J477m979l035L914N301l655o081L561O536l000o612J517N789
3188C321J305n720l926N676M652n270n159M241M889l267m769J149N243J047n856
3203b444l050O203M351n947m294M812M098k184m684O37O143N98p052j554P552
3218C185K058n835l344M387L999k224n576O48O829m99p447j80O984Q85n709l128
3234d967M549M676l174o330K501O517j619o232J311N529L78n007k515M801N219
3249E637m455o115L664O303k519n700J566M634P32m966k976N556M133n993n070
$$ y = [-3293, -2747, 3829, 5029, -1809, -4409, 2714, 4881, -964, -3841, 385, 4493, 1643, -4270, -3649, 4074, 4103, -4045, -5303, 1996, 3548, -1993, -4746, -605, 3557, 851, -5047, -2618, 4879, 2719, -4447, -3575, 2588, 4065, -914, -3949, -35, 5266, 1611, -4470, -909, 5627, 2627, -3985, -2468, 3321, 4626, -1094, -5020, 656, 5308, 38, -5121, -880, 4009, 742, -4027, -2878, 2365, 3412, -2444, -5494, 709, 5060, -887, -5181, -369, 3729, 1545, -3139, -2502, 3641, 4239, -2813, -4367, 3185, 5243, -592, -3936, 451, 4450, 2226, -3350, -2702, 4127, 3628, -3819, -3999, 2985, 3870, -1839, -4967, -418, 4258, 1084, -5246, -2745, 3772, 2153, -4079, -2768, 2761, 3139, -1868, -4383, 418, 5637, 1182, -4933, -1269, 5034, 2515, -3185, -1619, 3015, 3747, -1219, -4195, 1361, 5494, -499, -5569]
3264e569N138N108k868n307O79M635J535o016k410O546L084o555l160N005M081
3279C926k789n144J048O239N54o307j400O758J692n711k431M450L755l062n552
3294c974J728P384j517p160K17O097O62n150j968L895L698l526n728L023O880
3309D561k666o641J316N643J043m921k745M810M488m811n190M885N829l889n333
3324c621J647N433N94n341k561N455L958n856m132M692M315l779m579J087N613
3339B925R69o966k284O998K799o414k763M199L952k866m615J820N798j78p175
3354c801J44P065P72n668k398M371L355k465m834J908O599j726p042Q80O592j22
3370C630n695j659L878M209l927n388L246N756k805n914J935N408Q3n081k389
$$ y = [-5569, -431, 4677, 1809, -3498, -2819, 1816, 3351, -2665, -5075, 1471, 4555, -2000, -5160, -155, 3926, 1137, -4007, -2959, 3280, 3834, -2473, -3873, 2885, 4577, -1134, -3565, 885, 4640, 1578, -3974, -2246, 5138, 3621, -3539, -3322, 2775, 3437, -1713, -3681, 214, 3912, 386, -5342, -2319, 4561, 1895, -4746, -3430, 2213, 3256, -1665, -4410, 400, 4888, 77, -5113, -228, 5601, 1712, -3621, -1974, 3459, 4053, -1288, -3849, 1606, 5564, -292, -4424, 268, 4583, 804, -3775, -2688, 2925, 3894, -3072, -5356, 1642, 4441, -1973, -4736, -537, 3415, 549, -4066, -2246, 3552, 3374, -3801, -3657, 3408, 4180, -1488, -3886, 485, 3840, 1375, -3459, -1551, 5048, 3322, -3720, -2840, 3752, 3630, -2065, -3724, 154, 4363, 436, -4952, -1706, 4050, 1245, -4669, -2734, 2674, 2757, -2324, -4713]
3385d713N264M358n152m841M370M915l031m534J961M582L39n313k092N753L937
3400E803o349m019M943M194l361m739J561N330l73n934j224O822J298o281k194
3415d523M560L539l312m382J349N652J0o524j44O650N20n676j475M587L591l311
3431A111n667K743O854j707o629J150N906n61m733j481M115L255m232m994L774
3446a096N858l240n937J823M508N84m489j930M582L490n128m395M675N188l657
3461H36m916J841N371k1n092j618N619K788n777l115N372L523l777m341J652N150
3477C495j12o041j052O022J456n911k211M696K805k799m524K024N747r90p039
3492d434M77O624P45n608j365M143L214l384m198K970N676k509o162J730N739
$$ y = [-4713, 551, 4909, -243, -5084, -714, 4201, 1170, -3364, -1403, 3179, 3518, -1795, -3887, 1866, 5803, -546, -4565, 378, 4572, 1211, -3528, -1967, 3363, 2990, -2944, -4168, 2654, 3952, -2329, -4523, 37, 3576, 264, -4118, -2769, 2883, 2893, -3631, -3775, 2875, 3395, -2281, -3756, 831, 4422, 1111, -4556, -1813, 5041, 3334, -3295, -2145, 3761, 3200, -1533, -3014, 1101, 4356, 124, -4870, -1096, 4762, 1522, -4415, -2592, 1916, 2500, -1989, -3919, 663, 4153, -975, -5370, -695, 4493, 836, -4080, -2239, 3132, 3111, -1981, -3599, 2020, 4808, -969, -4084, 1288, 4811, 1034, -3307, -1655, 3495, 3383, -2658, -3710, 2312, 3768, -2143, -4354, 342, 3147, 348, -4176, -2152, 3595, 2605, -4434, -3957, 2667, 3412, -2196, -3561, 582, 3796, 412, -3786, -816, 4860, 2351, -3811, -2081, 3658]
3507C658j59n022j460L639L529l884m415L698M979l268n637K089N254l07n272
3522b578k019N062L685n170m092M673M410l881l971K320M739m81n450p51N962
3537B458K302n776k880M852L156l051l596J598M437m63o246m3O605R09o178k163
3553d079M842K920l238m383J864N446j378o243J319O246o84n642p63M405L220
3568C852l475m607K999N764k649n481K451M708q13m487r13M523K630m450m661
3583d609M434N098l206n337K084M667r34m396j461N399K027n605l238N205M147
3598D275m326m041K120M129R4m826j018N647J952n849k171N606K428l452m082
3613c514K212M838j1o227l98O543L39n866j025M897J692l660l958K704N351j721
$$ y = [3658, 3499, -1523, -2983, 656, 4185, 301, -4114, -416, 4563, 1295, -4342, -2253, 3001, 2694, -2578, -4597, 465, 4150, -1020, -5112, -439, 3971, 90, -3881, -1561, 3178, 2697, -2753, -3504, 2458, 4760, -1016, -3896, 956, 4112, 1061, -2535, -937, 3500, 3037, -3209, -3252, 3353, 4262, -1916, -4079, 763, 3683, 445, -3938, -2074, 3372, 1994, -4249, -2930, 3316, 2632, -3010, -3773, 632, 3852, 377, -4230, -1231, 4533, 1884, -3597, -1146, 3562, 2749, -1738, -2651, 1872, 4502, 52, -4609, -175, 4923, 1717, -3620, -1536, 3131, 2197, -2199, -3660, 1739, 3766, -1839, -5077, 128, 4275, -51, -4092, -1972, 2157, 2251, -2575, -3593, 2054, 4006, -1843, -4014, 1592, 4020, 568, -3514, -1302, 3536, 3525, -2702, -3100, 3443, 3782, -2084, -3109, 1788, 3480, -180, -4138, -1434, 3917, 2196]
3629B196o349J197N916n38n092q94L949K805l695l837L196N672k871n868K575
3644a638N235j048m237j112M117K882m422l805M950M082m581m317K769M681q54
3659B702m858j173M963J798m753k970M844K971l981l542K496M201q69n295l26
3674c792O054J591n950k070N205K621l528l285K741M482j614n689O03O718p57
3689C330n122j050M214K206l102l767K547M194j903n550J543O094j112n239j059
3704c776M713K406m113l616L548M470l070m564K843M326r90m628k53M831K082
3719D209m335l962M510M094l514m199K700L517r05m548j80M959J754n885k629
3734d414N125L040m048l444K156M252q85m997K01N343Q65n993q38M950K367l718
$$ y = [2196, -4153, -2956, 2960, 2422, -2670, -3564, 385, 3190, -505, -4342, -1146, 4526, 1655, -4213, -1638, 3597, 2549, -1688, -2800, 1317, 4199, -223, -4028, 922, 5004, 423, -3894, -1125, 3556, 2702, -2156, -3329, 1634, 3432, -1321, -4291, 553, 3524, -457, -3999, -1503, 2698, 1829, -3466, -3792, 2262, 3853, -2097, -4167, 1038, 3659, 131, -3154, -413, 4069, 2455, -3234, -2631, 4087, 3330, -1792, -2842, 1372, 3578, 476, -3291, -744, 3450, 1547, -4003, -2460, 3634, 2522, -2717, -3776, 937, 3343, -770, -4386, -838, 3632, 562, -4002, -1159, 3167, 2177, -2451, -2704, 2127, 4209, -126, -4088, 422, 4516, 1002, -3197, -497, 3020, 2115, -2433, -2613, 2346, 4100, -1785, -4414, 711, 3751, -297, -3741, -1585, 2667, 1782, -3215, -3014, 2329, 3194, -2799, -3637, 1313, 3680, -38]
3750c8l391K042N014j349n348R24N992q92n028l20M352J884l650l421K354N160
3766D285k678n534K280M744j075m603n24M425J729m323l297L951M679l720m486
3781d147K672M069q95m084m99M484J784m689k416M981L411m547l618K911M280
3796C697j581m505q9M667J379n104j588M730J919m453k723K744L824j117n551
3811c751J96N842L33n239q55M710J341l449k591K648M630j994n192J011N917o67
3827B890m843l14L768J951l658k897L317M312l271m939K489M911j466m873q6M186
3843A477J569l846l265L871L460l368m118L027M399j852m100l39M572K064m777
3858a226k890M826L147l877l000L153L247j470m113k18N331R05n495j661M851
$$ y = [-38, -3429, -1387, 3627, 2278, -3070, -2146, 3846, 2954, -2074, -2394, 1958, 3842, 192, -3229, -875, 4285, 1607, -3927, -1647, 3097, 2022, -2581, -3105, 1320, 3049, -1274, -4571, -620, 4059, 339, -4147, -1475, 2594, 1699, -2385, -2884, 1600, 3384, -1305, -3721, 1260, 4671, 124, -3494, -583, 3697, 2116, -2389, -2478, 2189, 3568, -1536, -3124, 1606, 3525, -928, -3651, -907, 2917, 1800, -3751, -3555, 2287, 2620, -2619, -3474, 1236, 2577, -872, -3463, -815, 3815, 1821, -3371, -2360, 3557, 2890, -1953, -2267, 1501, 3452, -206, -3103, 214, 4526, 1255, -3684, -1195, 3716, 2250, -2623, -2709, 1477, 3046, -800, -4065, -194, 3266, -102, -4220, -1193, 3206, 1354, -2746, -3085, 1487, 3551, -1226, -4116, 710, 3857, -20, -3020, 133, 3380, 1910, -2203, -2421, 2910, 3815, -1680, -3341, 1510]
3873A510K046l949k469K473L356j610m583M33N801k85n823m38M834J805l868k669
3889c436K433M108k258m501J909N078j062n024M60M342J550l893k650K962M192
3904D210k484n227L024M066j602m473J40M220J431m365l187M124L932l970l894
3919d055K820L822j827l342j42M415J132n065j692N081K641m357k717K753L632
3934C099j309m011K85M978L78n654m14M789J600m178k783K894L504j580m552M86
3950b468N246n80n281n7N143N47m016k118L133L737k594m816J710N378j121m384
3966b541Q05L523J244l722k646L960L761l552m794L261M363j454m524L23L817
3981A824R87l910k283M206K911m178l502L743K977j667l761k70M447J133m597
$$ y = [1510, 3556, -393, -2862, -389, 2967, 1357, -3226, -2793, 3008, 2723, -3100, -3538, 1296, 3101, -767, -3436, -1003, 3105, 847, -3654, -1745, 3333, 2271, -2753, -2293, 2049, 3599, -294, -2944, 18, 4210, 1726, -3501, -477, 3589, 1987, -2486, -2346, 1874, 3305, -1060, -4247, -123, 3809, -161, -4055, -1235, 2587, 760, -2582, -2724, 1691, 2823, -2242, -3934, 1147, 3788, -569, -3286, -533, 3099, 1790, -2221, -1936, 3042, 3420, -2234, -2648, 2141, 3741, -437, -3220, -326, 3178, 1598, -2954, -2468, 2778, 2198, -3083, -3140, 2003, 2550, -1466, -3584, -451, 3286, 692, -4124, -2414, 2964, 1843, -2541, -1736, 1787, 3031, -691, -3337, 623, 4384, 832, -3962, -701, 3662, 2208, -2316, -1993, 1824, 2811, -1099, -3382, 824, 3735, -443, -3945, -202, 2775, 1108, -2653, -2923, 1524, 2657, -1940]
3996a940j624M685J858m328k038L479L157k194l577J90N230L53m997r22M863J202
4012C397l896j716K669K844j711m548J031N452j099n557L67M228P29k966k402
4027c178K681L702l022m182K525M932j707m897N77M254J159l652k451L614L430
4042C785l114l991K908M056k255l792Q41M054O91m339k061L872L168m266k523
4057b966K765L151k378l426N43M219O62n168j062M663K124m406k054L003K825
4072B495j219l876Q49M807l63n325K23M978R58m320j604K321L165j716m084J341
4088a370M464j297m300M61M347M24l925j866K464L741k904l987K177M345j808
4103I66l898Q56L729O61m134j619L953L271l377l891L318L298j906l170O12L330
$$ y = [-1940, -3564, 1121, 2979, -1349, -3387, 92, 3249, 1055, -2522, -2332, 2898, 3251, -1746, -2668, 2195, 3397, -499, -2215, 454, 3298, 1587, -2961, -1930, 3522, 2423, -3134, -2767, 1461, 2190, -776, -3178, -497, 3205, 183, -3999, -1474, 3458, 1751, -3146, -2569, 1685, 2844, -808, -3259, 355, 3785, 671, -3320, -412, 3644, 1389, -2403, -1562, 2492, 3183, -1156, -3217, 655, 3823, -443, -2966, -201, 2950, 572, -2854, -2311, 1908, 2570, -2598, -3660, 1003, 3127, -1279, -3333, -330, 2495, 1276, -2600, -1751, 3056, 2693, -2632, -2409, 2569, 3527, -793, -2397, -76, 3089, 1373, -2711, -1370, 3094, 1797, -2503, -2042, 2305, 2729, -1196, -3062, -598, 3143, 239, -3748, -1571, 2774, 966, -2932, -2076, 1653, 2314, -1820, -3439, 514, 3785, 408, -3483, -165, 3133, 1227, -1943, -1331, 1999]
4119A999J204m295j666M027K466m263k707L090L132j784l701J78M057Q65n043
4134b441q26N098R06m281j700L112K791j814l959J194M387l03m534l0M614M38
4150B652l743j184K815K888k055m606K202M354j249m360K01M534J48l593j935
4165b931L569K692l307l967K861M112k287l941J200L379M82l403j547L690K470
4180C072l759k759L416L302k206l543P52L884Q23m094k032M761J807l991k059
4195b626L314K350k412l132J102L967l84m605l08M257Q18l821j432K990J878j519
4211D37l481J168M595n23n164K52M931L60l583j468K876L000k484l951K134M301
4227C400j878l925R06M034o6l039k264L135K905l143l342K575L277k014l395Q66
$$ y = [1999, 3203, -1092, -2758, 1269, 3735, -528, -3235, -145, 2987, 1203, -2498, -2320, 1737, 2602, -2441, -3267, 1831, 2737, -1544, -3244, -132, 2659, 845, -3114, -1920, 2467, 2164, -2370, -2400, 2214, 2652, -1091, -2275, 540, 3428, 1373, -3233, -1031, 3323, 2074, -2286, -2085, 2449, 2597, -996, -2931, 638, 3330, 23, -3944, -1083, 3029, 742, -3199, -1999, 1380, 1862, -1541, -3088, 602, 3072, -687, -3446, -30, 3272, 1066, -2477, -1725, 2159, 2982, -1112, -3144, 1617, 3424, -567, -2626, 688, 3038, 626, -2506, -1404, 2563, 2179, -2426, -2734, 1523, 2341, -1480, -2912, 78, 1956, 437, -3044, -1876, 2719, 2196, -2968, -2716, 2215, 2575, -1008, -2476, 400, 3400, 916, -3035, -901, 3400, 1522, -2403, -1497, 2537, 2471, -568, -2832, 303, 3208, 65, -3277, -702, 2575, 561, -2834, -1968]
4243a968L569L83l523k047M113K796l962k757L338K739k104l102J159L737L96
4258B767m464p19M337J570m305j901L281K490j874l245R53L452J2m871j55M707
4274B035N32m105j496L301K461k576l440J375M240p34m644R65M199j68l544j040
4290b639L019K927k880l588K240M373j875l942J094L633l62k858j252L335K063
$$ y = [-1968, 1601, 1984, -1539, -3586, 527, 3323, -639, -3396, -58, 2681, 577, -2525, -1366, 2371, 2767, -1697, -2416, 1921, 3491, -814, -2715, 566, 3056, 1182, -2063, -1110, 2342, 2354, -2517, -2672, 2035, 2567, -1538, -3034, 267, 2728, 152, -3288, -1913, 2327, 1593, -3051, -2086, 2113, 1945, -1599, -2639, 380, 3307, 427, -3161, -921, 3452, 1577, -2365, -1271, 2362, 2000, -858, -2110, 1225, 3288]
$$ [...]
8191G9
##END NTUPLES=NMR FID
##END=
