##TITLE=1H_EC-3186p
 CDCl3, 8 sc, 
 2.4.2019
##JCAMPDX= 6.0         $$ Bruker NMR JCAMP-DX V2.0
##DATA TYPE= NMR FID
##DATA CLASS= NTUPLES
##ORIGIN= UXNMR, Bruker Analytische Messtechnik GmbH
##OWNER= root
$$ XWIN-NMR		Version 3.5
$$ Wed Apr  3 13:53:38 2019 Russian Standard Time (UT+4h)  she@DPX200
##.OBSERVE FREQUENCY= 200.1316
##.OBSERVE NUCLEUS= ^1H
##.DELAY= (6, 6)
##.ACQUISITION MODE= SIMULTANEOUS
##.ACQUISITION SCHEME= undefined
##.AVERAGES= 8
##.DIGITISER RES= 18
##SPECTROMETER/DATA SYSTEM= spect
##.PULSE SEQUENCE= zg30
##.SOLVENT NAME= DMSO
##.SHIFT REFERENCE= (INTERNAL, DMSO, 0, 15.7039)
##AUDIT TRAIL= $$ (NUMBER, WHEN, WHO, WHERE, WHAT)
$$ ##TITLE= Audit trail, XWIN-NMR		Version 3.5
$$ ##JCAMPDX= 5.01
$$ ##ORIGIN= Bruker BioSpin GmbH
$$ ##OWNER= she
$$ F:/spectra/data/she/nmr/H-F/1/audita.txt
$$ ##AUDIT TRAIL=  $$ (NUMBER, WHEN, WHO, WHERE, WHAT)
(   1,<2019-04-03 13:52:20.90 +0400>,<she>,<DPX200>,
      <created by zg, POWCHK disabled, PULCHK disabled
       configuration hash MD5:
       00 E9 B6 7A A2 85 ED C7 34 08 36 98 17 FE 4E 26
       data hash MD5: 16K
       F9 AA 30 EA 87 E9 09 13 EF 01 B6 D0 B0 C0 E0 C7>)
$$ ##END=
$$ 
$$ hash MD5
$$ 81 23 99 83 86 B3 06 1B C3 19 1D 68 34 B3 8F 27
##$RELAX= 
##$RELAX= 
##$RELAX= 
##$RELAX= 
##$RELAX= 
##$RELAX= 
$$ Bruker specific parameters
$$ --------------------------
##$DU= <F:/spectra>
##$EXPNO= 1
##$NAME= <H-F>
##$PROCNO= 1
##$TYPE= <nmr>
##$USER= <she>
##$AMP= (0..31)
100 100 100 100 100 100 100 100 100 100 100 100 100 100 100 100 100 100 
100 100 100 100 100 100 100 100 100 100 100 100 100 100 
##$AQSEQ= 0
##$AQ_mod= 1
##$AUNM= <au_zg>
##$AUTOPOS= <>
##$BF1= 200.13
##$BF2= 200.13
##$BF3= 200.13
##$BF4= 200.13
##$BF5= 200.13
##$BF6= 200.13
##$BF7= 200.13
##$BF8= 200.13
##$BYTORDA= 1
##$CFDGTYP= 0
##$CFRGTYP= 5
##$CHEMSTR= <none>
##$CNST= (0..31)
1 1 145 1 1 1 1 1 1 1 1 1 1 1 1 1 1 1 1 1 1 1 1 1 1 1 1 1 1 1 1 1 
##$CPDPRG= <>
##$CPDPRG1= <>
##$CPDPRG2= <>
##$CPDPRG3= <>
##$CPDPRG4= <mlev>
##$CPDPRG5= <mlev>
##$CPDPRG6= <mlev>
##$CPDPRG7= <mlev>
##$CPDPRG8= <mlev>
##$CPDPRGB= <>
##$CPDPRGT= <>
##$D= (0..31)
0 1.2 0 0 0 0 0 0 0 0 0 0.03 0 0 0 0 0 0 0 0 0 0 0 0 0 0 0 0 0 0 0 0 
##$DATE= 1554285140
##$DBL= (0..7)
120 120 120 120 120 120 120 120 
##$DBP= (0..7)
150 150 150 150 150 150 150 150 
##$DBP07= 0
##$DBPNAM0= <>
##$DBPNAM1= <>
##$DBPNAM2= <>
##$DBPNAM3= <>
##$DBPNAM4= <>
##$DBPNAM5= <>
##$DBPNAM6= <>
##$DBPNAM7= <>
##$DBPOAL= (0..7)
0.5 0.5 0.5 0.5 0.5 0.5 0.5 0.5 
##$DBPOFFS= (0..7)
0 0 0 0 0 0 0 0 
##$DE= 6
##$DECBNUC= <off>
##$DECIM= 24
##$DECNUC= <off>
##$DECSTAT= 4
##$DIGMOD= 1
##$DIGTYP= 9
##$DL= (0..7)
0 120 120 120 120 120 120 120 
##$DP= (0..7)
150 150 150 150 150 150 150 150 
##$DP07= 0
##$DPNAME0= <>
##$DPNAME1= <>
##$DPNAME2= <>
##$DPNAME3= <>
##$DPNAME4= <>
##$DPNAME5= <>
##$DPNAME6= <>
##$DPNAME7= <>
##$DPOAL= (0..7)
0.5 0.5 0.5 0.5 0.5 0.5 0.5 0.5 
##$DPOFFS= (0..7)
0 0 0 0 0 0 0 0 
##$DQDMODE= 0
##$DR= 18
##$DS= 0
##$DSLIST= <SSSSSSSSSSSSSSS>
##$DSPFIRM= 0
$$ [...]
##$SUBNAM2= <"">
##$SUBNAM3= <"">
##$SUBNAM4= <"">
##$SUBNAM5= <"">
##$SUBNAM6= <"">
##$SUBNAM7= <"">
##$SUBNAM8= <"">
##$SUBNAM9= <"">
##$SW= 24.9336934301222
##$SWIBOX= (0..15)
0 0 2 0 0 0 0 0 0 0 0 0 0 0 0 0 
##$SW_h= 4990.01996007984
##$TD= 16384
##$TD0= 1
##$TE= 0
##$TE2= 300
##$TE3= 300
##$TEG= 300
##$TL= (0..7)
0 120 120 120 120 120 120 120 
##$TP= (0..7)
150 150 150 150 150 150 150 150 
##$TP07= 0
##$TPNAME0= <>
##$TPNAME1= <>
##$TPNAME2= <>
##$TPNAME3= <>
##$TPNAME4= <>
##$TPNAME5= <>
##$TPNAME6= <>
##$TPNAME7= <>
##$TPOAL= (0..7)
0.5 0.5 0.5 0.5 0.5 0.5 0.5 0.5 
##$TPOFFS= (0..7)
0 0 0 0 0 0 0 0 
##$TUNHIN= 0
##$TUNHOUT= 0
##$TUNXOUT= 0
##$USERA1= <user>
##$USERA2= <user>
##$USERA3= <user>
##$USERA4= <user>
##$USERA5= <user>
##$V9= 5
##$VALIST= <valist>
##$VCLIST= <CCCCCCCCCCCCCCC>
##$VD= 0
##$VDLIST= <DDDDDDDDDDDDDDD>
##$VPLIST= <PPPPPPPPPPPPPPP>
##$VTLIST= <TTTTTTTTTTTTTTT>
##$WBST= 1024
##$WBSW= 4
##$XGAIN= (0..3)
0 0 0 0 
##$XL= 0
##$YL= 0
##$YMAX_a= 66669
##$YMIN_a= -132571
##$ZGOPTNS= <>
##$ZL1= 120
##$ZL2= 120
##$ZL3= 120
##$ZL4= 120
##$ABSF1= 10
##$ABSF2= 0
##$ABSG= 5
##$ABSL= 3
##$ALPHA= 0
##$AQORDER= 0
##$ASSFAC= 0
##$ASSFACI= 0
##$ASSFACX= 0
##$ASSWID= 0
##$AUNMP= <proc_1d>
##$AZFE= 0.1
##$AZFW= 0.1
##$BCFW= 1
##$BC_mod= 2
##$BYTORDP= 1
##$COROFFS= 0
##$CY= 11.3945322036743
##$DATMOD= 1
##$DC= 2
##$DFILT= <>
##$DTYPP= 0
##$F1P= 18.9103706918063
##$F2P= -1.10871071338519
##$FCOR= 0.5
##$FTSIZE= 0
##$FT_mod= 4
##$GAMMA= 1
##$GB= 0.15
##$INTBC= 1
##$INTSCL= 1
##$ISEN= 128
##$LB= 0.24
##$LEV0= 0
##$LPBIN= 0
##$MAXI= 10000
##$MC2= 0
##$MEAN= 0
##$ME_mod= 0
##$MI= 1.114404
##$NCOEF= 0
##$NC_proc= 0
##$NLEV= 6
##$NOISF1= 3.799351
##$NOISF2= 2.8
##$NSP= 1
##$NTH_PI= 0
##$NZP= 0
##$OFFSET= 15.70392
##$PC= 1
##$PHC0= -9220.222
##$PHC1= 26.20025
##$PH_mod= 1
##$PKNL= yes
##$PPARMOD= 0
##$PSCAL= 0
##$PSIGN= 0
##$REVERSE= no
##$SF= 200.130013532006
##$SI= 16384
##$SIGF1= 3
##$SIGF2= 2
##$SINO= 400
##$SIOLD= 16384
##$SREGLST= <1H.CDCl3>
##$SSB= 0
##$STSI= 0
##$STSR= 0
##$SW_p= 3612.71676300578
##$SYMM= 0
##$S_DEV= 0
##$TDeff= 0
##$TDoff= 0
##$TI= <>
##$TILT= no
##$TM1= 0
##$TM2= 0
##$TOPLEV= 0
##$USERP1= <user>
##$USERP2= <user>
##$USERP3= <user>
##$USERP4= <user>
##$USERP5= <user>
##$WDW= 1
##$XDIM= 8192
##$YMAX_p= 0
##$YMIN_p= 0
$$ End of Bruker specific parameters
$$ ---------------------------------
##NTUPLES= NMR FID
##VAR_NAME=  TIME,          FID/REAL,        FID/IMAG
##SYMBOL=    X,             R,               I
##VAR_TYPE=  INDEPENDENT,   DEPENDENT,       DEPENDENT
##VAR_FORM=  AFFN,          ASDF,            ASDF
##VAR_DIM=   8192,          8192,            8192
##UNITS=     SECONDS,       ARBITRARY UNITS, ARBITRARY UNITS
##FACTOR=    0.0002004,     1,               1
##FIRST=     0,             0,               0
##LAST=      1.6414764,     0,               0
##MIN=       0,             -132571,         0
##MAX=       1.6414764,     66669,           0
$$ Real data points
##PAGE= N=1
##DATA TABLE= (X++(R..R)), XYDATA
$$ [...]
2387H9j412J496P29j614J167O29j224R38M04j793J944R82k566l77K513j261r48
2404c04J263q32p57J241j021p80K045n13k317J204J220j134L59k30j300J745O78
2421E67k049R96J667j464r13J769p1l46J445j321o52J890j69j318Q09J45j416
2438d31Q98K42p07P13k18k074J291J629k236l97J416q86m14J514j075l12J272
2455B25q43j246J960Q59j999Q74L94m66J134L36j455P70Q66k051P80K029j859
2472C08o51J274n62k97J367j321j302J970n78j852J370P58j150k02M07p42J360
2489A57%k408J433J500j043n56J725j031l44R86n87R3J741r79j566J942R25j852
2507A36N55K75q01Q99l44j549J147J253k608m33K335j028m40P12j577L49J580
$$ y = [89, -1323, 173, 902, -712, 455, 1084, -140, 798, 1202, -591, 1353, 2335, -231, -608, 1905, 644, -304, 959, 127, -630, 611, -410, -1190, 855, 342, -1975, -771, 449, -685, -326, -556, -1856, -111, 567, -1482, -486, 1181, -283, -1196, 573, 502, 156, 1601, 280, -372, 1518, 1349, 31, 840, 985, -431, 467, 709, 2, 715, 497, -1577, -286, 1343, -893, -1290, 126, -760, -1174, 340, -735, -1047, 225, -618, -1864, 96, 955, -1044, -170, 224, -242, 892, 1228, -227, 543, 1409, -642, 138, 2167, 308, -343, 931, 369, 72, 1439, 118, -1184, 786, 208, -1644, -274, 484, -666, -868, -461, -1203, 157, 157, -2251, -818, 682, -361, -917, 808, -223, -567, 419, -168, -75, 1666, 687, -879, 1063, 1988, 136, 691, 966, 165, 1064, 720, -829, 318, 1571, -1037, -1470, 865, -163, -603, 109, -1468, -1119, 461]
2524D61j187r34J354N70j484P98Q15n02K77L1j114J616J037j804K57J521j088
2541F24n24J146r26k99J554j626o35J950n18j833R11K88o85O31k46q64R06K47
2559A01j933J228J992k139k45J144p24J70J126j144j05J863j130j097J790M28
2575A325j773J191L63j208J320l41j579J045J014j598k59J448j172k34J002j126
2591e82j57J631j824j231K220r7j507Q66N47q72Q98L01j076J276N30j754Q59J819
2609A847j380l47O62n11J08J389j879j69J637q35j287J479j5r03J5m3p06J078
2627A40M94k072P85R53j391j25J372r23P9J104j465k14K786j547j318K123K00
2644I81r75O99Q7j115J267j19j163J511N00j652j04J428j342L20K63j263m8J463
$$ y = [461, -726, -1660, -306, 264, -1220, -422, 393, -109, 168, 199, -915, 701, 1738, -66, 191, 1712, 624, 100, 1246, 320, 21, 1575, -51, -686, 1264, 746, -1087, -176, 112, -573, 58, -188, -1052, -146, 101, -1832, -604, 1388, -751, -996, 148, -576, -406, 720, -424, -529, 1334, 204, -893, 897, 1325, -448, 743, 1106, -102, 1218, 877, -702, 343, 1357, -241, -500, 948, -224, -458, 544, -582, -739, 892, -932, -2163, 57, -40, -1547, -681, -134, -1006, -108, 193, -883, 393, 923, -831, 28, 1847, 467, 120, 782, 271, 379, 1768, -111, -280, 1357, 522, -765, 714, 699, -204, -189, -232, -938, 140, 634, -1438, -653, 300, -1091, -1216, 156, -767, -688, 416, -1049, -1263, 1523, -24, -1342, 781, 981, 6, 705, 792, -323, 944, 825, -338, 1173, 1673, 21, -83, 1345, 3, 323, 586, -677, -725, 738]
2662G38j012j220J774rj993J160L35n39Q82l17j366J548O97j667M98J339q35p2
2680e9J072p48J40O95j283j95K079o05j280P54p5j156J152l35n98Q00J8j810P22
2699g12J374j533m64Q18p68O73J151j727J50J624j009r21K017M9j433J093r0n27
2717b35J439k76j495J191Q78j629M29J135j312jL41r66L09J623k162o65K028n15
2735A17j318R29j15j026J328l82j018J684J49j855Q44J731j537M56N05j206P05
2752iJ147j260p0J774j134j012J288N16j018O59r22n05J634k06k093J174Q85j418
2770e70m24J078q06L64J31r13K84J542j093j107J838k66r91J436o73m30J120P4
2788E94j336J581J023k022J20R59r11M32Q78j273K7J308j728p27K152n52j238
$$ y = [738, -274, -1494, 280, 271, -1722, -562, -227, -766, 116, -201, -1567, -19, 678, -989, -491, 848, 13, -59, 1013, 265, 405, 1100, -183, -378, 1701, 1096, -184, 570, 495, -661, 491, 156, -442, 358, 376, -1434, -712, 662, -871, -1335, -517, -1285, -612, 539, -1188, -1038, 586, -423, -1344, 673, 722, -711, 382, 292, -235, 1204, 928, -567, 624, 1502, -127, 302, 1437, 125, 124, 465, -501, -192, 1431, -731, -1396, 632, 117, -1201, -272, -387, -1413, -85, -467, -1485, 199, 348, -1507, -663, 1068, -469, -13, 492, -714, -9, 1138, -122, -192, 1582, 448, -564, 724, 1240, 222, 881, -41, -546, 1088, 882, -1211, -37, 848, -570, -994, 84, -722, -358, -227, -1140, -856, 686, -407, -1514, 324, 58, -933, 503, -170, -600, 520, 594, -742, 839, 1862, -160, -40, 919, 8, 440, 1318, 45, 72, 1380, -348, -1075, 1077, 525, -713]
2805g13O26k74n29J140q63j076J681M69j823P50J043j571N79P59o03P51R30j993
2823g17K70K025p38j420J143M76j293J132j28r54J593o12k153J510R49j220p5
2840b12K73r33N87M67j143j4J515j306q86J923n39n28N03k24o25J990m18j308
2858h78J904K74k120J058J213j094N78k07p04L51J243j456n11J327p78n47P83
2875D36l65o19M41l65q51J746j17j880P81J048j193L48O39j284Q89J037k036O78
2893f67K231j426j085J715j8m19Q71n16j118J594m72j387J581L23j535L2R15j209
2911e90Q36M01k069L82J598j182n76J766p52r49P14k77MJ251o79j640J980N69
2929G87j393N85P70r80O63N53j324R36P30j654l19J810k46j247Q97o93r2J071
$$ y = [-713, -87, -361, -890, 250, -613, -1689, -8, 461, -1362, -612, 431, -1140, -561, 198, -405, 346, 1276, -717, -447, 1578, 840, -580, 563, 1039, -254, 878, 750, -204, 1389, 777, -1376, 134, 1083, -137, -212, 61, -872, -285, 182, -961, -975, 540, -766, -1652, 271, -268, -796, -293, -517, -1142, 848, 430, -878, 1026, 1300, -820, 238, 1451, 357, 935, 728, 24, 375, 1618, 162, -349, 978, 200, -347, 436, 71, -548, -107, -472, -1323, 423, 306, -1574, -793, 255, -938, -590, 49, -1235, -346, 691, -1345, -667, 1564, 138, -947, 768, 750, 331, 1202, 686, -432, 1162, 690, -697, 884, 1207, -328, -296, 619, -590, 246, 647, -1422, -1040, 558, -624, -1200, 566, -186, -1135, -421, -698, -694, 557, -122, -1762, 218, 787, -606, -21, 749, -231, 432, 985, -339, 597, 1327, -327, -646, 1164, 918, -329, 568, -125, -217, 854]
2947H54p72j564J781N4j770P95J092j230J49K92q27R34J009j929J0K171j298p3
2965c22J096n08l75P19n63n10K058o74j444Q36P51j215M56M36j158O03M93j543
2983h64M39J500j860m86J452l04m65N72o57p72J967p49j294J809qj132O21J011
3001G80p83O07K19j717J406J020j588J24J472j519n52J400k67m46Q54j053q09
3018h52J822pk156J071K37r67N04L09q35P53K33k218J330J491j022o26P68K20
3036E5l66J295j038k20J071j83j116J336O53j367J54M81p45R11K45k095N86J350
3054A007j250o69J311p31o47Q86m96K6J371q17j607J300J34n46M26N50j094R82
3072A36M66j546J606M83j968N88J811q91l27L21p28K1J106q44r96K268q13j630
$$ y = [854, 82, -1482, 299, 353, -1417, -622, 470, -760, -611, -319, -1146, -212, 797, -1132, -1122, 1049, -249, -322, 774, 266, -109, 610, 47, -463, 1595, 921, -523, 313, 1064, -151, 305, 741, -417, 186, 679, -864, -425, 1075, -785, -1271, 181, -123, -588, -16, -673, -1445, 522, -227, -1521, 288, 280, -852, -231, 780, -3, 604, 823, -894, 512, 1532, -56, 68, 1540, 21, -531, 869, 602, 156, 1010, -43, -852, 970, 963, -1193, -122, 115, -852, -348, -39, -874, -121, 112, -2106, -776, 715, -307, -933, -165, 55, -311, 984, -54, -274, 797, 614, -502, 834, 1487, 120, 274, 755, 10, 921, 1166, -929, -343, 1007, -243, -912, 399, -332, -979, -93, -589, -563, 808, -9, -1616, -316, -182, -728, -302, 248, -846, 136, 602, -944, 662, 1145, -823, -235, 1576, 685, 358, 679, -49, -28, 1078, 234, -762, 1506, 693, -937]
3090i37Q60N62j013Q25l96j086J040N96j820L68J705j435n62J463k35m90Q08p06
3108d53q2J620n38j197J284L50j086N68N43r32P89m00j437J113J496j745n66J354
3126F81j040j82J455j075o12J102j005p57J744N9j681M82O98n53N47J76j118J212
3144A33N87j159J94J241r92m06J173p70L71R23r04j116J838k26j202P51K28r53
3162b89Q0K55m29O74J08j864O45J472j350k17J126p11j20R86r99k52J659o63j163
3181a052J223O77n30J49J32m15O25K09j171O53P94j498P6J421j070m51N68j013
3199f73J48J346q93j175J332J45j614Q90K86n39O33j44r38J343P89k093Q58J031
3217G32r58K99P20p27L0J213j051m17J591l69j409P24J69m07M31m49o78P54K68
$$ y = [-937, -77, 485, -528, 297, -99, -1185, -145, 451, -1369, -1001, 704, -731, -1293, 170, -65, -555, 253, -453, -535, 1085, 547, -650, 634, 984, -102, 466, 1009, 77, 866, 466, -971, 142, 1638, -107, -673, 681, -359, -541, 914, -161, -773, 329, -676, -1433, 311, 370, -1311, -829, -131, -684, -137, 39, -1079, 133, 720, -439, -245, 996, 4, -402, 771, 1, 372, 1295, 391, -725, 1113, 887, -315, 436, 664, -289, -209, 46, -383, 291, 399, -1465, -820, 652, -698, -915, 211, -500, -620, 366, -633, -885, 774, 111, -1052, 171, 848, 318, 467, 599, 184, 809, 1018, -153, 500, 1294, -204, -128, 1293, 223, -228, 340, -673, -525, 821, -72, -1247, 85, 230, -1384, -494, -208, -747, -114, -258, -1196, 147, 936, -1157, -299, 732, -226, 73, 793, 66, 96, 1309, 258, -159, 1432, 1063, -346, 378, 547, 140, 571, 122, -556, 198, 466]
3236D66j520M72J223j279q6P71o47J26L05q03O1J655q46q07J276n7j227J100J45
3255C28m82J046k37j306J408R11j902O90M68p57NO90j279O92Q58j534m43J294
3273D50k12j191O91n6m24P54m4j100R53K25j046J13J726j100o0R92j211O11Q91
3292I62p43p42J713o88j039J244L28j077N06k49p43J427j46j514O17P95j211K84
3310b76N16r30R5N30j045J19J464p92r37J287J6r47J195l86o01J279n9j072J050
3329E06N98j246K2Q03m78J39N66j019J12J128r74j052J830p18j187O84M17o20
3347d89P84q54q48J433P49j644L85Q13r75J98N34l08L56L95j116J01J405l72j077
3366e30J136o1m44N45j27q83J226J00j707R46P31j340K21N38r07M18O77j244k05
$$ y = [466, -1054, -582, 641, -638, -724, 47, -600, -474, -169, -972, -911, 744, -102, -909, 367, 310, -917, 183, 328, -154, 892, 655, -651, 757, 1668, -234, 456, 924, 167, 172, 862, -417, 275, 1133, -401, -844, 450, 238, -953, -262, -318, -742, 12, -32, -1132, -179, 46, -1000, -887, 839, -261, -321, 671, -540, 71, 962, 219, -523, 1190, 502, -537, 707, 1035, -42, 464, 215, -528, 899, 753, -761, -144, 651, -560, -276, 240, -690, -595, -65, -1110, -991, 473, -319, -1256, 31, 47, -900, 295, -91, -692, 587, 528, -544, 506, 1104, -142, -120, 683, 205, 344, 910, -109, 3, 1131, 157, -895, 935, 217, -970, -286, 131, -489, 295, -559, -1407, 26, 775, -869, -484, 329, -646, -448, 86, -222, 134, 529, -587, -486, 919, 547, -530, 606, 545, 101, 646, 519, -364, 862, 962, -745, 201, 932, -408, -187, 351, -556, -138, 539, -705, -910]
3385i10J290r32n98J499k39p76N87l49l31J293j80j372J035P50j072O45P27p69
3403B98j07L94p64Q44Q36j412o78J713p13p28O30m35m19J101q44o16J088q7j349
3422a248N30J263j115L07J28n45J28J071r70l66J649q36n50J068j29k55M24l88
3440A66m12J204P3j412N94Q22j093P7Q61j096J22L67j360M77J107o44j173J314
3458fm69m68O54lm70R88j83j270J320P81j272J00Q92o99M74R7q02M58J027r34
3478B15l64J261m89r94J069p39o2J101q87j172J309M63j539M24P34q18j15L95
3496b08m75P66K81j580L39J351p56o2O24K12q51J089n54n27J534m59r15M67N92
3515H68p64L96J51r42O35K3r80O48P34j311m70J257k25q35O42l70m46J331n13
$$ y = [-910, 380, -552, -1150, 349, 110, -666, -79, -428, -759, 534, 354, -1018, 17, 767, -305, 340, 1067, 298, 191, 585, -179, 665, 1501, 89, -589, 1124, 411, -317, 313, -122, -541, 560, -284, -900, 188, 101, -1248, -718, 545, -570, -263, -135, -680, -552, 519, -451, -817, 832, -4, -554, 514, 385, 130, 554, 166, -246, 958, 1031, -381, 213, 1035, -58, 19, 880, -216, -94, 273, -1087, -610, 497, -147, -1320, -6, -475, -943, -289, -292, -762, 226, 43, -1227, 93, 874, -398, -298, 594, -105, 369, 466, -336, 122, 1149, 215, -149, 1112, 623, -371, 698, -41, -103, 998, 111, -1061, 248, 711, -828, -404, 330, -488, -603, -208, -683, 83, 364, -1216, -877, 474, -282, -344, 280, 492, -359, 730, 176, -351, 1183, 724, -191, 276, 868, 104, 500, 651, -291, 344, 367, -613, 35, 769, -542, -1012, 245, 20, -815, -173, -543, -989, 342, -171]
3534a71j155J002J020j368L10Q56q04L72L80j000P67J153j439m52J702o38o38
3551a03R73o23p2M09o32o36J664J43j865K73N71q51M96Pm26L84P67j274l1J312
3571D86n39j033J009j59p1R06p91oQ14Q4j151J236J88j053L11N65p51O49P7j212
3591d41L62J126j341m57J056k33n52Q45p64OP13m96q98J082K82p93J37J38k51
3610d79O09L51r20L68P86j087J71J312n74l12P23q56KP48o38n89R94q3j093R48
3630C81O5q62L10k1n27O93N39j346J0O50l43l24P42m77m0Q07p41N2J392q35o87
3651e62Q66L27n38l2L03n76P63n4q00N30J322j717k11O69j30j52K67o44k36J320
3671G15q30r84R30L31j153O83M45o65K34r5o80O57J148j212K63O64k16m28P63
$$ y = [-171, -1326, -324, 696, -672, -362, 494, -310, 62, 442, -558, 209, 1362, -77, -529, 1173, 535, -103, 870, 247, 175, 584, -48, -684, 980, 1123, -742, -469, 102, -749, -253, -246, -672, -288, 479, -795, -826, 486, -53, -1086, -77, -236, -307, 599, -192, -198, 616, 700, -451, 785, 973, -80, 231, 796, 45, 694, 771, -441, -79, 1047, -294, -751, 305, 72, -480, 365, -399, -393, 320, -176, -1074, 8, 290, -503, -366, -228, -479, 130, 481, -439, -71, 715, -372, -201, 1111, 537, 225, 948, 92, 94, 842, 204, -385, 609, 526, -567, 381, 446, -416, -106, -127, -654, 39, 578, -768, -758, -108, -451, -775, -33, -510, -550, 257, -484, -432, 960, 125, -562, 304, 631, 93, 61, 364, -212, 551, 497, -303, 227, 1549, -168, -379, 290, 160, 8, 275, -369, -605, 715, -115, -1099, -169, 162, -991, -308, 137, -528, -294, -389, -1069, -412, 736, -476, -213, 451, 235, -193, 570]
3690E70l99q4J098r56n84J226R0j342O73N5n59K07K39j010P59L35r51J54J071
3709E92r11n58P10j63j67Q31q29q0J132n50o94J108J12p11J41J87m52Q26P92j754
3729d38O89N72p75k37R36n86j27J78m26j15J048j087o81J013L17q35J54J01m44
3748g43O51J8q05Q45N79j135J18P86j28j42M17j017N38R05o12l75J083n05q01
3767c23O73J95m19M27l77p22R14K93j123K84O68o37n15N12k69M23m4m82n07J551
3787E22l90j097J059J01m96L08L17p21J066l66m10N39R29j119l57O20l92j9O05
3806F99r02j22R58o93n66R88N2j251Q13k62m26Q86m48r51J164P31j414K19J158
3825F33q83j62J090j123L43R42j211P5J230q8j013P14J15q63Q04k40m96Q70J5
$$ y = [570, 171, 87, 1185, 229, -355, 871, 961, -381, 292, 347, -212, -5, 234, -776, -17, 318, -633, -479, 592, -319, -877, -167, -330, -497, 334, -495, -575, 557, 7, -687, 421, 533, -178, -37, 150, -302, 524, 1316, -438, 251, 823, 48, -189, 747, 161, 34, 212, -214, -329, 719, -368, -1049, -36, 281, -554, -400, -299, -743, -92, -74, -879, -34, 545, -590, -472, 314, 186, 44, 461, -556, -18, 887, 275, -100, 983, 478, -323, 350, 545, 126, 553, 176, -546, 368, 661, -462, -178, 490, -147, -662, -150, -419, 4, -40, -522, -1029, 522, 132, -965, 94, 195, -301, 7, 324, -397, 669, 303, -107, 432, 1361, 242, -115, 505, 113, 94, 699, -203, -325, 633, -60, -626, 362, 414, -837, -24, -286, -712, 174, -274, -1225, -61, 670, -744, -525, 633, -250, -412, 678, -445, -102, 840, -371, -296, 934, 846, -167, 547, 662, -201, 603, 363, -133, 737, 752]
3844G52j368M81N68j47l83J47p35J52R80j291L0J190n06q63Q49N77j026Q75m05
3863a23j23Q36j93o72K15J103j352J25J046o10j02K46m07J14Q76p61m60N58o6
3882B50r61N98j25j61M07j98r28J389M01j677L11O65m37o6P80n97k48J018n76
3901a55j69J342o99p16Q13K10m05P15n52m90P49J02j167N57M95o83k76O17n24
3920b36L95M5r12J33P43k15q45O74m3m55P05k77j82Q56l23j099R78J316j272k62
3940b76R56p17L01N88q44J13P14n63o27J010l54n69L75j44k81P37o22n27M90M27
3960A87j128O61N28p61k6N23o55M79Q83j082l45J251l20m92N46K79l69J09J98
3979D66o97J256k40j008K60O47p05M05j31n59J75P43j057j98J003p56o65R86R8
$$ y = [752, -616, -135, 433, 286, -97, 50, -685, -533, 447, -844, -814, 376, -130, -993, -144, 433, -593, 282, -123, -246, 590, 397, -275, -60, 1043, -309, -184, 862, 252, 150, 396, -11, 103, 979, 218, -242, 316, 250, -711, -113, -238, -399, 8, -190, -1118, 271, 672, -1005, -694, -29, -466, -532, 248, -349, -597, 421, -155, -324, 1018, 319, -397, 416, 626, 221, 936, 384, -106, 643, 745, -422, 135, 630, -53, -329, 288, -236, 159, 204, -708, -575, 168, -47, -892, -218, -261, -716, -11, -288, -470, 386, 63, -1036, -58, 1258, -14, -276, 680, -37, 264, 852, 8, 121, 835, 272, -355, 655, 301, -268, 107, -37, -318, 419, -203, -730, -240, 187, -941, -280, 248, -513, -539, -16, -671, -192, 691, -391, -736, 515, 195, -297, 249, 528, 159, 268, 466, -231, 1025, 785, -223, 37, 684, -21, 384, 253, -306, -131, 612, -445, -643, 360, -396, -1061, -75, 23]
3998B3r22J022o26n77J016K00j093J017P29j251J47O44m72M70M29r61K18P28m88
4017B53o28J080p7p95M44J8o85P78m53o22J054q2r53K39L75n60J71L67n78J48
4037e06N14p43J54J330o14o52N29M4j53O37l89m53R79K19j156R09J16q39J97M06
4057E29q54N47N10j542N09Q16n71n43J013l29m53K02k4k79N97J17j120O22P28
4076D75o65k36N50n31M50J55n49M70N86q74q3J190n43n07O07l60l78P27n29l46
4096c91R95k60q58L12N23o00K06R0p46M15K49p34N7J014n41j84L34P8m98R16n79
4117b02n1P06N7j005O36N60r54P94m4n42M21J81j047J47R85m36q62P02k1m39N94
4138A80k86o17Q18l20q48J034J26n24j40R21n25M77P0j012M50J082j124K33Q27
$$ y = [23, -899, 123, -503, -1080, -64, 136, -957, 60, 789, -462, -315, 329, -143, 327, 756, -205, 13, 741, 253, -375, 705, 628, -167, 277, 295, -390, 388, -65, -687, 367, 285, -668, -429, -54, -614, -443, -76, -654, -506, 8, -735, -581, 749, 135, -517, 12, 56, -97, 540, 151, -302, 677, 896, -260, 649, 765, -74, 123, 529, -325, 222, 732, -810, -301, 515, -56, -599, 414, 85, -368, -166, -190, -469, 128, 245, -875, -253, 475, -190, -426, 124, -407, 43, 198, -351, 119, 705, -169, -252, 938, 395, -112, 495, 135, -243, 484, -45, -391, 604, 344, -514, -202, 321, -279, -73, 17, -729, -314, -65, -799, -742, 272, -269, -453, -119, -41, -539, 377, -202, -253, 453, 510, -495, 141, 701, -253, 541, 497, -45, 376, 557, -490, -343, 642, 206, -656, 46, 25, -414, 180, -106, -723, 95, -225, -1073, -39, 87, -437, -577, 344, -181, 296, 366, -646, -196, 886, -238, -5, 822]
4157H22k33r50R13k20l46J158j069o98J076J8o97J20N17p47O08n09k27M25J83
4176A44q75J39Q00n95K9K96j47k02R86o95l50R37L8j204J040O22j087N35l52k90
4196b31J005L06j441N30R85r39q43J463p01l30N26o78m96J228k68r17R25l50l61
4215e87K26M34o26L42M9p20J194K34q84J47O44l27%M07n95P8N98m35m76J215l90
4236E28q65N30N21q07L50J00q54M41L77r29r2J124o95k70O75m53m84Q51k03p09
4256h64J213J26j066N03N62p49L68K77m26P31K4j232Q47N17m63l27N62m73l0o1
4276C9j93k75P83l99q80R25K11q55L68J17l27N37j00n61M90O78j247J33N96k86
4296b46j58P66m46m86J410o82l19P85Q7r63N87R4n26M36j06p29N34P66j436K41
$$ y = [822, 589, -361, 552, 332, -14, 1144, 75, -623, 453, 471, -226, -106, 411, -336, 272, -237, -464, -39, 144, -731, -592, 208, -387, -358, -62, -209, -411, 575, -120, -470, 467, 505, -699, 341, 963, -124, 411, 59, -231, 774, 1080, -361, 169, 1154, 215, -628, 835, 134, -196, 330, -348, -844, 384, 116, -801, 124, -226, -587, -361, 73, -553, -211, -162, -882, 312, 546, -338, -191, 453, 126, 126, 533, -62, 16, 614, 179, -297, 918, 528, -337, 193, 714, -93, 257, 357, -497, -56, 321, -608, -700, 424, -271, -541, 134, -319, -803, 48, -155, -864, 349, 475, -591, -88, 474, -275, 93, 370, -56, 675, 699, -533, 314, 831, 368, 41, 603, 130, 100, 39, -154, -429, 354, -45, -925, 0, 211, -644, -276, -159, -486, 51, -49, -610, -120, 558, -689, -556, 40, -246, -404, 362, -84, -570, 840, 158, -161, 624, 711, -252, 335, 429, -97, 339, 233, -496, 38, 804, -632, -391]
4316c91O16l90m66P49n33p7M27n61L33N47m29r52R01R60r77K79L74n55M05L79
4336F39j082O42O81p93k14P12m02q6K12l18o9O68n27p01Q47j35n23K29J52m8J39
4357B3l28j41j88J094j110K62P13q99K39M97m46K46P16r08l6R81M0j035O55J3
4377C88l94M92k63o31R69L02j257K03P99m45o07N18k46Q7L58q62l88J001l38m30
4397g44N60Pk53P69n30j45R86j82j147M97R23p46j71O59k86m47N64j55m1Q39q75
4418H2n36J033j88o89L65j15k55K29k69m33P85M39j092J03P36o64K40K31n03J92
4438c09O18l59n49J420m57q55P77J80o22R37m97m92K33Q38j482L57J011o66m8
4457C5j0k03j08N24q55k8J173p79n24N19J63k36K03P0o69O29L16r53Q18N51q76
$$ y = [-391, 225, -165, -631, 118, -415, -492, -65, -626, -293, 254, -175, -1127, -226, 734, -243, 36, 410, -145, 260, 639, -443, 199, 880, 87, -127, 585, 183, 97, 309, -9, -78, 590, 63, -638, 209, 74, -449, -220, -68, -116, 23, -305, -446, -634, 460, -650, -388, 325, -574, -335, 162, -284, -38, 678, -230, -266, 715, 755, -280, 375, 388, -6, 486, 223, -408, 561, 863, -394, -191, 608, 163, -444, 74, -172, -85, 273, -589, -977, 24, -314, -744, -184, -177, -430, 339, -191, -336, 650, 468, -679, -182, 741, -5, -176, 483, 197, -250, 314, 159, 118, 957, 82, -454, 579, 391, -298, 67, -48, -303, -74, -343, -776, 9, 448, -644, -541, 195, -469, -229, 2, -501, -309, 309, -50, -599, 821, 364, -491, 286, 466, -156, 781, 284, -208, 25, 863, -619, -262, 749, 83, 35, 25, -178, -286, 238, -617, -645, 528, -251, -775, -256, -93, -329, -126, -56, -725, -96, 220, -733, 85, 636, -240]
4478b40J16N52o27K81P11q24m0R51m01o78O07N4q04M68j93q1K81j87o75O86L47
4499C04j023L18L98m92R5M69q83P03O33j089LJ006k21o44Q11m8n04P08k66m28
4519a50O49K32q55N3R10o80j21K89l93J83L89p51l69J089n76m39M70j55l13N91
4539E3j12n88R35K22j492R03M56q67M05N61l61o5K02m91M86N68m04p03Q22p6o87
4560b33J061p33l93P79l75n71M14L35o70J2L63k35l8J77p99O37P64j065j19R65
4580B76m18k29N53k36m32R96m26l54P50J12p21L67P28q43J91J20n63O73k22o05
4600b83L38M56m98n18L17J8j88K19j85l46J111l84q10N77N94p60M0M75k98K52
4620A27O1l96k0J078j000k40J068m23l80N60j21n27R52m33q28N84L55n75J07J71
$$ y = [-240, -124, 428, -199, 82, 793, -31, -71, 880, 479, -199, 408, 462, -342, 126, -67, -148, 133, -54, -729, -43, 304, -719, -401, -3, -495, -400, 69, -814, -111, 522, -567, -564, 442, 221, -423, 388, 340, -164, 544, 278, -150, 499, 731, -124, -71, 839, 159, 38, 327, -66, 117, 506, -245, -614, 475, -101, -540, -70, -225, -538, 53, -59, -647, 288, 510, -982, -79, 377, -490, -85, 476, 115, 50, 252, -239, 247, 815, 411, -292, 530, 454, -233, 828, 95, -298, 481, 106, -465, -51, 284, -386, -374, -11, -246, -284, -107, -906, -269, 495, -570, -689, 276, -142, -371, 182, -54, -486, 510, 84, -270, 480, 592, -129, 238, 966, 123, 314, 434, -129, 544, 322, -283, 55, 511, 13, -505, -188, -170, -358, -139, -324, -670, 441, 57, -753, -176, 418, -342, -302, 173, -125, 127, 188, -208, -228, 850, -150, -390, 678, 255, -125, 435, 314, -213, 739, 306, -522, 62, 417, -158, -51, 120]
4640A20k41j74M16o67M39K01m41m36R51l32n37Q74l22l89O67Q9o58J162l70r82
4660f30J030K82p34K4M43m95M26J93o69L50N47q71m12O89r5m19N09m80k92J099
4680D95l04r61K49N45n94L66J55l78N82q7Q6k52P54o61m40R51l25r4N88k59l68
4701D8N66m50o05P48J06m44K32L6l89Q2M24j029N79J45p82J96P47k35n59K48m0
4722c76M00O5m69K7O57k16l96M25K37l35j6K67k50L29L99r32N03N11p76k21O26
4743D59l27k85L07l68l5P74n32q28J031l35l21J06J16j63N59n5l26Q6N52p04n9
4764c48Q54l3m64K24k79J7P31k72o32P08Q8p48L24L03o17K30o8p50Q84K62p33
4785c19k88R76p32j4M46n64OM41j54l41J035n63n88P59J01k3K53r5p61Q27K90
$$ y = [120, -121, -295, 121, -546, -107, 94, -347, -783, 168, -164, -701, 173, -149, -538, 129, 218, -440, 722, 352, -630, 400, 682, -52, -28, 415, -80, 346, 539, -130, 220, 767, -104, -516, 173, 78, -341, 168, -312, -604, 495, 191, -770, -521, 24, -570, -204, -49, -427, 155, 68, 154, -98, 656, -5, -445, 506, 181, 87, 675, 416, 48, 614, 164, -441, 307, 413, -31, 201, 237, -152, -70, 354, -675, -96, 49, -733, -537, 210, -25, -584, -336, -376, 24, 89, -380, -353, 304, 88, -308, 117, 354, 19, 3, 270, 20, 349, 748, -184, 319, 830, 54, -167, 459, 132, -153, 154, -214, -249, 525, -7, -835, 196, -139, -460, -354, -238, -401, 158, 103, -223, -137, 415, -289, -348, 506, 473, 9, 233, -46, -29, 702, 430, -202, 506, 594, -154, 170, 473, -144, 86, 18, -732, 152, 414, -319, -607, 369, -363, -377, 69, -495, -489, -48, -202, -543, 492, -71, -659, 100, 201, 178, 431, 336, -425, 402, 692]
4806F92o54r6Q99p66m45P04K3l41N02m16n30N11q6o73Q28P5n79K63J14r0J32K37
4828C04r62K04P98o12k96O43k43j82N06k67M3O63k16p09Q68R4p48M61j28l18M10
4849C13j00k92P0M07r41J86P40o47Q3K23n01J74L88m77j86O81P2p86O32J48k08
4870b1Q8K7m39N84K03o08J95L60n05J33N29j68OM70j152K90N36l80n56P14j76
4891A30o25O65j57l78J88K64r93M97L83n84K08O03k50k15M84m63J45N70o67L5
4911a60O71o4p88K51J91J7K20J21q35Q88p2o42J17M90k38m57L14l24j36P96j030
4932f70l1R89k66p62N99l5l81M36J17n19O24M83q14L26L87j69l40M11k67N0P34
4953I02o50j30N00q70j04Q30j31n13L54K33o88L88P5n77R8L90n74j41Q47q97L31
$$ y = [692, 38, -58, 841, 75, -370, 334, 357, 16, 518, 102, -428, 83, -3, -676, 152, 227, -352, -89, 25, -65, 67, 304, -658, -454, 344, -268, -564, 79, -164, -346, 160, -107, -64, 599, 383, -326, 542, 636, -112, 349, 221, -97, 313, 213, -79, -9, 398, -543, -357, 383, -264, -181, 42, -459, -285, 103, -374, -560, 121, 193, -593, 39, 187, -21, 67, 94, -345, 239, 442, -166, 29, 389, -116, 17, 546, 378, 384, 854, -298, -8, 528, 148, -408, 306, 130, -495, 170, 13, -365, -177, 87, -906, -409, -26, -610, -402, 201, -49, -264, 220, -243, -98, 472, -195, -160, 511, 447, -341, -90, 101, 118, 338, 459, -376, 512, 440, -202, -85, 405, 167, -290, 24, -300, -436, 360, -670, -701, 288, 22, -740, -141, -176, -557, -121, -4, -523, 101, 584, -230, 96, 483, 314, -26, 385, 118, 168, 902, 252, 122, 622, -248, -352, 478, 347, -166, 188, 421, -267, 121, 196, -381, -283, 107, -467, -608, 239, -658, -327]
4974c27J38j37p0P63m65j76J68O51q14M12J78m50O34k85o36Q81P3n25J45K45l22
4995H1l22N80p69L52J86m93j96P23l98k13M61J88m32K01n2n66P29J98n71J91N74
5016D52l23l74L95j88p3K96k01Q7O55m53p21P93p6k62J12L53o39N80n14o44N81
5037a64N24q83r4O95n22L73P4r2j88N71n61k96J017m50n05N68K22k59L37q1n59
5058b73M04M29m31J57M29o26n6K41l24n3M51l24m89L33K13p43P95k51k6K74j25
5079Em79Q47p9p74O03L42q54J20K25J45l9J10J3j11O76n08o72N37K22l15K47j66
5101I5K6p5L3n02N17L53r36N2P55l86k17l8K87j00K40m14QN29k90j06L32k05q7
5124a29J51Jj96O00J51q29M65O32o15j26q9p6K72J22n14m2O84p40j37L98J2l22
$$ y = [-327, -189, -326, -396, 367, -98, -274, -106, 545, -269, 143, 321, -129, 505, 220, -416, 465, 538, 13, 158, 403, 81, -241, 339, -430, -78, 108, -385, -581, 142, -256, -469, -8, 180, -252, -51, -103, -669, 60, 258, -313, -122, 452, 129, -245, 150, -38, -111, 185, -16, 71, 726, 273, -448, 345, 269, 7, 119, 472, -167, 413, -101, -745, -164, 360, -523, -617, 78, -444, -71, 3, -89, -277, 294, -267, -563, 454, 4, -501, 67, 289, 30, 367, 286, -273, 131, 560, 129, 286, 715, 89, 33, 274, -50, -103, 348, 24, -465, -132, 81, -662, 133, -118, -144, 130, 5, -474, 373, 294, -480, 123, 465, -389, -269, -44, 101, 62, 172, 185, 74, 750, 242, -430, 107, 329, 14, 261, 95, 121, 46, 79, -423, 94, 447, -489, -437, 318, -68, -285, -323, -36, -136, 104, -310, -302, 227, -63, -169, 163, -42, -129, 22, 23, -173, 427, 578, -251, 214, 846, 231, 105, 16, -60, 212, 334, -180, -222, 462, -278, -415, -17, -5, -327]
5146c27J64k1k38N41l49k47O74Q0r03L57M02l05K95N3l35J62M92m13j51J68N9
5167A58k93M25l60J61P2j91n91O79M98p69L6K03K89l73jl83L95J44n92O6N62l48
5189b13j42K96Q2j38J64J68n18M26K63o42L09M68l35k1J61m12L16J23o03J53N28
5210D33l18k43M67l79k43J97k91j21L92J66o57J78O23m88J93J86j22K16K09o16
5230b18K40O09p31l87Q03p4j85L14q3l78O35m45N3J80q2l29K3K18l64L68l2m54
5252c19nJ077j137k44Q39k11l83L21k75J08L30l41k09P51J36p78J62P32n50L02
5272C06m1n10L90M48q71L09O00m37l33K80M0m14N64n09J33J94j67o57P56N1l38
5293b06J47r4k44O55j93j40k19M73l42Q7M92l79k97M38Q9m72O66o30j48N96K44
$$ y = [-327, -163, -184, -422, 119, -230, -477, 197, 277, -626, -269, 133, -172, 123, 176, -159, 3, 495, 82, -69, 99, 158, -135, 290, -70, 91, 163, -28, -619, 60, 558, -211, -175, 28, 317, -56, -57, -440, -45, 99, -493, -427, 135, -213, -355, -59, 23, -115, 49, 217, -301, 125, 388, -254, 55, 523, 188, 167, 328, -84, 232, 355, -248, -95, 433, 115, -128, 339, -40, -283, -86, -377, -498, -106, 60, -597, -419, 204, -284, -91, 95, -27, 189, 398, -218, 22, 631, -100, -487, 316, 242, 57, 371, 288, -90, 545, 100, 153, 333, 251, -78, -55, 163, -201, 167, 135, -319, -324, 753, -384, -628, 211, 0, -383, -62, -337, -229, 101, -240, -449, 302, 438, -340, -178, 554, 4, 306, 265, -245, 145, 593, -278, 31, 631, 194, -139, 141, 181, -233, 331, -178, -45, 149, -18, -675, 81, 132, -206, -59, -153, -397, 258, 65, -75, -294, 179, -163, -76, 416, 37, -260, 178, 267, -205, 461, -169, -317, 279, 523]
5314E23n65K5L29o69N76J17k92J56J25m26j34N74j03q16N87j93m13Q76m28m3N45
5335C51k7p83M22J85rm5j23l4Q9O32q36J75N29j16k63J48p3j12K74n18k92O28
5357B02j97m05M50J30m96K79K33l56L95N6m95J33K24m35j28O80j69R3L07o54J29
5378b4L36k94j87K88M90o53J93J82j31J54j41m12J58L79m82p5O03p39k50M51k97
5399d51L21K92n51k27Q74j79o54L11R5l5J30J32j53M17j12p10N06Q9Lj55M09l38
5421A4j5K29m08M13J76k16m86M61L71p64M89j94m00M37j71m9p5L08k67p2J72m12
5443d59L32j14o4Q7O97j24l93L82K15m78M7J42k34N6j90l07N71J84m67l41N55
5464I7j11l53L74l37J54M69o06rM14K54r33M57J84j96M49K00n80M44l04l16M5
$$ y = [523, -42, -17, 312, -357, 219, 336, 44, 200, 325, -101, -235, 339, 236, -580, 7, -186, -599, 277, -151, -194, 351, 324, -459, -37, 148, 139, 94, -29, -63, 26, 658, -178, -3, 526, 410, 147, 295, 222, 110, 384, -134, -426, 202, 5, -400, 50, 180, -316, -37, 196, -160, 235, 291, -204, -71, 153, -282, -410, 270, 101, 194, 501, -153, -24, 312, 18, -169, 119, 609, -44, 149, 331, 200, 354, 213, -199, -41, 338, -144, -219, 384, -355, -605, -154, -451, -130, 162, -389, -616, 258, 79, -575, -264, -169, -204, -74, 58, -95, 322, 210, -500, 6, 95, 98, -57, 352, 14, -1, 228, -180, 233, 409, 193, -293, 168, 539, -225, 264, 70, -330, 107, -64, -113, -188, 120, -147, -219, -47, -459, -127, -241, -305, -218, 479, 355, -38, 344, 559, 81, 128, 270, 36, 92, -98, -405, 166, 350, -117, -458, 97, -14, -367, 7, -330, -176, 293, -313, -322, 92, 346, -587, -130, 54, -142, 307, 507, -73, 371, 67, -249, -204]
5485b04M82l52R1J89l01L7N72k75m23P40l32l63L33o7j17O8r9k67M17l5l99j40
5507d45P29k24m22N10o07L12M6m91K34O26m23l77R14j83k22L64k16j09R3J71n65
5528b85M73L91p83p3P46k39k46J73j0l27M39k99m12N97l87j71K86J00j82N2J4
5549a43j32K62K54o03L20L17k79OK32m10R6K51k91K43M82n27k88L54L58m92J04
5570A14q4m2L43l17j80k9M97p47J47K61k73j08M81m17K7K86N4p6L77m7m99M19
5592A87o4l0K26j95m40R59o5r22L64K54k10q7L84m75L20J25k63n42Q20l13l74
5613c41K75J67m12N06k21o02N81J30p34M47M89m63j55O08k96j20L97l18O6M51
5633D55l85j10K28p6j83L15J8m91O97m01m30L08K83n98L29m6k32j76O72l40j25
$$ y = [-204, 278, -74, 17, 206, -95, -58, 514, 239, -184, 556, 224, -139, 194, 127, 10, 78, -21, -288, 129, 94, -305, -445, 284, 60, -362, 148, -459, -147, -101, -592, -358, 268, -155, -532, 382, 199, -23, 341, 125, 16, 109, 280, -285, 188, 579, -204, -277, 469, 230, -16, 157, 147, -180, 259, -40, -452, 145, -242, -413, -127, -27, -209, -157, -143, -275, -13, 241, -362, -42, 275, -4, 2, 234, -176, -80, 171, -120, 123, 605, 78, -210, 144, 502, 10, 114, 30, -12, 331, 14, -166, -195, 302, -445, -298, -37, -310, -418, 63, -354, -327, -41, 13, -63, 314, 267, -232, 187, 123, 93, 319, 124, -316, 643, 578, -344, 20, 274, 64, -23, 361, -114, 206, 331, 68, -474, 346, 33, -341, -66, 101, -311, 195, -26, -628, -47, 83, -651, -204, 285, -178, -333, 275, -21, -141, 256, -62, 4, 455, 70, -40, 188, 112, -71, 244, 262, -229, 468, 67, -363, -55, 228, -370, -41, -87, -319, -495, 177, -163, -288]
5654b88N97n36k0L75J58n63J70O2j83M17J8o28P69J05q34M25M04m20K39K29m66
5675C0P8K60o50m4M89kn64M53J54m76J31q6J72L1J71q20L57N05n99R8J03k9M87
5698B49j38j37o4N72n32j51M33p5l51M59J2n53P89k33q91P24K76n13l54O05K09
5719C36k49k6m30J96K45n02R6N93j88l62J76n8K95Rp7n32Q87l17j21L5J40J69
5741C15k66Jq5J54K80m71j8M98k77j66K29j30k3K19n49k02M26j09k54K74K64l78
5763b68O5M4k49M48J98p17J83N75j54l89R41m10L82l88n58M55L36n04k96L12L20
5784C26n10P6L31q0m51M75m07%N70l98m64M52K68m14L24k64k26O01J1o92N79k0
5806H7n54L45L56n32K76K41j98L40Ol46J10L44m89l47K58K65j21J32j79k06L44
$$ y = [-288, 309, -227, -247, 128, 286, -277, -107, -45, -228, 189, 207, -421, 348, 453, -381, 44, 448, 28, 267, 496, 30, 108, 368, -282, -326, 163, 161, -403, 50, 204, -272, -141, -227, -55, -24, 147, -673, -316, 189, -410, -312, -209, -238, 249, 111, -26, -90, 482, -50, -201, 232, 157, -194, 265, 277, -276, 513, 280, -611, 113, 389, -124, -478, 127, 336, 87, 61, -369, -173, 72, -430, -334, 259, 71, -291, -115, -173, 122, 131, 54, -478, 409, 92, -29, 6, 146, 315, 49, 50, -35, 119, 399, -72, -90, 408, 131, -35, 194, 64, 41, 260, -289, -491, -65, -174, -428, -154, 110, -268, -203, -159, -408, 40, 238, -479, -296, 279, 125, -264, 677, 267, 649, 261, -297, 158, 494, -10, -306, 6, 326, -184, -108, 223, 143, -308, 167, -240, -240, 330, -68, -532, -80, 188, -226, 98, -166, -392, 209, 220, -472, 107, 87, -467, -122, 234, -298, -22, 219, 21, 361, 367, 21, 131, 475, -14, -361, -103, 162, 41, 173, -6, -212, 132]
5827A32Lm43j96O54p31L24J39lrL98o33J49K88l98L79J13j15p8K07k2j07L52o9
5850C34l67J31K01j05K4N2k67J19J23l10jK15k48m96P42l35l4K76k78K81%j6l65
5873c24K27K36l95J98K1j20L23o2m80O45j11m38K26N97l05l80L49k66J01L08l47
5894Cl68M42k22j94K70L79n89L3K52j90K70k23N8l8K99m71l96Q76k92J47J65l19
5916a08j15N00l04j30N56q7j92l9K65k3L7k22p4L8K15r17L15M07j68k89N59k98
5938g4k72M06j19n26P11P0p46M14L32m14K48L08n24K75M09l34k20P03m24l19K11
5959A15M1k17J07j20j01O38m09m38O68K71q64J78k06J39L45J9o14M49N5o9m04
5980d17O93l44LM51n14k00M43j07l97Q07K9o47M05j01n14P89l32K4l0L56m35J11
$$ y = [132, 135, -308, -504, 150, -581, -257, -118, -121, -130, 268, -365, -216, 72, -326, 53, 166, 51, -27, 180, 158, 51, 403, 334, -33, 98, 299, 194, 218, 270, 3, 122, 245, -65, -66, 149, -99, -595, 147, -188, -222, 54, -224, 57, 57, 41, -324, -97, 139, -256, -58, -37, -157, 166, 104, -376, 269, 158, -280, -54, 543, 238, -142, 207, -59, 42, 350, 3, -365, 77, -145, -339, -69, 310, -279, -246, 6, -184, 86, -137, -79, -117, 182, -289, -685, 191, -101, 46, 211, -108, -223, 277, -27, -157, 399, 312, 120, 81, 346, 323, 360, 138, 64, 102, 317, -600, -285, 122, -46, -335, 224, -74, -346, 60, -59, -585, 126, 196, -550, -136, 196, -218, 30, 338, -186, 89, 498, 164, -56, 647, 223, -96, 115, 156, -61, 46, -74, -175, 463, 54, -384, 284, 555, -309, -131, -337, -198, 147, 166, -448, 1, 56, -13, -417, 276, -68, -65, 386, -128, -328, 115, 8, -389, 418, 447, -200, 205, 104, -410, 379, 47, 71, 41, 397, -38, 73]
6002G3J97q4k07K71k00k62J75J6k28J54J87k75K31J3k54j27O05n87L54J37k28
6023c9PK41k06j6M48l55l96N28k3j64J66k5l34L57J02l69K62J58o73L13o2Q4k3
6046a9K98m82m13N01J00k5K0k39M3K56j88k24L82j39j87K04K68k94M44O6p44O18
6068B46K99p47j52P34n32K77j21o2k1M56l90j73L03k3m25L85j21j28K44j7m65
6089d33K80O68r09K03L83O8k56L1j36Q7L45j92k4L58o33j78K37K71k85J48j17
6110h4j14K81J05l33K61K27o50j7N60l51k43p9j38N99O6k00l27N23j55j82J53
6131i8p3J30J38J24k82L95k9k35Q4N4l07J19L63l49k36J82k76QO73k89k37M4J22
6154B5m8K30k46k13M91l08l18O7N30n69M7M19r4J23M2j39l31L49J85j2m0O0r9
$$ y = [73, 270, 186, -21, 250, 50, -212, -37, -21, -249, -95, 92, -183, 48, 61, -193, -320, 285, -302, 52, 189, -39, -32, 209, 3, -13, 435, 80, -316, 212, 189, 25, 191, 166, -168, 189, 291, -78, 184, 342, -331, -18, -80, 4, -19, 279, -203, -616, -115, -15, -40, -20, -259, -216, 40, -148, -372, 10, -129, -316, -112, 156, -138, 306, 372, -372, 246, 545, -202, -354, 380, -152, 125, 4, -58, -79, 377, -13, -186, 117, 94, -331, 54, -67, -195, 49, 32, -433, -153, 515, -394, -191, 192, 260, 4, 35, -101, -14, 331, 139, 115, 473, -160, -338, -101, 170, -115, 33, -84, -198, 83, 188, -145, 116, 343, -307, -324, 236, -115, -358, -437, -575, 24, 90, -110, -437, 86, -69, -251, -98, -171, -41, 97, 221, -61, 334, 305, 70, 154, 208, -99, 20, 383, 34, -202, -20, -296, -288, 385, 96, -141, -97, 25, -23, 207, -39, -252, 239, -69, -387, -320, 210, -359, -312, 107, 13, 136, 178, 39, -292, 57, 242, 230, 190, 250, 151]
6177A51J41k70K3J61P5l98N3L00l81oJ53l33J04J43j43j93O40j16o08N78j91L8
6199g9J90J76m19O92n58Q6J83R6n72Q7K76p0j54R7mO9J29l54K82k0j7l43L32J20
6223B25m21k02K09j52M53j22m18LN20J4m07L72l10M53J20o27M71J66N0n09L44
6244B32o8k74r8N50l65L43L6k66q4L14l98k03L21n61N17j44N5J29K72j1m30M51
6266C18o00Q7J55J91j50p9L2J00m1L84m17O2K81j47p3K7k59Q3L36j05lJ8q4r8
6290A8K96n06j42O06Lo13L12K12o36M97l24k33L73j25K47J21K09p84M21N37m61
6311B8j42M50m13o5L72m27L33L41j80k98M29j7j57j73L67m83K2R5m76L94K13j37
6333G6l42J57j06J32k7qK71j44j05k58K18N19p25O48r3k82L38j38l25K47L39l84
$$ y = [151, 292, 22, 45, 206, 281, -117, -64, 236, -145, -151, 2, -331, -227, -84, -227, -420, 220, 104, -504, 74, -117, -79, 111, 287, -132, 560, 2, 88, 271, 367, -205, -118, 158, 88, -66, 31, 27, 96, 225, -129, 153, 133, 116, -227, 105, 225, -196, -398, -189, -341, 112, -10, -428, -425, 95, 109, -298, 74, -236, 217, 337, -290, 181, 347, 397, -112, 232, 164, -110, -208, 342, -23, 320, 356, 90, 6, 320, -78, -281, 40, -521, -4, -148, -93, 36, 308, 297, -133, 318, -282, -195, -40, 151, 1, -78, -46, 54, 13, 397, -20, 42, 323, 176, 103, 130, -129, -46, 290, 185, 182, 200, 116, 18, 314, -192, -334, 272, 275, -338, -26, 186, -450, 47, -277, -510, -137, -262, -15, 106, 315, -469, -48, 489, 28, -114, 336, -77, -142, 230, -197, 136, 477, 297, -1, 428, 411, 254, 81, 448, -35, -13, 82, -394, 0, 213, 76, -266, -109, -215, -83, -110, -118, 153, 9, -96, -354, -136, 383, -342, 306, 213, -69, 269, 131, -194, 53, 392, 8]
6355HL0K23j97M8J08l11J56M78r51KO96j53j51m28M89j75K14l4j66K07l9l30O6
6378b10M48o84N17L4J35l55J88j86r4N12q1m5j00L37l80j80M70l73J30L14n66
6399a69J86J70o70K60J1L21n48O34M3n60N10l90P2K88j6q31N07K93j72J67J61
6420B67m19M76r1l28L60J67n55J27J44m2m9J52k48k00q1J06j70N61k68J1l32M38
6442B6m6P0J83n49L19J68m5l86N95k57k41M55m25J37K35j03o37O02K59l32O3N9
6464A50n1M17m92J89o1j33n4j10L72m19M1K67k59oN50n05r6L52k13j51Q5R1k9
6487f5j27J96k68P93k31j78j77J70J25J1K36o19L2K45j9k20O48k43n04K56m6m56
6509d41M21L8k09L27j41k28J40L56p21K29K32J34j08l7o4J01L26k98M6M01k19
$$ y = [8, 38, 261, 64, 112, 220, -91, 65, 543, -408, -406, 290, 137, -14, -442, 47, -128, 86, 52, -114, 93, 54, -276, -210, 238, -446, 71, 105, 240, -115, 73, -113, -207, 305, 224, 179, 79, 416, 36, -144, 326, -47, 83, 397, -169, 17, 187, -483, -223, -212, 109, -439, 195, 238, -322, 188, -202, -130, 158, 142, -689, -182, 111, -61, 106, 267, -152, 324, 233, -95, 265, 432, -123, 4, 148, 106, 57, 209, -39, -239, -320, -214, -384, 177, -91, -80, -412, 26, -20, 50, 233, -316, 3, 171, 126, -260, 335, 78, -163, 292, -133, 4, 239, 136, -501, 101, 360, 28, 91, 150, 99, 516, 24, 213, 152, 19, -35, -145, 227, -192, -151, 116, -143, -149, 401, -104, -200, 152, -61, -212, -127, -36, -65, -192, 4, -264, 529, 298, 120, -57, 113, 238, 249, 485, -134, -102, 143, 124, -96, 552, 309, -195, 61, 15, -441, -20, 18, -191, 136, -5, -233, -93, 263, -458, -229, 3, 137, 29, -8, -72, 29, 355, 57, 103, 504, 285]
6530B85n88N41k97l6M16k98j88M10r3k33q1J26j1J61j59J9j4K39j01k54L6q6l22
6553e28M38m2L01k52j93K4L88K9o19N26L40m98n8K02J27l1J43k04j02K16R6o77
6575c74M32J63n30L94Kl1j28M52l31j44J53jl8Pn4j55L12j65l47M45j50j72L17
6598E7k45J94n5L47j46j96l28K42K19K85m50k40L92j14RK01n15J83K92j54M09
6619C87p6m82j02J78M7o6K72l13l01N93J06m89J63O42n03j6J72k74K12mQ5l92
6641a61O05l28J41k44K45l53l1L70n36L51p1qk58L41j23k68L81o7M9J19n14L71
6663A1M1k44p3K75k80q3P40n85L37J72k62r4Q1L55k41l7K29k21P6L0k97J98J11
6686B39J6k51R9p6m90M69j2K5K23l19o8P6j17m2l53P04q6m08L74M8j17N71m84
$$ y = [285, -303, 238, -59, -95, 321, 23, -165, 245, 152, -81, -162, -36, -47, 114, -45, -26, -40, 199, 98, -156, -120, -206, -528, -90, -132, 169, -83, -276, -252, 136, 165, -454, 72, 412, -86, -144, 58, 185, 154, 297, 93, -9, 207, 303, -374, 58, 221, -309, 85, 87, 56, -72, 380, 49, -95, 58, 57, 19, 26, -28, -183, 129, -36, -383, 62, -88, -260, 57, -188, 6, -49, 298, 152, -44, -372, -130, 89, 374, -76, -316, 76, -38, -29, 172, -343, -160, 132, -22, 387, 311, -171, -273, -95, -48, -114, 158, -155, -456, 137, 243, -246, -83, 559, 56, 40, 212, -62, 150, 146, 231, -161, 444, 116, 257, 13, 258, -95, -126, 244, -292, 59, -12, -20, -278, 63, -60, -328, 53, -14, 35, 154, -360, 11, 52, -192, -265, 10, -270, -353, 387, -198, 139, 311, 49, -45, 36, 391, 150, 113, 342, 121, 197, 227, -70, 128, 239, 255, 4, 103, 27, -463, 6, -6, 19, 242, -77, -145, -69, -186, -228, -581, 123, 37, -371, 3, 51, -66, 505, 21]
6709B1k6L07l80L35k02K5P3J19k22j5K35l0k50j92M01n57K37N3l10L69j82L78
6731A87m5pl90k6M60J93m01M3o3L50j74K4l63m5O61j68l90N01k59Q4p6k2j30J50
6755I4K1j95K21N1k15k9j7j25L02j68k16L53j77l21l6N88m17L40K3l61M97n68
6777c55M79m80O27p5n84N73k12j71L57N5m94O78m2m82M45j20J06l88K14j12m7
6798b8J47l70J66N48l66m62L93k50j11L39j5j45K22k09J00L77l71l3p4J16k27
6819b53N01rj17j24M98n73J27j21J33l04K80L63m81K84k36j19J90j0k69rK44j69
6841a74K85k58j31J75K33k42M9J46j63K45j83lL1O3n9j9J38j69j09K2L22n64K40
6864a25K61l0l4J8j54L0K72l81l6K33j76k33L65L7k64Q0m3Q9K21j70J12oO0j01
$$ y = [21, -5, 302, -78, 257, 55, 80, 153, 272, 50, 35, 270, 240, -10, -202, 199, -358, -121, -68, -378, -9, -191, 187, 142, 135, -255, -281, 179, 372, -29, 14, -49, 301, 127, 151, -212, -257, 404, 236, -154, 347, 88, 172, 96, 74, -56, 94, 115, -80, 141, 192, -23, -52, -69, -194, 108, -60, -276, 77, -100, -421, -457, 131, -286, 54, 77, -284, 213, -355, 124, -356, 271, 196, -388, 185, -27, -198, 159, 214, -280, 398, 356, -126, 319, 199, 305, -83, 131, 19, -28, 119, -251, -85, 463, 97, -365, 28, -222, -333, 6, -9, -154, 68, -141, -41, 336, -35, -68, -142, -26, -253, 248, 239, 122, -2, 496, -77, 50, -71, 62, -242, 38, 401, -80, 204, -32, -151, 39, 29, -240, -249, -5, -174, 111, -147, -278, -103, 130, -112, -63, 83, -80, 165, -18, -21, 10, 73, 14, -5, 133, -36, -145, -123, 199, -365, -125, 136, 106, 72, 90, -64, -34, 238, -143, -179, 54, -122, -355, 10, 47, -217, -137, -180, -91, 130, -40, 72, 66, 126, 25]
6888B5k00K24j6O9Kn8j75K69K94k23J46k78O7K6k37LK38j07o66M78K81k42j66
6911b46K23p7j07K65k89n2L55K61m09n7M3J90j59j34p9M28K43o76L09L9k16j43
6933b88N63j97J57k3j91k19M99n11J01J20l2p1R3L7l38K80j55k6K0M31n32O48
6955C66l73m01L65J93J77o06P71n75K50M3k04k58L43K85l49K53o15R6M39K95o98
6976b03M59j59l61K09J27k28J38J04l2l42N44j75m73N47q2j48L01j19k46M99l76
6997a6k9K18J45j29k63K13k22K39q3n76N53r0K26j29K07ko30Q0L45j12L20n37
7019b72K71j04j5K11j40J19k3J50Q3n77L67K15o02K44O9m85N77k48J93J35q6k96
7041b14J56L66j79l94K07r8P8j05K20k10q1M62l78k82O70l09k40L85j12j78J66
$$ y = [25, -175, 49, 33, 102, 104, 46, -129, 140, 434, 211, 357, 79, 146, 172, -65, -62, 176, 69, -597, -119, 162, -80, -246, -23, -100, -207, 58, -231, -283, 72, 333, -76, -133, -90, 100, -59, -193, -272, 156, 399, -277, 32, 71, -145, -288, 275, 78, 235, 212, 21, -198, 301, -210, -109, 11, -21, -92, 1, 38, -300, -20, -175, -201, -181, 250, -282, 366, -7, -408, -43, 150, 327, -279, 492, -83, 167, 210, 6, -252, 91, 376, 27, 280, -335, -239, 200, 495, -203, 256, 97, -264, -55, 72, -156, -18, 86, 54, -288, 256, 81, -392, 155, 73, -75, 226, 107, -139, 360, -16, -45, 173, 318, 189, -74, 139, -83, 156, 73, -503, 50, -40, 186, 57, 264, 262, -368, -288, 57, -55, 265, -272, -1, -105, -120, 91, -49, 70, 47, 197, 280, -297, 70, 285, -317, -73, -4, -489, 88, -160, 33, 168, 82, -214, -58, 308, 129, -265, -58, -156, -78, -183, 37, -173, -254, 208, -170, -452, 218, -91, -331, 54, -58, -236, -70]
7062g0j7M8Q6j00O2K89o3l80K41R6l14M10R5n53N90k94Rk30J69j53J62P0k73M4
7086g6J44l18K7M29pm43J07J89l26J26K63n35K35K75l68J53M43l06J36k28L59
7107B79j98o9n2J25M7j05K03j93Q9o8P1n8l10K56P9l43J03K62j99l6K28m01J59
7130a31J83L45o97M48k72R5K78j85j14q1L92l42K43q6j85M49k98J4j0p8j28J10
7152e0L06m46P3K98j47j62K23l5l02K0N7l9j02M07l2n7oJ3l73N34r6m19M98j3
7176A50q5j00J75o0l8o6j84N25p4j90N4N9j11O9j60o1k6K07l5l10M12k66j30K49
7200Dl31O1K02j08l9L04J74l02n7j51J85J01M14m13O4k6o27N49L72k84j37J67
7222A22r5P8K17l04l15K99l02J23J5K32r4j40J13K3r8K28k88o1M81j51m8J83m03
$$ y = [-70, -87, -39, 47, -53, 9, 298, 235, -145, 96, 192, -122, 288, 383, -170, 420, 126, 135, -95, 74, -79, 83, 153, -120, -76, 68, -250, -223, 206, 199, -244, -137, 52, -274, -148, 115, -420, -185, 90, -278, -125, 318, 12, 148, -80, 279, 81, 12, -40, 85, 132, 27, 230, 37, 126, 58, 129, 71, -239, 17, 96, -247, -144, 118, -81, -117, 111, -290, -131, 52, 397, -300, 148, -124, -29, 249, 64, -50, -131, 261, -81, 162, 76, -109, 340, 42, 56, 46, -32, -160, -50, 256, -190, -117, 181, 34, -128, 95, 60, -242, -222, -165, -204, -306, 101, 69, 12, 6, 19, -354, 180, 84, -335, 163, 150, 65, -35, 140, 80, 42, -24, -208, 317, 243, 53, 107, 166, 55, 124, -36, -97, -123, 84, 49, -261, 151, -115, -245, 4, -327, -266, -64, -172, -211, 93, 267, -35, -92, -243, -58, 43, 457, 44, 108, 82, -545, 4, 376, 92, -45, 122, 27, 105, 322, 18, -297, 2, -300, -177, -162, 70, -24, -164, -51, -28, -126, 102, -186, -247, 234, 83, 35, 218, -185]
7245a85rJ80J24M4k83j27J64J47J74q7K55j99k00Q7N1l82L32L40n79p6M1N35j29
7268B18j61l39J01J47L9o7O4J09k45K63n4j04K92n5m10P22k06l03P0o5J6m3J13
7291A02N1J40l95K84k61K87Ql26L0lj39M47l92J8M05q1m26J49N02l67k91J29K67
7314A38k83K06k25L0K33L04m10j18K91n3J42k93j40K51j66k60J91J80k03J34m
7335e5L3M9N5m2J17j60l91J57K85K70m57J96k40KK06J00k44j67P5K29j59K10j54
7358h5Q5M29k84k84L82m89L05l3k07L56k31l8J43k72J79j7K80k66k82K97J27J85
7380B80m93K46j48J86J00k88rL10P1k81j20J11J13q9O8j12J36J15k77K46L1o6
7402A30L73l38J4j5j58l28M56j59m66j05M63J81l63J98L92j88j02K8j50K40K4
$$ y = [-185, -194, -14, 110, 154, -129, -256, -92, 55, 229, 142, 397, 198, -2, 85, 136, -246, 86, 426, -153, -229, -188, 347, 218, 57, -282, -181, -34, 5, -62, 2, 111, -134, 129, 75, -29, 263, 208, -202, 520, 314, 11, 81, 16, 32, -11, 102, 153, 293, -102, 182, -79, 208, 216, -110, -80, -83, -222, 225, -167, -149, 256, 175, -251, -102, 400, 33, -258, -129, 138, -145, 61, -164, -134, 99, 403, -7, -125, 166, 113, 255, -38, -178, 73, -93, -353, -162, 18, -185, -51, -55, -22, 27, 82, 40, 157, -3, -394, -237, 48, 318, -139, 57, -183, -181, 25, 125, -119, -286, -211, 18, -141, 69, -85, 0, 429, 145, -139, 243, -246, 59, 26, -181, 175, -56, -94, 49, -223, -44, -61, 219, -47, -329, -32, 95, 280, -213, 33, -115, 71, 171, -117, -126, 184, 255, -26, -146, -35, 78, -11, 57, -55, 81, 196, -81, 165, 196, 130, 503, 165, 179, 164, 6, -322, 134, -25, -491, -596, -133, 48, -315, -117, 275, 87, -15, 13, -137, 103, 127]
7423A27k94n6K61j99J22K72l74M77p0n29Q9M09j97k97N20J79k93J6R8l60j33R1
7445a41P0m53Q15m73N0J96m19J03J84K0r0K75l33J19J61j08Q8M3k79Q5J43J66
7467B22l98J91K19J18l40J72k29K63R9l77j59M99m57N0J66m36J33N5K20l10N89
7488B90k88j94K64j37O4k35M54Q3l81J15k19K99m6k39Q2M6Q3K79k6M6l58J04k57
7511a71L4K22j3k08L55j8k76K46k80k07L96P0j14k30L03j50l4K74m80K23K07k60
7533a11K59k24J5N1k81M98l27L27m6m33P02n52L5q0M21n00J93L05j43L1R3l77
7555a44K70k82L38l36K94lk05j51K74k85K79J19k41M0P2J04l43O02m54r0J89k79
7577b32J96J06K08k58J64J12k50J35j84k1L17l19j95K43k59Q2J73p6k22K66k8
$$ y = [127, -167, -223, 38, -161, -39, 233, -141, 336, 266, -263, -174, 235, 38, -259, 261, 440, 147, 163, 261, -99, -232, -141, -71, -524, 291, -182, -132, 64, -355, -252, -68, -48, -138, 137, -196, -77, 84, -24, 64, 107, -172, -87, 56, 222, -176, 15, 234, 352, 12, 184, -45, 218, 317, -60, -219, 280, -177, -127, 39, -397, -264, -209, 11, -299, 290, 2, -192, 72, -65, -1, -236, 218, 301, -80, 35, -184, 115, 69, -170, -88, -42, 41, 320, 294, 340, -18, 86, -171, -137, 85, 72, -136, 219, 201, -75, 171, -109, -316, 80, 150, 36, -194, 109, -41, -75, 199, -281, -58, 149, -111, 148, -76, -61, -10, -291, 207, -120, 207, 161, -272, 430, -122, -87, -167, 254, -246, -53, 252, 109, 140, 233, -144, 126, -156, 182, -154, 140, 137, -68, -219, 55, -230, 49, 168, -73, -33, 39, 143, -200, 402, -52, -142, 47, -232, -36, 70, 278, 20, 184, 296, 46, 181, -3, -24, 293, -26, -221, 22, -237, -155, 18, -58, -280, -14, -42]
7598d2l7Mq0K09l47K20j00l5L85Qn09J86J95j52K24J06l12J89K03l71j93M86m74
7621b37L22J54j97Q7r3O2l77J6K56k33J35Rj81N70k92k17M2J87qk83K99K51m35
7644a63K66J31k78J00k63J65R3J32l78J03M14p15O00K37o11K34l1j00J15k2J00
7665A29j95J26j65J63k36L54k80L22m28n3K46J88k62n9K51O5q8R0j74NK10l05
7687i6J69J51m46o4L79R0J23p3j75m17L29N0m81M34Q9r6j99J47Nk4O7J0m1J04
7711C5j48J79j84j60K92R0k76N0J22L59p9l19J17k17J53J34k73J09L67m70K42
7732A23J44l20j61L91j08l88K89k41P0J51J57l33K07R7m30L75k18l0q9K69k38
7753b83J4O9J95n9M41m69N2K33l38M4L67k78k88N22J07l35j19L0R8k02o2K05o4
$$ y = [-42, -79, -75, -155, 54, -293, -73, -173, -208, 177, 185, -324, -138, 57, -95, 129, 235, -77, 112, 315, -56, -249, 237, -237, 85, 239, 42, 129, 36, 98, -279, -263, -7, -240, -105, -96, -277, 293, 1, -216, -174, 13, 5, -278, 21, 272, -163, 103, 234, -44, 56, -207, -42, 51, 183, -195, -92, 322, -393, 207, 444, -167, 67, 36, -64, 51, 29, 129, -66, 60, -105, 58, -178, 176, -104, 218, -210, -263, -17, 171, -91, -150, 101, 166, 78, 168, -6, -1, 209, -96, 73, 224, -222, -286, 93, 183, 306, 233, 58, -359, -30, 20, -461, -27, 62, -34, -233, -86, -81, -105, -38, -28, -69, 35, -113, 66, -118, -278, 14, 104, -172, -122, 0, 359, 280, -39, 78, -139, 14, 148, -125, -16, 351, -119, 123, 267, -53, -214, 177, 69, -319, -30, -271, -201, -50, 107, -226, -19, 78, -352, 23, -195, -225, -314, -45, -283, -269, -200, -5, -64, 377, -92, -40, 193, -145, -101, 266, -12, -300, 222, 329, -6, -125, -95, 3, -199, -261, -56, -120]
7776a20K28m21P0M30j70mP7j97K59k45R2j37M39J2n02L01K71k53K7o0k49K98J14
7799B60k22m3J4j0Q8l1J27k17k06j12K23K31k96j34L65Q7k75R9R7l51P85l21k72
7822a14L3M21n59J06J60j37K55j07j90L1J36k56qN59k04l47j64K96j9m9Mm1L09
7845A15j18l9J05J07j43k5j46Q6j44J48p3L11m2j3k68M94l70K34m9k37K27p0R
7868I9k65J99J28Q0k51J71J13l70L76k80k47P9R4j27K98J33l49J44K32L0n14K18
7890ij71J12J29j99J92qJ03l73M0J96r8M08j79k23L48k81P8r9K57k04J14j40J28
7913A21mJ51l23k6K19j97J10r3L28j8R2n22J81J5j55r6K97J33m64K11J7j97M56
7936B36k8k25r9M59l26J03J28j72K66m87k22K6K74J87j4r5k43N5J00K1k31J99
$$ y = [-120, 108, -313, -243, 187, 17, 13, 90, -107, 152, -93, -1, -138, 301, 313, -189, 112, 383, 130, 157, 97, -152, 146, 260, 38, -5, 9, -1, 87, 56, 183, -34, -240, -352, -129, 102, -194, -328, 37, 124, -151, -52, 45, -306, 479, 158, -114, -81, 340, -219, -113, 47, -90, 165, 58, -132, -101, 35, -221, -229, 330, 126, -221, -385, -89, -108, -157, -153, -194, 115, -3, -42, 63, 170, 27, 2, -144, -58, -202, -54, -127, 184, 142, 129, -139, 355, -15, 219, 170, -67, 160, 90, 99, -166, 33, 161, 241, -10, 161, 274, -96, 280, 0, -247, -168, -74, -201, 97, 230, -119, 25, 257, 287, -227, -9, -180, -68, 61, -138, 54, 46, 149, -224, -184, 12, -86, 322, 143, -80, 268, -13, 65, -34, 223, 19, 133, -7, 121, 117, 268, -55, -81, 138, -59, 51, -42, 286, 268, 360, -162, 19, 34, -121, -217, 80, 213, -251, -40, -23, -220, 236, 208, -17, -116, 343, 17, 120, 248, 76, 342, -145, -367, -341, -67, 120, 106, 11, -232, -177, -77, -56, -287, -88]
7958h8J25j49M24k78J67k41j75L43r0J72k13P5j65R3p5J67j29j44K39J7k25M42
7980B92k97j56K84k32j7k24J41N4J19j07j21L08p8nj64L99j92j22K86m07K84o3
8002a8J45l98N80j00m10L84N3k7k01J32r7l32J69p2R3M24R4m40J59K4m91Q65p90
8025b54K9K50q0J47j64j96J41J3K22J89k45J33j72%J62j20r3K4K6M0r6k05M19
8048A70Q7k34k38K74M0k07J38n4J70n26L53J06N5L2p44R13k69q0J52lp0p1j68
8071a74K97k36L61k14mj06J63m0Ro2k5j35J08J5K39R6j82l35L81j96l83O65k46
8094dK10j00l32J85J18l1n55L19J53J17q9M65m45k10Q8P3J51J25j97m0L6k09J29
8117d3L17k65m10L66L81n71K48r5J89l06J96j17R3n8j62J13R9j71l00K72L71o04
$$ y = [-88, 37, -112, 312, 34, 201, -40, -215, 128, 38, 210, -3, 72, -93, 0, -75, 92, -37, -181, 58, 75, -150, 292, -5, -161, 123, -109, -126, -350, -209, -155, -36, -143, -264, 44, -34, -39, -203, 196, 4, -118, 168, -239, 45, -18, 127, -271, 309, 209, -201, 183, 236, 209, 8, 140, 43, -289, -120, -192, -99, 325, 419, -21, 138, 162, -329, 536, -254, -225, 25, -55, 92, -72, -268, -127, -114, 108, 297, 52, 185, 13, 13, 175, 55, -38, -14, 12, 52, -44, -249, 170, 257, 23, -215, 59, 99, -108, 30, -24, 146, -380, -27, 79, 134, 166, -578, 335, 66, -14, 138, 135, 65, -6, -174, 123, -113, 248, 34, 30, -76, 87, 47, 56, -6, -31, -166, -58, -43, 196, 292, 110, -225, 156, -40, -423, 242, -4, 206, 106, -226, -41, 77, 46, -509, -190, -37, 80, -9, 456, 11, -199, -111, -38, 113, 238, 41, 1, 37, -172, -43, 274, 9, -401, -35, 346, -225, 23, -72, 117, -189, 7, -110, -17, -75, -237, -124, -25, -196, -496, -224, 147, -457]
8139d57N68j28NJ40j77L26k90K82m56K11J72l55j30L77l03L31K4J4j83K04o6l33
8161b24M08P0j28j5n2k29J47jj09j03P63k82l53Q6l03K35K18l27N3K58o0k10M10
8184B52j19j60K28j58k08l4N94
$$ y = [-457, 111, -17, -12, 128, -49, 277, -13, 269, -187, 24, 196, -159, -289, 88, -215, 116, 140, 154, -29, 175, 109, -224, 184, 254, 126, 111, 59, -170, -23, -24, -133, -236, 527, 245, -108, -22, -325, -90, 128, -199, -146, 112, 52, -158, 252, 133, -27, 201, 43, -165, -199, 395]
8191C95
$$ Imaginary data points
##PAGE= N=2
##DATA TABLE= (X++(I..I)), XYDATA
0@%%%%%%%%%%%JrJ6j6J6j6K0k8L2l3M1m8N4o3P3q4R4j07J21j35J51j71J92k13
35a12K37k64K93l25L60m00M44m90N43o04O69p42Q29r27J039j173J336j537J790
54I66k124K586l262M355o421J1601m6451r3821J08777Q1472m6044n9366J5144
67c2588K8946M589k1011r360J5677J8594k022r635p345J8897L0955j4299m1894
80b0496J2285L1702j0370o150J7229j3623j9194J6388N851j9183O36Q067o542
93c400j69R593j879j3018j2860R003K3821p528k7055J0149K3340q938p865N179
107a627p914k18J3742n263j663K0809l878k5708K498J1778m870Q181J8024p784
121A6107k3638o443J9899J8459j8364k3609J9403J8145k1022o740J6823j1244
$$ y = [0, 0, 0, 0, 0, 0, 0, 0, 0, 0, 0, 0, 1, -8, 8, -8, 8, -8, 12, -16, 16, -17, 24, -24, 30, -33, 40, -44, 50, -57, 64, -71, 80, -91, 101, -112, 125, -139, 154, -171, 189, -211, 233, -257, 286, -318, 351, -391, 438, -489, 550, -623, 713, -824, 966, -1158, 1428, -1834, 2521, -3900, 7701, -38750, -132571, -23794, 57678, 11634, -47732, -32588, -3642, 947, -20064, -29424, -13747, 4847, 2825, -6810, -14155, 4742, 35697, 21398, -20496, -8211, 23491, 13121, 6971, 24200, 10577, -8617, 7771, 13622, -5561, -4925, 3142, -3400, -3569, 6024, 4145, -8873, -21733, -12730, 11091, 3563, -23492, -13343, 9997, 1059, -6806, -1627, -9541, -9759, 3983, -1280, -2943, 17866, 13988, -11720, -9222, 2556, -2314, 5867, 23891, 16107, -7531, -13974, 5925, 24384, 6020, -17589, 1814, 19959, -1063, -7803, 9020, -2224]
133b224j3764J5084M75j3379J3510J0172j9342q665J1602O247k81o53j953m04
147c575j356P107J6845j1142k4965J5644K3749k0801r949K8223l60k6648L152
160d076J1777p249k989M867o49J509l35q172k815M4K273Q341l196r520J3065N562
176H437k4506k514K6056mj3718M257O13k163J4225j256k0561L087J8830M11r615
191A579j277O679M422j1375r679J7056J0137j8365o122J1015l963p80Q724j0264
205b213j0976J1690j287j3164J5371J5864j7337j7940N908J3164N859o006m314
218e381J0494K129j2299L492Q752p202L251J0978j1559o088J7861k996j9618M048
232d138J0807n071P64K959q781l654L165J291K414m601o407R466O287j1100P29
$$ y = [-2224, -15988, -904, -429, -13808, -298, 9874, -9468, -18133, -6531, -284, -565, -1218, -3171, -3575, -4931, 2176, 19021, 7879, -17086, -1442, 22307, 1506, -8443, 19780, 19420, -7228, -4076, 7701, 452, -2537, 2330, 1681, 3190, 2855, -5317, -8132, -8088, -5815, 2526, -670, -10190, 2875, 8437, -16069, -18583, 7473, 7469, -6249, -1992, -1379, -3542, 10683, 9427, -11134, -8047, 10783, 11194, 1579, 302, 6981, 11403, 28, -9651, 7405, 17542, -823, -6945, 4070, 107, -673, 8051, -2213, -13189, -1499, -2786, -15950, -579, 15285, -2052, -19992, -14084, -920, 4939, -1067, -5381, 5113, 7242, -5057, -1565, 7187, -15, 3236, 14214, 2655, -3433, 14428, 11432, -8186, -4138, 6669, 1598, 2362, 5321, -3460, -7114, -3949, -2658, -244, -4845, -11252, -1786, 4501, -6599, -5870]
247e870Q113p626r92J3382n197r525J2225K873j0518N439P421q874l557K404q2
262c84N718M807m341m332o626p330J1831J3220r278n867M725p853k582J2735k871
277A572r639R003L811j0809L282P807p068m207K999J852L530O55m263L870p06
292A689j0178O182J3994p630q967P023j139q13J0175o133j4004J0386J0699j1781
306d97o538P919N481j365q929o997J0089P334j1167k594R614k78j887j826j1190
321a2831K848K0132k864j5183Q023P496j0932m045P166N546L014n572r646P834
335I86R598q052n997K787n8M367L435r616p12J0021q797j0067J2424P371q016
350c26l206j085k938Q691M782q530j605K840l155L184N164l466J250K606q993
$$ y = [-5870, 2243, -5383, -6375, 7007, 1810, -7715, 4510, 7383, -3135, 2304, 9725, 851, -2706, -302, -384, 5334, 10141, 5800, 1468, -5158, -12488, -657, 12563, 3285, -2582, 2143, -5710, -8292, 4443, 1572, -8067, 936, 4747, -6062, -2780, 5027, -2041, -6248, -3249, -1397, 2133, 2788, -1475, 2395, 1689, -8489, -2307, 11687, 4057, -4910, 2113, 974, 161, 10336, 4203, -9801, 585, 11284, -497, -7035, 884, 6365, 5000, -3929, -10926, -837, 6497, -4670, -7264, 2350, 2072, 185, -1641, -12831, -9983, 10149, 7285, -7898, 125, 7621, -3311, -7356, -190, 5356, 8370, 2798, -6848, 986, 10584, 2532, -3465, -678, -736, 3631, 7066, -2550, -3262, 6759, -2038, -12105, 319, 7690, -326, -3532, -4617, -7555, 1136, 5918, -2612, -4217, -1377, -4532, -1348, 3816, 350, 1600, 4206, -4787]
365d787j131J0240j713l152P274l573p468O286J368q124M239N761k956R07K10
380C381p766O55N018l198K009M783n614k374L963m536l97P808n191n757R501K113
396D398q296K350J899m998L956M122m603K670K341p271J837P165k707k099J935
411B699n441N08P818j909k245M842p557r274R348P886n602r64o5m469K555J049
427h21o022N015O837p205l796O658K74j501q8o175L499J2921m582j0322O217L880
443D789n802m7K963l61M967l468q420O286P350q883n218N818J859O33n50q356
459f440J883J0465m875r431O897M196n152q28J088J656O491m888j2525O516J0929
474E982k742k271J763m254P85M309n239R80R091m673p471N326K689l010P86l293
$$ y = [-4787, -5918, 4322, 2609, -543, 6731, 3158, -4310, 1976, 3344, -4780, -541, 5220, 2264, 3171, 3381, -4385, -3730, 1288, -1910, 99, 4882, -732, -3106, 857, -3679, -4076, 3732, -1459, -7216, 2285, 4398, -3898, -1548, 351, -4647, -691, 3431, -1172, 1498, 3839, -3432, -1595, 5570, 2863, 764, 2699, -2742, -2234, 5584, 3675, 1430, 6272, -1285, -10559, -1211, 6675, 1073, 109, 44, -4425, -1870, -821, -6843, -1828, 5009, -2196, -5992, 666, 940, -561, -649, -6824, -3325, 9596, 5014, -5308, 909, 4789, -1013, -1060, 1903, 1542, 6509, 3041, -5379, 907, 8257, -626, -5844, -26, 1833, 2466, 1916, -6440, -4557, 5908, 1033, -8398, -1501, 2695, -2457, -3285, -2197, -541, 5950, 1062, -11463, -4947, 5982, 3240, 969, 2732, -1522, -737, 3572, -1667, -687, 8404, 3731, -3740, 1586, 4275, 1265, 2051, -1242]
490a242l816O906K269n882K164L98p585K255N851m355K024M139o775k217P042
505A176j547k227M598k694l083O028J336m096K576n63k957M341j96n109N255L520
521F358p217J7N203n457k461N343j979J43N391n276o292M894J052k297L403k21
537F04l881K840o10l500N167R44q034K645P644l591m33L477n330j260N821j834
553F69J46P378m509p891N136M232k595K4j414k196M258r41o186M976L728r013
569d198k819M818m26K107K072q196l75J0138l589q274N894O713k792j146p95J567
585F99N340l804o528O808O426m949k034O90l292L849K235r402l85J1160l417r045
601e649L945K711l391j364j099J600O419k333p349K960L452k176K957J342n932
$$ y = [-1242, -5058, 1848, 4117, -1765, 399, 797, -6788, -4533, 1318, -3037, -1013, 3126, -3649, -5866, 1176, -371, -2598, 2000, -694, -3777, 2251, 3587, -509, 2067, 1504, -1453, 2888, 2692, -2417, 2838, 6358, -859, -842, 4361, -1096, -3557, 1786, -193, -50, 5341, 65, -6227, -1333, -281, -2578, 825, 604, -3277, -437, -1047, -4547, 620, 1564, -6470, -3825, 3819, 228, -205, 3272, -2058, -3318, 2503, 669, 815, 8193, 3684, -4207, 929, 5161, 2566, 2590, 1176, -1020, 3238, 2297, -3889, 1087, 4815, -4198, -7017, -2199, -2625, -518, 1554, -6642, -7017, 3121, -468, -8742, -2848, 3865, 1073, -73, -868, 699, 6039, 2235, -4293, 2515, 8941, 3992, 1958, 2648, -644, 3205, 5440, -3962, -4347, 6813, 3396, -5649, -1704, 1007, -2384, -3748, -4847, -3247, 3172, 839, -6510, -3550, -98, -2274, 683, 2025, -3907]
616c907L627M609o442Q33Q653m169o516M076J439j031M278j437n144K178L56k358
632i55K758J8l901L591J053o182K205L136n810o33M964k499K70N454o334n645
648h510O981L047m044K409J593k144K008j357k577N173J661m717K111K874l773
663G35J824J853o598J967O841o048m825O907l13o025K999K062l162j097q81J3
679c748N450n77o090K290K518l943K569L219l980K888L350o895j19R695k846q649
695d868L877N639l51K5k688k855L530r50m258N408M594n492l308r43j538N999
711A821K330r226k13Q862m364o483N086K788l393J019j869k59O623O6o824K054
727a982N266r23j488j481k85P041J220q685J225P250n871m469O267n74l201L217
$$ y = [-3907, -280, 4329, -2113, -1280, 7373, 3204, -3312, 764, 2203, 1172, 5450, 4013, -1131, 1047, 1403, -955, 1803, 1821, -2080, 1511, 2564, -3618, -1413, 1723, -4087, -4720, 244, -2255, -1985, 3469, -2865, -8510, -1529, 1518, -2526, -117, 1476, -668, 1340, -17, -2594, 2579, 4240, -477, 1634, 4508, 735, 2559, 4412, -2186, -219, 6622, 574, -4251, 2656, 2343, -3682, -683, 1379, -1783, -2880, -3761, -3748, 1702, 1125, -4965, -2675, -157, -4100, -1531, 1688, -2292, 596, 3946, -2949, -3068, 6627, 3781, -4868, -991, 4648, 4297, 4322, 1634, -1221, 2309, 1359, -2899, 2509, 7103, 1611, -1697, -2640, -4178, 1821, 4151, -5075, -5288, 3574, -790, -7273, -2187, 601, -2792, -1773, -3642, -3901, 2722, 2788, -4036, -1982, 3284, 2361, 873, -608, -893, 6148, 7368, -1317, -92, 7158, 1287, -3182, 3085, 2511, -690, 2527]
743B527k517n210M654J908n342k71J863M06K158r98l733K503K57l976N636N935
759E800o412j832N964l528l279P551J302m796R32P8k119L037J210l194K14o19
775C09k256L141J468m272J518J241n929J471O111m693l363O090q7m465L188k65
791g93l005L276O40k514M335J488n136L32J689l80K636M66l857K470L376n479
807d56o80N738l950l100N677k39l546J788k042l819M593K367m932p2K847k035
823a861m55k24j75M225o52q713M196R635m419n343M229M22k242L932p44l399N512
840C924J235o255K93M387n37k433k410K09O881k04r158P98O133m591l324O388
856A336n30k509J597l923k361P287J684o579P29M365n43J66j763j204N008Q04
$$ y = [2527, 10, -5200, -546, 1362, -3980, -4251, -2388, -1982, 176, -822, -4555, -2052, -1795, -5771, -135, 5800, -612, -2444, 3520, -8, -3287, 4264, 5566, 770, 1702, 1780, -339, 2698, 3908, 714, 928, 309, -1947, 1194, 2662, -1610, -92, 1149, -4780, -3309, 2802, -1891, -5254, 836, 749, -3716, -528, -793, -3798, -522, 118, -2396, 1939, 3427, -1709, -1377, 312, -68, 2568, 3034, -823, 1647, 5023, -456, -1136, 4602, 652, -2448, 3229, 2990, -556, 1232, -810, -4629, -36, 2331, -2601, -2673, 174, -1861, -2316, -2540, -2715, 1510, 858, -7855, -3659, 5976, 1557, -3786, 443, 865, -1377, 2555, 1811, -1588, 3924, 5159, -1096, -803, 3584, 3047, 614, -1796, -1587, 5294, 5090, -4068, -3270, 2863, -1728, -5052, 1336, 806, -1703, -106, -4029, -6390, 897, 2581, -3998, -3269, 1096, 553, 719, -1044, -2248, 2760, 3564]
872C564n918J842N611l222j767K488k363M38M209m095m081O056P29m438J058P48
888H59m178J359K290k281J085R98l366Q44K120k779J593K723m560N43O074k189
904A135l264L750j950k745N735K220m247J315J422m272j4L013J31R17j932m517
920c303M096L165n638r06M116l321j520L929j524k132L836j681m599M161L585
935B264m069k62K055l75J320m77k728K954K339m875J701N094l008k490K324j647
951A20j74M247l185l796N427J506o023P02K351k399J47N20j076K980m7o122L03
968d519N285j640o83K133k476q0L681l905j320P385k94p457K171N585q65j124
984A877j440k155M027K264n051N38L695k656j387J528k444J441K916n861k571
$$ y = [3564, -2354, -512, 5099, 1877, 110, 2598, 235, 673, 4882, 787, -3294, 2762, 3491, -947, 111, 859, -3319, -1960, 330, -1951, -866, 132, -3234, -2390, -270, -3049, -1456, 1267, -3293, -2750, 3324, 1135, -2129, 1621, -329, -3074, 2661, 4881, 634, 1949, 3371, -901, -915, 2098, 2229, 3146, 1214, -3303, 793, 3958, -1680, -2586, 1530, -1791, -3311, 618, -906, -3038, 798, -883, -5482, -1321, 2264, -1805, -2067, -12, -387, 933, 456, -2272, 682, 3021, -1854, -153, 4941, 1933, -557, 1767, 120, -54, 4193, 1008, -2788, 2639, 4145, -1878, -1176, 1175, -1224, -1077, -557, -1633, 1347, 1300, -4822, -4519, 766, -874, -1557, 576, -1900, -1980, 1701, -2204, -3524, 3861, 3567, -3890, -1719, 3866, 3001, 1877, 437, -1718, 2309, 4573, -478, 60, 3755, 1099, -288, 1240, -1204, 237, 3153, -2708, -5279]
999e279P111Km914J473N48k979J916J823j662J934P01l579J653K979k692R01K656
1016B592k474R25L168l952j533M608j622k892M590M15m945J645P27k942J919J491
1032A720l776J346P74k810J825K140l897o87L127j645M38L362l282j820M917j244
1048D88l580M426J779m429J241J886j031K259k67m720J695L293k201M37K498l112
1064F62k011J975k029M55M659m194l987N068J035n026J280J525k026J763N96k848
1080c103L048J944m941m16M837k76m31M49k578J754M572m047k861N708l88m274
1096a003K465K048k356L16j162k464L610J557n289l72L679j711j049O34k221J518
1112a800K216l907o31P011q91n932J495K135k40K816m62l210L117J718m289R77
$$ y = [-5279, 1832, 1834, -3080, -1607, -1059, -4038, -2122, -299, -1961, -27, 674, -2905, -1252, 1727, -965, -64, 2592, 118, 1043, 4211, 259, -1274, 3334, 1712, -1180, 3410, 3825, -1120, 525, 1252, -1690, 229, 1720, -2056, -710, 64, -2746, -921, 1219, -2678, -3365, -238, -1883, -1445, 1917, -1365, -3185, 1732, 488, -3092, 1334, 3113, -1316, -75, 1811, 780, 3039, 2772, -1948, -253, 3040, 839, 1276, 3774, 662, -1349, 626, -1403, -948, 3711, -483, -4470, 598, 1633, -3393, -2113, -588, -2614, -851, -255, -3103, -55, 1889, -3052, -3468, 1369, 1093, 662, 1111, -1467, 287, 4859, 812, -2049, 3659, 3271, -1003, 1462, 3510, 1154, 1470, 308, -2156, 1454, 3011, -2278, -2650, 1029, -682, -1731, -1097, -3318, -1800, 416, -3491, -4122, 2889, 1998, -3934, -2439, -304, -544, 2272, 1810, -1400, 1717, 3435, -854, 123]
1128A23L723k407o72R57j648J809K437n060j721M179j475k017K600k93l249J643
1144a071k1k500L339J125m656J022L242k126P97K020l121O5L617k009J60L355
1160C238k670j476L779j327k626L959j69k860K404J45k629J216P4l972K420L488
1176B994l317j577J042j505M06K343l045j63M268k786k689M361J032l255J514
1191c77N8j271L898P80m345J309L007l449n7L489j829m37J143l043J566M076m002
1208E16l564L593M14k317K081p09j901K142j302l647M439K540m833j37L037j510
1224a158j75J182k262J517L515l299j406N425j028m011K100J183l00K214k397
1239A100l462M781J895n148J43K858j829l43M88k310K036J871n359j661N920m15
$$ y = [123, 3846, 1439, 767, 1724, 76, 1885, 4322, -738, -2459, 1720, 245, -1772, 828, 535, -2714, -1071, -1092, -3592, -253, 872, -3784, -2762, 480, -1646, -849, 1171, -1950, -1885, 1732, -277, -117, 3238, 568, -908, 2871, 1544, -1082, 2877, 2708, -152, 2252, 2397, -232, 984, 1058, -2914, -494, 2994, -323, -1900, -858, -2363, -1957, 386, -2659, -2822, 1446, -1340, -4029, 332, 1364, -1891, -377, -319, -1590, 2308, 3088, -1257, 52, 3059, -390, -447, 3042, 1213, 776, 1919, -1124, 442, 4518, 516, -3048, 545, 959, -1358, 723, 14, -1887, 255, -1047, -4694, -255, 2285, -2548, -2685, 352, -1158, -1333, -151, -2413, -896, 2619, -680, -2086, 3339, 2311, -1700, 400, 1583, 1283, 3497, 1100, -2362, 2419, 4314, -834, -691, 2167, 338, -5, 483, -1827, 209, 2080, -3279, -4940, 980, 565]
1255E65l321J378n20n80L285j163k943L508J065l761K427L070j969r7L30k505
1271a231K318L486l387j025L058k156k223L153m56k257J688j034j746K569n11
1286B46l044J626M44k634K620J932l575r0K776k298O99L268k807j004M043j296
1302I06k140L054J23j957J406o43r39L845o23n188K435K776l498k69J637j759
1318h34N64J924l446p7L689l127k888L908N16j370J400j487j891L750K43m072
1334c198L553J842l154K88K160q54O00J80l394J999M878l313k638L374j360k540
1350a577K590K56j382J979j841l361L577J798l633m13J061q06J451O38k998J840
1366h21L040m973j261N524j37k886J654K00o81K127j121k621L372J144l076J591
$$ y = [565, -2756, -1378, -1898, -2478, 807, -356, -3299, 209, 1274, -2487, -60, 3010, 1041, 944, 1274, -1231, 1087, 4573, 1186, 161, 3219, 1063, -1160, 1993, 1537, -720, 968, -66, -1812, 757, 246, -2798, -1172, -728, -3362, -742, 1190, -2385, -2475, 301, -1997, -1298, 1970, -837, -1841, 2202, 906, -1234, 1820, 1943, -14, 1392, 749, -190, 3655, 3032, -2156, 279, 3055, -443, -712, 925, -834, -270, 1654, -1792, -1869, 1820, -1307, -4195, -287, 229, -1141, 259, -1228, -3119, 631, 874, -3198, 355, 2197, -957, -669, 1491, 637, 1237, 1417, -1977, 22, 4900, 1587, -1051, 2323, 963, -1577, 1013, 1269, -113, 1866, 25, -3336, 241, 2039, -1594, -2007, -946, -1752, -301, 337, -2661, -821, 2219, -2754, -4015, 1509, 1372, -1514, 140, 340, -341, 1786, 665, -1956, 1416, 2560, -516, 1075]
1382A075R76j706P51p5k880L100K647m968j456M229j417k074J631j244q42K819
1398E66j370j985L245j73m057J854J937j006K053J11l144J466K981k853P20K497
1414B842k510j153L467j077j321K602j499k837K689%j943K160j15l716J177K112
1430H78k296N46K26k577K606J802l649j35M010k615j925M105j00j794J530n96
1446A6j250L278M62l554J564J579j295Q18j48j551J469N40m037K089M461l937
1462E04l594L072L77j653K044j835j535L455q84l089K555J294k549PJ463q55K538
1479A315O09m430J995L328l099j099L648n91k158K266j015o15L065k610k871L436
1495A174K248l821k37R64j036N50L11k886K374K212m121o79L910j666j066J895
$$ y = [1075, 2051, 345, 1096, 1021, -1859, 1241, 3888, -1080, -2536, 1693, 276, -1798, -167, -1411, -2253, 566, -804, -2789, 456, 283, -3774, -1920, 17, -989, 1064, 1175, -1969, -503, 2478, -375, 345, 2842, 332, -821, 2646, 1569, 248, 2850, 1351, -1486, 1203, 1203, -740, 1420, 1305, -2411, -1234, 878, -1418, -872, -646, -3223, -617, 1185, -2464, -2599, 1411, -1204, -3129, 976, 876, -918, 612, 16, -1234, 2044, 2506, -1048, 516, 2095, 800, 1618, 1470, -81, 1388, 1928, -2109, -20, 4441, 504, -3090, -18, 359, -1294, 750, -1085, -2620, 835, -49, -3138, -583, 711, -1838, -1831, -368, -1223, 1315, 1924, -2506, -511, 2817, -282, -1381, 2267, 1676, -482, 1784, 769, 154, 3219, 609, -2262, 1174, 3422, -399, -636, 328, -708, -158, 153, -2733, -359, 1853, -2268, -2947, 963, -703, -1769, 126]
1511A26k013p04M397j110l242L564M38k758R97K170j356J033o49j817K583J438
1527C097l872R41K319k520k17K887k418j866K925j562k549L487M78l195P26P57
1543e82j517J512J84j869J371J024k093K505J700m152j39L959j405r53K602j309
1559H38j033K010j057j329L123j85l808J236J594r94O01m65k720J617J683l466
1575b355P18L146k671j069K054r97n12K503k370j591M649J40l788J636K088k559
1591i78J013R73r48J971K19l167J135K477k286q34K377j895K37K252k961j470
1607a885L447j316l574L607J497l239n41N29j61J965k85k449J756K024l348P32
1623a241K637j226p61J505j894P10M078k021l749L341J103k777Q23J382j508R44
$$ y = [126, -1887, -2591, 1806, 696, -2546, 1018, 1456, -1302, -305, 1865, 509, 1542, 893, -924, 1659, 3097, -775, 166, 2485, -35, -252, 2635, 217, -1649, 1276, -286, -2835, 652, 1130, -2065, -1339, -582, -2099, -587, -403, -2272, -901, 123, -1970, 535, 2235, -1917, -2056, 1903, 498, -455, 2147, 838, -195, 1815, 758, -571, 2552, 2367, -1441, -205, 1389, 395, 996, 531, -2189, -572, 1111, -2355, -1637, 1509, -1162, -2231, -177, -1174, -1686, 817, -1553, -3144, 1505, 1645, -2143, -507, 1581, -978, 35, 1008, 60, 2031, 2250, -917, 218, 2695, 409, -425, 1952, 57, 294, 2546, -415, -1885, 1562, 246, -3328, 279, 1776, -1463, -2004, -1475, -1636, 329, 44, -2405, -649, 1375, -1973, -1241, 1396, 170, -591, 914, -980, -270, 3808, 1787, -1962, 1379, 2482, -295, 528, 1910, 402, 1346]
1639A346p40j947K751O37l900k16K849j322J16J203l355j23L671k297j822L819
1655F70j4k887J420J564j572J643l42j983K135K055k590N19J342j928O21J916
1671B569k177l8K108k661q86L733j900k775K328L03k835J741J082k298R33j25
1687h98k042J878K161k884M97J696j433K65K334k269l89L136k047j043M049j62
1703B849m137J248J696j256Q30M95k170J607M73l133Q54K378k035j224J100j012
1719a437J267J646l577j519M069j35k993K240J327k605J327L27j274K313O06l547
1735a965J572K709j414o48J123j508Q40J647k646K21L612l076k539K950R65k615
1751g72Q96m89j714K636L65l344J226J552k351K19J820r09L66O35k509J514L415
$$ y = [1346, 606, -1341, 1410, 2047, -1853, -2069, 780, -542, -426, 777, -2578, -2701, 970, -1327, -3149, 670, 656, -2231, -811, 753, -819, 824, 482, -1501, 634, 2689, 99, 618, 1960, 32, 653, 2569, 392, 354, 2462, -199, -1085, 2648, 748, -2027, 301, 604, -2231, -490, 592, -1706, -773, -898, -2940, -1062, 1099, -1785, -1288, 408, -1025, -760, 1574, -695, -1084, 2052, 5, -1038, 3011, 2849, -1288, -40, 1656, 400, 1230, 1725, -445, 1162, 1635, -1498, -644, 1734, -301, -1525, -425, -1437, -170, 1476, -2101, -3620, 449, 314, -2679, -439, 888, -1717, -390, -63, -1337, 976, 1582, -1965, -393, 2316, 902, 254, 1377, -131, 709, 2356, -290, -69, 3543, 467, -2072, 878, 1843, -772, 124, -365, -2079, 557, 922, -2422, -1196, 356, -1995, -1776, 44, -865, -499, 136, -2373, -859, 2556]
1768B556k907j819L461n8k192K366N73j781J570o72k046K232K055l352q06K166
1784A346j437O73K22k447R46J962k547j131L505j723k112J766L43j097K059J0
1800C38k604J934Q39k146J665J981k414J20J601j162J368Q88k844l3L100j460
1816A171j650K705j126k402J770Q6j308J476n79k896K161J543k801J46J504j469
1832a669J41J516j032R43J056k848j75M093p31k002J551j5j259K451m96k251K052
1849A325J057l227J223K561j870j432N71j350J545J315l062l73K602j681j882
1864b678K623j99j621J521o10j034L058Pl493J141K263j379L01J264j271O43Q56
1881A392k117P20K969k385k116K943L53j377R60j104j310K122l15k323J817J167
$$ y = [2556, -351, -2170, 1291, 1233, -959, 1407, 1980, 199, 1769, 1097, -949, 1283, 3338, -14, -820, 1346, -91, 582, 804, -1643, -697, 1265, -1282, -2413, 1092, -631, -2743, -977, -634, -1731, 328, 338, -2266, -332, 507, -1639, 26, 2007, -407, -287, 1314, 152, 1520, 2408, -436, -469, 2631, 1171, -479, 2226, 1100, -1302, 468, 554, -754, 722, 143, -2753, -592, 951, -1850, -1704, -200, -1669, -1528, -12, -1044, -101, 955, -1893, -2068, 2025, 1294, -708, 843, 828, -431, 2020, 1524, -727, 1325, 2382, -845, 378, 2939, 1069, -363, 208, -1142, 403, 1718, -1344, -1717, 885, -796, -2678, -55, -254, -1875, -354, -964, -1998, 1060, 1067, -2426, -1285, 978, -401, -100, 1164, -107, 536, 1392, -725, -5, 2964, 579, -1537, 1406, 1759, 382, 1342, 238, -1072, 1050, 735, -1588, 229, 1396]
1897A396k988j8J630q59O09J28k746J107L470k450j085K405q68j486K142l9p46
1914c98K539j659k169K410K199k947N34R77j791J239J132j832P0R96k402J99K651
1931A748j523k006J864q01j164K267p33j752K071j75k253K248J463k749O02J108
1947B15r18R19J625k274J37J999j762m12K813j159j341J086k57j83J405j066k767
1964a940K319J037k211K21J304j590k21L83j097J280J536k773p24K848k16j387
1980a231J243o24o80K333n91j407K443J86l088J246J978o75mM20k259J349J079
1997A718j957l98K289j540j404J846m12o29Q74j848j102L006J51k553J339Q15
2013A95j914L51J503j314J335N98k259J051K952j767j624J835k31n41J470o32
$$ y = [1396, -1592, -1610, 20, -839, -230, -102, -2848, -1741, 1729, -721, -1806, 599, -269, -1755, 387, 348, -398, 2141, 482, -1687, 723, 2922, -25, 509, 1486, -305, 934, 2066, 234, 304, 1300, -1102, -903, 1748, 225, -1781, 83, -718, -1882, 385, -348, -2100, -29, -204, -2457, -209, 1254, -1495, -893, 215, -703, 216, 1841, -433, -296, 1703, -59, -471, 2342, 1183, -158, 928, 671, 488, 1893, 827, -1940, 379, 1416, -795, -574, 730, -860, -1081, -698, -1795, -515, 1021, -1752, -2476, 372, 156, -1231, 12, -612, -1292, 1041, 450, -957, 1486, 1672, -1416, -170, 1808, 1133, 1129, 1549, -710, 639, 1718, -239, -637, 1652, 112, -1292, 554, 142, -487, 387, -1461, -2563, 443, 594, -1959, -620, 195, -1719, -1368, 135, -1179, 156, 754, -1505, -454, 2498, 731, -893, 942, 711, 170, 1640, 1008]
2029A008j138J984r26k109K580P38k858K51O90n49J155k30k625N27K194j969j06
2046a383K566j878j107J396l04k02J718m46k711K261J382j571P14N76j686J053
2062C78Q90j490J849J185l020m05K735j206j075J116o75j534J970p54j039J588
2078E13j144j567J905J000k137Q67M72j685J131R98j735M80K241j927n76K476
2094A312J03j478O33r97L50K568r80k492K031P11k351J037J090j582M53k16j741
2111a549J728J645k869p91K035q80m66J482j415m73J841j601q50L343J78k935
2127a577P35J490p30R89k62j633J841J108k358P33K120j868j104J427Nj123J962
2144A755j806j613K483l7k356R92P75j559M25L63l74J583n39l291J764K884k064
$$ y = [1008, -130, 1854, 928, -1181, 1399, 2137, -721, -470, 220, -329, 826, 596, -2029, -1502, 692, -1277, -1383, 1183, -695, -1802, -406, -710, -912, 806, 360, -2351, -90, 1292, -279, 435, 1011, -675, 378, 1268, -222, 1627, 2812, -208, -613, 2122, 916, -159, 957, 282, -1252, 718, -36, -1075, 513, -631, -2198, -293, 707, -1430, -563, -91, -1776, -645, 353, -1382, -902, 1339, -588, -1164, 1312, 1415, -63, 570, -427, -77, 2491, 1511, -981, 1050, 1761, -590, 447, 1537, -45, 408, 192, -1549, 179, 1824, -1045, -1836, 199, -681, -1147, 335, -1080, -1553, 288, -1313, -2163, 1180, 1358, -1577, -842, 648, -82, 907, 645, -988, 853, 1961, -397, 336, 2456, 588, -516, 911, 916, -207, 1755, -51, -1664, 819, 782, -1574, -582, 193, -1366, -941, -578, -952, 631, 92, -3199, -1435, 1449, -615]
2161f15o58K034q12q40J454l19o58J801n33j965K428Q52k000L41m20o44J674P84
2179A904k726J012J010k087j75J981r98j041Q69q36J50J813j455j662K104n2j583
2196a772K079M32j538M68M28j071J771J210k447K23J875r71j48J436j589n80J348
2213A154j155m67K459r11k778J849P19j542J89L92j043J133j70j827J557J150
2229G09k518l64K613q99P5J063j468k76K543o58j923K632K23j622J62R78p01R32
2247A501p91j845J753J259k388M89J030j779j98J331j177k2J499k019j224K783
2263B02N31k510P16L44n04J332J02j340J196P31k112J100K092j048r27R78p45
2280A38N33J525k101p49K658j270j521J765L79k003J43M72j117J640j63j824M93
$$ y = [-615, -1273, 761, -51, -891, 563, 244, -414, 1387, 854, -1111, 1317, 2169, 169, 510, 90, -554, 1120, 1904, -822, 190, 1200, -887, -1062, 919, -79, -1120, -251, -1087, -937, 876, -579, -2241, -137, -189, -1772, 307, 739, -799, -331, 97, -974, 797, 2007, -440, -217, 1658, 687, 539, 1975, 386, -194, 1154, -1, -468, 1991, 1080, -1698, 151, 870, -672, -483, -91, -1134, -1, -171, -1998, -441, 709, -1809, -2173, 440, -459, -384, 679, -789, -1065, 1478, 820, -1103, 1529, 1752, 130, 292, 1270, 569, 1501, 710, -1135, 618, 1877, -511, -22, 1008, -771, -969, 362, -815, -837, 662, -1357, -2581, 202, 733, -1777, -1061, -717, -1221, 111, 213, -1127, 69, 800, -1312, -212, 1880, 832, -95, 883, 138, 671, 2196, 95, -654, 2004, 734, -787, 978, 1357, -646, -503, -31, -1148, 492, 329, -1495, -1002]
2297a002J315j521L53P81j206K60J170j565O03K527j609k041K511R42j699P48
2313E67L73q86O62L6r75J417O20k421M41J606j008l58P97j926J64J766j553p02
2331a380J980o92k114J511P17j134Q37m97q18K159M70k402R85J444j360o2J486
2348A130n40k06J086j722K8K577j392k018J885J66j131Q88L32j724R29k20j570
2365a502J263J248j980m33R45m57N44O95j724M29J860j529r82K589J89k499J071
2382b73J100q28J429m19j865J292J390j341l05R46j098K14O32j236N15J365k190
2399f72p47K253p30j705J498j22j154Q27Q9o84J374j38k132J438J494j102j39
2416c52M51p32Q81J330j717K4K076j308j432J808L49j288Q70m96j172J429J82
$$ y = [-1002, 313, -1208, -855, -74, -1280, -1020, 150, -1415, -812, 1715, 106, -1935, 576, 1518, -181, 567, 940, 54, 716, 752, -223, 1194, 1814, -607, -166, 1440, 432, 74, 871, -1055, -891, 875, -678, -1380, 600, -92, -2206, -695, 22, -1112, -275, -772, -1590, 569, 1039, -1363, -378, 1066, -294, -356, 1130, 590, 384, 1470, -252, -224, 2353, 961, -1057, 828, 994, -137, 751, 1083, -641, 288, 68, -1502, -239, 1009, -971, -1404, -459, -916, -372, 323, -1401, -972, 888, -641, -1623, 966, 1155, -1344, -273, 827, -1, 1428, 1009, -856, 436, 1826, 485, 180, 1126, 28, 242, 874, -362, 153, 1518, -672, -1419, 834, 104, -1601, -103, -225, -1379, -552, -463, -1147, 227, 89, -2043, -605, 889, -213, -352, 99, -633, 248, 1578, -139, -115, 1961, 653, -779, 1029, 1378, 90, 960, 464, -708, 721, 903]
2433I03j878N07J454k130L57J057j172K56K20j342Q17K057j639j484K133j75p96
2450h55R59O0o65J287k0j567J785R20j878MJ070n76K30P95j716L53J190j590j62
2469c76J797j277j739J351L06q58Q06n51j685K107K86j925R78J335j176o63J275
2486ik47L32O92j516L89K510j533j191J633r2j262J323m02q56J994q83k058J629
2504D53Q48j780k22R35p67Q8M47j390P98J258j893p84K704m65j478R23j5l33J470
2523G97l58j384J265J077j583M42J180r29r6K60p02J007J065k286l38J881j049
2540B49q52J184m68r71R01m10j405K421l67k160N71J549q48l9L33q22Q75O87j289
2559h61J000J223j224j200K354o29n19R70q02p35J780j90j773J435K95j645j8
$$ y = [903, -975, -468, 986, -1144, -787, 270, -902, -646, -426, -1768, -951, 1106, -533, -2017, 116, -59, -855, 104, 164, -501, 786, 766, -801, 984, 1904, 26, 30, 1100, 524, 754, 1549, -167, 186, 1376, -214, -376, 1421, 144, -1595, -244, 62, -796, 10, -541, -2226, -119, 167, -1758, -780, 555, -621, -1284, -9, -256, 76, 768, -748, -359, 2151, 618, -573, 1060, 968, -294, 1029, 627, -229, 1765, 882, -1176, 453, 1301, -479, -701, 234, -533, -445, 2, -1388, -590, 668, -1225, -2009, 695, 230, -1248, -325, -340, -673, 797, 439, -945, 320, 1397, -186, 256, 1436, 507, 411, 671, -31, 976, 2041, -245, -583, 1298, 249, -603, 581, 113, -858, 43, -367, -1772, 649, 282, -1878, -1307, 242, -606, -645, -312, -1134, -259, 428, -861, 139, 1362, 138, -1062, 1292, 663, 144, 1114, 312, -423, 1357, 1167, -606, 829, 1124, -521, -539]
2576e39J258j007O24q7j781P82J590j505q72J597o41o17J460m67o08J054q88j126
2594a773K030P88j716M75R71p10L86P88j508R02O33j463R6J793q10j349R94o09
2612h2j36R33q38j197J832n15j642J476Q28j878J92M42m79P50P01j833M24K067
2630A045j373n55J280m14k6P99m87n11J640q3k496K146P73j748K54N84r65L68
2648B31M40j651Q70J161j723o68J742m92p53R05j141j52J400n31j174J555N89
2665F08k247J036J232n95L56J58j215J217J063j621k8J694r02o72J048o59l18
2682A55N09r81p64J943j29j755M98Q61j044J4O40j028M56R62k075Q97J883j602
2700e60o07J116p0j75J102r67l77J972p93j370J569O96j681M77M19q92O88M98
$$ y = [-539, 719, -288, 336, 249, -1532, -750, 840, -665, -1537, 60, -581, -1198, 262, -205, -813, 241, -647, -1773, 257, 1045, -671, -196, 775, 65, 451, 1239, -269, 633, 1266, -197, -101, 1692, 882, -467, 527, -82, -218, 715, -123, -1320, 512, -3, -1645, -169, 659, -1219, -1027, -585, -1064, -314, 387, -1446, -1022, 1045, -328, -883, 397, -17, -43, 756, 269, -242, 1398, 1315, -1181, 965, 1738, -10, 244, 828, -137, 231, 671, -980, -110, 1051, -672, -1340, 402, -90, -843, 62, -1079, -1231, 169, -362, -1536, 19, 608, -1639, -603, 629, 34, 390, 548, -667, 550, 1613, -8, -36, 1658, 756, 84, 1132, 473, 155, 664, -317, -1081, 862, 733, -1022, -524, 337, -707, -693, -53, -1081, -625, 337, -1738, -841, 1042, -560, -1167, -51, -121, -296, 806, -161, -538, 1434, 641, -729, 840, 1536, -145, 332, 751, -141, 547, 1045]
2718A045j420N26J040j221p14J446j001o37Q49p53j01J172j009j239K074L58j762
2735a347R88O32p24P05M4j082J447R06k305L42K076j231m27J116p75m38J264j161
2753C0k46J103m13j583J475N34j304L03n02q37J520L70j808L34J478j418j66J420
2771B90o78l46J029q73j2J842q66j419J602N43j374J043L11j092N75L28j136O95
2789D62J311k370q8J416l00o44N92j043k35J476j123j093J996jk168J228P00q51
2807g35O54Pj071J249P49j362L37J464j207l09J272p04K84R23j431q97K276l37
2825A162j908J201M67j171L77K47q31O28O2j935Q72J512j579k04R99n58k86J608
2843F63j406m26J814o36j023J660K79j184M40K59l50Q90J75j404J222N44j792
$$ y = [1045, -375, 151, 1191, -30, -744, 702, -299, -936, -87, -840, -941, 231, -778, -2017, 57, 415, -1347, -359, 273, -451, 254, 298, -784, 663, 1569, -736, -394, 1682, 451, 24, 1140, 365, -73, 1191, 30, -216, 887, 474, -1109, 366, 900, -404, -101, -603, -1440, 80, 450, -1358, -1024, 454, -964, -1130, 290, -388, -734, 295, -578, -590, 1252, 386, -1033, 569, 1112, -262, 781, 1092, 0, 575, 903, -233, 462, 1773, -597, -685, 731, 431, -213, 379, -664, -899, 577, -546, -1639, 357, 356, -1812, -584, 116, -735, -81, -74, -1145, 104, 853, -509, -172, 1292, 85, -224, 1048, 344, 628, 1551, 120, -777, 1499, 1162, -746, 455, 922, -249, 128, 375, -456, 172, 234, -1701, -829, 683, -896, -1100, -101, -659, -945, 663, -743, -1169, 645, 9, -1014, 646, 925, -259, 181, 440, 90, 980, 1155, -249, 973, 1517, -275]
2860b75rJ745j011o68N20p07K8J462j255j440J857j81j442J125j6r62R03K36j162
2879a252J284J085k353O17J822q53o56J377q89l63J586j048m11J506q44j264J155
2896D99N70j281O02K08j311R09N12j646O27R44j563N2R55p21N2L90j202l9K338
2915H95j342j116K083k95j211R46L06m80J220m36j437J339J361j906l0J116o57
2932C56L5N85j019p5J196j189j059K004n37j496N28N46o34N22k43j031J487M77
2950D53j911Q47J494j479j1O83j65M97J087j827m1J356k73r30J042K12j248N38
2968C24n0m63J238j80j832O81R25j390l08J253j011J26J004r30o91J927j469o03
2986a449J841j99j277J062j39o02J452m1j402J526L88j416K31J078l94l21N69
$$ y = [-275, -284, 1461, 450, -218, 302, -405, -377, 1085, -170, -1610, 247, 66, -1376, -251, -267, -1229, -326, -90, -1252, 32, 1117, -1236, -619, 1203, 350, -306, 1071, 182, -181, 1405, 357, -54, 1452, 608, -656, 499, 1069, -212, 390, 598, -713, 196, 708, -938, -311, 633, -930, -878, 77, -644, -592, -202, -1404, -1443, 895, -447, -1563, 520, 225, -986, -40, 266, -214, 1006, 570, -867, 472, 1833, -73, -103, 1013, 356, 391, 976, -43, -118, 1078, -111, -1170, 834, 297, -1199, -671, -125, -759, -237, -480, -1511, -24, 453, -1458, -611, 883, -596, -607, 76, -89, 408, 1495, -332, -373, 983, 710, -220, 822, 1034, -214, 324, 274, -189, 1049, 869, -963, -282, 643, -747, -1055, 198, -813, -687, 317, -613, -1304, 623, -846, -1449, 392, 193, -1084, -22, -161, -763, 689, 648, -754, 772, 1160, -256, -25, 1053, 659, 338, 907]
3003I07j336O19J581j731p32J426k50j396J192k96n54P15l76j496J842L35k168
3020a718J204N50j129M79J018j162M25J262j479K21J984j105j235J387J78p44
3036A36J068n67r64J120J31j510R64P87j662M2P16l60K59Q1j384L15J320r14q99
3055a321J688n63j060J031R4n75J279l00j400J411N10p96K50Q54q40J42O20q63
3073A61J80J085j477p86K033p68p12J133r30o64J097m55r03J174K1j635Q77P36
3091A67p81k45O38p20P48O94j345J89J696j066r40J704m1r35O67L9p49J472m2
3110A150j575R24P02j326L89L88j233K81O55j938R85J534j344j032J555k38j047
3127a170J150n88m39J338m98r10J363M99j437K04J211o67L91R8j127J211P45j361
$$ y = [907, -429, 190, 1771, 40, -692, 734, 484, -912, 280, -16, -570, 145, -231, -1727, 115, 450, -1718, -514, 36, -1093, -614, 404, -758, -333, 929, -550, -329, 1655, 550, -685, 702, 880, 136, 1204, 637, -327, 793, 924, -586, 378, 1165, -497, -455, 261, -99, 160, 241, -1143, -828, 492, -422, -1321, 367, -196, -1256, -225, -131, -706, 573, 273, -1127, 284, 794, -2, 248, 1102, 262, 404, 1024, 161, 341, 1426, -51, -837, 1196, 428, -284, 849, -81, -745, 352, -103, -1006, 168, 189, -1446, -569, 167, -614, -859, -221, -941, -193, 501, -844, -655, 1041, -25, -965, 739, 698, -237, 430, 469, -280, 1192, 1150, -425, 499, 1201, -125, 264, 652, -581, -300, 355, -1583, -598, 936, -408, -1440, 115, -123, -1170, -20, -608, -1047, 291, -207, -1117, 246, 745, -692, -488, 723, 56, 447, 545, -582, 629, 1374, 13]
3145A3m12J720q70j019J049N7o80J045j143j188J915K70j781O17P32j330K23P49
3163c3o33K65P42j566K13K114j307p06J273l31p49J646o17m87J220m88j306J354
3181F04J037j461j04M87n90M25N01j802P07J349j769n73J545n22p42M97k11l02
3199i24J126k51j652J822J46j331Q66O22q54K73L19n09J098P27j868j99J783o79
3217E15m81J001o42p93J093m19q47J327j30k035R18Q93r76L44K49q16M93O85j402
3236a023L94J275j417j65J110o3j80L81o21l35J527M1j185N99N42j095K93R25
3254A003q67P67k15j391K06J631j217q45J368m89m61O01n15n48J349r38o67J396
3272A68K72j529L67P51o93O44M20p65M59N95r79L6J393n92q72J125m00Q2P38j187
$$ y = [13, -399, 1321, 451, -568, 481, 538, -142, 903, -240, -1428, 487, 757, -1024, -407, 325, -1005, -782, -33, -666, -401, 341, -1225, -1012, 1102, -205, -911, 362, 31, -718, 928, 311, -176, 1044, 556, -750, 604, 1641, 180, 76, 563, -27, 398, 899, -903, -196, 1153, -616, -1189, 356, -166, -908, -411, -622, -924, 202, -49, -1701, 121, 267, -1064, -198, 424, -430, -157, 162, -347, 751, 1478, -390, -589, 1194, 515, 34, 1035, 393, -400, 693, 274, -573, 754, 624, -1411, -493, 400, -576, -232, 17, -799, -306, 379, -1023, -629, 646, -771, -936, 174, 111, -69, 312, -309, -644, 883, 924, -261, 338, 880, -215, 78, 1003, 136, 903, 688, -703, -497, 1134, -83, -928, 440, -49, -510, 91, -424, -972, 377, -561, -1228, 168, 440, -1089, -722, 29, -664, -20, 400, -365, 94, 689, -290, -254, 1139, 547, -325, 800, 400, 482, 1220, 33]
3292C3n07J059J61j696J277L01j483O94n4k41L88R20j868L2J338q74j55Q81p61
3311e55l04R45m89j96J478n72j289J308Q44j416O01K53n78N19K22r64Q94N58j622
3330c63j99J456m51p00N82o77l10J330q18j059R73J58r23N89N14p95O56k46p21
3349a004J285N51j017kR92m49o73J274n39m93J225j113m00J751n22j371O57M84
3367F36r26P89m69o24M47N50j539M90J390j151o40N78j90J94P58r64l60J688j108
3386d51p12J583L22j159M69M56m97R14J22j614P26J140j358Q4O52m41l43O27p65
3405b45M56R34j402j419J952J78j172J63L02m28M84K8q53Q74M25j301J99J737
3423I12r10l13P68m47K70Q98j235n8J596p34j124O11P52j154M74r4o21R09L61
$$ y = [33, -474, 585, 746, -950, 327, 628, -855, -161, -215, -456, -68, 852, -1016, -984, 354, -520, -675, 206, -555, -859, 86, -403, -599, 879, 307, -982, 326, 1170, -246, 355, 608, 30, 549, 771, -193, 701, 1259, -363, -562, 894, 443, -257, 325, -352, -662, 668, -150, -1209, -236, -78, -1001, -412, 102, -693, -37, -283, -1004, 281, 832, -185, -187, 805, 356, -317, 957, 418, -75, 1150, 37, -363, 1388, 866, -505, 152, 636, -290, 499, 30, -594, -147, 403, -1136, -646, 744, -407, -1047, -469, -659, -465, 293, -671, -1031, 657, -451, -1163, 420, 742, -417, 52, 508, 11, 925, 1047, -567, 159, 1299, -59, 25, 677, 236, -107, 520, -245, 211, 1145, -257, -1676, 276, 454, -718, -555, -253, -681, -197, -169, -1022, -148, 277, -1024, -825, 912, 2, -311, 457, 10, 280, 1178, -57, -115, 1481, 747, -377, 234, 986, -168, 306, 212, -409, 500, 861]
3442H61j582K68R17j324M03M29m28J72M22j012jJ417k92j399Q59O28q58J032j89
3461C23n50O45K71j450J224J069j793j55J297l96l58N63o45k34J361j304o47J517
3479G38m42j272N82K4m38O59k79p11J271M40j678L70J063m79n00J249n65K77P55
3498A064r96n15J447l64j136R41J66q99R38J08j060P96O9j379P53R58j169k85
3516e63P79j017L02N96p93q6J234r13q47J291K97n66K55j78p3Q65l02j032Q86
3535A35R29j212M76R12q27j95N88q61M23P88q78r27J250l28q33N42J2m19J1L12
3555a02j032J317K97j920M25J372j100Q7J021o23l5P56m51o14J458o35p34P60
3573B47M84p47Q24m89q39J418j40j228N05R15j146k67R31q60J08O14j105J45J240
$$ y = [861, -721, -453, 464, -860, -457, -28, -456, -284, 138, -874, -875, 542, 250, -1149, -290, 338, -520, 512, 323, -227, 418, 689, -761, 463, 1532, -261, -416, 881, 485, 127, 690, 45, -189, 1172, -132, -779, 738, 296, -976, -394, -370, -808, -149, -428, -1139, 132, 572, -1106, -736, 327, -152, -652, 597, 32, 309, 1064, 68, -447, 1000, 636, -500, 441, 607, -292, 646, 754, -306, 490, 559, -820, -67, 891, -278, -563, 216, -801, -499, 97, -696, -782, 452, -461, -1308, -17, 280, -286, -31, -209, -282, 583, 281, -751, 135, 1064, -148, 328, 1240, 413, 218, 806, -55, 368, 1156, 278, -649, 601, 273, -560, -18, -6, -425, -414, -102, -1134, 183, 480, -1440, -1015, 357, -743, -656, 365, -258, -293, 463, 12, -602, 856, 221, -513, 247, 731, -16, 808, 319, -520, 898, 758, -470, 35, 950, -196, -463, 468, -392, -284, 330, -775, -630, 610]
3592F10j077l78O72K60q73M33J38l81O99j52j059J353N93j314K11O66l74K25Q41
3611A093j165J4J227j332n7J223p9j419N90k38J34M36m86r42R24K45j204M39O72
3630G5q47J15O23j035O18R83r06j43J083n02k66Q18m97j04P05m20k04N36R0j182
3650d60L75J051q86j19N77r55K86N72p79k71J295j176o64J175J8o96N72m27k17
3669g29J096n37p73R32L69j006K64P80J4N4j2p87N31J308j426l79J393p50n18
3688a76O89k80m85N85j28q87J171l3j327K09L98k13L12J71p93L32M52p84J62R63
3708C38p85p45J139L04l32P79m49p01J121p8q49M21O60o57k05M99k40R5J16r48
3728e17k66J564j026n82J087o30m07O40j58m39P06k83r53J357K40r87L13O09k02
$$ y = [610, -467, -845, -173, 87, -786, -353, -215, -596, 103, -49, -1108, 245, 838, -476, -265, 401, 27, 252, 1093, -72, -58, 1169, -163, -220, 1003, 924, -495, 95, -143, -9, 427, -59, -1001, -77, 168, -1036, -597, 75, -772, -657, -34, -1069, -451, 532, -374, -517, 566, 64, -202, 616, 119, 15, 720, 300, 96, 632, 722, -460, -85, 966, 80, -39, 538, -417, -131, 441, -338, -609, 686, -490, -1154, 21, 39, -657, -85, -512, -729, 367, -170, -943, -11, 358, -648, -384, 396, 410, 464, 452, -335, 196, 1504, 78, -301, 1092, 342, -176, 513, 233, -252, 333, 205, -682, 489, 456, -871, -662, -264, -477, -165, 6, -787, -455, -3, -787, -625, 338, -447, -1192, -53, 251, -81, 698, 249, -452, 669, 591, -258, 163, 823, 166, -39, 460, 220, 315, 431, -517, -783, 781, -245, -827, 260, -370, -777, -137, -295, -734, -28, -311, -1264, 93, 333, -654, -341, 268, 66]
3747F6L2L57p14L56R45j112k03R60j44j007Q19j68k69P60n20o04P28K37j034M09
3767a06L05n77%j9n11O82P08j545K04J452n74j004R21p9j93O01k71l63J064j78
3787E17j364R82P73q47M14J61p32O15L06j143L56Q45j176m83J229m82l59L64l52
3806c76m96J173n11r69R39M34p45m3L84l59P36j9r11M36R24o14k45P19k97l04
3826a44Q26m92n2O39m87o52J152J10j422M20O50n57k25L59n37M47l9q80Q1J269
3846D66q35k40N15k98J29O01m36o82J339l35r24R94P22j037J91M1l24R88J42j191
3866a74M01J001j186j92Q39p17m90O37k36j56R01o83j074R31N61j063J64N16o74
3885f94M31O03j172R86M54j226O7J243l84l95O84n72M6P79m07p98J061J09j217
$$ y = [66, 98, 455, -259, 97, 1042, -70, -273, 687, 543, -464, 355, 187, -82, 678, 158, -446, 282, 519, -515, -106, 199, -378, -378, -397, -908, -226, 482, -1063, -859, 593, 19, -985, -64, -143, -336, 265, -6, -369, 695, 517, -847, 135, 908, 61, 475, 636, -96, 519, 825, -318, 38, 883, -293, -776, 453, -29, -388, -24, -376, -872, 301, -210, -1179, -240, 194, -551, -594, -210, -569, 167, 148, -763, -327, 597, -17, -262, 457, 160, -144, 682, 190, 138, 777, 290, -362, 790, 900, -522, -102, 548, -9, -234, 125, -412, 35, -4, -884, -803, 466, -369, -609, -94, -392, -263, 338, -98, -780, 559, 224, -700, 294, 1016, -21, 170, 211, -113, 875, 1017, -174, 227, 1228, 42, -150, 689, -28, -518, 119, -117, -273, 628, -55, -1129, -198, 363, -700, -536, -20, -694, -263, 340, -832, 154, 608, -618, -551, 692, 308, -87, 597, 25, 71, 850, 443, -355, 706, 815, -402]
3904d02P00L08j053M49on47O01M89j187J3J099p76k13L50Ol77O12p12j55J230
3924D29j28j089M58J023r34K04P54r48M13M22o93Q1R02p67k99R62p17j01M09l56
3944B5k60N71n77q07J178P2j016L71L82m00L85k34m45P36M01q21N5Q91m43l96
3964c32P24k00k36Q97p67o02J347l00o77L53K99o83L68K53m98L74K77j186N71
3983a8L93m52p52Q36m43k63Q55p73J12O12k85j265J248N44o59J99K27q2K95J63
4003D92p67J84P82n48l60R13n11l59L72j50j0R04q86o75Q82K1p98M93o8l74L40
4024a23k57n71Q67L61j191J65O83k6k80N12Ol13Q93p81l56J417k38j247R91k2
4044D90o38O90k0p23M33M86r91K67O73p27k41R2m65M04K6o14M2P92J3q34O13M17
$$ y = [-402, 298, 606, -447, 2, -4, -551, 50, 539, -648, -635, 464, -312, -525, -175, -169, -546, 66, -646, -801, 429, 301, -788, -330, 693, -241, -37, 717, -231, 182, 604, -89, -8, 894, 127, -172, 790, 73, -28, 381, 25, -235, 336, -241, -1048, 130, 202, -814, -443, -61, -461, -76, -310, -755, -19, 382, -439, -384, 507, 64, -332, 392, 192, -44, 853, 86, -516, 831, 531, -146, 207, 506, -177, 191, 444, -54, 320, 597, -589, -18, 375, -77, -829, 7, -436, -699, 156, -617, -505, 107, -178, -1443, -195, 349, -310, -111, 116, 34, 329, 492, -275, -91, 691, 143, -217, 696, 185, -174, 198, 48, 38, 942, 56, -619, 263, 284, -514, -21, -89, -463, -123, -380, -951, -84, 277, -914, -749, -66, -92, -372, 140, 146, -167, 726, -55, -411, 1006, 768, -479, 512, 490, -148, 542, 522, -201, 232, 718, -273, -6, 667, -60, -301, -209, -674, -270, -244, -858, -816, -24, -11, -845, -232, 185]
4066A85n51J4O23o28P09j00r78P24R73j115J10M20r9m1L24o09J85P62q29o29J101
4087E51r6j102Q31k53m95M48J27j031Q60K42r45J25J056o19j19N23l62j3R72r06
4107b06n55J441n57p30Q26O18q60M50k17m82R54j8q24o3R57r88J08L13l64K11
4127A4n8m26j56J100m69j036Q95K5l29O6J00j01N74k68o49Q55N48r55j03M96Q2
4148B05J66K96p47J90Q14p12o02J174m44o98M63K48o01O34n63p81R47M21j023
4167f13J19P88p40L70j16j23k14O29o23O3R30m14n65N37K38j91K49K69p04N92
4187D81M23j267M60Q44o88m81L20R1k76N12r94J64P88q34l92P50R3n83O65m57
4207c81l62R56J34j147M14Q28p13NO75m99L65N21j042K92Q77r17k30J033l86l01
$$ y = [185, -366, -352, 271, -357, 352, 252, -726, -2, 971, -144, -34, 386, 287, 246, 570, -39, 146, 908, 79, -550, 551, 455, -647, 184, -69, -564, -116, 11, -1020, -160, 82, -863, -738, 318, -301, -420, 103, -259, -272, 700, -206, -761, 680, 123, -607, 219, 837, -23, 427, 210, -272, 682, 664, -160, -223, 734, -254, -146, 167, -197, 14, -44, -470, -626, 474, 5, -1031, -136, -111, -440, -374, -274, -375, 199, -69, -718, 137, 685, -270, -373, 123, 205, 371, 667, -80, 110, 924, 212, -390, 784, 340, -358, 105, 353, -248, 386, -177, -958, -11, 410, -613, -494, 294, -446, -76, -192, -315, -529, 100, -523, -460, 470, 56, -509, 28, 266, 75, 324, 593, -111, 481, 904, -363, 97, 941, 253, -228, 92, 183, -93, 419, -575, -411, 377, -457, -849, -99, -6, -589, 76, -381, -743, 213, 347, -800, -386, 442, -271, -266, 409, -90, 275, 796, -246, 46, 923, 6, -224, 809, 423, 122]
4227A22K55k02l14N44l88o11Q62J44j091L65N21p52K1M51k78n03J249p80k76J031
4247C70l54n46O21N5k98O60m40o57J388k42p18K54M11o19NQ22j014K91L08n59
4267b62j51J006n30p67R35n25r3O2j34m5N52k33q86Q82R45j270P0M82l97M54K66
4288C61q97K78Q51m03k04N36o5n11L24N6j23M99l22q80R58L06j255K3O91o82M23
4309c6n3o39O79Q8q84J59Q77j31m23N42k70l66O84j74l55Q41j47p83N19L55l59
4330A24j03M30p27L74O70j017L44O15o90q73J263m34j29M33o46l49J433p59o30
4349f71M50K95q00N54L8K0N9J14n69L67Q36r26l00R17j42m69O55j43l22N80r1
4370D52r96J185Q2j406Q06L70m79K74m92k43k7P62r12K22N66m64m80O77j66N0
$$ y = [122, 377, 175, -139, 405, 17, -594, 268, 412, -679, -314, 207, -545, -524, -73, -351, -854, 395, -385, -661, 370, 16, -530, 91, 146, -152, 508, 68, -589, 799, 557, -161, 93, 504, -115, -110, 712, -302, -11, 297, -262, -413, 593, 63, -704, 231, -294, -387, -325, -459, -504, 48, -185, -1071, -189, 756, -514, -444, 38, -359, 95, 361, -536, -258, 593, 190, -14, 522, 457, -54, 270, 326, 203, 702, 380, -500, 458, 764, -491, -468, 223, -459, -36, -89, -728, -49, 39, -845, -686, 191, 60, -363, 179, -91, -457, 227, 53, -302, 539, 392, -391, 128, 483, 124, 21, 451, -276, 98, 768, -249, 95, 710, 20, -853, 410, -24, -153, 280, -366, -715, 718, -41, -671, -221, 74, -726, -172, -134, -114, -55, 59, -510, -143, 693, -233, -533, 384, 242, -227, 428, 285, -37, 543, 452, -544, 641, 723, -683, 123, 493, 14, 288, -204, -447, -474, 288, -624, -402, 164, -300, -780, -103, -269, -219]
4390b19M22l92n47J106k47n56L83Q36r47K86L97n12M44M3p94P2J099q96PP26l88
4411C23n08L26k10k20O11j86q07O66J01o87K58K15k37J97L98p78L57Q29r74l10
4431f36J081j31k67L07n17j37J134n60k32M97K97j178M31O06r99M32J19o32N10
4450A25M82j159J0Q07o23j09M82j47l75P35j55n49P63m4j302J232L0o58L79L23
4470B47l80K57L98n42J19O95n75m37Q92j66j78M75r28k78Q00l97k19N05j72j079
4490i63N78N89o69M54L5r08N74O22o32k46N93K1m90P34j73m7M75m66o00J397k0
4511H58j014L62l8k06L91Q4o41N47l1r32K89P76o78k2L52l01m3L68o73l22J118
4532B44k81n38P09j74l33M57j44m18P06L17q14L72Q18o34m06O15j42l19K23l24
$$ y = [-219, 203, -189, -736, 370, 123, -433, -50, 786, -161, 125, 522, 10, 454, 497, -297, -225, 874, -22, -15, 711, 323, -185, 141, -69, -289, 322, 136, -671, -5, 96, -591, -333, -118, -355, -158, 240, -538, -181, 648, -326, -636, 445, 314, 47, 354, -163, -300, 834, 274, 42, 539, 836, -342, 89, 695, -304, 128, 247, -385, 125, 607, -552, -542, 265, -358, -467, 15, -132, -507, 228, 73, -476, 287, 243, -1059, 173, 203, -455, -76, 247, -133, 124, 522, -20, 99, 794, 219, -218, 674, 508, 330, 805, -123, -401, 399, 2, -217, 288, 116, -963, -385, 204, -465, -11, 24, -884, -310, 312, -320, -566, 27, 48, -442, 292, 119, 72, 547, 81, -519, 878, 858, -156, 206, 168, -38, 353, 437, -204, 343, 312, -620, -331, 445, -233, -255, 97, -204, -247, 121, -552, -874, 244, -37, -575, 134, -40, -373, 84, -60, -478, 228, 545, -269, 103, 921, 287, -119, 496, 354, 35, 258, -66]
4552f6J14P28l79r79M60M67o72M39L4n90M99l81l83M61O02j167L2R77j83m30N82
4573A65m93pQ99n89m78P59J2l55L87K06l74K92p6m10M76L10j163J35P90o67j12
4594b93O08n66k50N74p91L56O50l91q66N62O36o77M79J09m46M24J76p96L72J072
4614I42r58RM52m10J36N20o00j41P31m87q51P41J84r70M87M42n20N59k08n68k54
4635g64R07p25J90O71o42J99K44l77j0Q55j049l5R78p0l88K79K16o89Q39k71n46
4656a88P06J29j027K46Q89j074K94K20n38j19R93q23k66R01l51q17P79J93q97
4675g50M51L57m37O68l6q29M55M85n67k4O37l95K10J60o31M04P75r23j76K80K13
4696C27m63K42J14q89J259m63o02L95O04j027n1Q28p15N22k0l56k63O40m88N3
$$ y = [-66, 48, 776, 397, -582, -122, 345, -327, 112, 146, -444, 55, -326, -709, -248, 354, -813, -781, 196, 13, -417, 165, -328, -335, 564, -25, -503, 256, 268, -87, 300, 506, 132, 424, 348, -62, 414, 724, -439, -304, 486, -181, -293, 315, -251, -501, 73, -718, -362, 288, -103, -969, -407, 229, -448, 31, 140, -306, 118, 294, -502, -130, 942, -16, -7, 445, 35, 171, 691, 91, -50, 681, 194, -657, 84, 268, -702, -215, 227, -293, 266, 58, -510, -764, 143, -582, -392, 279, -363, -164, 80, -297, -307, 548, -501, -536, 442, 372, -16, 263, 479, -210, 629, 358, -188, 518, 647, -380, -134, 755, -319, -25, 195, -343, -462, 531, -292, -558, 343, -8, -825, -46, 147, -750, -299, 58, -379, 289, 253, -576, -121, 364, -203, -227, 410, 15, 225, 385, -246, 158, 933, 10, -166, 114, 327, -136, 106, 220, -669, 590, 127, -475, -80, 524, -503, -554, 274, -441, 81, 61, -295, -558, 82, -406, -353]
4716c53N38O5q55O25K20k55M58k98o13Q35N14j284M14N72p48NL01k30M51r3p86
4737e17Q1P82n59l18L98O0o8j70M03n42K63L73j214R48K09m51R5L69r8j17M22
4758C49m55J95N66n27m49Q87j07n61M38n3l31M05l90l16O17L3q10K23M38k81j44
4779b73L94m02J21M54n99m99J345p31k52O89n6o25N84j80j04P46q6r12N26L38
4799D78l54j52M38j99j8N22q78J2R34p30r3j9L25q18Q23m00n48P40j50p94P71
4820a10L00n70Q2M56n7o6L70p02J87O35k15o71O88K69q82N70j19KK88k72k70M47
4842C60K64j229L74M91o21K38N54r24L44O0j70l43R17j99o79N09M6l33Q06k88
4862A77o74R18Lr87P07M04l70j47J29j72N61j33n76J00N32l66n87Q30l40n68P68
$$ y = [-353, 185, 250, -605, 20, 240, -15, 443, 145, -468, 367, 881, -403, 11, 583, -165, -160, 141, -89, 362, 269, -517, -436, 346, -213, -531, -133, -73, -141, -311, 92, -450, -187, 186, -1028, -80, 129, -322, -227, 142, 44, -73, 349, -106, 89, 655, 128, -321, 566, 459, -102, 336, 283, -48, 357, -33, -349, 268, 301, -509, -286, 152, -129, -273, 121, -281, -160, 294, -305, -804, 541, -190, -442, 247, 191, -434, 150, -30, -134, 612, 526, -386, 140, 478, 124, -28, 410, 211, 193, 715, -163, -151, 783, 53, -40, -59, 266, -552, 271, -129, -677, 63, -87, -881, -110, 190, -380, -298, 158, 101, 35, 405, -297, -110, 525, 310, -361, 327, 596, -286, 284, 165, 167, 455, 183, -87, 360, 624, -605, -231, 260, -361, -123, 431, -493, -149, -89, -259, -602, 315, 116, -563, -54, -8, -341, 465, 177, -497, 421, 424, -563, 144, 548, 178, 31, 160, -12, 549, 416, -160, -60, 472, 106, -481, 349, 9, -559, 209]
4883B09j89m09P12l88o19N49J81o12M62K62n11Q0K28l28M37K67m98k52R24p7o82
4904b54J10L37n60R13Jr94J075k24p38M02N14n94p5R5n07L10L71n85j41N70J0
4925C6o05M00j38rJ29j89j9O88J5q42L80N58j66J2K57r68P80M3n99L10Q40l78
4947E35q09O80k17l23O97p33k04N74m05m95O45L68n09j13L44m29L37K83p58J83
4967c49P18m85j98N51k15j23q5K34O7N26p88l9O35n0n30J21L56m74J78K14n20
4988b56L26P4k52j44N87k86n87M81j28q24J261k82m80Q72l96l48K08L86l05R5
5008BJ81l00K06M71r31Q05L55o58l06M81j02l80L91k97j28O66n45l10J29L26k62
5029b06J53Q6n85L02J58m94K62O17q67J13L46K3q2K33j28m09J020n86l83J078
$$ y = [209, 20, -389, 323, -65, -684, -135, 46, -566, -104, 158, -353, -273, -45, -373, 64, 331, -167, -419, 505, 428, -254, -144, 193, -367, 546, 547, -447, 628, 404, -334, 68, 582, -12, -87, 8, -499, -189, 182, -403, -544, 26, 36, -569, -169, -307, -316, -187, -376, -395, 293, 308, -534, -154, 404, 238, 250, 507, -461, 319, 362, -237, 73, 913, 535, -274, 406, 189, -134, 563, -170, -374, 200, -205, -700, -55, 313, -196, -309, 35, -394, -57, 226, -532, -349, 369, -116, -314, 237, 22, -101, -186, 48, 115, 641, -147, -186, 449, 399, -131, -10, 346, -128, 50, 264, -256, 70, 144, -108, -252, 335, 49, -538, -57, -185, -1009, 252, -30, -510, 362, -34, -382, -174, 212, -93, 2, 183, -117, 89, 560, -371, 434, 789, 131, -175, 306, 204, -176, 215, -82, -210, 456, -89, -399, -270, 56, -206, -53, 33, -552, -250, -92, -586, -324, 293, -574, -461, -115, -92, -174, 59, -69, -478, 542, -44, -427, 651]
5049F51n34k61J23M92m69O21m01o62O89J77p90J35O79m67m78L78j52J07M04m83
5069b41k34N60j43l91O13n9l47J74P9p7J56Kj67J9O90p56J73J97j05M4J97j67
5091B17k53N68l09n28L60k3k12p3L35n63L88K36o85J22P95j071K23R69m31j81
5111a16K95m10p2Q88q57k1N73m3o28P23L33n29J78Op84J091o8o65J62L95o20O7
5133a02K81k53k72M83l42p4N75k12o81P71j04m57J00M26n16O80J83o69L84N1l95
5154a43J7N36k86M9j48j48j55Q39n52m19N58K25n13J74J72m38N39j59p19N54M24
$$ y = [651, 117, -144, -21, 471, 2, 623, 222, -440, 249, 426, -364, -229, 450, -17, -495, -117, -269, -162, 242, -241, -475, 85, -58, -449, 164, 105, -242, -68, 11, -66, 90, 92, -75, -56, 634, -122, 51, 248, 143, 187, 384, 217, -36, 532, 223, -305, 55, 32, -180, -253, 82, -481, -93, 143, -542, -420, 375, -696, -473, 496, 65, -116, 179, -231, -303, 585, -272, -293, 280, 237, -391, 332, 665, 136, 314, 320, -464, 627, 559, -106, 56, 451, -169, -102, 179, -74, -346, 137, -205, -279, 296, 84, -597, 174, 70, -387, -287, 139, -377, 303, 486, -183, 201, 252, -143, -126, 410, 124, 173, 25, -123, -278, 561, 9, -410, 148, 373, -140, 34, 206, -232, 307, 148, -571, -17, 407]
$$ [...]
8191B6
##END NTUPLES=NMR FID
##END=
