##TITLE=1H_EC-3186oc
 CDCl3, 48 sc, 
 2.4.2019
##JCAMPDX= 6.0         $$ Bruker NMR JCAMP-DX V2.0
##DATA TYPE= NMR FID
##DATA CLASS= NTUPLES
##ORIGIN= UXNMR, Bruker Analytische Messtechnik GmbH
##OWNER= root
$$ XWIN-NMR		Version 3.5
$$ Wed Apr  3 14:03:59 2019 Russian Standard Time (UT+4h)  she@DPX200
##.OBSERVE FREQUENCY= 200.1316
##.OBSERVE NUCLEUS= ^1H
##.DELAY= (6, 6)
##.ACQUISITION MODE= SIMULTANEOUS
##.ACQUISITION SCHEME= undefined
##.AVERAGES= 48
##.DIGITISER RES= 18
##SPECTROMETER/DATA SYSTEM= spect
##.PULSE SEQUENCE= zg30
##.SOLVENT NAME= DMSO
##.SHIFT REFERENCE= (INTERNAL, DMSO, 0, 15.7039)
##AUDIT TRAIL= $$ (NUMBER, WHEN, WHO, WHERE, WHAT)
$$ ##TITLE= Audit trail, XWIN-NMR		Version 3.5
$$ ##JCAMPDX= 5.01
$$ ##ORIGIN= Bruker BioSpin GmbH
$$ ##OWNER= she
$$ F:/spectra/data/she/nmr/H-F/1/audita.txt
$$ ##AUDIT TRAIL=  $$ (NUMBER, WHEN, WHO, WHERE, WHAT)
(   1,<2019-04-03 14:01:24.50 +0400>,<she>,<DPX200>,
      <continue with go, POWCHK disabled, PULCHK disabled
       configuration hash MD5:
       00 E9 B6 7A A2 85 ED C7 34 08 36 98 17 FE 4E 26
       data hash MD5: 16K
       1A F0 8C A9 8E 62 76 79 0A 9C 38 5A AC 82 23 D9>)
$$ ##END=
$$ 
$$ hash MD5
$$ 55 0C EC E9 F0 84 48 D6 73 6E 8F E8 1D EF E3 10
##$RELAX= 
##$RELAX= 
##$RELAX= 
##$RELAX= 
##$RELAX= 
##$RELAX= 
$$ Bruker specific parameters
$$ --------------------------
##$DU= <F:/spectra>
##$EXPNO= 1
##$NAME= <H-F>
##$PROCNO= 1
##$TYPE= <nmr>
##$USER= <she>
##$AMP= (0..31)
100 100 100 100 100 100 100 100 100 100 100 100 100 100 100 100 100 100 
100 100 100 100 100 100 100 100 100 100 100 100 100 100 
##$AQSEQ= 0
##$AQ_mod= 1
##$AUNM= <au_zg>
##$AUTOPOS= <>
##$BF1= 200.13
##$BF2= 200.13
##$BF3= 200.13
##$BF4= 200.13
##$BF5= 200.13
##$BF6= 200.13
##$BF7= 200.13
##$BF8= 200.13
##$BYTORDA= 1
##$CFDGTYP= 0
##$CFRGTYP= 5
##$CHEMSTR= <none>
##$CNST= (0..31)
1 1 145 1 1 1 1 1 1 1 1 1 1 1 1 1 1 1 1 1 1 1 1 1 1 1 1 1 1 1 1 1 
##$CPDPRG= <>
##$CPDPRG1= <>
##$CPDPRG2= <>
##$CPDPRG3= <>
##$CPDPRG4= <mlev>
##$CPDPRG5= <mlev>
##$CPDPRG6= <mlev>
##$CPDPRG7= <mlev>
##$CPDPRG8= <mlev>
##$CPDPRGB= <>
##$CPDPRGT= <>
##$D= (0..31)
0 1.2 0 0 0 0 0 0 0 0 0 0.03 0 0 0 0 0 0 0 0 0 0 0 0 0 0 0 0 0 0 0 0 
##$DATE= 1554285522
##$DBL= (0..7)
120 120 120 120 120 120 120 120 
##$DBP= (0..7)
150 150 150 150 150 150 150 150 
##$DBP07= 0
##$DBPNAM0= <>
##$DBPNAM1= <>
##$DBPNAM2= <>
##$DBPNAM3= <>
##$DBPNAM4= <>
##$DBPNAM5= <>
##$DBPNAM6= <>
##$DBPNAM7= <>
##$DBPOAL= (0..7)
0.5 0.5 0.5 0.5 0.5 0.5 0.5 0.5 
##$DBPOFFS= (0..7)
0 0 0 0 0 0 0 0 
##$DE= 6
##$DECBNUC= <off>
##$DECIM= 24
##$DECNUC= <off>
##$DECSTAT= 4
##$DIGMOD= 1
##$DIGTYP= 9
##$DL= (0..7)
0 120 120 120 120 120 120 120 
##$DP= (0..7)
150 150 150 150 150 150 150 150 
##$DP07= 0
##$DPNAME0= <>
##$DPNAME1= <>
##$DPNAME2= <>
##$DPNAME3= <>
##$DPNAME4= <>
##$DPNAME5= <>
##$DPNAME6= <>
##$DPNAME7= <>
##$DPOAL= (0..7)
0.5 0.5 0.5 0.5 0.5 0.5 0.5 0.5 
##$DPOFFS= (0..7)
0 0 0 0 0 0 0 0 
##$DQDMODE= 0
##$DR= 18
##$DS= 0
##$DSLIST= <SSSSSSSSSSSSSSS>
##$DSPFIRM= 0
$$ [...]
##$SUBNAM2= <"">
##$SUBNAM3= <"">
##$SUBNAM4= <"">
##$SUBNAM5= <"">
##$SUBNAM6= <"">
##$SUBNAM7= <"">
##$SUBNAM8= <"">
##$SUBNAM9= <"">
##$SW= 24.9336934301222
##$SWIBOX= (0..15)
0 0 2 0 0 0 0 0 0 0 0 0 0 0 0 0 
##$SW_h= 4990.01996007984
##$TD= 16384
##$TD0= 1
##$TE= 0
##$TE2= 300
##$TE3= 300
##$TEG= 300
##$TL= (0..7)
0 120 120 120 120 120 120 120 
##$TP= (0..7)
150 150 150 150 150 150 150 150 
##$TP07= 0
##$TPNAME0= <>
##$TPNAME1= <>
##$TPNAME2= <>
##$TPNAME3= <>
##$TPNAME4= <>
##$TPNAME5= <>
##$TPNAME6= <>
##$TPNAME7= <>
##$TPOAL= (0..7)
0.5 0.5 0.5 0.5 0.5 0.5 0.5 0.5 
##$TPOFFS= (0..7)
0 0 0 0 0 0 0 0 
##$TUNHIN= 0
##$TUNHOUT= 0
##$TUNXOUT= 0
##$USERA1= <user>
##$USERA2= <user>
##$USERA3= <user>
##$USERA4= <user>
##$USERA5= <user>
##$V9= 5
##$VALIST= <valist>
##$VCLIST= <CCCCCCCCCCCCCCC>
##$VD= 0
##$VDLIST= <DDDDDDDDDDDDDDD>
##$VPLIST= <PPPPPPPPPPPPPPP>
##$VTLIST= <TTTTTTTTTTTTTTT>
##$WBST= 1024
##$WBSW= 4
##$XGAIN= (0..3)
0 0 0 0 
##$XL= 0
##$YL= 0
##$YMAX_a= 296830
##$YMIN_a= -566786
##$ZGOPTNS= <>
##$ZL1= 120
##$ZL2= 120
##$ZL3= 120
##$ZL4= 120
##$ABSF1= 10
##$ABSF2= 0
##$ABSG= 5
##$ABSL= 3
##$ALPHA= 0
##$AQORDER= 0
##$ASSFAC= 0
##$ASSFACI= 0
##$ASSFACX= 0
##$ASSWID= 0
##$AUNMP= <proc_1d>
##$AZFE= 0.1
##$AZFW= 0.1
##$BCFW= 1
##$BC_mod= 2
##$BYTORDP= 1
##$COROFFS= 0
##$CY= 11.3945322036743
##$DATMOD= 1
##$DC= 2
##$DFILT= <>
##$DTYPP= 0
##$F1P= 18.9103706918063
##$F2P= -1.10871071338519
##$FCOR= 0.5
##$FTSIZE= 0
##$FT_mod= 4
##$GAMMA= 1
##$GB= 0.15
##$INTBC= 1
##$INTSCL= 1
##$ISEN= 128
##$LB= 0.24
##$LEV0= 0
##$LPBIN= 0
##$MAXI= 10000
##$MC2= 0
##$MEAN= 0
##$ME_mod= 0
##$MI= 1.114404
##$NCOEF= 0
##$NC_proc= 0
##$NLEV= 6
##$NOISF1= 3.799351
##$NOISF2= 2.8
##$NSP= 1
##$NTH_PI= 0
##$NZP= 0
##$OFFSET= 15.70392
##$PC= 1
##$PHC0= -9217.407
##$PHC1= 23.00025
##$PH_mod= 1
##$PKNL= yes
##$PPARMOD= 0
##$PSCAL= 0
##$PSIGN= 0
##$REVERSE= no
##$SF= 200.130013532006
##$SI= 16384
##$SIGF1= 3
##$SIGF2= 2
##$SINO= 400
##$SIOLD= 16384
##$SREGLST= <1H.CDCl3>
##$SSB= 0
##$STSI= 0
##$STSR= 0
##$SW_p= 3612.71676300578
##$SYMM= 0
##$S_DEV= 0
##$TDeff= 0
##$TDoff= 0
##$TI= <>
##$TILT= no
##$TM1= 0
##$TM2= 0
##$TOPLEV= 0
##$USERP1= <user>
##$USERP2= <user>
##$USERP3= <user>
##$USERP4= <user>
##$USERP5= <user>
##$WDW= 1
##$XDIM= 8192
##$YMAX_p= 0
##$YMIN_p= 0
$$ End of Bruker specific parameters
$$ ---------------------------------
##NTUPLES= NMR FID
##VAR_NAME=  TIME,          FID/REAL,        FID/IMAG
##SYMBOL=    X,             R,               I
##VAR_TYPE=  INDEPENDENT,   DEPENDENT,       DEPENDENT
##VAR_FORM=  AFFN,          ASDF,            ASDF
##VAR_DIM=   8192,          8192,            8192
##UNITS=     SECONDS,       ARBITRARY UNITS, ARBITRARY UNITS
##FACTOR=    0.0002004,     1,               1
##FIRST=     0,             0,               0
##LAST=      1.6414764,     0,               0
##MIN=       0,             -566786,         0
##MAX=       1.6414764,     296830,          0
$$ Real data points
##PAGE= N=1
##DATA TABLE= (X++(R..R)), XYDATA
$$ [...]
2481d3M99n57l11R9K94m09Q13k00l01J61k64M78L5K87j134j81J270m02m35R15
2501F14n45m50M57n82L3k25M24M93n43J74lJ53L0p00K66J79Q16L66p71k8j42l4
2523a8O23l28n29O85o81M69r2M35o03k67J9N47Jj67M50n11n63R71n78L09o36J265
2545H01j285l10K2N26Q2l23k64J110j06o64O95k05l54M67J32l68L63j06k2L52
2565E43j220O88n38Q3J81J33m04P2P81p23O49n9r80O20J350j116J43K22j16p64
2585d55K8M92m81O25j86j97l9K76l19p64J177Q1j001M22j0J34M25mL51N03j833
2606g75K12J073o27K65L83o92K03J26k39j40J085j160k26J602j237M17k96J60
2624A34o23p13J080l97n46J497m12q18M50J122j41l23p66K51M00j0l73O44o42
$$ y = [-43, 456, -101, -412, -313, -19, -428, 385, 185, -116, 45, -219, 259, 294, 581, -553, -734, 536, 134, -301, 614, 69, -381, 76, -506, -473, -698, -274, 219, -324, -150, -153, 0, 30, -670, -404, -225, 591, 957, 186, 158, 16, -18, 605, 277, -252, 433, -248, 221, 129, 564, -39, -306, -287, 260, 261, 94, 544, 33, -530, 441, -137, 172, -464, 801, -484, -794, -772, -246, -164, -487, -751, 359, 253, -411, 284, 79, -275, 192, 324, -44, 319, 213, 191, 543, -677, 11, -527, -444, -263, -130, -534, -462, 319, -404, 245, 186, -794, -174, 1176, 60, 203, 425, 309, -455, -427, 65, -416, 209, 23, -174, -213, 63, -256, -1020, 157, 238, -763, -341, -351, -217, 208, 204, 555, 1058, -775, -563, 510, -117, 148, 531, -161, 42, 168, -71, -211, 874, -286, -512, 1090, -147, 270, -26, 134, -489, -1202, -122, -519, -1065, 432, 20, -798, -348, 774, 633, 310, -456, -205, 195, 185, -188, 456, -186]
2643a86j0L50l48R78n19l20j49n56N04P25o54N9R47m37N30o03j526J149j68p84
2663a018K47J239l25p32L53m38j63J285M6m87K06M36Q9kl56m07Q3K29j28L20j92
2684B85j130K94R10m28j03j98L44k0OP97m00j37k37l6m01P17k25p59J90L94K45
2705A08M01n85P99j336j3N18L87J74l12r8K3J43J81n82Q41n05j41L66q35R93n20
2726Gk15L37j109J240j87r11L99P28k88l34M0L96l31M60m20m93M51k26M67L11
2746C22p89L12K9k48K50R49n79k07L41J68j190K00j16J66j41Q62r58J86P38q23
2766e28P21J7l23l0J07k59M81k63k80m22J156l53p75J187q23j17O05J97o0J28
2786C66j45j055Q49M26o26J47N4j007P16Q54j90n39M63j141K19J231k91n49j48
$$ y = [-186, -196, 154, -194, 784, 265, -55, -204, -760, -256, 469, -185, -126, 821, 384, 914, 311, -1215, -66, -234, -1018, -771, 468, 143, -589, -236, -674, -837, 448, 494, 7, 213, 649, 738, 736, 380, -27, 56, 285, 157, 477, 285, -845, -551, 359, -69, -172, -370, -26, -46, -40, 757, 357, 220, -17, -53, -454, 263, 38, -721, -531, -137, 108, 509, -76, 723, -613, -626, -108, 279, 453, 141, 43, 66, 209, 390, -192, 649, 144, 3, 369, -466, 527, 7, -208, 129, -980, 260, 73, -838, -439, 289, 1, -333, -293, 103, -228, 232, -188, -681, -230, -456, 11, 322, -467, -155, -126, -374, -124, 825, 246, 39, 380, 548, -642, -442, -558, -392, -533, 329, -629, -443, 295, -528, 193, 210, -113, -143, -36, -295, 186, -77, -357, -779, 377, 24, -751, 436, -387, -504, 101, 298, 238, 366, 221, -834, 15, 441, -185, -38, 16, -991, -275, 579, 389, -150, 313, -828, -609, 622, 331, -218, -366]
2805c66O1j78j54M02K57j60M82j19k00N45p44K67R5pk71N96k97l00q2N37j139
2826g75Q64J38j031N15R02q58K16O70j206N44m97N7R25k20l77k02R41l09n41M9
2846a95J16j128R11p9l10J205l18k00m65m19Q46P87k49k09n81O37p6j05k08M86
2866D46o59K9nO01q40J7R35j90J16Q2j013M38P4LO71m33K19j074N64K33n16K00
2888a02J95J24l76L14l83N99j94N73p99J27L3O30j169J69R66r71O62J8k05m26
2908b15Q73j383M97L43K27q47R23p17k69O62M62k46J35l32p58L31P65l05o85Q22
2928B83N17q29M54o64j52j34J046r21K78Q57j031k35N20j03m08J132o25Q2j12
2947d5K27j59L11l46o54Q40q8o18O85L06j296M51K70j92O52q02Q12nr22K36L10
$$ y = [-366, -305, -483, -637, -235, 22, -138, 344, 225, 25, 570, -174, 93, 188, 181, -90, 506, 209, -91, -173, 364, -775, 89, 227, -804, -289, 613, -245, -29, 641, -565, -21, -518, -461, 464, 244, -133, -335, 606, 297, -244, -195, -79, -1207, -296, -375, -685, 520, 202, 2, -463, -882, -36, 751, 502, 293, -288, 349, 273, 168, -40, 446, -213, -184, -189, 412, -428, -411, 524, 334, 450, 532, -481, -43, 31, 34, 705, 272, 491, -583, -19, 214, -302, -102, 93, 217, -159, 155, -228, 371, 177, 750, -49, 78, 111, 741, -428, -259, 707, -264, 398, 416, 211, -215, 658, -725, -228, 115, 342, -505, 418, -299, -568, 94, 556, 310, 445, 113, -645, -314, 451, 146, -539, 283, 800, -29, 425, -239, -391, -525, 521, -400, -122, 735, -296, -531, -11, -114, -522, 610, -15, 67, -45, 182, 23, 334, -12, -666, 174, 86, -532, 153, 459, -837, -386, -116, -308, 344, -458, 354, 349, -573, -337, -27]
2968b7M80j65o69J09O52l06j58M9L65J42o37l40M36J37k86k02J321n68n44j32
2988c43K21P07m77O10j004J089p98l31Q40J16j327O19l78n45J360l63L48q62L47
3007a71K83k78L47l72l93M67m15J50j77R29p38M33k49M3M31l39l96R50o70O07
3027D42p8j07l75L29j87k01P12o66L35l72M79p69J071j56r42R21o81m61O63O75
3047F32L0JM9j290J250j005O01n30J23p9K18L54o36m8k47J451j059QK69L81p06
3068b33J61J51l74L52N63n15k00P91j167M34J3jJ18L72q29J045m27K87o95P37
3088E83l94n08J70O26o91L14R6l14L41J91r9k9p01L85N09k35o43Q12k94j70P83
3109G32p0j21q15L25o2l73P83p31K39N39r25R05J28k19p10P56m02m42P65m99O1
$$ y = [-27, 453, 288, -381, -272, 380, 74, -84, -35, 330, 472, -165, -505, -69, 68, -218, -420, 901, 333, -211, -343, -122, 585, 108, 718, -286, 803, 5, -326, 514, 630, -697, -78, -456, -1001, 359, -4, 344, -518, -171, 112, -166, 181, -191, -584, -117, -532, -382, -559, 370, -368, 65, -184, -141, 290, -49, -445, 505, -165, 442, 364, 257, -118, 211, 24, -177, 535, -131, 204, -168, 311, -458, 613, 457, -485, 436, -245, -706, -43, 632, 662, 663, 712, -578, 672, -333, 268, -262, -139, -218, 0, 354, -282, -330, -577, 874, -185, -177, 92, 473, -233, -72, 79, -295, 57, 620, 105, -95, 696, -471, -37, -24, -25, 93, 465, -364, 681, 254, 541, -154, 583, 189, -319, -149, 477, -214, 100, 196, -118, 223, 414, 315, 286, -415, -30, 479, 244, -399, 413, 119, -51, 732, 662, 541, -274, 51, -11, -384, 399, -332, -93, 446, -479, 426, 554, 335, -375, 381, -21, -463, 302, -197, -136]
3130a36K89L3m59j03N01L99q2l53pM31k78o96K20L59p0l44N89n29J76l13n55Q72
3152e6K25J23m91J77m09rk52J516j261P26r19Q08j78K74k35j40J66N5N8l60O07
3173D25j008M92r86J314k39j35O50j95l65N64r8j60p68R49j61k22P69k09o80j86
3193b49J54O94M51j400R04l17L24n48P3K53p78Q78j43o95O83k67K68l24P5J14
3213A50N71r51n6N16j129Q16l24Q60p63K31L61k15J93k3j11o2M97k10J73n98m31
3234e05K95J017j274M10R11j090n88J659r53M78Q8lj823J050K86m99l4R15o67
3253c27L05J43J98J83K08r54j56j71o73J683l84K3O0M36o05L2j54M93q16N20J98
3274B42k30K73K35o13rn42M68o94M51r2L85n9L57j53P2K8n93P99j50J0j4l52N90
$$ y = [-136, 153, 186, -273, -376, 125, 524, 442, 89, 82, 513, 235, -461, -241, 118, 48, -296, 293, -236, -60, -373, -928, -56, 169, 292, -199, -22, -431, -440, -692, 824, -437, 289, -630, 178, 0, 274, 39, -101, 65, 120, 178, -182, 425, -583, -91, -1077, 237, -2, -137, 513, 318, -47, 517, 419, 259, -509, 440, 279, 57, 826, 617, -63, -249, -95, 599, 1050, -350, 554, 237, 561, 13, 86, 339, -439, 439, 296, -399, 284, 17, 285, -39, 36, 150, 721, -230, -286, 230, -899, -83, -407, 453, -310, -79, 282, 67, 260, 237, 126, 64, 561, 351, 524, -74, -505, -210, 807, -467, -57, 854, -236, -824, 835, -118, 360, 448, 445, -1378, -328, -42, -541, -575, 340, -327, -22, 121, 319, 502, 710, -244, -400, -571, -1244, 439, 55, 78, 138, 574, -31, 1, -153, 340, -476, 44, 242, 12, 285, 520, -93, -102, -644, -176, -870, -419, -511, -126, -185, 172, 19, 91, 119, -474, 325, 175, 185, 171, -181, 409]
3297D09q25R37r79Q17k35J0l26L52pJ24l96M27n7q94P07r01J398j328P79l54M05
3318F3M36j584Q47q83J657o32O11m52j92o15P28J46J24k68o52M61O94N1r2n55
3338a07M91l6r41L42M2L36K95o59l0J57M76p80k32J674n91J05n53N59o16k63Q8
3359b43L49P25n58q45N40ql14L59m00L61N79j16m61m9J05J22m35M16N09p36K05
3380A05k67L69K65n47M56K07l63r11J53J354p90q1l70J72k70L59l25j44O28J83
3400A83j21Q7J63L8m69m1Q0k50o1L92m5N27j13m95k71P52m65j7j13P46k22m1r3
3423A51m28K94n70J076l19m95L61J63j46p1L74q65J025j208Q55N45n62j694O02
3442i12J037l4k03M87j56q91J043k98l64j9L32L46m50m13M01P26r63o7N08j09
$$ y = [409, -416, 521, -458, 359, 124, 134, -192, 160, 153, 277, -119, 308, 251, -643, 64, -837, 561, -767, 12, -342, 63, 499, -1085, -238, -1121, 536, -96, 515, 63, -129, -744, -16, 130, 254, -14, -666, -205, 489, 540, 448, -107, 384, 348, -593, -251, -209, 127, 422, -237, -267, -110, 366, -414, -646, 1028, 437, 542, -11, 548, -68, -331, -243, 106, 831, 273, -572, -32, -40, -354, 5, -395, -34, 545, 429, -32, -81, 24, 146, -289, 127, 636, -100, 105, -162, 207, 472, -75, 381, 588, 225, -686, -533, 821, 31, -50, -420, -248, -518, -159, -484, -628, 0, 183, 62, 149, 312, 350, -119, -160, -80, -330, -391, 1, -44, 483, 370, -125, -396, 356, -109, -126, -239, 507, 285, 244, 151, -277, 17, -553, 523, 204, -291, 70, 233, 87, 16, 390, -475, 550, -658, 197, 742, 180, -1514, -912, 125, 91, -112, 375, 219, -672, 371, 73, -291, -310, 22, 368, -82, -495, -94, 632, -331, -398, 110, 1]
3462An97L94J10o3J77k83K22Q06l13p08O76n32n8k11N38J72m75L95l55l41K31
3483b14Qj71N32q55M61L32r2P75r00K48k74P10j77m31l92K44j72R26p24L00N77
3504G11p21J243r85M05l70o27O34m80K15J61J75k68k89K16n54N79j42M35k32k47
3524a41N35q8l0L95m33J24j239J000m6K64p06M47J96R00p46j253K50J311L97j506
3544c69J374n13q6o10j13P68j109P26M09j42p18M30p66N59j95O00l66K81m25o6
3564c31j86N44k11M0l29J90j5l3K05J70N49j92m27j08n30R69m41j27J11j36M0
3585b48j68L67j28j44O1M01L20j95q49J44O50%O6M35K4k71n38j20P01l76n44R38
3607E26l08n98l67P20M06o9o85K04j19L99J82J46r77P81N9p13J70j69J060q34
$$ y = [1, -596, -202, -92, -155, 22, -261, -39, 767, 454, -254, 422, -110, -168, -379, 159, 331, -144, 251, -104, -445, -214, -206, -377, 155, -700, -239, 93, 1, 776, -124, 124, -150, 560, 383, -48, -440, -196, -368, 558, -166, 134, 711, -10, 1233, 248, 653, 283, -344, 290, -190, 25, 186, 361, 93, -196, 20, -534, 45, -97, 338, 106, -141, 394, 306, 276, 671, 238, 362, -877, 123, 77, 341, -365, 82, 278, 1178, 432, -821, -571, 740, 1137, -369, 1005, 492, 406, -204, -317, 451, -658, 68, 477, 335, -383, 47, -719, -160, -355, 245, -121, 160, -265, -331, -517, 27, -184, -144, -473, -283, -298, -331, -126, 44, 593, 401, -26, -134, -664, 305, -136, -263, -152, -288, -248, -416, -49, -177, -321, -260, 141, 461, 266, -583, -439, 211, 211, 277, 712, 736, 465, -73, -193, 508, 132, -412, 526, 218, -380, -747, -27, 379, 310, -375, -171, -290, 109, 291, 437, -540, 241, 300, -413, -243, -412, 648, -186]
3627a86P57n3j55n26MJ87M71l30M51k72n07J48K27j70j77n11L68K69L02q66L28
3648b41j19K15k51O70n64k66R00J08p43K9N67j53o64K01Q30r56P44J03m97M02
3668C15o52M86k36N61l22n83J03j36R6l54L91L75M07n02o26J26J137q55k87P63
3688B07J74m75K95Q4N28k91j136J47M67j60k92R26J33j014Q11j004J070o97P96
3707E69k14l6k58n84J059j224L19O91k69o16K14O89l43K55m79n89O91J48k44N60
3727C39o28Q6M8L20M84o70J73K64q51L5L44k41P2K8M06l18P37j276M50N4N28J73
3749E57P8n81L72n17m78P72N3K2m0n66J62L35J95j87j189J405o35N05m38l37J519
3770A007j619L58K70L45J65m39K27m0j20j0j122J405k89j04o46R94k43Q5j7ro37
$$ y = [-186, 571, 518, 363, -163, -159, 28, 499, 169, 620, 348, -159, -11, 216, 46, -131, -642, -274, -5, 297, -569, -241, -360, -145, -396, 274, -290, -556, 344, 452, -291, -262, 305, 152, -512, -311, 519, -437, 307, 410, -87, 315, -337, 149, -87, 474, 152, -431, -328, -464, -368, -722, -331, 44, 451, -51, -677, -551, 586, -269, -556, 207, 381, -94, 201, 285, 813, 522, -614, -467, 0, -160, -452, 474, 607, -407, 404, -600, 470, -227, 569, 355, 319, 61, -523, 536, -688, -369, 322, 53, -563, -349, 340, -3, 252, -227, -816, -125, 23, -221, 339, -289, -203, -155, 165, 649, -21, 152, 416, -435, -400, -56, -297, -225, -197, 209, -109, 628, -648, -198, -144, 384, 557, 635, 54, 426, -91, -569, 203, 256, 278, 238, -328, -166, 169, 364, 177, -1012, 393, -242, 263, -175, -512, 1007, -612, -254, 16, 361, 526, 87, 314, 274, 154, 144, -978, 427, 138, 34, -612, 382, 139, 224, 207, 198, -439]
3791d39Q00k44k62l67M58J36o55M14L55K15n76O97p69M87p71O8M80j59n7l91K53
3812c27O47j382P01M42j62N64p38k06J259n49j51l83k68P0J79M29o5k23o9R1l65
3833e06M35K97k34K13j82l00J111m0r93j7k36L3l76J561o19L22r11Q01n81j88
3853d10O71k59J041j101m16L25J9M57r42O56O62j702J304P3k48j70M1m73J49N24
3873B01k55P94j397J050p54M71m1j68L98o83Q72O0o4j06r24J097l31l76L72n16
3893c00M95n14q26Q31L64J61k64P97q64j35N5L64M73o65L63m26j32m20O31l93
3913d05O52o08J22N64l89P4L91n77J00P2o3l26M78L42k67l26N3Q1L16n42k46L65
3935a39n67M80O49k47L76j280J210j83k32m27k94L49N02m56L02m38k9O29n7P9
$$ y = [-439, 361, 117, -145, -512, -54, 82, -573, -159, 196, 411, -165, 532, -237, 250, -521, -453, 27, -132, -189, -580, -327, 320, -1062, -361, 81, -81, 483, -255, -461, 798, 249, 98, -285, -553, -483, -304, 125, 60, -163, -232, -141, -506, -71, 226, -8, 205, 23, -277, 834, 794, -199, -216, -452, -419, -795, 766, 147, 469, -442, 359, -222, -410, 261, 2, 1043, -58, -474, -149, -130, 327, -615, 41, 703, -999, 305, 378, 130, -40, 1, -472, -323, 201, -54, 740, -657, 393, -361, 110, 69, -99, 299, -384, 488, 548, 484, 378, -546, 551, 220, -156, 216, -300, 195, -319, -1145, -314, 50, 211, -53, 744, -120, -255, -200, 164, 637, -28, 335, -91, -223, -643, -12, -405, 247, -361, -239, 325, -64, 10, 401, -176, -76, -4, -67, -393, 85, 427, 160, -166, -113, -32, 284, -258, -504, -139, -706, -226, 423, 176, 552, -728, 482, 299, 67, -360, -654, -305, 197, -259, 43, -395, -424, 205, 148, 227]
3955B27K03j281J144o46j48K89j137J245J34M8J05j55R87q72o5O94o70J1k4l18
3975b29J66n4j70M81R7l67k00L98K5J68Q3p99P72p83K30Q1r02Q89J89l34O10o04
3997b53L01L81k00L59p65M1N06J71p50L70n1j18r8n5K15R9p37R73J1m88M39j031
4019f80M61L19rQ0P9K23n50j07J185j262m16J15K71M66o57M7n26J256L35q97O53
4040C86K0p69l98M43J63Q56o44k81p8k97M25q4J55M6J27m54L33l67K51l39L63
4061a43j18O73r42J17J38M28m72P7k8K17K39no37N1M65R3k88N74m34q9j68L72
4083A20M47k57o49j6O58Ql61J36o7k91N71m40l08L83O62j138M07P69n25k6n2n21
4105d90M77Q9k77J70K5j31k03J112L1j183K85K46K33j34p15L16R82j225k83K78
$$ y = [227, 430, -851, 293, -353, -501, -212, -1349, -104, 30, 78, 183, 28, 1015, 143, 78, 772, 102, 113, 89, -229, -63, -117, -287, 194, 291, -76, -276, 122, 147, 315, 398, -401, 371, -412, -182, -101, -1003, -114, 75, -259, 351, -253, 48, 429, 229, 588, -177, -136, 370, 541, -209, 161, 110, -8, -106, -161, 54, 153, -584, 389, 400, -88, 351, -680, -219, 100, 91, 171, 250, 473, -77, -184, 1001, -261, -677, -562, -291, 175, -482, -435, -961, 295, 630, -267, 386, 406, -363, -761, -318, -155, 701, 57, -224, -302, -599, -174, -258, -103, -57, 70, -384, -51, -418, -167, -506, -143, -261, 412, -530, -413, -275, 153, -319, -242, -270, -53, 186, 181, -456, -405, 60, 153, -135, 439, 5, -84, -252, 120, 567, 310, -339, -355, 303, 311, -50, 86, 19, -272, 299, -141, -449, -66, 596, -542, -135, 634, 109, 83, 31, -490, -13, 76, -201, -31, -6, -137, -340, 772, 803, -380, -95, 151, 384, 250, -465, -149, 833, -392, -675, -397]
4125c97K4L09l09j08N39q42N22R0L38k87K53q27J096n08j70N60j33l26N96J93
4145F13r07l55L04L90k67O62p16J04O40J05l68J60r67M62M43l42J69K92R7n38
4165a9j40P20j410Q99n54M8K68m61Q9O16j2J78m87L15M02o61j36K77O55j70p07
4186b90J8J162o22q15R40k91n55N96P5j76J43M39l52l57O67j207O79P46K41n14
4206E27l66j72m83P45J08j026L81M29k97j71J27n78P98P15j317Q38l07L88n44
4225b05J08O53o79N05p17O8Q91l99r96N71L55q6p42L67J58K47p08P1O03n93P44
4246B16n23N61L94q50K55l59O57l60K61p26O99j66j20J30j6j6L61J36n77M35n15
4267a23N7K29M0p11K28L43K13p91L38K36Q0o4m58J93J72J05M96k44n71J129m65
$$ y = [-397, -373, -64, -373, -481, 58, -784, -262, -172, 166, -121, 132, -695, 401, -107, -277, 283, 150, -176, 420, 613, -294, -649, -345, 45, -222, 440, -276, -172, 468, 573, 205, 365, -602, -140, 303, -39, 130, 422, 519, -19, -159, 561, -849, 50, -504, -456, -188, -649, -560, 56, 44, 222, -265, 50, 452, -209, -345, -68, 587, 417, -290, -272, 890, 268, -547, 393, 102, -453, 143, 218, 42, 185, 624, 272, -85, 582, -625, 54, 800, 1041, 527, 161, -11, -494, 251, 359, -667, -286, 143, -154, -325, -198, -776, 22, 737, -580, 258, -49, 339, -205, -97, 556, -123, 382, -335, -267, 624, 225, -771, -200, 155, 69, -673, -306, -148, 99, -609, -538, 65, -528, 216, -307, 254, 648, -202, 53, -306, 351, -9, 252, -474, 225, 59, -61, 69, 53, 37, 398, 534, -43, 392, -123, -66, 163, 203, -508, -280, 63, 276, -515, -177, 59, 139, 75, -383, -190, -18, 87, 583, 339, -232, 897, 432]
4288D32J7o34n54J294P82j417k81K75J41l19L5N41M5L4l92k25o29J797r00K35
4308B77p87O39J9k99N03q73J171o55k13o39L07Q04o71J78K55K29j6l17K23M3Q86
4329A064j221K9L64m36k39N14k53l08R51j032M70J75N27q88O08m70K88k00n16
4348e73L74J248r24k08l13K64J65o02Q73j82J08o16N69o9J07m48N88k96J70M82
4368G17r23l9O17n26k75K49P62m85M50p39K30J07L45N22j402R57k85l30k37K80
4388ek2R1l27L49j2j7L24m81j58j25K02R01j513O33L2P49p44O4l63P3j79J65P93
4411D30j54K7m62J16q5k8j71L83l22n96O95J305o39o12P12Q6j136Q40k62p56m15
4432a044J032o79N28N9J86P7n97J06L77m67n99J329k03l3k14L67n8m58k9J23L18
$$ y = [432, 449, -185, -739, 555, 1337, -80, -361, -86, 55, -264, -229, 312, 357, 391, -1, -226, -855, 942, 42, 277, -510, 129, 148, -151, 352, -521, 650, -5, -218, -857, -550, 254, -417, -239, 16, 245, 229, -88, 135, 178, 1064, -157, -128, 236, -200, -439, 75, -178, -486, 465, -567, -97, 78, 605, -283, 325, -145, 143, -57, -573, -199, 1049, 125, -83, -396, -132, 33, -569, 304, 122, 230, -386, 183, 114, 221, -227, 361, 65, 235, 717, -206, -245, 372, -154, -429, -180, 582, 97, 547, -192, 38, 145, 490, 1012, -390, 567, 282, -48, -285, -5, -27, 64, -263, 86, 74, 57, 381, -100, -258, -383, -181, 720, -793, -160, -128, 621, -123, -59, -422, -349, -528, -363, 430, 276, 303, -159, -43, -128, -156, -327, 56, -266, -862, -167, 1138, 499, -113, 599, 685, -451, 389, 127, -629, -1044, -12, -691, -163, -104, 82, 159, -438, -332, 45, -422, -1021, 308, 105, 72, -142, 225, 167, -291, -320, -197, 121]
4453A21j71M0K92L10j061o1J078q17J73k21J07l36N74J8J82O61j281L77M81k11
4473B55%k43k56qP34n86q1j94l52N03N14q82Q07J51n92P24q78Q31m68P9L07Jk10
4496A56l35Q17q20O61l55k69L06N22o26j85K61K0k58J91O1k59J21j016J156m24
4516b75J38M40p30P98K01n8L72k76j26M05p94r93J054n77P57J09p02N01l38K27
4536A33j13o8j27L11m01M46M6m98K1N50L99p43j03O80J72k27J7j213J185l64l43
4557b40l40R57o89P88r46N1O12k74j248K206n28l1l56M86o82L40q8k47j78N21
4577A14n97J221p42P30o69r7l80K99P21l35N6m25N22j433J305l09k33q7L29m69
4597d79P10M4l58P2j39J250j741L20Qp2J13J87m09R89j28n49R3L49K64j66m70
$$ y = [121, -50, -10, 282, 592, -469, -530, 548, -269, -96, -317, -210, -546, 28, 46, 228, 889, -392, -15, 466, 255, 255, 12, -244, -252, 482, -104, -185, -379, -731, -228, 286, -596, 211, 362, -230, 494, -384, 447, -21, 58, 365, 366, 156, -179, 638, -182, 479, 124, -145, 161, 683, 57, -128, 133, 153, -105, 86, 147, -112, 9, -1007, 149, -275, -137, 303, -427, 371, 572, 514, 886, 610, 484, 889, 95, -898, 156, -421, 336, 445, -257, 244, -94, 133, 20, -48, -175, 136, -265, 181, 227, -271, -250, 300, 699, -44, -147, 533, 705, 478, 495, -718, 467, 103, -240, -580, 377, -312, 476, -470, -419, 193, -81, -1329, 877, 349, 318, -38, 448, -234, 106, 18, -229, -407, 114, -483, 738, -4, 726, 57, -40, -420, -121, 600, 265, 321, -104, 418, -1015, 290, -19, -252, -339, -10, -479, 231, 275, -83, -11, -150, 1100, -641, -321, -313, -385, -272, -85, -494, 495, 367, -182, -89, 260, 524, 358, -112]
4618a12O31j89K46k93k20K50j313J238r71J188j40l33J60N12n43k25K00j45M82
4637D23l97n49Q27p77J16L31K42p87J405j16n46K29j06K64m50L00k02M84q82m0
4657b31J220j721K96P05l50N28k16m86K04M02l58j07N00k25l80k15J535j478P73
4676C96k29k69j90J341o45o82j02n9L44J44J89m21N50o28R64l78p03j70j52O35
4696f5j8n29M18j15P64j40j71k30L47M1N4J78m22P6n86l3O20n91R00p65L62LM23
4719E21m22j11J95n0q6J40j33L9j76k62k88N32J30M32o70Q28j372J007m11J80
4739B3k08J33n64l73M00j9K96k37N88J81O9q05N17l02J077q76J60n61M93N24m12
4760A04O16p32l05N13l50N93m37J82r34J035r4n69M07J18K03l79p6K00R9j61M94
$$ y = [-112, 519, 330, 576, 283, 63, 313, -1000, 238, -733, 455, 315, -18, 142, 654, 111, -114, 86, -59, 423, 26, -523, 304, -473, -357, -26, 216, -571, 834, 718, 172, 401, 295, 559, 109, 409, 207, 691, -191, -231, 989, -732, -436, 269, -81, 447, 231, -255, -51, 351, -7, -114, 386, 161, -219, -434, 1101, -377, 396, 167, -102, -292, 1049, 404, -278, -380, -439, -95, 49, 238, -183, 367, -261, 703, 325, -378, -548, -700, -65, -83, -612, -194, -309, 455, 315, 144, -86, 261, 302, 356, 534, 112, 188, -398, -431, 189, -402, 498, -267, 95, 98, 521, 99, -12, 183, 133, 47, 187, 54, 93, -83, -345, -633, -101, 29, 461, -209, 619, -753, 254, -157, 23, -185, -52, -616, -989, -589, -608, -312, -549, 39, 220, 289, -516, 1, -301, 776, -100, 60, -501, -8, 516, 104, 720, -12, -317, 196, -154, 439, 2, 184, -750, 285, 191, -378, 29, 147, 350, -29, -105, 95, 194, 33, 527]
4781E27p60L82l4j60k65O54K97j029N34o26M94k85P62l19L29k79L17kr34P20j75
4802A48N9o31L01O79p05N67J80j256N38L99L70r98P37o66N36l81r3O24j252J299
4822D55p45J064q35L2R6q41M98j00k10O56m02J067m17l92p65J001k80L54j70q31
4842g65Q73j08P48p51k00J84K36k30R21r87Q46n18o86p9O15j89J85K41p52L14
4862a02p44O21k02R65j99n61J70l5R59j402P0j19P70R3l01k06O07l81p35J211
4882D79j220M31N24j98K70q2j46M58n07N04p49j8L56j17L67Jk86p3Q6L12r51O53
4904I4l42P27m22j28J007j325L16k32J91N90K73j026N95j93K0K61l37k42l5R9
4924a09M66o20L33o98J058l98M63m18m50P14N87q05m25L82k76P39n58L3l72P15
$$ y = [527, -233, 149, 115, -45, -310, 344, 641, -388, 146, -480, 14, -271, 491, 172, 501, 222, 539, 537, -397, 323, 148, 207, -424, -123, 556, -149, 418, 598, -658, -120, 279, 649, -349, 388, -278, 258, -123, -216, 408, -844, 455, -290, 774, -61, -29, 67, -774, -276, -376, -586, 70, -332, 735, 318, -74, -839, 162, -118, 236, 66, -765, 108, 0, 748, -3, -203, -19, 217, -13, 908, -79, 767, 249, -437, -516, 99, -90, 95, 336, -416, -102, -846, -225, -427, 538, 339, -222, -52, -87, 872, -530, -460, -579, 191, 284, -17, -223, 384, 3, -732, 479, -741, -310, 214, 16, 286, 204, 58, 516, 9, 513, -236, -254, 102, -15, 352, 353, 67, -6, 80, 392, -559, 94, -248, 479, 57, -71, 936, -389, -73, -305, -114, 476, 749, -277, 318, 125, 145, 406, 69, -173, -208, -109, 357, -263, 70, -628, 430, 32, 495, 77, -373, 341, 928, 123, -302, 80, -196, 543, -15, 18, -354, 361]
4944C61q0m91K21l38N78l72M6M77k93o0j44m95P76J77m64j10J66m42k46J301m90
4965G8K90j158P37k78M54J88l10K05K10l62K68q25K49J62K19M71n89K2L63m04
4985a0j5P3O6n98K53k25J34N89j63o92L12N00j28l40R88l63n84m3R16r64L24K03
5007B33j042R40o85J522p07p17M93j7l31K32M43n5l85O58m10n27M12l36p6R27
5027E72m57J09J17k10J85m04K82n50J288j351J193j157O9k47J37O46l42j29L46
5046I7n90R66p09M0K73l00R59j061O53p58K59J1k0J75J28N60m72k95K29QJ05m13
5068a55o76O38K47o19K24O61J17m89Q12o66j181Q38K67m2j7K01o48L60j72N38
5088B38j226Q53N46m18k9n72R90K8o71J69l48J00N92p83R07l87L92O3p00n3J87
$$ y = [361, 281, -210, 11, -327, 251, -121, -75, 402, 109, 49, -95, -590, 186, 363, -101, -211, -45, -487, -733, 568, 78, 368, -790, -53, -331, 123, 311, 1, 206, 416, 54, 322, -503, -254, -92, 127, 598, 9, 31, 394, -10, -25, 48, 114, -484, -231, -456, -322, 267, 104, -588, -276, 224, 96, -244, 744, 381, -203, -246, 670, -294, 30, 233, -809, 131, -554, 968, 261, -456, 37, 20, -311, -79, 364, 309, -76, 582, 172, -355, 57, -279, -355, 572, 115, 224, 341, 131, 316, -88, 194, -356, 932, -419, 774, -383, -314, -561, -424, 222, -120, -249, 97, -493, 473, -236, -196, 77, -223, 736, -325, 328, -430, -171, -160, -180, -5, 123, 683, 211, -84, 145, 153, 258, -155, -831, -193, 54, -565, -341, 320, 437, -52, 760, 94, -1087, -249, 18, -24, -41, 160, -488, -128, -300, 238, -988, -135, 411, -7, -36, -608, 382, 410, -261, -92, -440, -340, 252, -531, 376, -11, 381, 444, -256, -309, -122]
5109a22L48m20M36j28J87o39J395r11q25P09P33r14j90K13K56j0n80J95J44l11
5129d34M43N68r43K15PL24l69J05K62M06k07j6m48L45L61n22q77J33J203q11Q3
5150a72J88o23K09L63l21N68K50p52N13m6n62L25k14P68k55p4j35M13o61O65o47
5171b00M66j47n08P44r9J87l79n11M57k91N21p6k21j46o3J033j216J74Q48o42
5191f9j38K61K12m51mn19Q29M19m16k00L71k07K17j61p63P99k31J78q07J022M0
5212C82L25o93M89k77N4o76N3J001q74k27j22J360j515J245k87l83J22M9Q54n41
5232C39k83M30P6n93lk31M12l83O45L17j529O53J22N46r45N82J20j30k16M12l41
5253@P2q57N67k2P4P76n52k75K80Nl32P34m45J50L81o68O5K15J76p64P74k99M94
$$ y = [-122, 226, -194, 242, 114, 301, -338, 1057, 146, -679, 30, 763, -151, -341, -128, 128, 118, -462, -267, -123, -434, 9, 577, -366, -151, -144, 180, -189, -84, 178, 584, 377, 361, -87, 258, 619, 97, -780, -647, 556, -255, -172, 16, -607, -398, -35, -356, 212, 462, -290, 223, 177, -385, -60, -274, 494, 239, 165, 30, 443, -218, 447, -200, 266, 119, -389, 355, 256, 443, 64, -447, 10, -281, 240, 164, -57, -203, -266, 767, -449, -275, 573, -69, -207, 54, 266, -185, -189, -708, 121, 540, 124, -76, 295, 88, 305, 144, -619, 180, -51, 127, -680, 342, 382, 707, 14, 503, 226, 280, -396, -343, 658, -216, -443, -565, 795, -720, 525, 238, -145, -23, 26, 880, 339, 56, 486, 562, -31, -34, -265, 147, -236, 409, 726, -803, -150, -28, 518, -427, 155, 275, 145, -71, 341, 0, 72, -785, -218, -240, -166, 610, 58, -217, 63, 68, -264, 470, 25, 175, 556, -112, -47, 168, 344, -420, 354, 55, 549]
5276E49n18j20L2m96O72J01k42j19J73l29L82L48q86O71K93n55k67P39k13k21
5296fl86P19m11K4K25j10q71M93L53m10N57J48p23J12P76q82j03P02n10N78k66
5317Il4j40j07N49K07j74p27R1M44m9r31L96K77J52J85j65j15N51Op85K98k56
5339c18Q66q58N02o45J08L66n6p02R26k70n98O11J000k04r97P69j75k40m57K5
5359c47K14j59M67K33K36q00j83R14n40k79O77o36L77J18j09j84k96l63L82N83
5379C05j140P37R2l12Q98k84n29L30j6K34l75J43n20N07M18r1p91J046o77r1K78
5400A62l73k19Q06o43j84N72o94R69o67J76j90M89o40L33O9o58P50r4k3J561j464
5421C8l39k89M83N52M9r16N20O94q73M59l34k7K07k03j56Q5j51Q1N06p12K69M42
$$ y = [549, 31, -89, -57, -553, 119, 220, -22, -141, 32, -297, 85, 433, -453, 218, 511, -44, -311, 428, 215, -6, -392, 327, -84, -60, 165, 55, -816, -323, 30, -380, 177, 325, -398, -286, 490, -392, -495, 207, -303, 275, 9, -25, -165, -272, 277, 484, 310, -417, -326, 118, 69, -862, -466, -189, -37, 148, -17, -132, 419, 425, -360, -62, -318, 548, -310, 192, -453, -345, 21, -35, -737, 189, -81, -679, -68, 932, 728, -269, 500, 325, 85, -372, -347, -133, -292, 175, 408, 644, -156, -339, 575, 35, -244, 433, -203, 174, 292, 183, -1, -297, -660, -278, 305, -835, -98, -6, -318, 580, 296, -233, 97, 81, 315, -60, 83, -437, 70, 488, 397, -394, 652, -25, -116, 162, -211, -430, 376, -267, -451, 121, -573, 396, -271, -95, -285, 204, -436, -103, -34, -692, 58, -36, -59, 1502, 38, -301, -590, -107, 445, 494, -422, 98, 792, -81, 378, 44, 17, 224, 21, -135, -50, -201, -120, 386, -326, -57, 385]
5443C85r9n01M51p46M14p74N70K54J9L72J74o96L09Q6k6o44M22n55L50O45j156
5464g46J178K64o06m38L81j45l59J282j009M91l16P10r69P94R1m92N74j006M67
5483A46M46l41k72J56J015j650K62l6L67L45p20q2K00J36K24k86N56l75j72n75
5503f56R28r82R02l66K07L81o43O98m09R12q98p5o75J018n32J20l66J11O00j65
5523A10L23m21J19j50N67m68K46L15p28j6L47l6J78n72M79k64J12j61m61N51P31
5544H01k48q53Q37j21j098Q64j65N8m32O43n95N37O04o77q6M69L63p17K95l65
5564A14j70k6k4O7o3m85P71M99m44R8o40q7K09K17J58n28N03k52l63N32n02N60
5586A44Q6k77k63O06j23j00m28m38R9R07j81j26M09j046J115p43K80J10J11m42
$$ y = [385, 286, -215, 236, -510, -96, -870, -300, -46, -27, 345, 519, -177, 132, 218, 192, -452, -30, -585, -235, 410, -746, 432, 696, 90, -348, 33, -112, -471, 811, -198, 293, -23, 687, -282, 512, 603, 111, 685, -321, 146, 592, 251, -21, 135, 1150, -500, -238, -274, 93, 438, -282, -364, -164, -28, 196, -90, 466, 91, -81, -656, 272, -710, 192, -174, 33, 414, -229, 469, 60, 972, 74, -1, -676, 342, -190, -70, -436, -325, 275, 110, 433, 12, 131, -19, 548, 80, 326, 641, -87, -103, 244, 208, 386, -186, 293, 29, 141, -20, -481, 70, 801, 553, -300, 537, 416, -682, 182, 17, 75, -357, 286, -309, 228, 832, 155, 69, 538, 901, 184, 479, 114, -56, -82, -106, -39, -102, -587, 184, 683, 239, 337, -303, -390, -181, 36, 194, -334, 169, -83, -446, 86, -416, 144, 230, -47, -310, 296, 173, 73, -355, -793, -694, 213, 32, -94, 315, -731, 384, -359, -79, 31, 142, -300]
5606c00j82K28j33K97L43l61M22o27j75N75j84M34m34N16p38O97l6j94K67P1k52
5627B34m02N11k0J58k78p96N44o8J52l64j5M11p18P67M87j081O67l82l74M27M68
5648C28n00J032q37p14R04j62n13N2M37k88L3P11r45Q20r11P49o5n63O53j49L58
5669D30n39K70k79L78n67L0J216p7r57n20J144m51n82J242j358O83K59k94J45
5688A73K75K4o67j3P40k90J37K33q81Q79l05p58N19K3J79l56l10O93j92N2M07
5709E62k17j048j04Q82l60j24O72Jr07L61lm22M85l09N01L4n9n5p59N41M8j43
5731d23J444j520L92M5K66k63r08P28J040j223L36O2k77N27L11l8k73j049J370
5750E47o15k52Q31n71j57k46K38P23m85%m54K85M60k52O18j483J036M09l51k41
$$ y = [-300, -482, -254, -387, -90, 253, -108, 314, -313, -488, 87, -97, 337, -97, 419, -319, 378, 342, 148, 415, 486, 234, -168, 343, 323, 481, 203, -593, -49, -117, 35, -329, -344, 67, -651, 116, 603, -478, 189, -193, -567, -140, 328, -172, 860, 23, -691, 213, 51, -462, -410, 27, -261, -228, 483, -462, 358, -553, 196, 131, -432, 221, 72, 430, -109, 161, -118, 260, -307, -277, 939, 862, -95, -615, 529, 78, -504, 738, -620, 63, 322, 28, 173, 448, 472, -195, -208, 532, 242, 379, 612, -269, 610, 305, -453, 66, 89, 268, -88, -398, 295, 103, 155, 562, 345, -703, -807, 75, -285, -409, 263, 264, -643, -282, -285, -707, -222, -531, -30, 4, -55, -110, -869, -328, -280, -423, 1021, -499, -107, -62, 204, -59, -967, -239, 801, -422, -86, -24, -301, 226, 537, 499, 226, -823, 547, -68, -320, 511, -60, -217, -463, -225, 498, 13, 13, -441, -156, 304, 52, 670, -813, 223, 632, 281, 40]
5770D0M93o65K57l48K17K94n88L69k89J91P8j85J26m56L31M75pk38N5k14j27P4
5792a17L06M9r0O8q4n22K64j40M97M70j78j616J777n96q89J397n30j75M73m13
5812d9n16K33J46q48Q31M99m68J26N36m57m5j54J3j59Q28j62K17q17L17N40r12
5833c01O31p05Q08k31k27L8m64j25k14J220o74O22k06j70j44K92j94j62N50k78
5853F6o15j4J386j094k09J456p78o1N25j41r60N84o7j168J242j36j48KN97p31
5873b64j18K5P39m21K74O6m72k8q68J043J042q79k0K19j96l2p03L77j25P85o04
5894a60j16N18n21K60j96M46n73P53o88N9N62J37r50R20j69l34k23M15n61K17
5914b04N24M76o83n86m28R52R3p25P49O6n27L98O06k1r74O52o1K11j266M64j0
$$ y = [40, 533, -132, 125, -223, -6, 288, -300, 69, -220, -29, 49, -136, -10, -466, -135, 340, 333, 95, 150, -64, -191, -117, 189, 238, 148, 216, 132, -390, -126, -266, 231, 701, 523, -1093, 684, 88, -801, 596, 66, -109, 364, -49, -565, -332, -186, -1034, -203, 296, -172, -46, 490, 33, -12, -166, -153, -312, 516, 354, 571, -246, 71, 611, -301, 330, -375, 433, 202, -25, 13, -451, -576, -790, 430, -244, 378, 172, 2, -142, 150, -44, -206, 344, 66, -549, -563, 823, -271, -480, 976, 198, 137, 662, 521, -439, 145, 78, -1090, 152, 16, -132, -130, 467, -264, -382, -357, 382, -39, 235, 301, -171, -199, -1067, -24, 1018, 139, 119, 338, 142, 110, -593, -216, -341, 444, -160, -276, 242, -279, -19, -215, 231, -342, 411, -277, -218, 344, 481, -469, 451, 282, -52, -275, 140, -421, -204, 320, 796, 113, -473, -901, 51, 144, -581, 168, 234, -293, 105, 711, 690, -284, 368, 307, 518, -748, -284, -294]
5935b94N33m56n28Q25Q22j283j43O34J67l06m35M09O48k91P15p73J30n07M6L21
5955B34o72O22l13m08M21n06L85r1O85k08P4m12M8M67r21N26P86o76m51j37L70
5976a77M98o47M32p72L79M93o26N59p53K39J047j99r08M23N69n83Q65n4q77L95
5996C03N14n90J40j99nl75K16Q31k75q39K81m8p98K56L12Q19j015pJ52Q3P82r16
6018c78O15n67P7J90L09k35K04n1j58O9l15L72J86L06j01m82K21K52o56K47m00
6039b95L00r48J200k77K46n31l80L34L5P74p18N77n85O36Pl86M37o24K81R8m37
6060b56N44j271O08k56Q68m25J51O08q09R30j089O18m64M73l68m91M43j7j8N32
6080C11j60K69o88M26j41l06j21M96k76Q9p8K87l8n3n24R11J18L27j277O06J32
$$ y = [-294, 239, -217, -745, 80, 902, -381, -524, 110, 277, -29, -464, -55, 593, 302, 1017, 244, 374, -133, -87, 234, -438, 184, -129, -537, -116, -622, -237, -328, 357, 149, 223, -189, -141, 326, -595, -69, 717, 41, -410, -547, -177, 321, -326, 106, -666, -287, 206, -420, 139, -614, -375, 672, 473, -435, -12, 557, -26, 839, 785, -92, 303, 817, 227, 367, 168, 163, -212, 4, 835, 560, -279, 2, -46, -844, -588, -276, 543, -472, -479, -327, -244, 538, -378, 237, -330, -253, -63, 246, 11, 215, 164, 6, 75, -240, 132, 318, 624, 523, 41, 262, 514, -142, 105, -295, 5, -943, 257, -20, 226, -305, -685, -351, -316, 458, -260, 317, -268, 368, 375, -11, 426, -198, 83, 181, -256, 288, -983, -375, -631, 237, -188, -37, 571, -238, 692, -397, 221, -243, 230, -138, -629, -186, -203, -221, 311, 151, 420, -268, 158, 17, -289, -410, 86, -190, -101, -179, 108, 70, 17, -507, 404, 522, 849, -428, 178, 310]
6101C10n16L80j94K23j70m08L40N25l44m04O38L41k46R1p76m5P78j87n15L28j16
6122C3K18j037Q99j83j13n17N41l29M5R12o90R00j451R20N91k97j116J199j82
6141C43m02M13p05J46Q49j227R44l21L93o07j59k81R12j99N23o58J56J93k99l41
6161c27q60J065j68M68m31P72q70L9N16N95r69J89M12q65O05m34M10N82m09q64
6181e44O15r77Q55N20l40N69p00M17j78K93r7j98Nk73K11N13p91J92k64n11R58
6202B75j194Q27l48K76P37m59l3o65J139k48n53K29J05l39J008r97p3lK50M14
6222C48l65M36o25O26l47j125J645L04j214P42M05p54P7o39O37n17L66L90j87
6241B03J07o0n66J3j70O08K45Q2Q7k42m37N79K10q12l06O48n67M71j58J75L69
$$ y = [310, -206, 174, -20, 203, 33, -375, -35, 490, 146, -258, 380, 721, 475, 566, -210, -255, 523, 336, -179, 149, 33, 251, -786, 113, -70, -183, -700, -159, -488, -443, 469, -221, 679, -772, 148, 739, 442, -674, 525, 343, -59, 354, -351, -205, 644, -583, 361, 40, 433, -174, -333, -614, 298, 99, 622, -36, 120, 313, 14, -327, -1187, -122, -290, 178, -253, 519, -351, -312, 204, 799, -170, 19, 431, -434, 171, -263, 147, 729, 320, -544, 71, -906, -51, 469, 129, 698, -2, 415, 237, 530, 433, 235, 240, -33, 178, 691, -100, 92, -172, -683, 275, -919, -92, -440, -164, 573, 114, 81, -584, 555, 307, -246, -17, 88, -251, 757, -240, -313, -316, -66, 348, -17, 419, -206, 420, 73, -1052, 593, 897, -317, 425, 830, 76, 153, -486, 151, -366, 0, 390, 203, 310, 250, -316, -303, -473, 135, 380, 462, 549, 307, -130, 449, 659, -153, -459, 189, -378, 93, -65, 110, 479]
6262D79q1o68K0L63r8k33K18J79j35J61L15k77l24L8O5L10p50R04J38r07k98N57
6284b4J7k08J66M1M81K98j061M99K97l97J18l38M66j78j63k44j10L46j82p8R01
6305F47j54o42M43p3K96j25m63r7O76j213M83M11j9J49j70m8j010L75K20K19N23
6326D28n64K01m83J081n89M51m70m28n01J410p86P14k29p84J135q25K83q5O49
6345F08n36q44O75j73Q6k00k33L16l1M19J63k37l32N20k91p02J104m40Q1o27Q01
6366A27r42P41N71k46k5l31m80J53K97M71p8j025J345m52k34K87o01P54q59LL36
6387a88K46L11j53J0q85N17L3O32n27M74n32O23j195Q34l00o9l53O83l93j06P32
6408C94Q16j189L62q41l51P52k77O82K06m33J85l43J12k9o6N32n44n4J3N59j7
$$ y = [479, 398, -270, -250, 113, 15, -218, 0, 179, 44, 205, 520, 243, -81, -43, 22, 332, -418, 486, 624, -283, -581, -24, -7, -215, -49, -8, 473, 771, -290, 209, 506, 109, 227, -111, 355, 177, 14, -230, -340, 6, -176, -254, 647, 493, -149, 294, 221, 517, 392, -71, -168, 508, -705, -222, 189, 170, 319, 149, 101, -909, -534, -314, -95, 428, -136, 65, -418, 663, 74, 525, 55, -373, -874, 536, -250, 464, 235, -549, 586, -239, 44, -41, 608, 72, -772, -97, -270, -184, -384, -617, -301, -332, 87, 250, 13, -319, 201, -90, -792, 312, -128, -47, -674, 127, -815, -74, 497, 251, 226, -105, -585, -432, -135, 336, 258, -767, 578, 126, -108, 179, -422, 332, -527, -524, -188, 58, 369, 216, 226, -659, -142, -109, 523, -4, 470, -62, 561, -634, 200, -100, -169, -522, 161, -232, -338, 394, 1210, 21, 383, -458, -809, -57, -334, 348, 554, 121, 306, -37, 75, 46, -20, 512, -32, -86, -73, 486, 469]
6429D69m54kj9J86j110J134n75Q5l22O27K11J40k96r96J292k83nq07J252k0k32
6450B75k76j74j75L74K29m8J44j44j44m14M10j25N77n61j70j15J00L69K21N54
6470I07j170k0P22p26N07l39m10N40J55N93j091Q56m54L80l64k73K57m2j82J075
6490I21j52p91l42k30N05P7M51J48j998P40N49k7K51p83n0J594r35L48K44l27
6510A93o53O37r7k50N98J93k92o00L19L98o40K45k40J23J27j96O41Q9r92l92L90
6531c99P17m73L92P8p39K71N10J86p27M8l18O64r82o1Q46j001Q43p1K38r07Q83
6552bj90M6R18p51QJ29L56n66k53j75K45n9Q90p26J52j51r6N70j05j36O60l1n86
6575A47M35j063JO22l64K89J44k71N52o82L39L33r66N03k62jj48O94l68K14q63
$$ y = [469, 15, 13, -6, 180, -930, 204, -371, -286, -608, 19, 230, 370, 74, -922, 370, 87, 82, -725, 527, 507, 275, -1, -175, -350, 24, 253, 205, 349, 205, 61, -353, 57, -68, 509, -52, -222, -337, -237, 132, 353, 907, -263, -283, 439, -287, 220, -119, -529, 11, 166, 759, -332, 524, 70, 450, 86, -187, 70, 28, -154, 921, 769, -22, -364, -594, -89, -12, 439, 587, -1411, -671, -122, -149, 102, -681, -731, 863, -72, 276, 520, 193, -460, 177, 80, -170, 428, 621, 329, -271, 48, 446, -194, 51, -189, -66, 61, -135, 506, 595, -397, -789, -399, 318, -155, 237, 315, -424, -153, 357, 543, -184, -136, -454, 210, -772, -833, 13, -988, -145, -216, 22, -885, -2, -192, -146, 772, 21, 29, 158, 514, -52, -305, -480, -235, -294, 596, -130, 22, -129, -225, 345, 240, 104, 764, 733, 147, 582, -481, -480, 142, -222, 67, 211, -60, 492, -190, 149, 482, -484, 19, -243, -244, -392, 302, -66, 148, -715]
6596g15m2J220q42P3K28N43j079Q35j83k6m5j84N15m72K27n1L28M18j203O9L55
6617c1l00p2J20N55m68k39L99n33J101l18j52m6l68N1P34n00J1P59p93l84j38
6638f12P48M57n17J01%jj54j4K48r30J22J048o67J39J095j413o87M60J76M20l4
6659a5J18l57m6L82l88m25K05P87j77L89o57m44Q09m53J46M56l02k88Q44k07n99
6680b22O14K90p44L05o06O33m30p33L74K02J25kJ52O3j91j4P81j115J225j1n14
6701A82k26k14K72j33K80O16l17p26k70P12O26o19m80J024q77k58j25L74J15n67
6721f11K22M93O12m38k91m41j8J212m01j204M11N13O21l61J43nn41k16k1K59N7
6742eR0O1p22O18Q25j046P32r81J029p61J8J28o86J757o43p56L77M33p15j17K96
$$ y = [-715, -757, 463, -379, -306, -78, 465, -614, 221, 38, 12, -33, -217, 298, -174, 53, 2, 330, 748, -455, -386, -31, -331, -403, -283, 272, -196, -435, -36, -569, 532, 214, 62, 16, -352, -301, 433, -67, -56, 703, -90, -474, -612, 136, 593, 76, 177, 177, 176, 22, 8, 256, -674, -552, 496, -171, -32, 1063, -350, -1037, -577, -401, 19, -15, 103, -254, -300, 82, -306, -731, -526, 261, 84, 473, -184, -628, 181, -272, -126, 330, 28, -260, 584, 377, -222, 392, 682, -62, 243, -363, 270, -160, -893, -519, -317, -192, -194, -42, 21, -170, -184, 597, -518, 707, 696, 182, -44, -258, 14, -119, 161, 777, 460, -266, -536, 176, 802, 183, -297, 727, -150, -408, -533, -159, -44, -611, -389, 104, 716, 278, -13, -454, -472, 740, 339, -865, -454, 59, 680, 319, 462, 457, -84, -300, -321, -62, -5, 85, 146, -576, 42, 867, -179, 553, -428, 601, -160, -142, -14, -700, 1057, 414, -342, 35, 468, -247, -364, -68]
6763f8P7N09j427J077q63J043n17j48N26Q3l89J13L62J99j100N73M76l10j1n9
6783A46o48L19N24l89O47k16k74K53k57m11Q66l96N0L92j94L41o95n13K48r25
6803a132J649j29n71m12R12m87J16j9o52k8L93N28k04M67j31jR7n11N56j059O84
6824F6J60q75K51O75j018M27m59Q50j24j5k84R65n00l21Q68m13n62J00m8J39k18
6845c36J35O27q14O77j94m26p1L44O42l09q74O90n27j00P26k65p78J239p15q9
6865d18O15K14l52Q5p59L85J45l67J37q3k57L94J57n30P52J11K5J5m61N18n38
6886b12M82p6k11l46M05n52J095O2o41J84o51M61o3K54l4M86q5k18l34Q8j06R7
6908H5K08L15r24j41K68L41j37p32P07k52M24j14K24k57n39J26L10k78m90R34
$$ y = [-68, 9, 518, -909, 168, -695, 348, -169, -317, 209, 292, -97, 16, 378, 577, -523, 50, 526, 216, 205, 146, -502, -183, 341, -48, 599, 383, 109, 362, 105, -306, 560, 164, 214, 606, 412, 753, 58, -455, -207, -1132, 517, 388, -183, -595, 317, -170, -54, -73, -725, -753, -360, 168, -36, 431, 300, 299, 396, -115, 441, -618, 66, 226, -649, -398, 277, -741, -314, -773, 77, -47, -62, -346, 619, 119, -202, 666, 253, -309, -209, -257, -118, -336, -201, 426, -388, 289, 95, -331, -402, -58, 584, 275, -599, 91, -436, -536, 190, -75, -853, 386, -329, -418, 197, 411, 59, 144, -615, -230, -85, -452, -315, -398, -655, -261, -104, -634, 118, 229, 254, 269, -192, 326, -212, 270, 194, -17, -363, 42, -510, 585, 647, 6, 190, -461, 0, -63, 191, 157, 643, 558, 340, 6, 94, -12, 85, 293, 608, -316, -457, -189, 152, 15, -717, -10, -262, 162, 48, 272, 15, -524, -398, -88, -366, -856, 78]
6928G8j70Q10n23l85j2N19R1p7o18N33J9p82P71J27n64J42M92n58j09K75M56L44
6950H59j030N84n80M51P12r81P0N24q58N1L33J18l69M9M99k24M19o14N16o54J72
6971D7N01o69j16M73K25k93P5j29m11J147o88n7m21l86L09L29p9k96p2P69j07
6992A51p15Q80p14L58j39J46K24p79L97J3o3L29O2j13o55J586m95n20K70m94M07
7013A36m36P57k49p7P6o70J2P10k39l03J18P18j152O01p2J49n97O87j38p80N42
7034b07l02K58N46q57J252m60l05m3j35P79j088P59j26K52n0p30k00M17J94K96
7054B50J92m36k23j56P18o02j35R34P8l18Q8j024n34R85j48N02j31j81P32j452
7074h61J265m00J15j27j36J53M84o77N68p7k82K8l92J022p48o1j81N36L33p72
$$ y = [78, -92, 718, 195, -190, -202, 317, 408, 331, -287, 246, 265, -517, 254, 381, -183, -41, 451, -107, -216, 59, 515, 859, -171, 413, -167, 284, 996, 15, 85, 609, -249, -198, 135, 253, -116, -67, 432, 208, 627, 13, 529, -125, 47, 548, -121, -237, 236, 461, 168, 243, 114, -297, 850, 162, 105, -316, -702, -393, -64, -143, -439, -511, 258, 151, -564, 316, -398, -40, -179, -33, 191, -588, -191, -178, -241, 88, 150, 37, -618, 968, 473, -47, 223, -271, 136, -300, 457, 208, 131, 207, -463, -451, 259, 20, -283, -165, 553, -599, 2, -70, 79, -518, 169, 31, -749, -207, -509, -251, 295, -562, 690, 230, -75, -118, -253, 526, -562, 197, 71, 323, 273, -457, -657, -240, -46, 250, 442, 6, -217, -373, 345, -257, -392, 542, 620, 302, 390, -634, -1168, -183, -331, 171, 40, -141, 591, -861, 404, 4, 119, -8, -144, 9, 493, -184, 384, 307, 25, 53, -339, 683, -65, -126, -307, 229, 562, -210]
7094b10L46J14r00P03L90R1m24j71K41pj38O51j158M68K35J04l47J03J89k58J60
7115A82l68K64q79J431j67p89Q9L33L42l07o26J49P7M25j39j46p00J76J302r84
7135c35P74o77Q93o35L80J87q74M66p10M3J044n58n70Q09j31L03o57K53k53J62
7155h6N97j418J307m19K24k06O9k34L44P15j051j61m26M14J38J02M8j24M90P5
7175C98n37J25K58l4m43N08q68L86J179r56K68K23J12j404L44P14j125J371n63
7194d4k01Q3n09N19j73O34k34k35o0L05k69Q19j062P25m74K39l04K89J95q31R37
7215C49q60L82L06L3j1m32l4J29r56P08%R87k97k28r40J081q8K79m79p10N00M76
7237A95M75m47M19k50p34L62o94J738n20m4l18q42P22m52J532j018r8M63p82J00
$$ y = [-210, 136, 250, -650, 53, 443, 534, 110, -61, 180, 173, 35, 686, -472, -4, 231, 335, -12, 91, 280, 22, 182, -186, 78, -801, 630, 463, -326, -237, 96, 438, 131, -495, -346, -269, 156, 17, -129, -829, -653, 649, -335, 439, -238, 655, 20, 400, 587, -287, 179, -531, -488, 556, -2, -572, 237, 106, 409, -248, 5, -248, -86, 511, -907, 400, -19, 205, -1, 68, -166, 178, 893, -158, -319, -745, -331, -193, -91, -43, -167, 323, 398, -139, -14, 244, 210, -233, 275, -593, -207, 972, 16, 284, 507, 619, -785, -441, 273, -852, 519, -44, -245, -162, -671, -152, -325, 309, 75, -160, -220, 85, -184, 635, -427, 298, -176, 63, -241, 48, 243, -588, 349, -511, -129, 177, 210, 199, -233, -267, -138, -1094, -386, -386, 601, 304, 76, -864, 217, 129, 408, -71, -781, -281, 195, 670, 223, 642, 392, -342, 20, -674, 1064, 544, 500, 182, -660, 62, -390, 1142, 124, 26, 489, -293, -193]
7257a93l15N39n59n6Q06J7m70n05L06K84K75P9J40r63J601q38Ol96k68P67n14
7278b57L44l13O06j4j169L60R64l05m49J27L38p40P17m46J78L61k70n26N30M74
7298E10r51P20K76o3q83O97m01M77o2n40K25j95K86j32N46l82J59j27p25P66r
7319A92n10L91l85L55n19Q71K07p74K1k5L76j210N92K65J07q14R17n4L22p53R65
7340E37l64o90L00K82L18m6l53k90N97j141J66O90m16P37p19M5L75J70j80K5j33
7361i0l2j24J45r7L22m71j02Q67k15O63P4q54N00r62L31m60n25L42P81Q1K61o31
7383a96M96k24m24j10O75j050J524j214J85O90l1L49q25L19N74m04l45n08N14
7402eR7K01o63j3Q46p68j43K45k1l65L93j59R61n03J72l22n09J187q30l62M83
$$ y = [-193, -508, 31, -528, -584, 222, 239, -231, -736, -430, -146, 129, 208, 348, -615, 986, 148, 154, -242, -510, 257, -257, 87, -226, 380, 366, -803, -443, 521, 216, -233, -106, 232, -508, 209, -237, -59, 302, 32, -494, 36, 510, -441, 279, 555, 492, -391, 306, -95, 382, 320, -220, 5, -190, 96, -36, 510, 128, 287, 160, -565, 201, 192, -318, 73, -312, 43, -476, 395, 602, -172, -151, -176, 200, -1010, -418, -153, -46, -860, 57, 3, 325, -428, 537, 173, -517, -217, 65, 383, 337, -16, -306, 291, -850, -684, 6, -410, 327, -392, -347, 28, 198, 18, 43, -90, -122, -246, -101, -198, 124, -347, -449, 418, 203, 866, 940, 86, 586, -376, -45, -505, -1030, -688, 93, 174, 435, -196, 300, 76, -348, -458, 217, -833, 691, -523, -338, 352, 321, 670, -155, 164, 738, 334, -11, -519, -5, 92, 293, -370, -383, 463, -305, -448, -203, -224, -589, -196, -355, 606, 103, 275, -47, -556, 631, -199, -561, -78]
7423g8j12L92j12l20O9l45Q15l43o33P87L16k77j51k42R30j107O98q43J137k18
7443C63o92K75n06N29k13J67O11q51K70L4Q90p33R2p23j4M13M2k52o22O75K25
7464b0K25j06p49N08J150j241PJ34R24j202N22Q05k83j044K89L14o73L37O8m15
7484d50k64N10q2L24L48n22j215J491L1m51O09m52k51M91o70N00l43M57p73O10
7504a02J7K74k42K71k09q00P19pM80R27j721M9J016n99J4M6K06m1m71M89k80m7
7526a1m16L49J32J81l57L25j79M84j342Q24r5o9K07l57K83j01k09L38o48J245
7546E84p46P38m4j72j97j25N28M3r89N66n8m46J29M7O07m41K12o65N36k32M10
7567B85l92P68r36L99m07L40J53p9l66j54q4P44K95q11K01n01O15n9l67N11m67
$$ y = [-78, -190, 202, 90, -230, -161, -506, 309, -34, -667, 120, 436, 159, 8, -234, 696, -411, 287, -556, 581, 363, -329, -54, -560, -31, -244, -77, 534, -317, -47, -13, 877, 144, 236, -487, -501, -88, -46, -298, -920, -245, -20, 205, 99, -650, -142, 1008, -233, -226, -92, 832, -370, 152, 957, 674, -370, -81, 233, -440, -103, -35, -450, -714, -204, -286, 38, 386, -136, -1351, 140, 171, -280, 329, -123, -374, 117, -553, -53, -396, 61, -712, -102, -85, 189, -53, 218, 9, -791, -72, -79, 401, 1328, -393, -344, 672, 73, 87, 133, 339, 298, -173, 316, 36, -11, -427, -78, 54, 235, -122, 203, 24, 508, -834, -10, -105, -174, 33, -324, -41, -142, -351, -13, -661, 584, -162, 576, 532, 360, 163, 38, 566, 609, -380, 186, 128, -318, -189, -142, 465, 24, 236, -429, 107, -125, 285, -107, 661, -275, 124, -283, 57, 210, 131, -235, -389, -473, 271, 566, -245, -44, -545, 70, 11, -356, 155, -312]
7588c12M81l42Q7J97o30j72M88K82o09j54l22P63L59P39o37O59m00m72m5q6J4
7609a12R8Q3j33l31N71j87o59N75p6N14o81J174l79o96k18l99M07M87j80N1M32
7630C41j23k16K84j046R1J177p36K02P08m63p61N67K71m96R91j229O50n96Q22
7649D38k98l6n10P14r83R17l81k9J70Q4n48M11j86M26p18Q40j30L39l69K14q00
7670d35M10J93k99L94l08K5k29o9Q57o06M47l40J08n52l14P07j99K06M6J56k36
7691c8l06M68L84m19M24K65l44l91L10j013J350p92K17L44o33L33m70J32M94j04
7711B11n37p33J316k67n63O87j43N85r70J46P29k91j61L52m00l85M96K56l68p79
7731h19O32k58M97M29l29o20N24l85M19M83n17N71r10J90k55l57P09m7N86j056
$$ y = [-312, 169, -173, -86, 111, -519, -691, -203, 79, -530, -684, -1006, -243, 116, 855, 218, 877, 477, 5, -40, -126, -112, -14, 69, -64, -395, 176, -11, -670, -95, -171, 343, -338, 836, 457, -239, -457, -856, -449, 38, -142, -91, 341, 218, 2, 286, -760, -669, 508, -228, -26, 682, 219, -542, 25, 296, -200, 791, -438, 212, -384, 438, 140, 104, -406, 308, -675, 242, -139, -168, 2, 86, -462, -51, -237, 189, -529, 311, 181, 520, 151, 365, -435, -25, 168, -131, 263, -45, -20, -249, -318, 539, -67, 380, 40, 148, -404, -718, -11, -210, -4, 42, 198, -38, -344, 124, 508, 89, 513, 778, 434, 43, 353, -660, 690, -102, 115, 459, -174, 159, -311, -179, 315, 211, -326, -1059, 257, -10, -573, 114, -29, 556, -414, -268, 461, 170, 9, 361, -39, -424, 72, 328, -40, -819, -187, -445, 52, 481, 152, -468, 56, -329, 90, 573, 56, 627, -283, -93, -348, -705, 4, -43, 543, -513]
7751e13M74N97p11J35L7L65k66j61m02J91J95M79n13j60j72M58k2R0L73o64N06
7772C16k22RJ16m7k38l36O10l02K65k59L52n09N1m51M67N67l67o5k13J111q74
7793a9K67P32l44q81m54P43k11n95O56j66J03N56p01R40o26p65M74K98j52L72
7813B27k33J63L13r73N41n56O05L53j208R45k25N7k18K39P18j080N04n75O13o20
7833d10L99L66m84j23K61M81k21p4J82k43j98n23J54O79q6j00J43m30Q03O2m9
7854E89Q7l51o22J91K43J12M17j73o31l16L10N90j70j20j59P84m85r26K63L82
7874A5J89J52J30n39J01M9p9O24k45p87P01J30j21j34p02M55l6j41j02L66N2l82
7896c04J65k16R18K49m25o9n53L06k89O74o83J28K71k82n15M70P6k62N74m84J294
$$ y = [-513, -39, 558, -153, -18, 19, 384, 118, -43, -445, -254, -59, 420, -93, -253, -425, 33, 11, 101, 474, -190, 316, 94, 103, 219, 172, -66, -402, 208, -94, 171, -88, 264, -245, -194, -645, -178, 389, 22, -43, -256, 855, -19, 248, 980, 636, -245, -699, 44, -167, -762, -106, -272, -169, 387, -314, 626, 0, -765, -291, 7, -145, 227, -6, 157, 470, -503, 38, -518, 87, 440, -768, 177, -48, 9, -209, 30, 748, -332, 172, -403, 210, -410, -11, 355, -129, -252, 9, 490, 269, 195, 377, 134, -64, -587, -433, 246, 160, 60, 203, -227, 576, 638, 589, 676, 325, -297, -106, 137, 249, 666, 493, -138, -454, -144, 446, 276, 156, -3, 781, 296, -630, -367, 15, 204, 356, 486, -53, 48, 97, 18, 642, 397, -390, 311, 441, 320, 186, -516, -61, -97, -238, -340, 26, 78, -304, -139, -355, 563, 812, 387, 318, -235, 71, -218, 456, -227, -99, 172, -110, -625, -155, -79, -341, 233, -251, 1043]
7917A043n76n83R0n24Q05k00q69J116K16Q2o56M16j91K80p51J65m02P12Q5q93
7937f35J079o01q6Q15l15j39M2k23M80o58J126j137l50J243k84k61M86m47M04
7956E39q40L9k5L7k30l70J473l53m5mo25L21n45K98K70K18J18l22O3l01J87M57
7978C60k29k37l07j11J04N55O1L04q29O63j57K22p27P44m06K37p40J65J554j511
7998b85P67k37J1L2j388J144R29r76j9l06M85l66k91N28P5l36M87J44j90K88m56
8019D0l80M65j17K13l14K04k67n26P22q3o43K69P96k81j63L06L8K14o22L88k18
8040D1j37M3J98m07P4P4j9n5j33N09r86J583j118J98L02O0n00k02O71k51J389
8061A334j737N17m17J67R8q8M53r00P09n55N56k28P89L79j157O26m85M59o27K80
$$ y = [1043, 467, -116, -26, -550, 255, 55, -814, 302, 518, 600, -56, 360, 169, 449, -302, -137, -539, 173, 258, -635, 444, -157, -243, 572, 257, 118, 160, -63, 417, -241, 885, -252, -602, 641, 357, 96, 582, 135, 539, -301, -262, -287, -250, -480, -850, 623, 270, 225, 221, -404, -83, -628, -330, -60, 158, 276, -46, 17, -284, -97, 360, 131, -106, -413, -524, -420, 135, 196, 500, -329, 334, 177, 399, -328, 416, 10, 247, -493, -328, 1226, -285, 482, 245, 256, 288, -1100, 44, 973, -3, -22, -328, 157, -209, -500, 28, 103, -233, 254, 398, 208, 496, 40, -340, 125, 8, 221, -93, 111, -156, -682, 40, -43, -686, -417, 379, 98, -65, 241, 279, 493, -129, 259, 41, -96, -53, 145, -262, -188, -114, -133, -188, -321, 188, -798, 785, -333, -135, 167, 227, -273, -475, 196, -55, 1334, -403, 114, -303, -136, -38, -126, 327, -573, 136, -419, 137, -91, 698, 1077, -80, 546, 61, 520, -107, 173]
8081A73j41j06l97L75j41R99q48j36m01L65M3J00M81j09P53r89K10m68O00n0j25
8102A88m54N56l88Q2r16J70J169l27N26o47M81M3j253O78N4j5M07J72l20L64p21
8123a51K65l91K71J99l44nO4n9L55k45K49J73K67j238Q47J51j88L92k99n15r6
8144b98L04N36l63m77K27k71L9J85o59O91m35N00j19n61L82J44J66k33L17K56
8164C31j36l34j78J50L74M8K21k53j39j97K63J29l45N98l47P4q8l33R3K31K91
8185D53k78r41O58L06J07p6
$$ y = [173, 32, -74, -471, -96, -237, 762, -86, -222, -623, -258, -215, -115, 366, 257, 1010, 21, 231, -237, 363, 313, 188, -266, 290, -98, -16, -932, -762, 407, 80, 606, -41, 440, 483, -770, -92, -38, -53, 354, 526, 206, 570, -151, 114, -277, -6, 193, -151, -156, -92, -151, 204, -41, 208, 381, 648, -590, 257, 408, 220, 612, 313, -202, -298, 6, 542, 179, -298, -71, -342, -303, -118, -777, -86, -521, -21, -140, -701, -319, -175, -9, -242, 75, 331, 195, -139, -317, -167, 207, 255, 476, 223, 84, -113, 150, 279, -66, 532, 185, 259, 171, -162, -69, 162, 453, 175, -766, -108, 198, 305, 229]
8191B29
$$ Imaginary data points
##PAGE= N=2
##DATA TABLE= (X++(I..I)), XYDATA
0@%%%%%%%%%%%%%K6p4R6r6R6r6J04j52J92j93K28k75L04l49L99m47N08n73O36
32C34p09P96q92R96j109J228j358J508j673J852k046K263k512K793l103L453l867
49b046M343m904N587o423P488q888J0808j3638J8223k6863M8539j89129m09883
62e66786M44419L54998j63057k49662L2614J15482M2777r7575p3159P4647J08697
73B3395p273m5583l5376N2246J32960o150j63658j548J13299j1031m0Q9496o1569
86G9168j21785N1027O3374n3439j1527K3729l8715j8218M0459J6078l3245o1681
98f4775q880Q6078K1668j00236j5652Q8357J5915k4204j661m3615k0589O3506
110d088P639l1586O0113L7989o9302l9162J2798j1247K3723Q2423K7153p2439
$$ y = [0, 0, 0, 0, 0, 0, 0, 0, 0, 0, 0, 0, 0, 0, 26, -48, 48, -48, 48, -48, 56, -96, 96, -97, 131, -144, 160, -189, 210, -237, 271, -302, 334, -375, 421, -471, 525, -584, 644, -714, 794, -879, 973, -1073, 1190, -1322, 1471, -1632, 1821, -2046, 2297, -2607, 2980, -3443, 4045, -4843, 5965, -7673, 10550, -16313, 32226, -156903, -566786, -122367, 232631, 69574, -180088, -147474, -31992, 10785, -86790, -159949, -85302, 23395, 16122, -29461, -64837, -12591, 120369, 114219, -49439, -50987, 62312, 51281, 51241, 140737, 79168, -42617, 8410, 71784, 18345, 6818, 30547, -8168, -26386, 14073, 30151, -3094, -64775, -73655, 12423, 34091, -66145, -81797, 6560, 22475, -1729, -3390, -47005, -67594, -4088, 3551, -28035, 32078, 70067, 765, -38397, -25599, -36846, -13123, 69300, 96453, 24014]
122B4014q0961J3162R5155K1138r0495j7902P1024M002l4620J3795j4996l6084
134c2768K7848J8586l8045P778M4083j6642m5553r503J7814K6542J2823j4620
146a657j8816r339Q138L9579J6418m3934j6013L7978l185k7391L1380K9893k8913
159A4138k2059J3021M340q152l291K634J2512Q959j4251j9374j433M905R848o03
173A194j1537Q880J8023j7059k5748J0013K1215m5n415n575l135J0835R689j2583
187a248j0306Q210Q604N20n117n37M664j140q203K861Q893j630n959N0l77N32
203a83M125j708m545R70j35l638K984O673k001o625j124L486L027K39l660K472
219C57J257j151M79k08j642K251L229l019j345L849j992m528M13J529J591J130
$$ y = [24014, -56947, -43785, 51370, 72508, -17987, -35889, 35135, 39137, 4517, 18312, 3316, -32768, -4920, 13666, -24379, -16601, 27482, 10840, -34713, -44216, -26402, 140, 12963, -1657, -20473, -29812, -21674, 17905, 34323, -9611, -25624, 12354, 9169, -18222, 13158, 43051, 14138, -7921, 5100, 9440, 1288, -2003, 631, 13143, 22102, 7851, -11523, -12956, -8051, 1797, 1194, -10343, -1463, 16560, -499, -26247, -16234, 4981, 4936, -479, -6054, -9189, 1646, 11335, -1248, -11554, -3344, 5260, 5780, 663, 126, 4790, 3650, -4553, -1692, 7201, 5571, -388, -338, -715, -183, 3942, 2234, -2311, -1341, -1476, -5114, -2130, 4543, 2542, -4083, -5207, -1721, 1306, 1545, -2115, 357, 1614, 463, 942, 734, -908, 1343, 4572, 1553, 208, 4057, 2065, -2463, -2050, -521, 1070, 2200]
235B200n3m610j618N26J925J018j013j646L344K196l712j286P51j351L879N443
251E993l976n237M234J870k320K265O57k795j084J96k96J309L412p9l703n792
267e346k019N857O637l575k549J364l975k074O565L76l841J765J157j993L985
282B334J323n929l545L184M149O93j170j175L475j164q951J90J1215L005n266
297B368k428k180K045P559l965r889L320R292l012o138K22L974K408l831n653
312e908L119N026m086k989L974K559M37k945q033P37J2503O14p512K150N247m358
328E35m044K238L354M545k518q210K915Q404j018o949m347l71O900O145o055m903
344c379M429m680n154O570N354j927l97k053n108L771N129r21j019k686j900M419
$$ y = [2200, 2147, -2463, -4081, -3555, -1630, -612, -1625, -3271, 73, 2269, -1443, -2729, -1978, -3329, 550, 5993, 2017, -3220, 1014, 2884, 564, 2829, 3486, 691, -393, -197, -493, 816, 4228, 4149, 446, -5346, -7365, -1508, 5129, 1554, -995, 369, -3606, -5680, 885, 1261, -2580, -815, 342, -1651, 2334, 3657, -2272, -5817, -2633, 1516, 2209, 1039, -136, 3339, 2175, -6776, -6586, 4629, 7634, 2368, -60, -2240, -195, 7364, 3399, -6490, -3170, 6122, 3110, -3028, -2806, 1168, 3576, -255, -5908, -2789, 2237, -1849, -4838, -864, 1695, 2132, -813, -8846, -8109, 4394, 5008, -2504, -354, 4893, 535, -3509, -1271, 2083, 6628, 4110, -4100, -1185, 7219, 6201, -748, -5095, -5466, 1434, 7579, 1524, -3379, 1050, -3630, -8784, -2214, 3140, 1213, 816, -1237, -6345, -2574, 2555, 1634, 615, -2071, -3971, 448]
360D48N399k277k405l89m927K767P694m637k420M553j778m210K418K14m725L098
376a177K761k831K729J639n363j500J275j280M658L547n530lN021n194j917L811
392F46k506k392P410J569k800K417n954r442O208J1079J003k362n308p188P452
407a68O667p579k994P391o37l743K42q39O952M194j4712j1933J5105J5151o254
422F843r883m640K222R468j368r984N951P688p972n260Q026N323J23p500j0885
437a1848N507J6972k794j1179N528L035n816m071O10M133R193l524j2927N085
451b096R022o516q831K369N678P947O30j4062l240J0684P65o668L757K620q37
466A222k65k962n47O491j667q665J878P120p36Q21N73n892j513M369n72J875L732
$$ y = [448, 5847, 3570, 1165, 776, -4151, -1384, 6310, 1673, -747, 3806, 2028, -2182, 236, 450, -4275, -1177, 1584, -1247, 1482, 3121, -2242, -3742, -2467, -3747, 911, 4458, -1072, -1075, 3946, -1248, -3165, 646, -1860, -4252, 3158, 4727, 1927, 4344, -1610, -11052, -4844, 6235, 7238, 4876, -432, -7620, -168, 6499, -1080, -4074, 3317, 2680, -1063, -821, -1660, 5292, 9486, -5226, -17159, -2054, 13097, 6843, -3040, -7680, -5458, 4010, 2642, -7342, -1391, 6297, -1675, -6935, 1091, 6414, 6537, -963, -11848, -6341, 10631, 7837, -3342, 2186, 5221, -595, -4666, -4056, 77, 9270, 5746, -7181, -2096, 6926, 410, -8421, -6052, -374, 7573, 8203, -5859, -9099, 1585, 2350, -4318, -561, 2059, 1222, 957, -2005, -2552, 3939, 2272, -6393, -4515, 2605, 1869, 2690, 3263, -2629, -4142, 227, -345, 1530, 5262]
483E262o304m890N782N421k025j402m707l535N280L336m19K560j256p372p85L355
499a699J54L403K295m419l115L707n64j955K764L15k115J828J087q81R47j866
515a14l622K921K850m01j045J65k521R96L066k892j805K627N42j075O86o4p51
532d37J832j356k070K246J469j316k49n73N4K346j137l999J067K920m35m61Q96
549G97o61j192l54P6R25J738j74j525o55P99K17Q70l62o04N49k97m04J93J172
568A108j532O7n31J069j54K00r19P61K78o54K40r2K83j4k07J49q3N90o40P29l75
589B73j43%p12R0M11L64j422J482l52j155J041j42P6M6K01J042q37l2j29n53N2
610c99K99P85m95k54n29O91r80R9R56m55M05K01n14p2M41q78L37N03j29n73N3
$$ y = [5262, -1042, -5932, -150, 5271, 3246, 1844, -2863, -6398, -1118, 2218, 1799, 4359, 3103, -4269, -5054, -1699, -1545, 1858, 4153, -266, -3381, 326, -238, -2193, 571, 886, -1229, 599, 1686, 805, 1752, -114, -3736, -815, 2035, 1634, 589, 754, -1767, -771, 2295, -597, -2402, 225, 767, -308, 378, 314, -437, 1395, 39, -2031, 215, 1684, 368, 119, -454, -400, 1946, 809, -3190, -2123, 797, 362, -99, 797, 136, -1056, -1410, -1334, -409, 1329, 1155, -370, -1025, -226, -9, 861, 499, -105, 444, 147, -257, -64, 1108, -424, -357, -888, 181, 27, 227, -692, 69, 347, -307, -67, -159, 124, 110, -97, 52, -31, 559, -81, 648, 273, 130, 130, -582, -492, -81, 283, -1139, 343, -9, -1164, -123, -265, -189, -143, 58, 1100, 263, 231, 102, -451, -399, -100, 685, 190, -64, -593, 98, -882, -783, 173, -282, 123, 324, -190, -262, 179, -699, -362, 141, 12, -561, -508]
631e08k97k96J254l8k49P99q32k39Q4J010j069J18O30l4n05j82N38p29J218q94
651b21j12N44J43j020M95n42N20J249q10j432J104K91j94M96n70L17K54p7p26
670b91l61K249k21j379RK18M5p74P5k98J975j354J22j47l07q64N62N11p61J542
690E51o87j122Q93R57K27r40j198R67R33K05l83m75Q37j012j20Q94Q95j078L28
709F72n96p81J725l32j392L68J022k82j76J70N74k033j02L38n33J940j52o88n96
728h54l67J432Q6o89P90Q45q55j038J385J81k424J471R11m00m82L15j58n57J020
747F12o38J3J04k42n09L39n09J370j093j180K87K158o41K00J16j47k21J591m99
766A111n55o49J155j413Q30J72l70p5r79L03O35P58p88n17k82j234J654N76r86
$$ y = [-508, -805, -1101, 153, 115, -134, 665, -167, -406, -322, 688, -381, -263, 367, 333, -172, -354, 184, -545, 673, -221, -333, 211, 354, -666, -171, -713, -193, 1056, 246, -1186, -82, 209, 15, 511, -59, 258, 512, 435, -291, -652, 1597, 1376, -3, 6, 224, 269, -505, -430, -728, 1247, -107, 15, -132, -439, -1303, -741, -230, -991, 551, -136, -1258, -365, 592, 819, -121, -1319, -352, 581, 786, 403, -72, 765, -247, -367, 527, 1422, 344, 672, 76, -705, 1020, 688, -704, -336, 686, 404, 228, 398, 972, -1061, -1163, -825, -1358, 582, 430, -258, -854, -1221, 211, 297, -392, 398, 1243, 388, -650, 735, 916, -1508, -37, 874, 474, -8, 307, 149, -408, 612, -26, -13, 91, -151, -660, -321, -830, 540, -553, -1733, -1446, 712, 71, 271, 387, 240, 19, 1610, 1111, 556, -93, 1062, -351, 479, 651, 281, 206, -773, -470, 165, 923, 135, -382, -664, -1898, -244, 332, -654]
785f54O06R31j365j217J773O73j111M94l59k61M43k70M5n08N12P82p15M84m00
804a17P23L14j704kJ619p07j037O38O70N52o47j251q04K093Q25j810P47p2O34
823F64n84j043N2J606j079p61J73K520r86l03o83o7M09J248j50n94P12r45o69
842d80J34Q80l1l23q30j02J112p3r62K82k19m21J240P9r75O31m8j041J95J668
862G16o93l50P68L63j81n83R5J14l86M07n69J049O35k589J188j24n53J265K39
881H11j658Q12J067q43p46k08M28k30M21l6P26m40p82o05J667R8L61l68j018K79
901b64J491j346j23pL34n36J369j11r38k65o6l52J35J135k11o11J61p06J286K84
921F59j780Q12P88j061m28K050L94j580m24P38o82N65J533j621q21J185m2R0q06
$$ y = [-654, -48, 883, -482, -1699, 74, 747, -364, 130, -229, -490, -47, -317, -272, -780, -268, 514, -201, 283, -117, 606, 920, -784, -786, 833, 126, -911, -273, 397, 949, 302, -949, -1753, 340, 1165, -645, 102, 30, 664, 80, -963, -911, 695, -384, -1145, -972, 1548, 562, 259, -424, -491, -82, 1166, 1016, 422, 1134, 189, -480, -346, 534, 503, 180, -650, -752, 360, 287, -675, -393, -612, -1033, 207, 286, -689, -58, -106, -1147, -952, 716, 23, -327, 441, 804, 623, 40, 135, 249, -137, 270, -299, 750, 1385, -1204, -16, -140, -693, 572, 811, -847, -35, 1032, 189, -557, -765, -337, -567, -146, -182, 544, 104, -678, -1283, 384, 482, 843, 475, -543, -264, 1227, -119, -242, -249, 85, -451, 918, 807, -131, -396, -462, -814, -679, 456, 245, -366, -205, -911, 375, 659, -1121, -309, 479, -582, -1010, 1040, 1434, -146, -570, 168, -514, 51, 1584, -37, -858, 327, 285, 375, -431]
940d31Q7J406q08j062M59O13p68o64N62J67j16k8J7m60K64O02q18M74Q43L37o10
961F6l46K25J84n48q90J267P06m03l54O66l1j005J327j161N13J89J10j024N72
980F3K14K96q99m77R76l26K89k03O13k92m36j07L51k89m03J007q0n14O79n29k46
1001c13l03R73m52M73m35m10M04l81N35k61N46Mm80L08p72N54m27O03L5p89L87
1022b01k56N0K83J013m60l45L06m43q0O43j34o94M75K03J02l98Q24j459j47J096
1042C78j083N56M06q16P55K22q56m39J131J62n36n33Q24M44N0o44p10P30L68n57
1062a48J467p09m69o04K36l94J158R04j335j454J768o37J30M67r21m1K50n4m83
1081h69J397l7j107l28J32N09O68o33o13J426L51j376j48N04n96O05M54J094j310
$$ y = [-431, -344, 1062, 254, -808, -349, 264, -504, -1168, -606, -439, -555, -583, -566, -1026, -762, -160, -978, -504, 339, 676, 66, -280, -55, 129, -419, -1309, -42, 664, 261, -93, 573, 542, -463, 864, -297, 216, 405, 515, -509, 63, 277, 573, -326, -803, 173, -153, 136, -67, 546, 254, -182, -289, 62, -227, -630, 377, 297, -217, 462, -67, -313, -616, 357, -95, 378, -57, -467, -63, -444, 91, -170, 376, 380, -100, 208, -564, -10, -437, 166, 201, -588, -201, -457, -407, -124, 889, 429, 84, 390, -53, -133, 510, 376, -318, 157, 360, 462, 64, 888, -571, -718, 378, -705, -149, 257, -559, 196, 418, -438, -877, 254, 416, -120, -653, 171, 615, 665, 21, -689, 41, 409, -148, 1319, 610, 141, -463, -227, -621, 537, 1441, 106, -1348, 420, -217, -87, 380, -541, -582, -332, -386, -869, 528, 491, -616, -944, -812, -303, 365, -268, -881, 545, 896, -480, -628, -124, -720, -115, 339, 1433, 123]
1100A23J058j383m93P32R85r49L1n10M04N76l66m92N93Mj263M61M41N02l53q87
1120g86oJ184r4r25K93R35l61L6P3k61J77q3l58P39n17l54O72n1p04M75K6m67
1142c57J64k51M85l87N35m81j45%M81J40J7p3l70PP06m24n13O92R3o5L15r48o37
1165a016N89M43n87O08n78K77L62l25n05Q31R46j946P83j5r52Q78L34j44l15K02
1185a30OQ16M50j029o17N71l17L26Q70j019m96J059j29q22K83J019j612J007j122
1204h86K71J879p42j508M81N67L44k16L28j093N14J7m27k68J540j99j063J471
1222A010j151O29P0n40p3J270m15p08L22M54p21m2o21J541p70j55k18l73L85l67
1242d73R5N80r92J051K38p48k42K27k60l53O15Q30m32j372J040L46J49o6q41L22
$$ y = [123, 1181, -202, -695, 37, 1022, 73, 104, -406, -2, 574, 208, -284, 309, 313, -950, -489, -48, 454, 101, -786, -792, 392, 298, -627, -334, 601, 240, 276, 349, 88, 265, 182, -176, 563, 46, -308, 364, 313, -391, 84, 110, -357, -193, -444, 41, -346, 189, -292, -437, -437, 44, 184, 201, 128, -242, -235, 471, 47, -466, 226, 319, 254, 569, -379, -1016, -427, 16, -571, 37, -541, -264, 98, -227, -732, 99, 1045, -901, -118, -133, -1085, -207, 127, -17, -332, -130, -124, 692, 1142, 113, -504, 67, -250, 76, 946, -73, -569, 490, 361, -461, -178, 841, -771, 236, -886, -615, 1264, 522, -986, -505, 62, 406, 190, 518, -575, -61, -44, -471, -739, 801, 602, -461, 1010, -141, 488, 558, 18, -55, 1215, 800, 92, 414, 868, 147, 105, -516, 1025, 255, 100, -118, -491, -106, -473, -378, 202, -790, 261, 499, -249, -491, -264, -524, -877, -262, 568, 136, -1236, -196, 150, 299, 233, -608, -286]
1262b86N42k02k36J092L2p35n05n61P73J202o51n96k32k79r8K78M36o00N47m24
1282e03K06l83N44j24q50M81L50P98K47q34o86J163J66l50M78M7n50K45N2q78
1302c81L82P93j190K45K99N4R96q40q72K54L96o10JO85p18K48L59N8p36J87k44
1323f34o46J90K019p45l53j13M88P11p68j6K28R4k70r53P56N79j76k11j062j6
1343h98J624n88l45J37N2o28M35P9l82N09L68o15r4Q24k61o99L92n3K47L48l53
1364I9n42K93J77r25j5J838q25j137N95O48j47L85m10k19J04J96J74N7K94l45
1384B95Rp41j15L48J640j012p03L35O71Mn43m65n81J243p9k29p28M81n19L41k15
1405e63N73K25L99j101j47N63j49O80J63j478l18J863l56J04l65K67m14m2J271
$$ y = [-286, 256, 54, -182, 910, 942, 207, -298, -859, -86, 1116, 465, -131, -363, -642, -740, -462, -26, -626, -79, -503, -297, -680, -136, -260, -1110, -629, -279, 519, 766, -68, -754, 409, 575, 225, 703, 750, 200, 445, 497, -381, 1, 794, -396, -151, 148, 202, 1198, 358, -514, -260, 136, -474, -473, 212, -506, -258, 101, 159, -577, -390, -634, -1280, -1090, 929, 184, -169, -282, 206, 917, 149, 133, 361, 455, 185, -768, -12, 567, 391, 180, -882, -898, 726, 138, -207, -70, -18, -646, -211, -132, -514, -5, 363, -252, -346, 478, 217, -482, -90, -143, 104, 452, 99, -443, -150, 27, -898, -913, 925, 100, -1037, -442, 206, 59, 444, 34, -185, -81, 115, 289, 346, 640, 295, 304, -437, -552, -204, 1436, 424, -279, 56, 727, 731, 188, -277, -858, 385, 306, 77, -651, -170, -689, -348, -563, 10, 235, 634, -467, -614, -51, -200, 480, 643, -835, -1153, 710, 354, 458, 93, 360, -54, -96, 1175]
1424A175j174k66N23o72N64R7j027O58J36p32L46N61q05p30J025J17p66N2P34
1443a84M68o63M00q74J382M75j401L84L2Q7j21J028k10j181J048p97j220J778
1461D31J97j400Q93J09m0J23l10q1P6J13k86k55L13L81q87O05n39j98J658r51
1481d8r85O41M52k92J23o4K71j24P22p19K71l75j59L29k43K6N87J90r29O9P0n34
1503g21Q4Q84n89J64M19q81J244p73J10j251J521Q35j070J65n03O80k49N47M65
1522A081j13j227m02J098r9l54l89J60j7K30Ko45N32j51J82m80L18P5l42j8O4
1543d95n60J376l72k24O95r8j008M89J266p07n72K39m30M14P93r70K70o04J222
1562G24p29J323j450l10M3L95N93J77j056j50j18P46j267J747l08j074j65J007
$$ y = [1175, 1, -265, 258, -414, 150, 247, -780, -122, 14, -718, -372, 189, -616, -1346, -321, -204, -970, -918, -184, 284, -379, 21, -853, 529, 1004, -397, -13, 19, 106, -15, 1013, 803, -378, 670, -127, -1347, 431, 628, -772, 121, 230, 190, 313, 3, -78, -2, 111, -175, -430, -117, 264, -623, -18, -557, -755, 903, -48, -1033, -392, 60, -232, -109, -173, 98, -26, 696, -23, 248, -127, -286, 43, -200, -174, 413, 603, -326, -257, -187, -721, -637, 247, -342, -178, 241, -640, 604, -169, -59, -1310, 211, 1046, -24, 141, -362, 318, 69, 616, 1081, 968, -259, -661, 437, 338, -16, -405, -245, -262, -32, -30, -675, -143, -294, -112, -592, -274, -199, -541, -559, -495, -1055, 321, -51, -275, 420, 322, -686, -197, 1069, 362, -210, 29, -401, 13, 806, -164, 106, -498, 724, -5, 1318, -132, -442, -399, -4, 589, 766, -290, -440, -558, 188, -1079, 668, 360, -714, -879, 128]
1580A28K45j217J364q62j97J590m2q49M1k44o8q8L28R07K86p59j119O51Q42j159
1600b22J64p20J06J133J29l83l97Q40q06q65N74O65M2q75m38J506q23L97J63k47
1620e7J44q7k26Q84o48l41L26k93O25N87N16k195J542j5m25L28n27K59l37Q39
1640H99r75%k92O07j214K91j99R80P39j137M27o76J13O65l91L27p68j55J013n54
1660c00L94R49j127R9lP7J02N30o82p94J249j73k13kM9j15R69n14P8k83r6R4o1
1683B27l55K13j15m27J74r1K43l5o0j16M80l92N60K0o09K86K17j207N58J187k40
1704E18o61J15M21j54n17J20m2j57N81j212Q34N4K00k49Q51j71m96N88p45M7J032
1725I57p85n74N65K61p11K57o73N40N42o41n03J043M2n62J000j168p8Q01o32k19
$$ y = [128, 373, -844, 520, -342, -539, 1051, 1009, 160, 201, -43, -111, -199, 129, 1036, 1322, 563, -556, 95, 937, -222, -58, -778, -672, 461, 590, 207, -190, 650, -156, -1021, -447, 218, 260, -615, -1053, 453, -370, 27, 190, -57, 87, 0, -226, 658, 10, -331, -5, -298, 327, 914, 1430, -765, 777, 762, 337, 665, 138, 397, 60, 899, -76, -76, -368, 239, -975, -684, -883, 97, 836, -301, 126, -550, -437, 228, -163, 164, -604, -759, 254, -300, 94, 1043, -84, 15, 12, 89, 191, 721, 39, -755, 494, 321, 108, 106, 155, 40, 1009, 495, 573, 290, 194, 288, 227, -128, 85, -30, -457, -283, -374, -131, -166, -226, -342, 138, -254, 306, 326, -283, 3, 220, -987, -429, 758, 518, -143, -28, 393, 239, -278, -158, -200, -357, 224, -988, -154, -100, 100, -149, 702, 531, 35, 623, -122, -75, 957, 172, -402, 163, 424, -287, -30, -703, -163, 379, -262, -765, 278, 320, -242, 758, -410, -488, 313, -319, -538]
1745e38O75O10m78m99O83k28K98l62m60RJ88L13q83R23J19r22M05K79l65J580
1765A347j156j019O95j09M65l78N13q93P06M75j366N86P55n57m39R17l17n90N12
1784A47Q5q5M88k85o58Q90n09l93L9Q85j71p01L78k07N62Q3n41k05Q16j514J049
1805A53l61n08M80j29O32o8O32n34j75L95L13o94k22O39n56J078o11o39K85J75
1825B85o4r49J360q61M63J73r11K24P2m64Q62N1k0j069J65J387o87J08J43k50
1845A8n61Q07n37M40m5k73p8O68m86P80l13m67l7R92o76j314J176j93N08n60P65
1866F14j005J101j221p08J308O58p64p36L42j57L02J88m2l88L47K16r50P57M56
1885C18o72J1K93J30K89l52r57Q19K05j30P49j51k26M77n28n89J079j07p29l85
$$ y = [-538, 137, 747, 269, -230, 453, 225, 523, 161, -299, -290, -102, 211, -672, 251, 370, -552, -147, 132, -233, 1347, 191, -828, -133, -242, 223, -155, 358, -535, 171, 646, -720, -134, 621, 64, -375, 542, 225, -365, 147, 232, 147, 635, 350, -308, 582, 73, -320, -281, 604, 433, -268, 110, -97, 465, 548, 7, -198, 618, -896, 153, -208, -716, -236, -365, 267, 199, 831, 297, 122, 517, 830, 136, -86, 553, -3, 1075, 464, -175, 110, 285, 221, -728, 632, -229, 234, 407, -504, -280, -208, -672, 190, 241, 221, -848, -683, 704, 17, 125, 268, 18, -543, 264, -273, 167, 122, -151, -229, 439, -47, 733, 420, -47, -84, 908, 232, -1082, 94, -99, 409, -151, 614, -391, 710, -511, -1219, 89, 747, -17, -753, -411, -568, -266, -78, -120, -508, -161, 55, -895, -138, 318, -354, -343, -50, 80, 369, 17, -940, -121, 84, -46, 703, 552, 326, 803, 275, -314, 765, 658, -71, -456]
1905d56P44m78j15O79o12L54j85J9m5j01N34p45L28K21J6L41m72J87J51J027j694
1926c02L93N86o61n3k89j75l78J063j188P80M74K85k09N88j043n5l26J280j531
1945g61k63J166J11l15J15j86O7N45j188R75Q9K40l05N9o85L95j78O40j119P43
1965A45l0o20RM75j03o69M06%OQ23n64N3k33K24m48O02j88r58J182L1n41J105
1987G07j297k90J051J39m92j33rQ38m13rk11M24j45K01q08O25K23R3k7j092j72
2008g97M04O39K26k90k30P44o21O01r40K56L19p61m7O56J11j64J08nj81k83j18
2029c73Q52j60r37J10Q74k16o02R35l18j49l39O35m5q76P20M24k67r55k0J868
2049A161j790J217j287Q69Q1p4j97j17j0R6j49L3K63N1l98J26k8PM41o77P70n98
$$ y = [-456, 288, -190, -305, 374, -238, 116, -69, -50, -95, -196, 338, -407, -79, 142, 158, 499, 27, 214, 365, 1392, -302, 91, 677, 16, -37, -326, -501, -879, 184, -1004, -224, 250, 535, 326, 914, -129, -184, -510, 770, -761, -1024, 142, 253, -62, 53, -133, -66, 479, -709, 266, 355, 595, 290, 349, -336, 59, -119, 521, -598, 145, 115, -505, -496, -21, -124, -793, -387, -387, -381, 442, -122, -69, -302, -78, -526, 76, -112, -1070, 112, 143, -398, 707, -590, -880, 171, 310, -182, -315, -324, 514, 101, 92, -119, 305, 160, 361, -447, 178, 401, 494, 467, -625, -797, -393, 246, 472, 182, -48, 696, 75, 676, -264, -8, 311, -450, -497, 159, 270, 106, 214, 209, 28, -255, -373, 479, 319, -618, -508, 366, 150, -452, 483, 165, 16, -323, 312, 267, -609, 111, 535, 268, -687, -707, 1161, -629, 588, -699, 170, 251, 177, -20, -137, -147, -51, -200, -167, 96, 147, -251, -125, -153, -146, 295, -382, 388, -210]
2071b10L41r7L19l24M82n13q1J79j75L42r00M61pl57J098q92L39O18q43J41Q59
2092G80n23J31k78K91m6j5n25J0K15J25O2r15J270n14k35N03r64n7O21j2j6K46
2114A54L18o72M0N90j060R66N83j312M39R69j385M03J93k91l24rJ56Q1O07o52
2134b06m93O13n0l13k98R64l06l58J203j203K87L41m94o50J275k89O23k48mJ43
2154E37j065J051q30K74K18n61n3m9M23N0m1N29o75L85k7m20j73k86P49k55L15
2175I6J08K85q48j50J30l74M58N5m53J42J05J085m08p1k5n16J11O16p88L29M87
2196C74j306M9Q3J150J63l67R7o18M03J89l47Q95j134M60O00k76m30J10P31p82
2216D4n44J085n94j17P85r98J190j624N65oN58j42j81Q8o8J27o1J47r88O77m97
$$ y = [-210, 131, 34, 353, 29, 511, -2, -83, 96, -79, 263, -637, -176, -183, -540, 558, -334, 5, 623, -220, -79, 780, 257, 388, 110, 401, 355, 340, -185, -175, 40, 165, 227, -688, 582, 68, -167, 336, -628, -685, -64, -76, -92, 154, 472, -200, -160, 430, -630, 336, 919, -393, 46, 1015, -370, 33, 226, -65, -389, -398, -242, -161, 446, -206, -699, -86, -136, -449, -747, 217, -89, -447, 756, -447, -160, 181, -313, -963, 312, 23, 646, 398, 394, 537, -528, 523, -307, -33, 185, -376, -429, -478, -55, -5, -46, 483, -192, 193, 166, -254, -427, -713, 36, -219, 96, 204, 489, -359, -509, -379, -753, -295, -240, -693, -551, -446, 639, 231, 160, 135, -381, -270, 346, -442, -113, 374, -932, -883, -800, 350, 513, 146, 243, -375, 28, 217, -130, 765, -369, 91, 691, 415, -15, 95, 826, 44, -500, 585, -9, -126, 659, -339, 851, -773, -208, -214, 344, 202, 21, 109, 41, 168, 107, 254, -734, -57, -554]
2237e54Q62j1L00r24m8J301p02K00k31J7J89n81J45M89j14l91K09j22N30o16m01
2258d53O91J36o22P12l46k68oo0R25q17k93O08l84P9R6n58O30N81p51o65P87l71
2280c49L2N36j35J66j46M01j026M77L22l25k81P68k68L03j97q6n48J10J72K60
2300A86qn20K66P48p27k58J172o94k87m49n00Q76O02l15L0q9p82M13L38j12l10
2321d20K83J81j30j48l6M28k34J49m09K48k56k22j77N43Q65p38M97j191Q01L57
2341C91L9L65j045J343j356K7j6O63j33k23K40m49j4l81L82L25q2o42Q63l06o96
2362g05J162j093N86l31j61J00p7Q20n39J275j053O91m88K21q46L40L40q80K65
2381c73j41P98p6l46n86Q17K6L84r89Q70r9r35N22k51Q04n50j41l73Q43R9Q0q00
$$ y = [-554, 308, 297, 597, -327, -375, 926, 224, 424, 193, 210, 399, -182, -37, 452, 338, -53, 156, 34, 564, -52, -453, 238, 374, -248, 464, 118, -150, -156, -216, 709, -108, -401, 207, -177, -98, -2, -560, 70, 651, -100, -765, 22, -349, -317, 219, 84, 250, 104, 505, -521, -44, 278, -47, -328, 440, 172, 475, 278, 192, -356, -246, -74, 186, 178, -342, -76, 672, -55, -313, 859, 165, -122, -571, -1071, -195, 407, 92, 122, 33, -749, -336, 2, -110, -420, -137, 44, -86, -234, -270, 158, -76, 73, -336, -88, -344, -566, -743, -200, 665, -73, 424, -767, 34, 391, 430, 795, -250, 1093, -263, -236, -252, 411, 278, 55, 295, -154, -168, -549, -167, 158, 76, -566, 297, -9, -705, 457, -636, -50, -381, -542, -442, -519, 301, -238, 1037, -16, 675, 187, 408, -438, -98, 242, -638, -373, -514, 284, 208, -138, -724, 93, 119, 503, -486, 384, 285, -650, -128, -379, 425, -125, -266, -639, 204, 303, 383, -417]
2403d17n2Q2M59j28J71l42P99q99J004o04l99K49P3p21Q13K83J98n08L80l46o3
2424C2m30J350l95l00k10j049J74J246q45n7L04P40l67n05P27n4l98K03k55O14
2444E25o62L80k16K10j010M31L42J33l48R51N3rj34j614J436p14L32o10J272j41
2464F07m4l08j108L64Q22o32K82n6R44q47L75r60O7P8J080j114L60k14P53o18
2484a69N54p44L94P17j673K42J613r28j53kO56o84j80N10k21M05J6j041n8Q30
2504H4m74L11l35N91m6J40j77K49j73k15K18P50o91j62o5n65Q38J20m18o15J147
2525E12R8j77RK45q28L23m52l10O16o78L42L68p2r3k63K90q2N83m77j77K91q52
2547g84M79O58m54o70J285n54M15j0m60L68K58l34L83n10o45N45K58k6j80R0m01
$$ y = [-417, -469, -387, 72, -56, 115, -227, 572, -327, 677, 73, -326, -77, -4, -725, 88, 371, 569, 61, 441, 95, 32, -398, 952, 557, 257, 47, -1002, -828, 418, -427, -484, -180, 560, 193, -312, 415, 361, -37, 166, -89, 525, -137, 243, 27, 237, -773, -342, 0, 133, -215, 736, 789, 780, 646, -968, 468, -246, 86, -524, 748, 607, 563, 255, -853, -489, 333, -299, -17, -73, 871, 24, 399, -561, -494, -416, 664, -450, -90, -304, 449, -169, 385, -359, 35, 752, -921, -679, 934, 6, -147, -149, 507, -177, -357, 153, -68, 337, 353, -688, -746, 84, -390, -79, -414, 177, 131, 271, 94, 343, 170, -45, 173, 923, 232, 70, 5, -560, 278, 398, -20, -635, 512, 610, 433, 442, 687, -141, 182, -270, -580, 36, -642, -300, 68, -4, -97, -360, -70, -152, 431, -46, -223, 68, -784, -305, 353, -101, -771, 514, -40, 375, 365, -95, 273, 531, 197, 580, 70, -575, -30, 228, 202, 22, 112, -289]
2568b89N53J51K90j11k99l03m74K77O30j48J09q17P8O28n65k36M88j43k60K00
2588b41J68j000Q92k32K23j46j20N54m03M03M12k29Nm65M4L20l43q5J95N53j63
2609C42m4n18K60n63L85N52o07J36N80l75j34m74m3P08k25q25J561M99j117J50
2629B48K66m30j12M90l03n2l09N02N2R65r98o63L35J67r85P96J90M70j04q81j04
2650d60J194n86j017P07l16L52O21k60q38J33N14q04J453n05p27P60J69k43j50
2669cM74o32j21J000l81j28m26kJ169k82l91j572K13J833j989J046M55k57o04
2688e98K67J37J75K72%j76l92M86r53J490p9j015J384j063j05Q41l05J66P1j79
2708D24q74J288k22j025k21P33p4m89N08r2q23N72N4L26p1l50P27o81k31L26J64
$$ y = [-289, 264, 415, 705, 594, 295, -8, -482, -205, 425, 277, 386, -431, -353, 275, -290, -526, -38, -181, -441, -241, -73, -1073, -181, -413, -190, -336, -456, 98, -305, 98, 510, 281, 286, -179, -135, 185, -158, -243, -48, 505, 342, 298, -220, 40, -523, -138, 414, -193, -57, 523, 148, 14, -460, -503, 205, -20, -845, 716, 1215, 98, 248, 514, 84, -28, 462, 159, 107, -202, 300, 352, 1317, 319, -344, -9, 158, -827, -31, 159, 629, 525, -356, -460, 734, 148, -869, -162, -478, -126, 495, 235, -603, -470, 44, -760, 693, 188, -539, 221, 390, 147, -3, 471, -161, -282, 718, 337, 209, -217, -219, 950, 668, 277, -1295, -1082, 751, -1238, -192, 263, 6, -598, -331, -194, -19, 253, 253, 77, -315, 171, -782, 708, 629, -386, 998, -65, -170, 671, 366, 532, 603, 424, -450, 838, 616, -409, -630, 103, 29, -460, 48, -44, -867, -295, -241, 85, 14, -336, 391, -290, -521, -195, -31]
2729c1L06n25K01O95q25p9Q24o60J11O42m70M5M3l28m76J170m17J22R4k50l71
2750a79j34J205n07l22r96O29k34J142m21n63P66r40Q25k24j42r38J015r55N73
2769d00L68R78j165k75L14R49m64J61q93j84M50L4r8L85l54oM88j247N74L70j95
2790b10n96M22L9L88l68M49L71J2o96n58J135p6q02O7K38j87Q83n09k2j042J423
2811C61R0p31O52j24j99k75J50O48l03p66L47m66N90K64n0n51k52R19j8j398P94
2832c18P10j025O4J047j41K59m03o14p49J681k3m08K61K77j49j310P27N07l2l60
2852Am25P65p66R39q90K93J93k79M62l09K99o59K37k61j6O5k82O14m63J19R81
2873F18p70l4J31K85n96k24J039n51J36J23k81N53m2L77n60l43j4O6k63L83K69
$$ y = [-31, 275, -250, -49, 646, -179, -258, 566, -94, 17, 659, 189, 234, 277, -51, -527, 643, 226, 348, 442, 192, -179, -313, 892, 385, 63, -933, -304, -538, 604, 183, -380, 386, -554, 271, 47, -95, -1033, -18, -973, -400, -32, 946, -219, -494, -180, 769, 305, 466, -427, -611, -161, -127, -225, 160, -194, -200, 288, -959, -385, -15, -210, -806, -384, -345, 43, -325, 124, 495, 507, -189, -747, 388, 312, -490, -423, -185, -372, 511, 2, -20, -1062, 361, 451, -280, 372, 248, 49, -226, -76, 572, 269, -497, -150, -616, -26, 238, 188, -363, -615, 304, 286, -1112, -318, 392, -633, -569, 478, 337, 596, 193, -421, -1170, 511, 488, 80, 341, 618, 469, -841, -114, 393, 361, 1, -424, 341, -425, 514, -376, -83, 110, -169, 293, -16, 283, -376, -139, -400, -416, -351, -633, -19, -482, -363, 618, -152, -186, -55, 230, -366, -590, 449, -102, 34, 157, -124, 429, 387, 764, 204, -139, -153, -87, -350, 33, 302]
2894C02r55M42K54J96k23P9r31P94k65J160q98M45j094P39l11K43k19L43M35j064
2914e28J099q61L04j00J29o72N94K52j2q29Q24j139Q43K18l99L49L97k57m17N23
2934C18m20O56j31p42k90L59j43r9M10o02j44N14P20Q0J1j053L19l26O61j033
2954i35Q41l85O94K00q77J010k25o23n1n1J93M2l73M32O51p18p42J761o28k0P
2975B03m02J8O17j89p1o54M31j73N45k50r04R27r1J47O07q58l87L83L23M45j302
2996f35N9Q49o68K77J53n24O60J81O8L61m08J80l86J97m9q95M84L41l0p95p7R64
3018C07n43q79O28qR83r11K66K07L69m07j11K68JN83j190R96j34n19P89p42j29
3039a76m12P31m01N52n60J79l50K20P28o54n5L28j15q73M30N52M87l85j27J61
$$ y = [302, -653, -211, 43, 239, 16, 95, -836, -42, -307, 853, -45, 400, -694, 45, -266, -23, -242, 101, 536, -528, 571, -290, 14, -86, 43, -629, -35, 217, 205, -624, 200, -939, -96, 122, -277, 72, 469, 212, -205, 318, -102, 554, 423, -319, -609, -250, -393, -492, -82, -684, -828, -314, 406, 486, 497, -556, -237, -563, 98, -935, -94, -479, 215, 415, -462, 548, 323, -300, -351, -402, -209, -167, -540, -108, 543, -175, -917, 844, 216, 196, 203, -199, -181, 436, 247, 176, -478, -47, -220, 325, 75, -829, 98, 7, 154, 761, -97, -484, -101, 222, 667, -635, -576, 273, -395, -118, 35, -489, 171, 352, 420, 781, 373, 553, 167, 364, 315, -580, -96, 245, 215, -580, -657, 307, -236, -1115, -487, -495, 488, -423, -157, 50, 419, 12, -99, 169, 170, 753, -437, 559, 425, -94, 695, -47, -176, -588, 143, -258, 294, -266, -87, -437, -217, 511, -143, -198, 130, 15, -858, -428, 124, 611, 226, 99, 260]
3059B60l18L58m17L99n20L67O36o79k26l1P37p11O39j14o17j73p08L84J099m72
3079a07N14o97j27o69P71L4P77m26J43p49J16N45n72J095r38Q63k65j83q9j35
3099i9rN83k52j08j64p51R43r53J139q1o66L03l73Q38m11m05Q01n60p6J2k73O17
3121E5L54n87N57q53O39o74K93n28N33M24J20q56J105j095O51M94j78l0J96l20
3141C00q48K85P69j27j22L71p57p9M22j60k34J467j742k1J42J15j32j4P49q53
3161d69M82R40j190L7J77p14M00J221j541R91Q3k68M01m87J40j48j92l51L92M04
3181C08O62j014j25J204q98l32K08j12K76M95j063L86N22r10M11M54l90n72L38
3200a52L71l93O33k5n18k04N11L9k57K1m89R77r13K54m13J114o62K75O50R2p68
$$ y = [260, -58, 300, -117, 282, -238, 129, 765, 86, -140, -171, 566, -145, 494, 380, -237, -410, -1118, -734, 365, -107, 407, -290, -417, -1086, -315, -281, 496, 70, 213, -536, -420, 125, -447, 648, -290, 573, 308, 125, 36, -99, -108, 475, 223, 115, -49, -800, 143, -810, 329, 248, -418, -115, -488, 350, -61, -466, 335, -225, -301, -289, -562, 55, 409, -178, 379, -474, 165, -509, -216, -744, -211, 213, 333, -523, 582, -513, 138, 632, 454, 424, 620, 300, -548, -263, 506, 379, 257, 628, -129, -208, 214, 54, -180, 1287, -455, -476, -334, -219, -351, -365, 384, -469, 13, 953, -237, -200, -23, -737, -337, 884, -657, 334, 417, 149, 550, 63, 203, 55, -137, -488, -96, 308, 970, -44, -169, 1035, 137, -195, 13, -99, 177, 672, -391, -5, 517, -393, 18, 472, 82, -490, -152, 219, -174, 459, 434, -84, -288, 223, 262, 5, 26, -463, 514, -399, -145, -558, 556, -106, 169, 819, 911, 143]
3221A43K40p25L86o8O53j051Q8M82K12l97l49P52l54k01M69n35N37m78J23k36
3241c09K46j90J59l44l1J36q47J493O7n78K33m43L66L5m81R31O7k6m60j24k90
3262c90J047j320Q16k37j018l03J258M92j486O60Q42K09q25m39n44J160k46K23
3280a01K97K61m70n13N72L76k40J10n12k01J132q98Q34p80J90o44J77J067K53
3299I10l39o04O37j067M75j24RL32K0n17o29O09K62J04o66N17n67O05o14L9O83
3320G5l16J13l08R42r78M17q0P20p64M00o95Q38o20j81Q18p05M14m35Q66j25q99
3341e03k13J090J55q96R89l42o64k13J050n09m51R42n91m06J102o56J110r03J5
3360A06J96j51N76m1n39m0K78l42k84N33R7p69O03k44m15O13M69p27OK41k35M48
$$ y = [143, 383, -342, 44, -24, 629, -422, -334, 148, 360, -37, -386, 366, 12, -189, 280, -255, 282, -196, -73, -309, -63, -253, -94, -438, -469, -333, -1180, 313, 380, -198, 35, -408, -42, -7, -488, 443, 510, 484, 24, -100, -390, 657, -663, 153, -84, -1102, -1405, -147, 345, -1141, -481, 361, 570, -255, -694, -1238, -78, -324, -101, 196, 457, -13, -526, 46, 422, 182, 292, -220, -421, 711, -187, 647, -133, 57, -587, -410, 657, 910, 571, -33, 604, -463, 12, -112, -103, 229, 249, -268, -897, -288, -26, 78, -588, -71, -638, -33, -647, -608, 75, -241, -128, -436, 506, -472, -55, -135, 585, -179, 221, -474, 364, -256, -437, 381, -324, 90, -345, 521, 396, -503, -716, 374, 529, -367, 622, 280, -384, -597, 453, -56, -507, 435, -156, -562, 540, -116, 994, 91, 106, 302, 151, 727, 686, 147, 107, 385, 43, -241, 292, 389, -380, 223, -21, -436, 177, 646, -81, -75, 166, -69, 379]
3382C79j73K6m46Q97j362J34N52q14Q27j25K13l83J260o24n29m57N96o4J1q82
3402i64J106l22O54q99K34L65J33l44N64l03k66L81l05L06k56m62N15N20q39j42
3422c24L45l61Q12m5o88N73L26p52J08N87n13M34j238R56M15n02m92p8Q71q37
3442d03J81pK80r8n59P74o97q3O56j186J418k13j6k63O9Q26r54J57P10m62q41
3463g11N57M40o85r9J255j201L80pM92q01P68m94m71M93j41J26l47K90j19J69
3483a06P07n35P32j083k95M89K97l14N82r51P92L17o98j0l71j92P48K78J7K8K13
3504F45q27O1pJ39O01q3n43j06j77m16O28KM44m82l66R13r54M14m6l47N3L03L10
3527A59L77j160J047k86M11p35l48R02k23L99k8K42o85l2n78P17K47j92J13o46
$$ y = [379, 206, 232, -214, 683, -679, -545, 7, -807, 20, -105, 108, -275, 985, 361, -168, -625, -29, -93, -82, -964, 142, -180, 474, -425, -191, 174, 307, -37, 527, 224, -42, 339, 34, 340, 84, -378, 137, 657, -182, -324, 21, -340, 472, 427, -261, 312, 638, -114, -6, 581, 68, 502, -736, 220, 635, 133, -359, -437, 434, -403, -222, -229, 51, -47, -606, 168, -529, -612, 44, -1142, 276, 63, 47, -216, -147, 679, -275, -118, 592, 130, -711, -154, 286, -399, -498, 757, -444, -64, -71, 421, -380, 388, -106, -577, -84, -225, -99, -446, -156, -275, -106, 601, 66, 798, -285, -580, -91, 206, -108, 474, -477, 315, 632, -66, -76, -447, -639, 109, 387, 404, 432, 645, -182, -121, -128, 11, 612, 529, -14, -120, -297, -713, -85, -83, 361, -121, -487, 426, -528, -114, -160, -507, -454, -151, 159, 536, -624, 423, 137, 548, -187, -535, 367, 144, 543, 515, 757, 72, 40, -538, 179, 426, 234, 347, -299]
3547b99N8J444j342R6K24K35O7Q3o13M48o25N94k96N3m9n15J215q79k79L42l31
3568c69L30N5J76k36N46n87O58j009P84j61k52K77K6j13j66M31o61J86P84p36
3588c7k33P24q14Q30m52j28K74L87m06l94l24J48O41j75p1J6m05M21L6M21j296
3609h37O86K14M05r57L99j02L68p50J16l6L74N52k22n82Q62l42p45N39J66k20
3629a12m50L88q22P23qK50r9J123j585j90J060k64l05M16j146P66j48l00P62R1
3649A50J92M16l19j46K58j026M66J33l03O71J85m43N2m74j6M8O39l11q98Q45p96
3670f77J106p07J66n25Q63n38ol2L78o7J05k79j34K10L48k71K56k10Q52q1j085
3691c28N22j5L47l24K29K18j154N40K41n1o89R20j273J113k71O33j427J36P92
$$ y = [-299, -241, 1203, -139, -43, 181, 416, 483, 566, -47, 401, -224, 370, 74, 127, 78, -437, 778, -101, -380, -38, -369, -39, 16, 192, -44, 502, -85, 573, -436, 348, 187, -65, 212, 238, 125, -41, 390, -271, -85, 699, -37, -270, 454, -360, 470, 18, -110, 164, 551, 145, -249, -573, -425, 216, 41, -30, -14, -419, 2, 38, 459, -837, -151, 63, 468, -489, -90, -192, 176, -574, -458, -494, -120, 432, 210, -372, 490, 148, -597, -58, 108, -112, -562, -174, -996, -273, -281, -31, -130, 993, -592, -782, 278, 14, -291, 125, -1021, -255, -403, -703, 59, 150, 342, 758, 439, 293, 551, -475, -9, 124, -179, 492, 677, 234, 286, -188, -204, -156, 483, 172, -726, 119, -677, 429, -278, -112, -637, 226, -312, -318, -350, 28, -39, 66, -213, -347, -137, 211, -60, 196, -14, 838, 757, -328, 194, 179, 526, 202, 431, 649, -505, 35, 276, 225, -464, 456, -817, 296, 25, 658, -769, -633, 159]
3710A59p11L61J65Q33m49q42l7P23r16O69K64o82Q17p05P47m58O23m61R85n08
3730E77r69p9J288r14m19J084m57l7m55J027j051M12j57K37K42j21l9l96O00r39
3750e66R32M37q20r4j29Q12j059J010k05j0l20M6k43Q46j073j55J631j219K35
3769E6M05p93J30L94j55K53P7o88L20k04M7K11J74l88L02M14n18p0P40j9l28K77
3791F37lp17K15o40M75K82K36m38j50J70r71J341m39K29l96L64Ql97R37p76l50
3812c83k21M86N2k68N49p90N42K12n7m90P47J23n56K34j10J14J45n59J57n23M00
3833a96l34O91n9j03n71J252p35J27j62M40p2k55L35q12K00L92l76N5J258j468
3853c93J268j008m07J97Q29m01k63J34J6O04q10J88LL9K00q8n3l56M11L82m01
$$ y = [159, -552, -191, -26, 807, 358, -484, -521, 202, -714, -45, 219, -463, 354, -351, 396, -62, 561, 100, 1085, 577, -392, -471, 817, -97, -516, 568, 111, 74, -381, 646, -405, 7, -150, 87, 329, 208, 169, -227, 373, -566, 366, 803, -17, -111, -240, 572, -487, 523, 318, 308, -12, 34, -209, 637, -436, -591, 1040, -179, 56, 461, -332, -202, 192, 37, 290, 367, -321, -1, -205, -158, 53, 227, -161, 141, 555, 37, -33, 707, 688, 360, 637, 634, -83, 132, -508, -33, 249, 485, 47, -103, 67, -904, 437, -2, 227, -169, 195, 203, -194, 743, -33, -383, -604, -118, -66, -334, 215, -575, -33, 179, 122, -368, 379, 502, -54, 180, 70, 184, 329, -230, -73, -596, -196, -530, 161, 102, -1, -572, 680, -55, 72, -90, 350, 278, 23, 358, -454, -254, 138, -238, -183, 1075, -393, 875, -133, -540, -343, 486, 85, -178, -44, -28, 576, -234, -46, -43, -4, 196, 108, 55, -301, 110, 492, 91]
3874I1J34o6m07j75O51q36LL79K83L10J3p15O59J5K86l82k89k56R20r19N31m42
3896b12L9R3L66J77nq73K36l0M97k0J79o1l34l69L17j79n06J431j302j96J332
3917E80n06M81L04j200m20M57Q97o59m7J235j066o41J016o03M31o98J76Q20m24
3936A33k18L58M2r75M78j63K81l87J63J06L9r9j31K51MN85P4K1J11p60l16L51
3958e2o42N60k61R35p47K98l88M81m67O15n99O89m44k03J028p33k03k40o01Q91
3978h3j85r2m0N89o41K91N62K82l37j11K65m22k34P81m82r97L90N55J49l76M93
3999C57j55l53N70m40M35j68k85l30K70j2j06j56O83l51n82M51L97M16q29j99
4019c87j28m53O03K17l3J09j98K02o30P84L01k11j45K2J33o60K26K23N55q03P43
$$ y = [91, 225, 159, -248, -423, 228, -608, -605, -226, 57, 367, 380, -335, 324, 339, 625, 243, -46, -302, 618, -301, 230, -212, -173, -80, 286, 463, 458, -415, -179, -209, 288, 268, 447, 386, 52, -317, 0, -179, -685, 746, -556, -752, 580, 74, 555, 859, -341, -761, -304, 593, -66, -113, 1122, 56, -585, 431, -172, 259, -439, -263, 557, 133, -85, 273, 315, -660, -182, -345, -64, -451, -288, -182, -143, -242, -373, -122, -118, 467, 541, 562, 673, -87, -403, -52, -694, -134, -395, 540, -207, 91, -297, 184, -283, 332, -267, 422, -22, -225, 803, 70, -133, -373, -974, -83, -268, -360, -400, 189, -452, -161, 401, 683, 346, 235, 500, 78, -156, 625, 143, -854, -464, 91, 240, -136, 357, 202, -151, 419, -21, 414, 246, -39, -369, -99, -111, -217, -373, 310, -41, -623, -172, 225, 641, -188, -387, -515, -968, -365, -148, -181, -72, -270, -68, -698, 86, 387, 176, 31, 53, 186, -474, -248, -25, 530, -273, 470]
4040D70j34M1j7o15M75N0q2l9j77J81k79J08O06N0j111J44J047q19J127p36p62
4061d72j20J202j00n68k11P5O3K23l04M70o81J421j001m96N70M04J5n62m57M88
4081d1K9P27k26j005M11n4M86O5m84K95K97m44R23j182K99k08M3R7L27m78K73
4102A50j98J94L4K41N4o01j39P03l99N02j19n09LK72K63o21Q1Q5J08o32M59n6
4124a25k49P6j68R09m84J10m00M27m06j73O10n30O08m01k97P21o84L71L34n99
4144c50J006m36N34l53n69N0m64K65M94K8q32P81p50J86J415p44l59Q9p03P50
4164C8N67l10k76k14k02O43l36k43J61J36k89R33j008R35n81QM50j5L91J12o73
4185B27k87P60o13m93J18J028o76n12M96M36n69M4r1K89m68R0J68K93j42l76P64
$$ y = [470, 336, 377, 360, -255, 220, 270, 188, 149, -28, 153, -126, -18, 588, 638, -473, -329, 718, -101, 1026, 290, -472, -592, 610, 510, -58, -269, -194, -131, 92, -212, 258, -423, 998, -3, -499, 71, 475, 490, -72, -529, -41, -12, 715, 489, -516, -105, -159, 327, 392, -92, 203, 500, 56, 979, -203, 96, -112, -69, 28, 355, -123, 150, -48, 146, 180, 421, 475, -126, -265, 438, 39, 541, 422, -87, -84, 188, 451, -170, -89, -4, 104, -528, -69, -125, -374, -298, -466, 443, -41, 69, -331, 96, -310, -483, 127, -403, 205, -196, -493, 228, -456, -85, 249, -350, 656, 220, 754, 401, -168, -118, -582, -317, 177, 205, -627, 154, -596, -410, 1005, 261, -98, -9, -712, 38, 605, 295, 19, -195, -397, 246, -90, -333, -172, -36, -325, 608, -400, 535, -46, -38, 412, 397, 788, 900, 227, -60, 700, 87, -406, -288, 740, 64, -448, 48, 484, -85, -41, -132, 157, -311, -221, -53, 240, 98, -278, 486]
4206D86r32M02J07J45l1k00M55j221N72k74J81J01l24j62J128l73N7j50K88J13
4226C68J7m59O7l91J84pm35J442j46j136K31M98J30n82J20o79O12r4K65j04n59
4247f58N75l5M36j24r03J348m92L07r07O11m32K27n3J54j46l00QO01L66o78J70
4268G5K83j60j102J493j206K44L54M82q44O54K05l83J20n85O7M06l04j64P82p60
4288c43K37j05M43p25K42k47K50J050j126m32J352j80j2p23R28j142R53j70K6
4307B76o37J205o79m05J17K19o9l01m68O42J5j95k93K91K43o27M90O30l35j72
4327e3l2N40o8o23l05P06j86m66O87l85l51N10M18J76q03O02o18K05p45L01J68
4348c22m2M01j38n54J134M8o32Q48q46k92k62N47m74P14O81J6m92m86N95L03j390
$$ y = [486, -446, -44, 63, 208, 177, -23, 432, -789, -217, -491, -310, -209, -533, -695, 433, 60, 117, -33, 255, 368, 385, -74, -7, -398, -214, -221, -656, 786, 640, -496, -265, 233, 363, -219, -99, -778, -166, -260, 5, -99, -658, -83, -118, 318, 194, -709, 639, 147, 454, -453, 158, -274, -47, -100, 54, -92, -392, -384, 217, 583, -95, 75, 358, 198, -904, 589, -617, -373, -19, 463, -381, 273, 478, 95, 215, -370, -303, 103, -201, -365, 417, -343, -106, -211, 232, -493, -251, -498, -248, 802, -324, -756, 596, 416, 404, -319, 609, -533, 420, 250, 276, -361, 844, 165, -240, -123, 96, 27, -274, -742, -100, -85, -280, -573, -282, -39, -666, -176, 454, 119, -53, -85, 455, 387, -236, -541, 165, -21, -487, 200, -185, -536, -26, 392, 568, -235, 367, -251, -46, -791, -490, -322, -364, 37, -101, -655, 479, 527, -105, 743, -103, -395, -657, -110, -584, 130, 811, 827, 335, -151, 444, 747, -643]
4369f43J60N69j34M7n92j66K78L68p36Q82K77o66N27q32K5Q92OK19nj56n40K04
4391a6m62R88p22J358o48k78m30J122r47m10M29n42O19q34O59R2l7j09l0j98j15
4412e11N28m77J071j75o1r09P14n43R6j65L70j19K49j18j83M70p7m4m2k14K96
4433A56J19o41O36J45k87n4j0k13m51k5J182n00k34P03K46j060O5O88p21J8M75
4454B37p43N24r2R24r77R53q65J56k68m60J133p20N93k71j192J393k41n67N24
4473D1l76O75n6m78oKJ67R90n71k43P2l16l82Q17o8l13Q1P02l15m66n83N12j26
4496b40m17R68l7o32J446r34k03k06N57q02Q91M6p15M06m67L24P40j69o98k97
4516d39O86O08p22J25m58P64j03J2Jm03q30J755n39m12ln1l31K94Q62o57k11L92
$$ y = [-643, -483, 86, -48, -1, -593, -759, -481, -113, -849, 33, 310, -356, 171, -661, -636, 256, 262, 481, 476, 320, -220, -16, -478, 510, -212, 1146, 498, 220, -210, 912, -35, -445, -16, -558, 61, -773, -114, -22, -59, -168, -198, -396, -511, 17, -460, 611, 436, 375, -534, 180, -363, -267, -432, -62, -181, 68, -50, -233, 237, 160, 116, 74, -140, 156, 275, -366, 270, 415, 128, 74, 64, -149, -600, -625, 557, 57, -177, 526, 772, -288, -223, 465, -256, -238, 237, -506, 18, -74, 850, -127, 826, -39, 117, -151, -611, 522, -198, 395, 124, -1068, 325, 84, -483, 41, -335, 340, 284, -194, -200, -198, -31, 959, 388, 145, 217, -99, -481, 336, 268, -45, 36, 738, 423, -43, -626, -114, -240, -657, 311, 274, -358, 1088, 154, -49, -255, 302, -500, 391, 437, -278, 128, -339, -15, 725, 556, -142, -439, 247, 855, 133, 258, -200, 564, 461, 473, 474, 71, -759, 996, 457, 45, 42, -9, -340, -46, 816, 159, -52, 340]
4538C40p4K22M78j295m73J407p72M4M40m83k3Q5J22n39O87o32l7N48o58M90q0
4559b03p2N89p03J81L8l37Q34r10P17rr4m26R8L37J18m64m1j81Q49L2l68J66M2
4582A93j75m70L88N11q34P12J99j49j80k90J04k53m03J50R93l81q23L30l2M67
4602E7n39O87l86L30k63O48q07M50p33O02r9j7k74J258n20J00n66M49q7j29l76
4623b15p9K39K1O68o47p7j75r2L33K06n83R83M9l02l83m02N36R7l80N46k75j005
4645i37O16J067n81j30o48J45M79K08j160Q41O48M14m38o70m80O16N34o69K86
4664A41L16o14N33j95m78L9j49M51Q1L8k11O30r27O37m28l33J037n75m98M51J10
4685E6m24N31r04J46N17L62j325J255m11J47k37N77r60P67L83n40Q2p98J57R79
$$ y = [340, 266, 488, 966, -329, -802, 605, -167, -123, 317, -166, -189, -104, 18, -521, 166, -466, -503, 45, -613, -123, -203, -275, 314, -389, -208, -170, -507, 327, -583, 134, 125, 31, -395, -297, 40, 158, -306, -347, -528, 321, 353, -15, 151, 193, 18, -452, -64, 447, -387, 325, 524, 375, 195, -95, 9, -244, -647, -497, 496, 115, -708, -378, -410, 57, -482, 205, -181, 149, -114, 534, -273, 177, -556, 46, -53, -70, -344, 914, 394, 494, -72, 377, 290, 161, -215, -294, -55, -34, 634, -13, -90, -265, -357, -24, 182, -401, 582, 631, 329, -54, -456, 80, 177, -203, 343, 68, -937, -321, 746, 165, 35, -613, -468, 11, 219, -941, -100, 548, 962, 524, -146, -626, -10, 524, -145, 141, 457, -157, 376, 181, -297, -258, -407, 44, 125, 163, -48, 582, -345, 292, -136, -469, 568, -7, -505, -54, 56, -368, 163, -741, -595, -78, 284, -1041, 214, -197, -50, -287, 290, -670, 97, 480, -60, 22, -776, -619, 360]
4705C60p30N5L14P73j126k28J315j127M38M48q29N35J75K06j42l28n42N14L49
4724D30M5P5m99m4L1M91m68j89N77m28j52K02r29R71p4j07N31r75M29l6j98N58
4746B41J99p44J48M01r2n37K79P79l62l24n17N5M91K77q4Ol25j63p28O56O64o
4768C14m51N93j76m63N94l70k65Q86m84L82r37M62l65K44r7J52m05M50M20o61
4788a77N6O61q55L0j18Q36r57K47L50j95j58Q4P78p73n79N53K57R3Rk09L9p6M27
4811C23k60m64P46q66M34Q60m31O2k90r24O17l83J258J89n54o22O84m89M88o00
4831b22P19M5j045P31o58L18o10L43R97J9l63J75o26Q50p61L86o63k45k31L46
4851d95L28M25p47J020or65P67n0r71R17k76N80l35O77n91r87L06k09Q90n38L00
$$ y = [360, -370, -315, -1, 772, -354, -582, 733, -394, 44, 492, -337, 198, 373, 579, 437, 109, -433, 81, 430, 475, 550, 51, 7, 38, 529, 61, -128, 449, 21, -131, 71, -858, 113, 39, -68, 463, -512, -83, -119, -317, 241, 440, -304, -156, 245, 153, -384, -105, 674, 312, -12, -529, -474, 17, 294, 210, 216, -109, -272, -1000, -344, 320, 314, -137, 456, 280, -183, 411, 41, -224, 662, 178, 560, -377, 85, -280, -36, -133, 19, -386, 64, 484, -177, -121, 540, -315, -285, -403, 433, -524, -277, 73, -122, -280, -196, 582, -191, -770, -217, 40, 133, 142, -67, -28, -104, 323, 63, -401, 345, -521, -87, 773, 342, 404, 114, -810, -193, -576, 682, 871, 317, -305, 379, -110, 378, -222, 497, 542, -503, 228, -430, -112, -722, -379, 618, 637, 274, 449, -177, 673, -88, 298, -365, -610, -841, -495, -167, 258, -489, 531, 525, -440, 327, 277, -694, 223, -53, 527, 192, 869, 278, -709, -403, -612, 278, -260, 40]
4872D0J16k68K01j24k54O60MJ64j36j719J417K03r16M85J83o24Q62jj040J531
4892G84j39r71n0Q92J62r68R20m96m35L34L77m26k39L68k29j61N33n09j55K04
4912b04j34O50p04J61O74l18K61r14M64k28n38O33L78J75k62k82k1l01K46l77
4932f41M75p3P70k51J30j67n6l6m4J4N70j106l67Q35j17J36n07J14P6K6K52l77
4954c44O33l7M1k30m36Q4N9L87m21O34p86J91J02L46l79L71J33k10J94J42q00
4975c26J092m01P3m81J85K52j33n72O59J50l23j42O10l45n70N92p45O65l03M7
4995a6j73O9p35J217k15j75J41Lr8M8P47p62j6l43R02j017M04n69Q29j68l20K33
5017a4r3N58r99J92K00R90p12p38n37R11l00P49J35r70J103n99q81J030K16n32
$$ y = [40, 156, -112, 89, -35, -289, 371, 375, 539, 403, -1316, 101, 304, -612, -127, 56, -568, 294, 293, -747, 784, 645, -326, -376, 516, 678, -290, 630, 134, -301, 33, 410, -16, -255, 113, -116, -277, 256, -253, -408, -204, -338, 312, -392, -231, 443, 125, 386, -528, -64, -292, -830, -197, 181, 356, 94, -188, -209, -510, -264, -641, -166, -239, 531, 280, 410, 243, 187, 151, 107, 121, 691, -415, -782, 53, -64, 72, -435, -321, -245, -219, 33, -344, 289, 252, 293, 63, -373, -289, -230, 157, -264, 370, -416, -225, -123, 223, -156, 215, 348, 138, 332, 474, -326, 766, 365, 438, -43, 142, 394, 261, -311, 348, 498, 175, 33, 643, 298, -272, 320, -425, 240, -63, -16, -189, -120, -855, 362, 147, -28, 113, 116, 18, 66, 813, 51, 35, -308, 594, -423, -19, -588, 241, 73, -247, -14, -107, 451, -548, -356, -156, 834, 122, -616, -1153, -242, -542, 207, 342, -628, 475, -124, -1005, 25, 241, -291]
5037b91M66M17l29R6j12O6r24L35K15r19J908j188O19j48P03j226L17k82P30m52
5057AK90m42J42k70R6J10O69k82m69O34l28Q0k28N09r51O58j93m23K09K14K26
5078B52p53P35l47K39o7k92k3K68n08J25O06r73N51n19O42J9%pN15m14j5q78P03
5101a41N19k40p29J188m61m80J75J93J53k86k10j57j50L54L29r70Q06K1N65j225
5121g46P25N68o24L26o84k5J059j5p77O26m51l31O95n43K50M73jp83m13N40j61
5142b92N67l70K78k48J73k69M7J43l87Q82m94o4J41k51M21J29j077M88M79J20
5162D16m77K23J86n02N94m20K60j135J590j37m10p30P7L95J62K44l18L00O5o99
5182c16QJ32K30j81m47O78n09M97K48l82o0R6L43J17k08j83k83K10l52j5K59J9
$$ y = [-291, 175, 592, 263, 359, 247, 313, -611, -276, -61, -980, 928, -260, 359, 211, 914, -312, 5, -277, 453, 1, 291, -151, -9, -279, -183, -73, 596, 314, -155, 479, 151, 231, 3, 512, -439, 219, 26, -397, -188, 26, 252, -501, 234, -113, 126, 59, -233, -256, 12, -496, -371, 235, -738, -187, -706, -64, -45, -45, -52, 463, 49, 34, -844, -141, 378, 138, -591, 597, 136, -344, -169, 24, 177, -109, -319, -476, -626, -272, 57, -913, -107, -86, 479, -746, -21, 547, -77, 249, -435, -460, 599, 584, -193, 433, -18, -349, 346, -197, 53, 526, 525, -258, -671, -131, -292, 275, -95, 183, -65, 108, -161, -114, 29, -358, 524, 30, -34, 107, -144, 277, 406, -671, -183, 296, 416, -61, 162, 348, -154, 440, 20, 280, -855, 735, 598, 188, -542, -465, -70, 92, 336, 18, 318, 383, -316, -308, -176, 54, -127, -574, 104, -405, 92, 340, -42, -102, -6, 337, 454, 246, 63, -220, -10, -362, -377, -118, -99]
5204i9N51m58L98m13p0m11M65m67N41J18K68P2n82o9l49J48M44P5Q21j556j20
5225f93N54K05l30J58K39K0r43Q15n0J53k60N94q43J56K45k5K42q7j076J127j45
5246E6J17k38m18R5P92l67o0r3M09k75L47k40LK98o40m3J84O78j38j040Q75m51
5268a49O43m09n20O31J86m23Q0N31j355P70l0j02k26O56Q5l40M10m73J53j58j77
5289b17P65l15n78J76n27R20o19M39N9N17o91J67N8L49n12J33j096J053L84p16
5309b51N52p28P50J29j009M62o0L24N47j220P06j58M52l93j025J215J48k78K36
5328C99K8N30q52P26K49j273k42R10r93O21j12k11M57j173P81K52k45J75K2J19
5348A68p46n5P33m45k68M08J067j377M13M12j43p81L50l0k32O80P9j19k02K19
$$ y = [-99, 452, -6, 392, -21, -91, -502, -37, -504, 37, 155, 423, 495, -87, -156, -505, -357, 87, 162, 983, -573, -693, -139, 66, -264, -106, 133, 153, -790, 25, -25, 128, -132, 462, -381, -225, 20, -5, 237, 150, -926, 201, 56, 173, -65, -483, -388, 404, 37, -23, -116, 293, 18, 365, 125, 128, 426, -214, -257, -73, 605, 467, -573, 302, -149, 494, 85, -435, 196, 382, -41, 39, 570, -785, -15, -45, -147, -373, 283, 368, 28, 438, -35, 118, -40, -217, 548, 233, -345, -169, -696, 224, -395, 44, 103, 620, -71, 96, 154, 503, -9, 124, -972, 81, 465, -251, 301, -427, 323, 452, -557, -95, -155, 169, 716, -504, 202, 44, 496, 103, -922, 293, 441, 163, 399, 427, 957, 105, 831, 1080, -193, -435, 475, -518, 103, -9, -220, 237, -936, -155, 97, -148, 27, 49, 168, -578, -633, 100, -345, -613, -205, 862, -515, -102, 310, 167, -614, -264, -294, -526, 154, 233, 114, -88, 131]
5368A31L8m25L22L92K53m20M10j579J165m24n38M95O42l44m93n2J14J43j33M04
5388A01M80k37J88m24p3m11N37K85m91N6L89o78L62K33j63P6m13O61j126P02J20
5409A74l39J34L78j93l40L58q1m58L07k39L08J74n77J01O05o42N74n12R70M0n06
5430B36k08q3Q3J43j31m40L29K99q57R07k35k09n47M71N03M7N32m98j16n14J09
5451a79M73p23JQ18o2j87N64k23n46n03N70o61J127n81K70n29m01J502o06L22
5471D46l23l1L5k82K59j95J79N9l3K36n56j43O12k93j09j74R5M04k07j24n59M14
5493b90J339n33l31O02o79l23L09l63l6M86m4N9m46k68J98K82j25p21J351q5J49
5514E31k61k87q85Q86q97O47j308J335n5m01Q45m66O52j83q13M88l74N24l71M10
$$ y = [131, 169, -256, 66, 458, 711, 291, 701, -878, 287, -137, -675, -180, 462, 118, -375, -427, -313, -170, -303, 101, 581, 344, 532, 108, 35, -376, 161, 446, -45, 11, 400, -278, 84, 317, 154, 230, -183, 478, -648, 54, 174, -165, -31, 347, 154, -186, 172, 91, -367, -60, -299, 9, 183, -394, -293, 312, -330, 244, -268, 702, 742, 236, 28, -55, 28, 171, 40, -400, -71, 228, -629, 278, 43, -166, -713, -242, 261, 308, 840, 342, 226, -288, -179, 294, -429, -428, 390, 328, 141, 705, 482, -64, -567, 3, -658, 469, -112, 158, -371, -772, 730, 124, 446, 123, 92, 127, -155, 104, -91, 88, 147, 114, 350, -206, -349, 263, -30, -139, -313, -218, 186, -21, -145, -704, -290, 1049, 516, 185, 787, 108, -215, 94, -269, -305, 181, 137, 196, -250, -518, -320, -38, -163, -884, 467, 382, 531, 270, -17, -902, -16, -913, -266, -1574, -239, -294, -695, 150, -316, 336, 153, -660, -172, -546, -22, -393, 17]
5534A7o6K02l45N30m4n11k87P25l56K93K80q06r8L00J39J4N8M69j85O7l03l53
5556b60O88q49O33r67J295l74N64j037M39K16p12K16L0K17k72J50L39n86m00J134
5576D64l10%r1j13j54Q65M0r70P99J61n84P91M22j966R04l37kn10N68k18K27l05
5598c19L83k63J50M61k32j8q9k83K8K47L58l64J60J28n18K81n35J06P41n22mP34
5620F30j10q02P88R3k49L18p38L70j81l99O73n1q55K92J141k90r73K50j35K88
5640F0k29N21j17k96m06Q39k64o07L58M10m4o40J84M22n79j73L84L43m6k26l77
5661d83J05L32M86J8L4j369Q76N29k59p62R73m63N00n56N85j253N0P16N36n69
5681B6j90m25L29k58N80M48P3j022O65k27O6n76J55P41m38N00n65M3Q68j137Q85
$$ y = [17, -49, 153, -192, 338, 294, -217, -504, 221, -135, 158, 438, -368, -466, -166, -27, -13, 45, 514, 329, 396, 93, -260, 428, -421, 212, -755, 540, 166, 730, -307, 132, 348, -364, -148, -118, 99, -173, -23, 316, -270, -670, 464, 154, 154, 63, -50, -204, 661, 701, -269, 530, 691, 107, 898, 1320, -646, 258, -79, -81, -591, -23, -241, -14, -319, 64, -199, -49, 412, 180, 162, 73, -210, -182, 65, 423, 59, 219, 347, -171, 110, -425, -319, 422, -100, -104, 630, 520, -282, 506, 599, 350, 668, -70, 300, 119, -280, 393, 342, -513, -221, 920, 630, -343, -93, -228, 60, -169, 352, 235, -61, -467, 372, 108, -499, -141, 269, 225, -415, -231, 191, -388, -561, -177, 166, 120, -106, -483, -378, -46, 440, 458, 492, -877, -1, 528, 269, -493, 480, 17, 517, -39, 546, -707, -657, 59, 595, 26, -164, -589, -260, -518, 62, 510, 583, -439, 226, -1, 65, -511, -356, 385, -53, 447, -118, -75, 793, -344, 541]
5702E41M24j289N15o48K48m29O71l91N58J85l50q92P0N06r0Q57j006K37O22r17
5722e78M76L68n19N78L60r00k60P72J26j66p3L32j3p23J95L35L46m89n25M74j84
$$ y = [541, 965, -324, 191, -457, -209, -638, 33, -358, 200, 385, 35, -857, -787, -281, -371, 486, -520, -283, 339, -578, -102, 266, -253, 325, 685, -215, -475, 297, 423, 257, 184, 516, 503, -220, -25, 310, 656, 167, -358, 116, -68]
$$ [...]
8191A1
##END NTUPLES=NMR FID
##END=
