##TITLE=1H_EC-3185
 DMSO, 8 sc, 
 2.4.2019
##JCAMPDX= 6.0         $$ Bruker NMR JCAMP-DX V2.0
##DATA TYPE= NMR FID
##DATA CLASS= NTUPLES
##ORIGIN= UXNMR, Bruker Analytische Messtechnik GmbH
##OWNER= root
$$ XWIN-NMR		Version 3.5
$$ Tue Apr  2 15:52:47 2019 Russian Standard Time (UT+4h)  she@DPX200
##.OBSERVE FREQUENCY= 200.1316
##.OBSERVE NUCLEUS= ^1H
##.DELAY= (6, 6)
##.ACQUISITION MODE= SIMULTANEOUS
##.ACQUISITION SCHEME= undefined
##.AVERAGES= 8
##.DIGITISER RES= 18
##SPECTROMETER/DATA SYSTEM= spect
##.PULSE SEQUENCE= zg30
##.SOLVENT NAME= DMSO
##.SHIFT REFERENCE= (INTERNAL, DMSO, 0, 15.7039)
##AUDIT TRAIL= $$ (NUMBER, WHEN, WHO, WHERE, WHAT)
$$ ##TITLE= Audit trail, XWIN-NMR		Version 3.5
$$ ##JCAMPDX= 5.01
$$ ##ORIGIN= Bruker BioSpin GmbH
$$ ##OWNER= she
$$ F:/spectra/data/she/nmr/H-F/1/audita.txt
$$ ##AUDIT TRAIL=  $$ (NUMBER, WHEN, WHO, WHERE, WHAT)
(   1,<2019-04-02 15:51:30.89 +0400>,<she>,<DPX200>,
      <created by zg, POWCHK disabled, PULCHK disabled
       configuration hash MD5:
       00 E9 B6 7A A2 85 ED C7 34 08 36 98 17 FE 4E 26
       data hash MD5: 16K
       23 F4 F3 9D 50 B8 C0 D5 DE 23 14 2A 5E 5E AE 15>)
$$ ##END=
$$ 
$$ hash MD5
$$ FD C5 C2 0E 27 2D 19 15 82 08 72 EE C5 E0 0D 0E
##$RELAX= 
##$RELAX= 
##$RELAX= 
##$RELAX= 
##$RELAX= 
##$RELAX= 
$$ Bruker specific parameters
$$ --------------------------
##$DU= <F:/spectra>
##$EXPNO= 1
##$NAME= <H-F>
##$PROCNO= 1
##$TYPE= <nmr>
##$USER= <she>
##$AMP= (0..31)
100 100 100 100 100 100 100 100 100 100 100 100 100 100 100 100 100 100 
100 100 100 100 100 100 100 100 100 100 100 100 100 100 
##$AQSEQ= 0
##$AQ_mod= 1
##$AUNM= <au_zg>
##$AUTOPOS= <>
##$BF1= 200.13
##$BF2= 200.13
##$BF3= 200.13
##$BF4= 200.13
##$BF5= 200.13
##$BF6= 200.13
##$BF7= 200.13
##$BF8= 200.13
##$BYTORDA= 1
##$CFDGTYP= 0
##$CFRGTYP= 5
##$CHEMSTR= <none>
##$CNST= (0..31)
1 1 145 1 1 1 1 1 1 1 1 1 1 1 1 1 1 1 1 1 1 1 1 1 1 1 1 1 1 1 1 1 
##$CPDPRG= <>
##$CPDPRG1= <>
##$CPDPRG2= <>
##$CPDPRG3= <>
##$CPDPRG4= <mlev>
##$CPDPRG5= <mlev>
##$CPDPRG6= <mlev>
##$CPDPRG7= <mlev>
##$CPDPRG8= <mlev>
##$CPDPRGB= <>
##$CPDPRGT= <>
##$D= (0..31)
0 1.2 0 0 0 0 0 0 0 0 0 0.03 0 0 0 0 0 0 0 0 0 0 0 0 0 0 0 0 0 0 0 0 
##$DATE= 1554205890
##$DBL= (0..7)
120 120 120 120 120 120 120 120 
##$DBP= (0..7)
150 150 150 150 150 150 150 150 
##$DBP07= 0
##$DBPNAM0= <>
##$DBPNAM1= <>
##$DBPNAM2= <>
##$DBPNAM3= <>
##$DBPNAM4= <>
##$DBPNAM5= <>
##$DBPNAM6= <>
##$DBPNAM7= <>
##$DBPOAL= (0..7)
0.5 0.5 0.5 0.5 0.5 0.5 0.5 0.5 
##$DBPOFFS= (0..7)
0 0 0 0 0 0 0 0 
##$DE= 6
##$DECBNUC= <off>
##$DECIM= 24
##$DECNUC= <off>
##$DECSTAT= 4
##$DIGMOD= 1
##$DIGTYP= 9
##$DL= (0..7)
0 120 120 120 120 120 120 120 
##$DP= (0..7)
150 150 150 150 150 150 150 150 
##$DP07= 0
##$DPNAME0= <>
##$DPNAME1= <>
##$DPNAME2= <>
##$DPNAME3= <>
##$DPNAME4= <>
##$DPNAME5= <>
##$DPNAME6= <>
##$DPNAME7= <>
##$DPOAL= (0..7)
0.5 0.5 0.5 0.5 0.5 0.5 0.5 0.5 
##$DPOFFS= (0..7)
0 0 0 0 0 0 0 0 
##$DQDMODE= 0
##$DR= 18
##$DS= 0
##$DSLIST= <SSSSSSSSSSSSSSS>
##$DSPFIRM= 0
$$ [...]
##$SUBNAM2= <"">
##$SUBNAM3= <"">
##$SUBNAM4= <"">
##$SUBNAM5= <"">
##$SUBNAM6= <"">
##$SUBNAM7= <"">
##$SUBNAM8= <"">
##$SUBNAM9= <"">
##$SW= 24.9336934301222
##$SWIBOX= (0..15)
0 0 2 0 0 0 0 0 0 0 0 0 0 0 0 0 
##$SW_h= 4990.01996007984
##$TD= 16384
##$TD0= 1
##$TE= 0
##$TE2= 300
##$TE3= 300
##$TEG= 300
##$TL= (0..7)
0 120 120 120 120 120 120 120 
##$TP= (0..7)
150 150 150 150 150 150 150 150 
##$TP07= 0
##$TPNAME0= <>
##$TPNAME1= <>
##$TPNAME2= <>
##$TPNAME3= <>
##$TPNAME4= <>
##$TPNAME5= <>
##$TPNAME6= <>
##$TPNAME7= <>
##$TPOAL= (0..7)
0.5 0.5 0.5 0.5 0.5 0.5 0.5 0.5 
##$TPOFFS= (0..7)
0 0 0 0 0 0 0 0 
##$TUNHIN= 0
##$TUNHOUT= 0
##$TUNXOUT= 0
##$USERA1= <user>
##$USERA2= <user>
##$USERA3= <user>
##$USERA4= <user>
##$USERA5= <user>
##$V9= 5
##$VALIST= <valist>
##$VCLIST= <CCCCCCCCCCCCCCC>
##$VD= 0
##$VDLIST= <DDDDDDDDDDDDDDD>
##$VPLIST= <PPPPPPPPPPPPPPP>
##$VTLIST= <TTTTTTTTTTTTTTT>
##$WBST= 1024
##$WBSW= 4
##$XGAIN= (0..3)
0 0 0 0 
##$XL= 0
##$YL= 0
##$YMAX_a= 150742
##$YMIN_a= -305276
##$ZGOPTNS= <>
##$ZL1= 120
##$ZL2= 120
##$ZL3= 120
##$ZL4= 120
##$ABSF1= 10
##$ABSF2= 0
##$ABSG= 5
##$ABSL= 3
##$ALPHA= 0
##$AQORDER= 0
##$ASSFAC= 0
##$ASSFACI= 0
##$ASSFACX= 0
##$ASSWID= 0
##$AUNMP= <proc_1d>
##$AZFE= 0.1
##$AZFW= 0.1
##$BCFW= 1
##$BC_mod= 2
##$BYTORDP= 1
##$COROFFS= 0
##$CY= 11.3945322036743
##$DATMOD= 1
##$DC= 2
##$DFILT= <>
##$DTYPP= 0
##$F1P= 18.9103706918063
##$F2P= -1.10871071338519
##$FCOR= 0.5
##$FTSIZE= 0
##$FT_mod= 4
##$GAMMA= 1
##$GB= 0.15
##$INTBC= 1
##$INTSCL= 1
##$ISEN= 128
##$LB= 0.24
##$LEV0= 0
##$LPBIN= 0
##$MAXI= 10000
##$MC2= 0
##$MEAN= 0
##$ME_mod= 0
##$MI= 1.114404
##$NCOEF= 0
##$NC_proc= 0
##$NLEV= 6
##$NOISF1= 3.799351
##$NOISF2= 2.8
##$NSP= 1
##$NTH_PI= 0
##$NZP= 0
##$OFFSET= 15.70392
##$PC= 1
##$PHC0= -9218.192
##$PHC1= 17.80025
##$PH_mod= 1
##$PKNL= yes
##$PPARMOD= 0
##$PSCAL= 0
##$PSIGN= 0
##$REVERSE= no
##$SF= 200.130013532006
##$SI= 16384
##$SIGF1= 3
##$SIGF2= 2
##$SINO= 400
##$SIOLD= 16384
##$SREGLST= <1H.CDCl3>
##$SSB= 0
##$STSI= 0
##$STSR= 0
##$SW_p= 3612.71676300578
##$SYMM= 0
##$S_DEV= 0
##$TDeff= 0
##$TDoff= 0
##$TI= <>
##$TILT= no
##$TM1= 0
##$TM2= 0
##$TOPLEV= 0
##$USERP1= <user>
##$USERP2= <user>
##$USERP3= <user>
##$USERP4= <user>
##$USERP5= <user>
##$WDW= 1
##$XDIM= 8192
##$YMAX_p= 0
##$YMIN_p= 0
$$ End of Bruker specific parameters
$$ ---------------------------------
##NTUPLES= NMR FID
##VAR_NAME=  TIME,          FID/REAL,        FID/IMAG
##SYMBOL=    X,             R,               I
##VAR_TYPE=  INDEPENDENT,   DEPENDENT,       DEPENDENT
##VAR_FORM=  AFFN,          ASDF,            ASDF
##VAR_DIM=   8192,          8192,            8192
##UNITS=     SECONDS,       ARBITRARY UNITS, ARBITRARY UNITS
##FACTOR=    0.0002004,     1,               1
##FIRST=     0,             0,               0
##LAST=      1.6414764,     0,               0
##MIN=       0,             -305276,         0
##MAX=       1.6414764,     150742,          0
$$ Real data points
##PAGE= N=1
##DATA TABLE= (X++(R..R)), XYDATA
0 0 0 0 0 0 0 0 8 -8 8 -8 16 -16 24 -32 38 -40 50 -64 72 -88 102 -118 136 -158 182 -206 238 -270 304 -343
30 -343 390 -437 490 -549 612 -682 757 -843 934 -1037 1147 -1270 1406 -1559 1726 -1914
46 -1914 2127 -2368 2646 -2965 3346 -3800 4353 -5053 5961 -7197 8988 -11828 17043 -29779
60 -29779 127499 62158 -228972 -71993 106321 104016 -29334 -56021 -35496 26509 62432
71 62432 38829 -39993 -44227 -16360 -23779 -28309 33400 40432 -35289 -56423 32985 75055 19711
84 19711 -37686 -39722 -16998 26998 44586 -8645 -49786 20166 88858 26643 -67119 -46108
96 -46108 21141 24841 -1058 4061 8660 4063 16339 27423 7710 -16304 -23203 -17399 9579
109 9579 39919 15080 -44733 -38458 32838 54380 -10257 -77544 -75417 3622 90224 68431 -58922
122 -58922 -104919 16843 112230 30899 -77875 -49268 29543 39361 21860 20941 -2489 -33498
134 -33498 -13837 30256 37860 7728 -38036 -65501 -16212 76356 69944 -41751 -82416 -812
146 -812 49570 3129 -36954 -22817 -2181 19521 39769 7850 -48260 -34891 20697 14716 -22188
159 -22188 -5590 18517 -6919 -16092 22589 22214 -29483 -35805 18714 43053 9297 -32301 -41609
172 -41609 -233 64493 62628 -27433 -80333 -17053 54654 31935 -26701 -35123 -5557 25053
184 25053 37525 8407 -40283 -37319 12035 30023 11035 3842 -2478 -24205 -10975 42558 46225
197 46225 -18957 -50977 -5170 45115 37392 -7385 -41311 -23303 36918 57366 -1325 -52722
209 -52722 -21378 29750 28130 7117 886 -11292 -18317 6955 29540 9362 -15624 -8155 3820
222 3820 6170 14178 6419 -26030 -24855 26795 43781 -9802 -46874 -13093 31388 30593 -545
235 -545 -30926 -28752 14510 44451 7982 -38813 -18678 29304 29895 761 -11967 -17473 -22229
248 -22229 920 34717 28080 -8241 -25725 -14717 9431 30276 18181 -28624 -41950 11274
260 11274 50520 13429 -36525 -26185 15196 30264 13454 -15229 -31076 -12033 20608 18882
272 18882 -9404 -13753 3962 6142 -2688 -1391 -4743 -16187 -7342 20181 22455 -4375 -22139
285 -22139 -16480 2473 23468 20934 -16585 -38194 -2817 38063 19172 -25854 -29281 3566 24478
298 24478 16040 -10126 -27940 -13256 18982 23659 -3969 -19149 -9358 -1591 2562 13543 10912
311 10912 -14678 -24168 3343 27503 13458 -18267 -31274 -10680 27433 36812 -3460 -43137
323 -43137 -23081 27442 34653 -2059 -25404 -15035 4667 15148 11222 -3282 -11452 -2921 6127
336 6127 2500 -1463 -833 -5418 -5060 10819 19805 1677 -19035 -11560 10022 14475 -303 -13458
350 -13458 -7823 15351 25463 1118 -26912 -14100 22914 26666 -4679 -23393 -11333 7469
362 7469 15791 12461 216 -9750 -8306 523 6625 7789 -223 -13674 -10954 14662 28179 1887
376 1887 -29397 -19692 16925 30362 7507 -19174 -20341 4229 24034 12887 -13614 -16038 5779
389 5779 15861 4264 -5815 -5154 -5022 -3551 5733 11527 988 -15318 -15620 2702 19163 13416
403 13416 -12103 -24767 -5372 19300 11761 -14865 -17198 7939 22484 6085 -15651 -14616 4697
416 4697 15741 4316 -11981 -8052 8305 11596 351 -5332 -824 -1729 -7053 -2767 7676 3668
430 3668 -13380 -16849 5510 25344 12132 -22871 -35479 -6835 25496 19249 -13055 -24551 -2880
443 -2880 18107 11724 -7581 -15319 -7166 2334 4510 3602 1486 -4346 -8866 -3272 10545 13162 -5171
458 -5171 -22324 -12795 12639 18911 -1604 -18884 -7324 14602 12401 -11732 -24027 -7364 13420
471 13420 11300 -6552 -13671 -3701 4277 535 -5625 -2901 1750 -1245 -5067 -35 6858 2907 -8076
486 -8076 -5873 8966 13499 -1178 -15776 -7045 15113 18761 -3560 -21589 -10153 13533 13960
499 13960 -6484 -16280 -2789 13655 10968 -2943 -10988 -7584 -338 3560 6173 6874 1108 -9724
513 -9724 -8447 8216 18677 3541 -18869 -17182 7026 19741 6421 -12082 -10882 7103 15763
526 15763 1079 -16278 -11721 6316 11475 1894 -1957 3719 3650 -2209 -4439 -730 -13 -2779 -2861
541 -2861 2395 7071 3749 -6131 -7986 5377 15082 1956 -17982 -13504 9249 18965 6339 -7194
555 -7194 -5925 4831 9985 2209 -8717 -8130 2524 8059 4274 890 -200 -5599 -8135 278 9433
570 9433 3333 -9630 -9837 3233 12513 6408 -9206 -14050 269 15251 7569 -11225 -13548 2650
584 2650 12622 6168 -4418 -8375 -5013 839 3673 2551 514 -606 -2683 -2562 2499 5003 -4334
599 -4334 -11862 -3584 9553 7205 -4899 -8903 -1849 4702 2259 -7283 -12231 -3594 8741 6324
613 6324 -5510 -6786 3072 6204 -210 -4298 -4877 -5266 -1146 7732 9080 1199 -5664 -6778 -3985
628 -3985 2611 5581 -4683 -14435 -5815 10878 10044 -4655 -10399 -3567 3343 3444 -1507 -8147 -6781
643 -6781 4017 10524 4225 -2048 -1702 -1635 -3693 -2081 1468 -1723 -4203 2470 7720 3209 -4814 -7120
659 -7120 -3599 2319 5345 -761 -8085 -3966 6348 7812 -334 -4470 -1843 340 459 299 -3566
674 -3566 -6090 -1026 5828 4596 -1451 -4577 -5720 -2065 5351 6659 -2418 -7341 160 8272 5310
689 5310 -2960 -5628 -2148 4617 9710 4186 -7843 -8396 2994 8274 2225 -3674 -5067 -4709 1115
704 1115 7952 5378 -4822 -6257 -292 3250 2381 1723 -989 -4247 1304 9364 5122 -5542 -5654
719 -5654 1132 2926 709 27 -1317 -1793 2847 5598 -395 -5866 -1793 3857 1501 -2287 -2456 -2165
735 -2165 1531 7814 6768 -3408 -8599 -2373 3974 2344 -1327 -2436 -2005 1491 5812 2540 -5370
750 -5370 -6405 -544 3717 3305 215 -4091 -4943 1946 7657 2848 -5795 -5571 576 2609 842 -1977
766 -1977 -4041 -2484 3539 5711 -1203 -5921 -4223 -786 1454 3611 1481 -4894 -5132 2477 5945
781 5945 771 -3978 -2284 669 2232 3036 -1607 -7437 -2803 5713 4882 -2614 -4305 24 1586 1515
797 1515 81 -3346 -4920 765 5132 279 -5206 -2068 2607 2157 1418 -505 -5387 -6451 1337 7863
813 7863 3041 -4827 -4749 128 3516 3770 -714 -7106 -5064 3146 5569 400 -2185 -297 251 -37
829 -37 1503 668 -4824 -5358 854 4995 3185 -309 -2509 -2055 1853 3426 -2307 -6577 -1255 6610
845 6610 4581 -2039 -3899 -1139 2350 4884 2167 -4059 -5121 1119 4292 1319 -720 430 586
860 586 767 2948 1972 -3315 -4221 1633 4795 2161 -1318 -2965 -3009 1728 6041 1454 -5573 -3447 4250
877 4250 4634 -1614 -3712 -1944 179 3416 4770 446 -3778 -2432 1320 2353 1173 254 -2809 -2921
893 -2921 2473 6070 717 -5291 -2649 2755 2033 -972 -2761 -2374 273 3851 2782 -1469 -2191 781
909 781 994 -1253 -1766 -895 -418 1231 4001 1816 -2706 -2148 1464 2564 77 -2957 -4376 -1487 4454
926 4454 6492 -10 -6101 -3642 1920 3893 447 -3596 -4540 -763 4420 4407 -1003 -3911 -2180 434
942 434 1656 2498 7 -4455 -3787 2832 5934 1436 -3397 -3538 -32 2292 1917 -2759 -4311 246
958 246 4902 2087 -2823 -2365 477 998 656 924 134 -2524 -1374 1057 885 -474 -111 462 122 1195
976 1195 859 -2717 -3354 704 3084 -729 -3124 -360 3009 2636 824 -2060 -3193 -21 3671 2453
992 2453 -2404 -3536 748 4070 4470 2310 -2230 -5009 -1693 3984 4260 -350 -3370 -1619 2589 5631
1008 5631 3097 -3372 -6181 -1661 3924 3050 -756 -2021 -418 1504 2922 2007 -1231 -3424 -2077
1023 -2077 563 2406 2497 614 -1105 416 3459 2689 -1447 -2620 806 3070 1197 -777 -460 1566
1039 1566 2930 1452 -889 -2097 -121 1742 582 -1557 -1144 477 1258 1596 280 -2371 -2849 -48
1055 -48 2633 1435 -863 -2403 -1443 1019 2858 1471 -2048 -2499 1654 4510 2114 -1778 -3036 -885
1071 -885 2704 4506 1880 -1905 -2183 1091 2668 1972 163 -2442 -3320 -402 3252 2677 -1464 -3163
1087 -3163 -459 2327 1461 -2119 -3975 -2771 389 2170 288 -738 295 1375 -207 -1577 -877
1102 -877 -954 -395 802 1426 447 577 1208 2160 1705 -858 -2866 -2575 775 3165 2137 -1537 -2147 1028
1120 1028 2947 894 -2637 -3898 -2590 977 2618 614 -1997 -2186 -176 1196 678 -1485 -3449
1135 -3449 -2876 107 2699 2303 -694 -1722 -29 2198 2441 -293 -2724 -1317 2595 4170 1257 -1338
1151 -1338 -921 1627 2256 1080 22 -744 -696 489 371 -179 -728 -429 104 426 -11 -1031 -1324 -478
1169 -478 985 31 -1952 -1486 634 1650 900 -850 -1032 404 2047 1967 -253 -2010 -1601 1288 3533
1186 3533 3167 995 -1633 -1016 1562 2970 719 -2396 -2774 175 3167 3493 182 -2964 -2086 348
1202 348 1304 -189 -2397 -2569 -1094 1355 1697 873 -574 -1176 -768 216 142 -95 -69 348 1399 2437
1220 2437 1936 703 374 843 296 -443 -514 1101 1884 1701 10 -176 767 1240 698 -1303 -1729 -923 1110
1239 1110 1544 715 -555 -1712 -1078 1370 1999 -441 -3082 -3200 718 2808 1453 -1617 -3097 -833
1255 -833 2420 2686 202 -2605 -2471 714 2816 3019 271 -1801 -1576 1379 2983 2149 -1466 -2980
1271 -2980 -1274 1382 2056 710 -1293 -1818 -45 1943 852 -1495 -1746 -1436 -1162 -491 691 606 -85
1288 -85 -393 -483 322 344 -32 -745 -1356 -110 955 1158 1384 1468 984 -367 -1164 495 2050 897 -1828
1307 -1828 -1921 973 3396 2657 -851 -2584 -1744 331 1576 -226 -1872 -1931 -89 1401 1811 302 -2104
1324 -2104 -2921 -1052 1447 1374 -830 -2515 -729 1867 2533 691 -1329 -1606 -517 921 1327 126
1340 126 -1208 -632 855 1241 1023 474 -980 -1463 -66 1317 698 -687 -968 356 1066 534 -39 -178
1358 -178 -126 132 -244 -1299 -532 1225 988 -1722 -1732 891 2740 1285 -982 -1960 -1110 191 1396 1409
1376 1409 158 -617 -195 778 1838 1454 -456 -3116 -1550 2180 3483 728 -1613 -1071 936 2510
1392 2510 1030 -1467 -2708 -1204 1021 1106 570 -528 -549 -96 409 817 -215 -2303 -2179 -779 1339
1409 1339 1657 111 -1034 -459 940 1041 -331 -1323 -526 573 613 219 310 793 691 456 -1059 -269
1427 -269 879 571 -672 -1073 89 488 355 312 279 -661 -1640 -1319 453 443 -696 -1441 -898 681 1767
1446 1767 251 -1574 -1523 454 1050 17 -637 -772 -245 168 1323 1828 -228 -1262 -686 160 772 670
1464 670 -940 -1503 -81 1970 1851 -337 -1578 -947 2 -263 -1038 -865 -527 332 189 -534 -407 261
1482 261 738 -810 -1984 -737 505 557 526 169 382 431 -161 80 587 -74 -967 -1330 367 2336 1785
1501 1785 -589 -1015 86 1256 326 -938 -1790 -1281 745 1832 846 -636 -805 -404 439 806 241
1518 241 -1352 -1891 275 1902 1575 128 -724 -670 513 1485 731 -855 -1734 -325 1091 1138 339 58
1536 58 -379 -476 -142 385 -279 -743 -982 -498 -412 470 403 -475 -774 -302 481 -233 -504 184 -53 -365 290
1557 290 984 1484 692 -375 -1062 -217 484 837 -204 -1045 -540 189 1222 1051 105 -1838 -1866 -428 854
1576 854 535 -769 -1561 -43 1839 1706 366 -1255 -1281 -176 385 94 -202 -260 -191 503 1114 644 -589
1595 -589 -842 -788 -379 -93 861 787 5 -42 477 533 60 -721 -987 -960 -135 172 -305 -438 73 154 -1031 -672
1617 -672 -96 204 -1068 -1077 -340 852 1322 1262 -275 -1028 -377 1249 1157 -506 -1713 -1123 48 863 1117
1636 1117 -788 -1770 -501 1329 928 -586 -1213 -1272 -478 456 1144 844 -120 -887 -510 891 1228 42
1654 42 -1624 -1416 513 1520 922 -116 -937 -276 54 741 342 -721 -1046 -169 859 1038 537 187
1672 187 -60 -233 -297 -548 -286 -153 -446 -511 -104 600 608 -189 -1095 -1005 -348 -391 470 312 -128 4 787 1408
1694 1408 1004 -153 -878 -817 -219 481 608 -433 -489 49 388 633 356 -480 -1926 -1056 475 1275 133
1713 133 -539 128 595 1336 517 -270 -962 -432 27 368 731 37 -343 -653 325 470 222 -743 -808 -25
1733 -25 -100 -22 507 598 528 493 397 159 634 218 -649 -960 -342 291 843 169 -283 -825 -304 292 435 -501
1755 -501 -1240 -789 291 428 860 888 128 -435 -124 501 670 -622 -1384 -1349 141 1603 1122 -548 -1107
1774 -1107 -482 653 229 -723 -1364 -766 137 986 883 257 -219 -198 116 164 -200 -668 -826 -469 623 910
1794 910 438 -110 -500 -884 -360 30 -20 -291 -747 23 1083 989 -93 -105 -198 -607 -345 -383 -400 463 478 -106
1816 -106 -189 207 286 99 -683 -689 -517 244 507 441 -735 -620 361 1205 283 -631 -1201 -265 124 93 -144 -189
1838 -189 136 215 97 316 141 -425 -933 -379 321 686 45 -67 44 691 666 366 -209 -376 -376 73 192
1859 192 381 745 196 303 82 148 -457 -283 95 112 -343 -210 405 1063 454 -224 -400 -288 38 173 -424
1880 -424 -688 -16 950 1128 903 119 -327 -583 132 178 -116 -521 -109 85 505 806 350 -480 -812 -511
1900 -511 290 265 -429 -720 -625 640 1022 222 -323 -825 -278 61 193 121 -350 -218 89 391 929 383 -363
1921 -363 -612 -195 319 160 -477 -83 114 231 57 84 242 -152 -787 -794 -334 162 450 -138 -293 -36 452
1942 452 643 72 -323 -678 -615 231 144 327 141 258 754 728 204 20 -321 -706 -686 -224 742 413 -343
1963 -343 -171 -57 273 144 -625 -927 -535 314 350 104 -27 48 102 210 -123 -200 -847 -438 -239 344 338 217
1985 217 450 586 -81 -433 90 -26 -131 -590 -541 -296 588 644 -83 -185 -211 -89 136 -219 -80 -307 -261
2006 -261 208 693 787 189 -345 -371 368 265 154 -42 -284 -431 764 1544 912 -507 -1231 0 197 552
2026 552 -427 -725 -388 269 576 375 6 -237 -501 -376 70 46 -353 -872 -275 513 987 491 -118 -405
2046 -405 -201 -95 -24 -56 198 411 396 875 762 383 115 -133 -397 1 216 99 -183 -98 159 376 248
2067 248 -334 -368 -708 -630 -55 -252 245 280 387 -237 -239 422 487 -301 -845 -208 665 767 78 71 596 673 672 160
2091 160 34 -129 -62 62 297 410 619 68 -552 -2 112 -324 -849 -725 -185 10 -146 -263 -34 325
2111 325 -85 -446 -792 -527 -165 -177 49 125 629 970 442 123 -5 207 164 8 -308 -78 -53 -155 -14
2132 -14 253 966 -125 -841 -799 -462 302 -12 -994 -726 523 1084 235 -536 -277 -46 -162 -573 -257 551
2152 551 58 -523 240 870 1066 263 -233 -373 567 1136 139 -251 211 812 1265 119 -176 19 -96 -708
2172 -708 -838 -112 338 -147 -293 -407 160 319 -240 -1089 -1117 42 248 -46 -177 -17 736 195 -94 -53
2192 -53 338 280 -358 -631 -383 952 852 49 -727 424 893 271 -1004 -339 346 202 101 52 600 460
2212 460 -22 -659 61 123 -195 -947 -922 22 484 282 -888 -270 157 449 -531 -445 -96 21 -33 -30 776 1006
2234 1006 598 -4 -306 254 1032 422 -918 -693 243 753 206 -450 -9 272 -351 -1054 -505 49 316
2253 316 -200 -1012 -102 1035 899 -336 -1638 -813 302 297 -918 -706 305 450 56 -387 113 366 -221
2272 -221 -1050 10 796 859 -207 -583 683 1720 789 -579 -1233 -296 758 304 -222 -283 383 370 -331
2291 -331 -219 258 -211 -955 -1062 -123 584 775 -438 -668 570 1088 513 -716 -608 98 246 -387 -201
2310 -201 522 678 249 -442 -254 1182 728 -763 -1113 -74 1295 898 -397 -586 649 914 -36 -824
2328 -824 -651 552 43 -973 -564 846 1223 -126 -1071 -382 783 366 -1048 -1467 -127 892 554
2345 554 -366 -76 888 725 -268 -831 97 918 -335 -608 -106 945 794 -45 -556 -29 666 58 -854
2364 -854 -751 1 811 211 -430 -42 959 201 -873 -899 189 787 -99 -1246 -520 1150 1151 -538 -1557
2383 -1557 -68 733 -16 -1166 -199 826 774 -478 -668 630 1590 175 -1308 -1172 421 1015 -294
2400 -294 -1218 -175 1135 791 -583 -734 482 464 -591 -661 13 789 290 -510 -587 214 664 -270 -1000
2419 -1000 -812 700 453 -444 -713 328 916 408 -552 -755 261 302 -448 -898 309 863 529 -705
2437 -705 -688 490 1147 -695 -1281 -122 521 400 -225 -306 929 1026 -271 -1331 -98 1146 536 -1481
2455 -1481 -1094 565 1474 107 -1018 -378 946 545 -739 -1033 -154 609 99 -737 -95 1372 940 -394
2473 -394 -1323 -6 1187 458 -916 -491 874 1305 210 -772 -156 501 242 -905 -847 242 981 0
2491 0 -970 138 1200 675 -883 -1461 34 991 -182 -886 -477 939 918 -200 -780 531 1146 -204
2509 -204 -1211 -575 1129 1077 -708 -903 600 1907 969 -1209 -1185 275 1038 46 -695 91 991 594
2527 594 -586 -595 260 902 -945 -1642 -224 995 668 -701 -1051 178 1117 181 -805 -901 386 586 -252
2546 -252 -608 246 915 502 -583 -374 817 691 -273 -1099 146 1424 626 -459 -633 666 981 -251
2564 -251 -1355 -657 747 -39 -1088 -772 961 1122 -97 -1418 -445 1267 868 -940 -1360 569 1147
2581 1147 587 -646 -398 1167 894 -586 -1124 233 967 118 -1069 -516 1108 1657 -577 -1258 -127
2598 -127 1032 708 -992 -1144 245 1098 262 -578 -515 969 541 -959 -1225 504 1081 -417 -1268 -191
2616 -191 1219 1237 -754 -1300 -305 522 -122 -1045 -653 678 1041 -404 -759 529 1006 104 -1775 -1170
2634 -1170 479 882 -370 -1164 340 1283 638 -624 -882 523 604 -371 -1051 171 1053 456 -925 -612
2652 -612 443 986 4 -1616 -738 742 1204 -518 -853 -51 1165 661 -972 -798 526 371 -699
2669 -699 -917 51 1647 412 -1154 -811 673 1045 -142 -1521 -324 1373 807 -792 -649 775 1066
2686 1066 -21 -987 -89 798 322 -1011 -719 522 1214 138 -1412 -479 710 438 -1063 -1157 138
2703 138 924 186 -751 -470 1020 704 -458 -1398 125 1086 -34 -1520 -702 1066 1184 -67 -1073
2720 -1073 -82 671 387 -846 -1195 429 1237 -94 -964 -195 1335 869 -991 -1265 58 1175 25
2737 25 -1252 -460 1025 1187 -368 -745 -44 829 5 -926 -706 1077 1036 -192 -744 117 1401 266
2755 266 -1368 -1024 445 735 -480 -935 -55 913 607 -633 -432 335 384 -539 -1125 136 917 801 -621
2774 -621 -1056 530 904 -9 -1247 -660 568 622 -369 -447 382 1271 158 -935 -645 577 760 -559
2792 -559 -1332 -281 1074 928 -435 -789 721 1114 0 -1530 -501 652 394 -798 -585 782 911
2809 911 80 -791 -224 890 423 -1159 -1211 200 1174 510 -760 -464 855 665 -621 -870 3 857
2827 857 -197 -955 -171 882 1093 -180 -1254 -578 707 99 -866 -768 471 772 433 -694 -4 388
2845 388 225 -917 -843 178 882 92 -835 -424 941 1057 74 -1063 49 743 161 -1082 -280 636
2863 636 866 -330 -648 155 760 315 -1091 -992 526 899 -52 -943 52 1167 624 -719 -473 82 396
2882 396 -425 -447 209 493 526 -851 -273 316 774 -483 -1054 -505 800 723 -273 -830 308 714 -20 -512
2902 -512 -428 367 141 -786 -821 94 1250 343 -1041 -593 887 949 -354 -1161 -949 990 847 -552 -650
2921 -650 231 516 -275 -840 -243 362 210 -737 -505 470 1080 -201 -512 -541 268 156 -459 -905 216 650
2941 650 229 -335 71 722 545 -638 -702 -246 449 -76 -636 -391 636 1071 192 -648 -468 268 25 -347
2961 -347 -583 395 671 -327 -616 3 874 233 -564 -737 43 945 370 -483 -310 547 819 -216 -367 -327
2981 -327 754 -264 -697 -312 796 769 -327 -820 -26 960 108 -823 -903 408 626 25 -406 66 1198
3000 1198 503 -382 -337 208 421 -569 -963 151 654 212 -338 -2 229 859 117 -709 -379 53 563 94
3020 94 -368 366 766 73 -457 -237 269 89 -256 -639 -96 796 615 -402 -393 457 668 -315 -581 -456 759
3041 759 430 -88 -2 653 838 -84 -785 -370 427 131 -883 -481 186 1006 500 -131 -28 286 66 -713
3061 -713 -417 134 331 -81 -111 53 497 738 -298 -865 -142 278 299 -585 -95 13 502 136 -365 126
3081 126 468 -105 -505 -573 356 367 149 -290 -133 605 816 -334 -462 -73 427 368 -296 -51 511 490 -125
3102 -125 -28 21 644 -457 -651 -237 466 410 -127 -340 129 557 259 -490 -309 169 -1 -88 -408 225 365
3123 365 336 -414 -232 397 237 -239 -1053 -183 177 391 215 -131 -181 809 14 -273 -109 -53 195 -363 -302
3144 -302 137 601 60 -281 -432 211 372 -426 -740 -201 529 441 143 -208 327 366 -198 -337 -78 317 328
3165 328 -300 -184 299 554 -74 -692 -95 228 8 -298 -642 -123 375 579 94 -137 270 -109 -597 -277
3185 -277 246 214 118 -475 17 482 431 17 -555 -266 205 -127 -261 -91 18 539 205 38 280 380 166
3206 166 -485 -611 -37 148 199 -272 -222 231 705 201 -348 -114 29 -119 -593 -23 419 317 -159 -263 230
3227 230 605 63 -277 -125 61 483 198 -278 265 415 108 -68 34 151 249 -419 -452 35 212 516 -43
3248 -43 -258 -17 -133 118 -469 -505 -135 74 167 -164 -52 47 127 2 -281 231 -314 -340 -74 421 367 183
3270 183 -413 -297 -57 98 -83 -312 -301 139 102 -75 218 51 117 -366 -353 16 17 211 -233 -47 484 398
3292 398 258 -239 -276 -147 157 -310 -227 -116 127 16 -81 429 221 160 -208 -353 -1 188 -55 -328 -65
3313 -65 -37 336 38 87 -62 -406 -147 -158 -194 -157 123 -108 -39 -114 259 249 261 -71 113 191 -189 -108 -264 241
3337 241 -40 394 -309 -34 336 -333 -330 -139 67 380 79 -99 148 -51 48 -102 -371 -211 150 -42 171
3358 171 220 400 250 -4 -295 180 -12 -154 -227 12 620 168 119 -36 64 79 136 8 -320 17 148 47
3380 47 -107 -169 380 376 -41 -431 -44 117 146 -266 -275 -79 363 -75 -367 -101 -65 -114 -370 -199 -39 -97 -213
3403 -213 279 520 322 199 -53 -56 198 55 -268 -243 305 153 218 -248 188 -66 -141 -49 -489 51 -263 -149
3425 -149 -82 208 191 304 -55 -249 -240 -108 322 -45 -63 43 86 387 322 -177 96 -190 -98 -465 -62 186 133
3448 133 60 -204 -86 568 212 -66 -222 -217 28 -46 206 216 421 96 -38 -10 149 -92 -312 -216 -108 111
3470 111 216 -192 -235 162 -92 -37 487 -10 24 -445 22 110 -157 180 -16 51 -342 -10 -278 -65 -35 11
3492 11 321 -158 -96 9 -262 -29 -136 97 -270 -322 -185 -240 -58 206 88 -69 -603 -308 22 -174 -248 -255
3514 -255 -25 325 436 265 -90 -304 -395 -439 -143 74 -12 16 -95 52 -46 119 -67 -254 70 -48 -14 13
3536 13 -72 -412 -13 409 7 177 -234 -176 -359 -132 127 23 5 -232 -80 512 47 112 -232 54 3 -58
3558 -58 185 515 22 239 247 119 486 137 -174 -186 -264 19 70 -111 -203 252 73 -82 -29 -232 -70 -42 -22
3581 -22 286 0 213 -18 -90 65 158 -29 -475 -7 -160 379 359 213 325 188 263 109 1 -50 -141 -576
3603 -576 -375 399 216 -97 261 -135 125 -289 -31 -4 -157 18 27 254 205 -96 25 -89 53 246 -284
3624 -284 -255 -60 -8 110 13 220 -61 -61 -245 -95 90 -180 -422 -294 -159 79 -115 -4 115 3 -241 -150
3646 -150 70 46 -52 -420 -53 337 431 64 118 -310 -305 -92 -197 -25 75 503 90 73 156 47 74 35 -227
3669 -227 -158 -203 80 32 -277 -87 173 158 20 -40 -187 115 285 -61 64 -12 115 121 148 -80 51 -13 -230
3692 -230 -106 37 -13 261 180 228 -91 10 149 -37 -177 -382 -128 67 -24 297 204 -164 -342 135 86 40
3714 40 -229 -180 -40 3 253 142 -72 34 100 181 -274 -308 -431 38 -90 -31 93 149 -249 -210 271 203 103
3737 103 -385 -142 -268 -7 304 307 -21 -84 237 -29 -469 77 -79 139 156 263 60 387 -7 39 100 -61
3759 -61 -130 -314 -45 -171 -304 523 -3 2 -326 -36 -64 192 56 -346 -201 238 25 58 -261 76 -80 -284
3781 -284 -315 2 -192 -128 234 172 -237 -59 228 -164 -300 -400 140 104 -9 -95 192 -6 -107 143 -126 256
3803 256 415 -258 194 41 264 121 177 252 166 104 26 -80 -190 162 -260 26 -199 233 263 238 -192 -166 -170
3826 -170 -60 -166 -171 124 74 -146 -73 230 87 327 -88 17 -80 131 130 132 183 146 -52 189 82 -26 -75 -203
3850 -203 -137 -462 147 246 148 30 -216 -127 -414 -154 44 -103 107 -286 138 288 22 52 288 -220 -127 66
3872 66 -24 -120 -76 162 114 152 453 179 19 -150 -245 238 164 36 -377 -174 230 120 138 -26 -143 -161 69
3895 69 -177 -20 75 183 -238 -97 31 105 76 -268 -166 250 72 -57 211 -6 127 -96 218 -31 -47 -45
3917 -45 140 111 86 143 56 363 155 -324 181 155 -196 -135 -215 -32 -46 -95 10 -131 -7 -85 35 -169 -258 -323
3941 -323 -216 181 97 103 135 13 -208 159 -88 -70 -74 60 -52 -7 -38 164 243 -214 27 -77 -22 -18 -133 155
3965 155 83 91 241 43 43 -265 -33 239 -82 32 36 11 -151 178 121 33 -373 -342 -180 -81 -3 -25 17 372 150
3990 150 169 75 189 -128 -150 -320 -118 117 -13 35 -154 324 196 17 -277 -200 -212 -48 -6 -229 -21 -64 77
4013 77 138 58 44 254 -331 -44 50 -318 143 29 108 -6 -31 44 -153 101 -2 -186 91 -237 -77 -60 -12
4036 -12 171 37 -114 -49 -53 -320 -313 -188 270 41 81 -55 21 -22 134 -94 95 -10 155 -155 124 19 51
4059 51 133 379 -142 -122 -286 -2 -30 5 143 -240 29 127 -19 -126 -178 68 7 -27 136 23 84 134 31 -92
4083 -92 41 -35 -149 -231 22 -12 51 305 273 -247 -121 165 372 -6 -90 -59 -52 -276 -173 184 26 -46 -24 -156
4107 -156 -3 126 -57 301 261 277 -30 1 122 241 -313 -307 -90 -66 0 -21 88 -4 222 40 -25 121 -7
4130 -7 -194 -334 6 -318 266 -47 -314 -169 438 409 -136 -303 -212 -223 -42 20 173 77 356 267 131 141 63
4153 63 -201 -158 144 -194 21 234 306 -218 -162 399 51 -260 -245 12 140 185 -24 -193 79 12 9 -282 -50
4176 -50 -25 -282 -16 33 406 93 -5 234 -241 41 -146 -140 -203 18 -179 352 -40 248 -113 -105 -57 -79 -25 -397
4200 -397 -35 47 -25 -40 -239 258 69 -288 -104 -191 -48 -121 -241 84 178 264 190 -201 -93 -236 191 43 71
4223 71 -133 -143 6 172 182 319 -268 -109 -39 -68 30 152 -64 29 -164 9 -125 -253 141 -134 72 71 -94
4246 -94 -166 -24 69 8 36 -28 -37 -373 -40 -156 -169 132 -182 -20 -38 46 75 116 144 76 -231 -96 59 9 331
4271 331 114 -248 -93 286 36 -212 -79 -22 -275 80 19 343 80 -215 -92 168 -15 -84 -444 -79 309
4292 309 66 -93 107 299 -140 -234 -11 -83 -180 135 206 157 -250 -246 88 155 -232 -85 10 -66 -300 30 -193
4315 -193 -218 101 185 -131 157 -72 -304 -159 29 -210 30 101 -52 170 -195 -50 212 -167 35 145 19
4336 19 129 -20 67 276 134 -30 -176 329 25 -247 18 36 209 274 -102 -112 11 -225 -135 177 -26 226
4358 226 50 4 200 248 150 38 103 83 -202 -158 -134 -215 -69 -289 248 1 565 140 183 -74 24 204 -126
4381 -126 -222 203 132 -76 -140 52 -16 27 -14 2 -340 -120 348 -66 3 -184 202 174 -270 177 250 -176 -18
4404 -18 -45 -14 -186 106 -112 124 -142 -134 26 -141 -177 74 -25 116 7 -30 95 -336 10 -10 -39 -72 76 -27
4428 -27 135 290 -63 -62 -53 234 -228 4 113 74 -53 -237 246 55 233 -336 -162 91 120 -14 -538 199
4450 199 58 258 125 340 416 -101 -3 15 61 -49 67 -284 -77 88 323 149 -120 6 96 66 24 -93
4472 -93 168 -47 -57 203 -11 -148 -95 48 -116 -160 10 66 123 -140 -52 220 5 55 -236 -318 -354 -223 66
4495 66 267 12 31 -123 1 -62 113 -111 -575 -4 -59 -191 -165 1 327 -47 -104 4 -194 -149 114 -105
4517 -105 -143 159 60 20 307 118 -115 -69 -37 160 -84 -59 108 46 3 106 -34 174 338 80 35 -199 30
4540 30 -167 75 279 237 258 -378 -213 -212 -110 -78 -85 -363 -131 -456 -52 -199 314 -195 -121 -213 -45 107 -140
4563 -140 -100 -198 6 -157 183 141 125 245 -34 -206 -190 72 231 164 -164 -84 -118 -37 -273 83 -124 -90 270
4586 270 286 17 38 -279 266 239 -227 -158 171 107 217 71 -168 -32 21 -125 -88 -52 -104 -30 55 35 273 58
4610 58 123 232 -78 -134 240 -49 -154 -89 49 -194 280 366 -296 -242 -184 -32 -70 -76 -51 -37 12 -111 254 222 103
4635 103 -83 173 -354 -84 97 101 274 -55 -302 7 -99 -159 -162 -281 -39 -119 224 -90 -36 158 155 -32 29
4658 29 239 -68 91 43 -112 68 167 30 335 364 -83 -237 1 445 -16 102 135 99 5 239 -52 139
4680 139 -97 33 161 -55 41 -86 152 -170 -164 184 179 -320 16 -6 -219 -119 -201 -47 -106 -121 126 83 -234
4703 -234 -192 115 -191 -198 59 38 47 -122 263 -46 45 -72 -219 -42 -99 222 99 128 112 1 -123 -7 -15 36
4727 36 -202 -164 430 74 -91 168 -123 93 -11 -275 -214 44 -73 -31 -89 -193 -27 -13 -174 -229 -381 21
4749 21 227 -264 42 172 -65 -76 70 -4 183 -56 -3 -119 50 70 76 -129 102 131 0 159 -113 159 -192
4772 -192 194 -120 -328 4 291 113 -59 -196 -29 154 83 262 -163 -4 302 39 -94 -258 93 126 -86
4793 -86 90 -111 -30 -282 269 190 -186 -124 133 122 131 -4 -226 239 -183 -262 -69 50 -92 -91 394 -90 123
4816 123 -177 108 -243 64 -137 100 85 117 -3 -279 -206 367 -76 116 132 -155 -199 -95 -209 -124 362 154
4838 154 -162 28 53 -5 -361 -216 34 -200 -86 -33 -48 113 -33 -177 194 -113 -59 11 -48 -96 73 -246 -92
4861 -92 -63 -229 143 -136 47 257 -30 -121 -31 -70 23 20 -160 -37 -91 157 89 70 45 209 31 244 -122 122
4885 122 -206 -168 -70 118 162 268 8 -60 95 -29 11 -134 4 26 -121 123 68 154 69 36 428 36 120 18
4909 18 18 321 330 -127 30 108 163 -262 311 -20 -61 137 49 83 38 -3 -108 -318 -8 -134 -225 -70 -65 -399 82
4934 82 -57 -16 200 -165 71 -220 -271 -18 -117 -90 109 157 123 -31 331 69 -47 -216 -126 -218 49 89 8 -146
4958 -146 463 196 214 2 42 45 -41 146 19 -156 234 -116 -96 100 -134 -41 -189 -209 85 150 -17 139 168
4981 168 -159 -93 64 -82 -130 -294 -45 74 -65 -47 142 -59 -118 103 -46 -104 -22 88 74 281 -89 -76 160
5004 160 176 68 55 -9 -44 -282 42 -102 79 47 27 104 -151 -40 127 -5 6 -194 26 69 198 75 279
5027 279 -66 -361 -236 -62 25 360 -18 27 -92 -7 43 -56 -229 -195 -147 -3 -113 42 0 -33 338 -213 -82
5050 -82 14 -40 -38 -237 67 143 61 16 27 -9 63 204 -53 119 -92 -189 215 -129 -42 91 73 -15 -69 81 99 -215
5076 -215 -38 -307 -110 66 -43 175 179 -16 -402 -124 28 157 189 5 -184 97 213 61 -348 -200 22
5097 22 116 -220 31 -27 66 -389 82 163 -93 -233 195 3 391 215 130 -1 42 -70 58 -153 -100 328 -103
5120 -103 164 41 -240 5 11 214 -144 176 25 201 72 -35 186 25 -194 -165 -137 29 343 -133 108
5141 108 30 110 153 -105 274 303 -145 164 157 204 -55 -491 -222 234 72 -32 -138 89 145 -243 375 65 -116
5164 -116 110 177 385 231 163 -130 -170 39 40 78 28 -157 -114 -130 -171 239 -356 -45 153 63 -142 113 -87 -346
5188 -346 205 17 -50 46 387 -32 -57 84 -224 -46 -162 -216 11 -121 -363 113 -74 -20 63 -35 -227 67
5210 67 -19 -7 -132 90 -125 13 -250 -1 47 -30 -27 16 -16 -82 55 -125 -98 -179 -53 -36 24 -38 234 85 -166
5235 -166 -284 -62 133 66 -124 128 -233 63 -123 -69 -88 -167 -196 233 155 -154 225 -236 188 253 150 -220
5257 -220 -74 -100 -153 397 -30 -114 -76 83 43 -241 -167 -128 -23 -79 448 -25 181 201 -105 -222 147 53 222
5280 222 119 -30 -109 177 -117 -5 36 -99 26 -60 14 53 89 85 62 -291 29 57 -3 -81 193 -140 407 -370
5304 -370 79 248 -44 -16 -267 24 -156 -283 23 -235 -44 0 219 -92 -9 52 82 16 122 -164 -196 -62
5326 -62 -12 18 25 180 -256 244 87 74 -365 73 71 176 59 -188 182 68 -236 190 124 13 -147 -48 -326
5349 -326 262 139 90 122 -5 -82 73 414 35 -176 -44 181 164 -237 67 75 -160 60 -204 -41 -92 -145 -283
5372 -283 -82 -118 -274 19 -95 -18 105 32 -106 116 -159 -105 -71 178 132 71 -27 -14 227 382 1 -118 -178
5395 -178 69 -213 -311 75 -119 204 -177 -80 -174 52 -37 -205 54 99 -113 35 107 57 -71 137 48 85 -15
5418 -15 21 32 -43 -263 -155 49 184 -150 419 54 -100 72 126 -41 309 201 124 -16 -152 -120 99 -135
5440 -135 -27 -529 -224 8 -93 -149 120 -96 160 15 236 214 128 -191 -186 -328 -284 -140 -139 109 -42 -37 15 -72
5464 -72 95 -53 273 -181 -145 -183 166 72 -237 -291 -149 359 -169 -71 102 347 -180 7 195 165 148 -125 106
5487 106 44 10 -72 127 55 -640 57 -107 207 93 -235 -29 -159 -89 66 -44 -71 245 -245 186 -226 -14
5509 -14 -217 -210 -79 263 148 81 -39 -139 74 -386 -28 168 230 -262 -62 36 -4 -18 -10 33 49 -101 19 -17
5533 -17 143 120 39 -274 187 -76 -130 160 101 -127 140 174 -389 111 161 -270 -170 98 -92 73 65 182 -80
5556 -80 -74 17 65 -5 -210 -169 -113 57 90 -122 -245 50 -151 69 13 -62 -154 -141 210 35 209 256 182 -56 -254
5581 -254 -83 -103 133 -256 -287 206 -80 38 -100 126 -174 292 -126 -175 158 163 39 -14 -144 260 97 301
5603 301 -195 -9 -61 412 -100 -23 358 82 370 106 -63 -194 92 49 -42 -267 284 -177 74 -174 18
5624 18 267 173 303 -135 273 160 -400 152 155 -55 110 -204 -272 218 126 -143 12 -58 98 -114 123 129 -23
5647 -23 169 -268 -125 579 80 34 -139 -174 -28 38 155 96 70 26 -107 -48 -6 -36 137 104 -274 106 241 55
5671 55 167 101 101 53 123 -147 -31 79 -252 53 -47 -321 204 -80 -168 -295 158 -156 -14 -134 213 107
5693 107 22 179 -21 -206 68 7 202 -233 -136 5 -92 248 307 72 169 104 -63 -308 83 61 115 44 176
5716 176 327 27 30 -206 -5 -199 57 159 -122 217 -13 206 -256 -236 -122 69 -392 -210 -9 -414 -134
5737 -134 -149 -371 -343 27 70 190 -253 -356 88 -42 358 4 115 15 -300 -58 -70 103 23 -70 -289 -154
5759 -154 -85 120 -111 -194 -79 -192 -62 95 -268 -273 -184 195 -91 37 -311 -201 45 41 120 129 98 -244 14 -106
5783 -106 -169 -204 -13 -172 133 -189 85 45 55 -98 -30 -82 -110 -10 372 87 176 -206 178 291 9 130 109
5806 109 31 -72 130 98 -195 -165 452 -160 42 -98 126 133 368 -99 -43 265 41 131 -18 202 -176 -139 -206
5829 -206 -6 205 16 -63 201 -138 -22 62 -72 -139 -44 26 -45 37 -57 248 -140 35 -36 -155 46 -64 -10
5852 -10 77 -33 -19 -50 57 89 -11 -146 188 -157 97 -286 116 -278 -53 168 215 49 -64 -308 -114 -136
5874 -136 -373 207 143 72 -232 30 7 -137 -203 -203 152 -33 172 66 21 -140 -166 123 -210 68 89 56 -296
5897 -296 -39 -96 -154 -337 148 32 391 97 27 60 94 203 221 -273 37 86 -38 -35 -43 -54 30 -152 -186 -85 186
5922 186 14 -147 212 -131 -150 261 -34 -33 -83 108 -158 -10 110 90 -44 112 74 119 71 108 10 -147 18
5945 18 -59 -51 -178 -165 30 138 11 -115 68 276 105 -128 0 -54 -82 187 -14 122 13 62 -412 7 88
5968 88 64 31 -113 -99 -155 366 -18 13 -19 -146 -31 -120 -252 158 -23 -177 -109 126 108 133 -35 303 82 111
5992 111 -421 -58 190 161 26 -235 65 -149 -311 -47 136 -135 -232 5 55 -17 -367 -196 -189 191 241 -161
6014 -161 -28 -152 143 64 183 -129 -54 46 -122 -164 -16 -196 -88 21 -133 -370 366 -427 -140 -101 245
6035 245 136 -62 24 36 53 -191 -186 -219 -30 -32 -278 258 -99 -37 218 -265 48 3 -68 380 -77 -206 -164 -105
6059 -105 -284 -34 -68 48 176 -9 -239 -50 71 -137 -79 243 66 -192 -27 -189 19 -38 101 43 -7 -193
6081 -193 -42 -7 98 -159 -205 -41 -137 313 267 -161 -2 193 274 130 -97 -131 -238 -107 189 140 -75 -57 -132
6104 -132 -3 202 -151 -142 31 -23 277 -107 332 -4 -43 -35 102 -6 150 -31 -137 -174 37 318 38 151
6126 151 -130 75 200 222 2 -253 189 -55 -185 18 -175 -232 -97 -148 47 193 19 28 -113 80 -54 140
6148 140 -377 26 159 -162 135 12 105 -38 -115 -246 123 -37 -103 136 117 -3 -254 -116 -212 375 240 -34
6170 -34 128 119 -338 -55 94 70 32 147 -4 -55 -351 -220 255 148 209 36 -16 -73 -57 166 1 -220 258
6193 258 -54 -142 -258 -107 -50 -116 -12 156 117 131 -267 -78 7 301 -272 76 -54 -110 -71 5 20 -186 -160 -52
6217 -52 -223 132 129 -40 -288 10 60 -2 87 103 -61 -31 -44 -36 287 124 275 230 -62 59 23 -76 -46 144 238
6242 238 60 391 1 285 -250 -30 -182 -130 222 -80 -357 301 -73 384 -45 266 112 79 -370 -68 -198
6263 -198 162 467 -179 -154 -149 -49 -91 83 259 -4 -71 -101 -30 232 -22 -238 -67 248 117 30 102 -22 -72
6286 -72 167 -153 192 244 132 -5 29 -37 -90 -186 -395 -57 -19 285 -119 -52 20 179 34 113 -110 204 76
6309 76 -259 130 245 -185 33 -70 35 24 133 -58 150 22 377 136 -4 -19 -112 35 -26 73 46 -96
6331 -96 -106 152 -139 74 122 -51 87 -56 221 -136 17 149 -204 87 412 90 226 -53 -158 118 -6
6352 -6 -230 135 100 -80 -233 48 31 -186 -19 -41 300 113 -69 -101 -230 -19 32 352 320 186 -29 5 -94
6375 -94 -285 -182 109 85 -114 -64 261 398 78 54 16 -108 -67 -382 342 -127 51 -155 -83 -107 -177 307 -299
6398 -299 -205 -44 5 -83 -208 35 175 -48 71 77 109 -297 139 208 62 -187 188 434 123 -143 150 -156
6420 -156 -44 -221 -41 125 -10 15 -21 -195 -46 199 -168 80 127 -486 -84 117 49 128 -31 166 71 -158
6442 -158 -29 272 -439 -43 -57 -114 -101 -203 -120 -132 -73 14 -141 -164 -53 -90 3 166 -18 -111 8 149 -235 -135
6466 -135 -210 -23 13 -33 -40 166 -75 31 -144 67 -16 -338 -451 19 -204 -147 -179 23 -205 -50 302 -127 -136
6489 -136 -371 -89 123 -111 -134 -73 -55 -79 -179 323 187 46 -241 -142 70 -13 175 -197 138 85 -19 284
6511 284 -247 6 35 -172 82 -49 98 156 199 82 107 -16 -27 -103 30 -10 -198 -222 -112 -202 -32 157 -161
6534 -161 -77 -26 -82 -76 67 72 -174 -8 -293 -129 382 -158 -171 -286 -110 226 13 3 -149 21 406 -115 140
6557 140 -97 125 225 -21 -7 144 -295 -12 -4 -47 -14 -173 47 -137 317 -213 133 86 189 214 -60 -167
6579 -167 10 -102 102 -111 -93 -44 -49 -105 36 -153 -27 106 232 -40 -14 -151 181 -109 -141 -30 138 -48
6601 -48 74 3 -185 184 -17 17 239 388 41 -196 -263 397 -62 162 -253 166 128 220 132 186 115 -72 -111
6624 -111 -282 -117 -14 -241 -61 120 -56 -130 56 -25 251 15 21 -47 215 318 -345 45 402 354 26 202
6646 202 94 101 -207 71 -85 -31 -58 -13 83 -58 -126 -292 -111 -123 -232 146 -129 173 116 86 199 -17 146
6669 146 -176 222 77 -163 -23 -15 280 -72 170 -191 22 -213 -193 -186 116 -97 -19 -13 191 -1 8 -86 -165 132
6693 132 -107 -121 -104 241 -74 129 38 135 78 -224 129 313 -64 -34 186 -160 -143 -26 171 -197 -256 146 75
6716 75 124 -130 -184 211 -24 111 156 116 -47 -208 -118 -230 15 44 139 -53 52 -151 120 106 -147 6 281
6739 281 -133 41 72 89 14 341 -128 -186 -380 -343 -44 29 242 97 157 -217 224 -161 41 148 142 27 273
6762 273 76 -165 215 271 368 40 -61 -310 15 116 -262 -11 -158 -14 -92 180 51 -193 99 -41 122
6783 122 -211 67 312 -22 -114 248 -134 65 -37 -55 -3 32 -311 -4 199 155 24 7 43 164 -14 -63 19
6806 19 177 60 142 18 337 198 -250 -135 145 -112 -155 140 122 111 -105 -41 212 166 -5 -103 186 414 -364
6829 -364 233 52 -176 -51 51 -164 63 -135 194 33 83 -173 82 -55 -54 236 -184 355 -49 17 85 250
6851 250 13 -10 106 139 -82 34 93 87 -7 -137 -150 -28 182 107 258 -111 -153 -32 233 24 179 238 -31
6874 -31 55 470 190 16 -160 -40 -151 43 -10 -144 255 192 -87 -133 -133 147 -278 78 -158 39 225 98
6896 98 -246 -140 39 132 15 190 -68 215 44 73 -16 -23 -134 -97 -236 136 41 -127 -91 -272 -85 165 2
6919 2 215 147 39 56 114 188 -95 383 -236 -271 61 -17 -33 72 127 -103 -263 172 80 218 -231 -151 206 -159
6943 -159 60 -155 -35 -10 -17 144 -126 -90 -50 -44 -79 -150 95 313 113 200 -172 30 -298 -221 -24 -2 -193 -324
6967 -324 -52 -357 -53 4 133 97 55 298 -140 -58 124 181 -210 -45 -213 -188 132 -309 184 114 -565 -143
6989 -143 -72 -72 -192 16 -88 -12 91 186 166 54 -89 35 232 -83 -146 -125 142 -100 -22 -394 296 -136 -213
7012 -213 -119 -77 -293 254 -73 138 4 -27 78 38 4 -87 -342 -5 35 138 -91 -295 85 212 -17 209
7034 209 -338 -29 149 70 -130 -80 -46 -103 -82 -172 43 126 83 -367 210 127 -43 294 147 46 -175 -161 -201 -149
7058 -149 124 -127 -19 38 -186 -325 85 113 58 43 333 188 404 1 -76 -112 131 -236 8 -118 -113 249 394
7081 394 -174 -111 81 49 -15 -187 -60 -110 155 152 -6 -149 180 211 -31 121 -237 31 232 178 99 136 109 -219
7105 -219 130 181 113 171 305 -358 -68 -17 -99 68 230 30 -271 -197 157 142 -49 -126 77 176 -50 257 66
7128 66 266 78 -131 372 -37 -78 -75 -16 -49 158 4 -227 -72 -68 -113 -135 -78 261 106 -43 27 -285 205 -265
7152 -265 91 155 -110 -40 -234 -235 397 265 -57 -189 74 -137 -5 -569 -121 -30 200 -35 224 142 -278 -44
7174 -44 -64 127 25 -42 233 142 -8 320 107 225 -46 153 -166 4 119 -129 -158 -55 162 -163 -150 47
7196 47 16 220 -251 268 22 63 67 91 -196 -193 299 -171 -141 -133 122 -285 -467 -102 134 177 146 141 -97 -71 -213
7221 -213 -85 119 4 -178 -19 37 -124 224 -86 105 2 -81 156 205 206 -43 -58 -36 -6 -8 -232 -196 -159 247
7245 247 -51 231 44 18 -82 135 -184 -98 -1 186 73 -45 145 35 103 -38 -55 13 -340 -257 84 -48
7267 -48 187 -26 -123 -32 -348 6 50 -149 -91 186 -143 15 -73 -57 -195 -187 -104 -355 82 -12 -48 -278 -220 -97
7291 -97 6 -166 -150 179 -67 -373 -139 187 -10 66 62 -34 49 216 193 -19 -43 266 43 -350 51 223 -79
7314 -79 -65 14 5 130 -86 85 29 -59 119 80 257 -152 -26 -130 -253 132 -93 86 -21 117 -107 1 -254
7337 -254 -238 89 147 152 83 -36 -210 9 -47 -156 64 147 -466 84 -121 -102 94 99 152 81 -89 -95 150 226 136
7362 136 55 -257 136 -102 28 -137 151 -175 -75 108 14 -87 -190 -176 177 -4 -127 -90 164 289 -31
7383 -31 -98 -26 -106 -118 84 -107 171 91 446 73 -220 -302 20 -121 -164 -205 212 179 124 113 -70 241 21 -9
7407 -9 -114 425 -48 34 131 9 -178 -221 284 -145 -174 -44 199 -321 -343 -427 -28 315 -214 304 -157 -188 91
7430 91 15 -157 -40 -116 203 -33 251 47 -17 121 72 -101 -137 -100 -32 -108 176 -186 -450 -10 -40 -130 357 172
7454 172 -191 -327 -127 177 -307 -120 -89 6 -6 242 256 -279 205 41 85 -172 104 268 0 -66 -108 -44 78
7477 78 -18 -234 -144 -288 -352 17 -88 175 -250 40 0 -284 51 285 105 104 100 -81 -178 223 12 120 -7
7500 -7 368 -77 -49 -16 289 220 14 161 -186 -124 105 -96 -135 42 -288 -139 90 73 205 -58 -115 54 81
7523 81 2 177 -38 -84 114 172 65 -217 47 -76 25 -55 -283 293 -77 26 -17 218 -156 144 -2 22
7545 22 299 105 -188 -360 -33 226 -125 5 189 -80 -38 40 155 216 -292 51 419 69 -128 275 32
7566 32 54 -37 -181 167 89 118 -368 -82 42 -120 180 25 132 104 -110 139 -72 -186 -136 -75 38 103 -450
7589 -450 -208 69 -237 -239 206 164 306 19 129 307 15 -116 27 101 18 -194 84 86 239 -68 -2 -85 -365
7612 -365 123 0 -146 -34 -373 138 224 73 -280 -8 169 -454 -106 219 177 -94 -110 33 241 -47 26
7633 26 214 -284 -185 -221 73 56 21 -26 -214 37 -187 173 280 213 16 -213 332 71 -111 181 306 283 -34
7656 -34 60 269 150 -125 -97 57 87 151 276 190 146 33 134 -198 -187 -49 123 58 126 -88 -213 -122 -223 10
7680 10 -51 12 -134 146 169 28 -196 -153 -240 -107 -253 -41 -35 -65 125 -146 180 22 79 82 23 -196 -106 -159 118
7705 118 -79 -43 93 -179 -165 155 9 -93 102 -1 106 -42 -33 -341 -100 -81 -42 -42 54 23 83 75 -244 -2
7729 -2 -35 74 -156 -6 73 266 -65 0 -20 -4 -146 -266 67 -6 136 124 9 332 -14 -50 48 295 -96 -16
7753 -16 -119 -189 -51 82 234 -103 12 -8 -232 -6 -120 36 -30 -120 -162 -103 73 -214 -423 458 123 -184
7775 -184 -135 -88 -169 -41 -94 -62 165 -197 -58 92 -181 -22 -50 125 -46 -181 45 -97 -49 33 -2 -106 51
7798 51 34 85 99 108 232 -229 -112 -16 -71 -358 9 -376 61 38 156 -59 29 36 -382 237 -153 -418 -328 -143
7822 -143 -375 -62 41 -145 138 -68 54 -56 -246 -24 121 -58 -107 117 101 -227 -222 -147 -4 -52 155 62
7844 62 -185 -5 -95 -83 44 -119 -295 -159 -120 -327 -102 -27 134 224 179 123 66 64 87 281 -35 144 -235 -126
7868 -126 281 314 254 569 107 -93 -183 -135 184 -223 110 -113 -59 172 308 146 -129 145 120 36 81 -22 78
7891 78 40 -7 135 -66 202 322 78 143 -170 246 325 -299 -91 102 -54 132 189 -251 -62 -58 202 52 93
7914 93 -141 104 41 -4 178 73 -113 -32 128 170 0 -260 -27 -79 -34 -263 -150 -395 -182 16 -70 7 -217
7937 -217 -51 -173 -254 -47 192 76 -5 156 433 416 -121 82 125 -276 -127 -5 -309 -79 72 4 238 -66
7959 -66 3 -14 -35 339 -233 56 -50 71 84 -3 -186 114 104 -50 198 -202 -50 -135 93 -454 18 112 86
7982 86 149 47 -137 77 284 -22 62 272 301 205 193 -142 -90 221 81 -1 112 -132 -109 -215 -459 -32 242
8005 242 17 -89 -193 -58 262 -181 -17 -99 67 255 -107 48 -29 -64 89 -370 -122 119 -66 216 -34
8026 -34 75 68 38 -300 -246 -141 -88 159 -143 146 47 -32 168 -18 -182 -122 -290 135 13 90 13 -134 202 -177
8050 -177 118 31 -24 -97 -29 199 112 220 -117 187 -178 20 -163 -74 79 200 -5 26 -292 -115 -108 109 -42
8073 -42 16 -76 44 -19 -146 -168 180 467 -179 -51 -95 -46 -8 143 -39 -52 -240 65 82 -62 425 94 -12
8096 -12 259 -60 -210 -316 -46 -70 -124 -86 95 29 -116 -96 -70 291 -296 -122 -236 33 28 116 170 74 63 -39
8120 -39 -7 32 205 -4 -90 96 -103 -37 141 83 28 -32 -230 15 -396 55 -19 66 -3 215 306 35 332 -39
8144 -39 159 254 88 -5 301 158 -93 14 157 -82 -173 -71 -156 143 59 -153 53 151 -160 287 82 -123
8166 -123 34 116 -200 -27 -229 161 275 76 132 -187 234 51 17 -18 426 -221 -52 85 38 -122 -98 -22
8188 -22 11 147 -134
8191a34
$$ Imaginary data points
##PAGE= N=2
##DATA TABLE= (X++(I..I)), XYDATA
0 0 0 0 0 0 0 0 0 0 0 8 -8 8 -8 16 -16 16 -24 24 -32 39 -40 48 -56 64 -74 87 -96 111 -127 143 -159 179
32 179 -199 223 -248 276 -306 339 -378 418 -463 514 -568 628 -697 773 -861 961 -1077 1212
50 1212 -1374 1570 -1814 2128 -2548 3140 -4035 5547 -8572 16963 -86305 -305276 -75284
63 -75284 150742 88925 -86298 -103265 -32562 27906 43625 6278 -61520 -56730 -8072 -3236
75 -3236 -14256 30473 43263 -19375 -32087 48890 70304 -14657 -72319 -40760 10185 45148
87 45148 46451 -6004 -43198 12481 62585 -6033 -85690 -35969 53052 46815 -4155 -11126 -2374
100 -2374 -7374 165 11963 -4199 -24602 -20396 -7259 8227 21326 -2646 -43825 -23342 43395
113 43395 44208 -33870 -82387 -39838 47602 99452 48708 -64903 -82176 40752 110245 4966
125 4966 -99199 -38360 65073 59625 5869 -10755 -23801 -40210 -10740 35249 30377 -10882
137 -10882 -41354 -40659 9439 71763 42430 -62713 -78844 22771 71270 4190 -45005 -14611
149 -14611 19640 28237 29602 -325 -43149 -22176 34583 25920 -19153 -5811 28118 9089 -8463
162 -8463 20260 19576 -28982 -29918 27874 45270 1199 -32941 -20321 21856 56474 29280 -53887
175 -53887 -77707 6256 75070 31347 -39860 -36652 8525 31327 25262 -5464 -37941 -20737
187 -20737 30470 38534 1545 -13967 -6950 -9822 3539 40823 30396 -34864 -53819 5633 51435
200 51435 25677 -23409 -38610 -7113 40405 40066 -23234 -60505 -11435 45804 31204 -8352
212 -8352 -16369 -14361 -13715 8839 26580 2886 -22698 -9594 8071 4011 764 -4557 -22475 -14451
226 -14451 30628 37460 -19265 -48808 -3972 38729 22059 -16616 -31423 -13021 25056 37846
238 37846 -5290 -45739 -15575 36675 28675 -13001 -24509 -14396 -8600 9287 30651 14453
250 14453 -23170 -29755 -4520 16782 20609 499 -34509 -31795 22552 50428 1682 -47572 -25435
263 -25435 21882 25836 -3168 -26403 -25149 1405 27790 16589 -16769 -19455 4533 9676 -3061
276 -3061 -4118 -2302 -8340 -1108 19305 14990 -13382 -22895 -4358 15495 22520 8431 -23535 -32739
290 -32739 7308 40924 13011 -31996 -25724 13934 26838 5906 -18261 -21517 1656 28406
302 28406 21914 -12166 -25059 -5441 9598 10071 12154 6589 -13976 -17953 10583 27741 5878
315 5878 -22214 -20139 8141 34046 25592 -17589 -43368 -9981 39653 34403 -11545 -29893 -7478
328 -7478 16018 18418 6588 -7665 -10867 1121 10511 4192 -3049 -931 160 1402 11953 15729
342 15729 -3623 -19614 -6052 16124 14842 -3348 -11543 -160 18267 18670 -6544 -27175 -7155
355 -7155 27342 22853 -12471 -24975 -2225 18430 16511 3971 -8389 -12447 -3961 7137 10229
368 10229 4873 -2939 -10480 -3567 17758 22695 -5496 -28972 -10159 25452 27476 -4279 -25625
381 -25625 -14305 13782 24980 5976 -19727 -16091 8847 16111 -831 -11852 -6321 -975 870
394 870 5727 7084 -4010 -15378 -8294 10553 18624 5127 -17819 -21329 2477 23059 10191
407 10191 -15780 -13209 13698 20906 -1458 -20857 -12358 9712 16191 295 -13688 -6815 9211
420 9211 8897 -5674 -10898 -3693 -137 -4055 -1560 5579 821 -12314 -10171 11026 22010 2173
434 2173 -27723 -26261 8334 33200 15277 -18316 -22078 5288 22444 8044 -14102 -15571 -485
447 -485 10047 8480 2825 -857 -4513 -5543 941 9966 7112 -9992 -19882 -4024 18974 17381
461 17381 -7321 -20252 -4269 16245 9168 -14451 -19536 2040 19159 9625 -10735 -13641 1020
474 1020 10318 4512 -3529 -971 4379 2057 -1855 3175 8871 2882 -6751 -4097 8655 10083 -4936
489 -4936 -14084 -1207 17550 13447 -10569 -21976 -3954 18384 13221 -9077 -15116 2678 16143
502 16143 7607 -8255 -11549 -1818 7318 8945 6274 3387 -2473 -8672 -4800 9745 14453 -2891
516 -2891 -19625 -10172 14811 20324 988 -15935 -8306 10346 13686 -3446 -16577 -7067 11925
529 11925 13131 -263 -4761 1729 2579 -4052 -5708 -744 1339 -534 318 4708 6339 758 -7400
544 -7400 -6410 5605 11657 -1502 -16554 -6394 15954 18312 -1049 -14159 -8107 4903 6864
557 6864 -2372 -11216 -6624 4854 8049 899 -4401 -3862 -4922 -4827 2467 8493 621 -10797 -6978
572 -6978 7307 12475 2170 -11679 -10769 4478 14786 3481 -13631 -10531 7933 14132 1845
585 1845 -10379 -9684 -1667 4858 6399 2581 -1436 -2511 -3196 -2585 1475 2810 -4014 -8315 1444 11423
601 11423 4504 -9016 -9226 1143 6581 2469 -6253 -7876 1859 11618 6494 -5997 -5508 5708
615 5708 7358 -1805 -6520 -3492 -682 3466 8478 6299 -3650 -9429 -6438 -1066 4297 4125 -4359
630 -4359 -9669 1168 14572 8561 -7894 -11537 -32 7431 4941 -1142 -5036 -1325 7883 10456
644 10456 1008 -6338 -3638 40 -1526 -73 2533 313 -2140 3508 7684 1495 -6180 -5647 441
659 441 4973 4574 -999 -5549 -125 9023 6787 -3752 -7453 -1743 2034 1492 914 -1521 -2637 1890
675 1890 6428 2530 -4045 -4956 -1468 2628 6838 5282 -3580 -7232 1834 8978 3163 -5594 -5752 -286
691 -286 4998 5720 -1573 -10831 -7658 5221 8777 -868 -7083 -5128 -1276 3304 7216 2625 -6763
706 -6763 -6791 1229 4609 1266 -867 -1372 -2084 2137 7418 1376 -9281 -7888 1761 4038 -68 -825
722 -825 -724 -1195 1491 3042 -2402 -6509 -605 5055 2046 -2796 -2531 -431 1798 4931 2175 -6640
738 -6640 -9128 -175 6116 1987 -3021 -2485 -342 2094 4043 -60 -6882 -6076 1629 4813 1817 -1879
754 -1879 -3744 -2321 3235 6143 -719 -8465 -6028 2533 4352 138 -2440 -3041 -968 3715 3368 -2560
770 -2560 -6093 -1840 3019 2833 1604 -938 -5200 -3483 4692 6954 -711 -5624 -2515 1643 2301 1441
786 1441 -2148 -4860 -381 6799 4169 -4934 -5326 1426 3520 946 -834 -2444 -2512 2341 5466 414
802 414 -4642 -219 4338 2271 -1239 -2433 -4142 -2637 5088 9303 2078 -6021 -3987 2326 3751
817 3751 1520 -2553 -5355 -1678 5935 6525 -1329 -4642 -793 1190 813 1260 9 -3991 -3578 3070
833 3070 5585 1820 -1956 -2229 -419 2129 1814 -2926 -5861 842 8024 4412 -3713 -4622 82 3009
849 3009 3070 1 -4340 -3269 3393 5511 254 -2736 -1248 216 454 1697 589 -3500 -3578 2185
865 2185 4361 674 -2941 -2931 -559 2763 4633 -909 -6844 -3122 5058 4388 -2219 -3481 -159 1893
881 1893 2398 2073 -1917 -4797 -1455 2866 2082 -802 -1974 -2658 -1458 3447 4945 -919 -6337 -2842
897 -2842 2596 951 -2766 -2677 -458 2075 3533 703 -3856 -3730 59 1411 -983 -1322 217 409
913 409 667 1657 -173 -3865 -2530 1892 2431 -1842 -4191 -3318 359 5300 4439 -3036 -7392 -3107 3155
930 3155 3030 -1595 -4144 -2216 2243 5080 2940 -3575 -5112 -1718 1753 2108 1218 -421 -3399 -1666
946 -1666 3784 4601 -757 -4933 -2295 1821 3052 639 -3177 -3611 1424 5293 1445 -3682 -2769 1278
962 1278 1434 -258 -230 -296 -1867 -840 2090 1305 -1088 -855 185 -27 561 293 -2000 -2109 2036 3074
980 3074 -706 -2807 754 3551 1814 -1162 -2864 -2329 848 4112 1935 -2724 -2438 2468 4694 1794
996 1794 -1828 -4851 -4558 437 5260 3891 -2106 -4153 -246 3460 3882 68 -4846 -5514 385 5899
1012 5899 3065 -1957 -2522 773 2738 2596 647 -2232 -3038 -413 2870 3482 2005 279 -976 210
1028 210 2302 800 -2789 -2728 1510 3414 651 -1681 -1197 720 1099 -281 -2293 -2670 49 1441
1044 1441 65 -2165 -1090 604 722 250 -962 -2479 -2265 1012 2450 679 -1605 -1906 201 2262
1060 2262 2546 190 -2910 -1929 2546 3952 448 -3652 -3003 17 3135 3076 -376 -3438 -2244 1309
1076 1309 2221 -45 -2447 -3639 -2508 1102 4013 1684 -2792 -3516 -222 2387 178 -2380 -2806 7
1092 7 2652 2955 672 -1063 180 1383 -146 -1092 -36 421 628 1291 1585 358 -375 445 736 -407
1110 -407 -2340 -3334 -1771 1978 3174 288 -2933 -2432 691 1106 -1412 -4137 -3448 -302 2973 2955 -261
1127 -261 -2636 -1709 894 1922 149 -1694 -2559 -452 2354 3716 1739 -1106 -1266 1031 2430 1263
1143 1263 -1075 -2353 -124 3277 3680 -59 -2639 -1223 701 1379 -176 -1455 -1375 -415 609 366
1159 366 -712 -940 -551 76 302 352 -626 -716 842 1741 19 -894 -159 2110 2381 687 -637 -369 697
1178 697 1923 1170 -1017 -1335 -273 2088 3224 1849 -1484 -3160 -1719 1464 2097 -1029 -3700 -2719
1194 -2719 1081 3169 1999 -1780 -3877 -2126 947 1224 -1141 -2401 -1275 1290 2741 1986 -3
1209 -3 -1227 -850 104 653 1033 817 714 919 1217 1533 466 -701 -524 20 207 -507 -318 943 1043
1228 1043 393 -1222 -1317 -304 104 -871 -1954 -1648 -368 1339 1459 -8 -1474 -1718 -920 1033 1415
1245 1415 -1100 -2977 -889 2259 3577 858 -2315 -1921 1140 3165 2660 -1195 -3132 -1502 1806
1260 1806 3218 1528 -1010 -2120 -1028 1560 2290 -417 -3404 -3429 -316 2085 1756 -461 -2408 -1629
1276 -1629 425 1775 443 -1587 -2114 -326 715 974 1233 757 240 -268 -86 780 684 452 -599 -143
1294 -143 857 1890 1657 797 669 -271 -1005 -1397 424 1693 307 -1905 -986 1660 2584 701 -2569
1311 -2569 -3289 -601 1848 1398 -592 -1937 -637 1020 2578 1605 -382 -2006 -1470 572 2541 1618
1327 1618 -1076 -1616 790 3090 2383 -608 -1758 -1127 509 1737 1504 -202 -1046 -172 1293 1185 361
1344 361 -696 -1412 -979 66 1372 276 -1328 -1010 469 1237 230 -491 -904 -581 -139 -312 -823 242
1362 242 2244 1439 -1224 -1291 1322 2315 -39 -1741 -1504 119 1712 1923 903 -333 -885 7 1189
1379 1189 1300 -44 -1727 -2903 -600 2817 2896 -763 -2482 -1027 1080 1441 -884 -2569 -2396 -222
1395 -222 1733 1625 -148 -1131 -912 -146 372 381 -487 -1616 -877 896 2249 1572 -273 -1546 -811 697
1413 697 724 -703 -1451 -197 942 679 294 -69 374 420 -1189 -1767 -945 610 266 -977 -986 180 808
1432 808 -144 -473 -423 -724 -1584 -237 1105 662 -219 -837 -76 1594 2128 127 -1781 -1028 903 1662
1450 1662 369 -703 160 503 878 1330 662 -745 -1748 -494 807 846 193 -1242 -1189 589 2048
1467 2048 1346 -1273 -2020 -878 292 329 -134 -305 341 1276 787 127 -37 742 422 -1258 -1346 546 1542
1486 1542 1341 633 94 66 359 -371 -235 276 -140 -759 -761 862 2091 933 -1137 -1575 67 944 -282
1505 -282 -1267 -1419 85 1774 2045 350 -1250 -913 -144 702 1003 224 -938 -474 1621 2442 1481 -764
1523 -764 -1080 -21 1160 853 455 -934 -1071 418 1453 399 -143 -417 -580 -480 -123 -22 -431 -1186
1541 -1186 -443 319 615 700 687 -279 -763 -117 619 57 -134 91 536 192 74 908 629 -212 -1292 -1125
1561 -1125 -306 623 105 -1019 -1024 -71 777 911 -140 -1293 -1921 -1312 546 1674 559 -690 -620 689
1579 689 1491 926 -1155 -2009 -916 625 1018 60 -280 9 61 524 955 -151 -997 -805 123 376 892
1598 892 887 661 235 -71 544 37 -585 -1040 -1087 -274 651 566 -64 -212 169 146 -360 -546 368 480 -164 -403
1620 -403 204 1259 1243 156 -897 -1201 -165 1180 342 -1238 -1846 -985 732 1274 483 -1034 -1650 -252
1638 -252 1395 1154 -395 -989 -537 361 1200 1584 734 -811 -1393 -162 1304 483 -580 -1428 -937 981
1656 981 1914 557 -748 -505 -64 672 412 27 -904 -123 515 1457 1223 -38 -681 -560 -583 -450 -391 -262
1676 -262 -213 131 112 361 756 759 -202 -1084 -486 23 914 799 676 -102 367 781 566 -282 -1171 -1631 -658
1697 -658 -20 706 -51 -453 -573 73 393 -50 -530 -971 -1204 -104 1094 1396 -359 -921 89 765 910
1716 910 -192 -1048 -1448 -400 757 715 -84 -353 -577 8 218 207 -170 -1172 -284 457 718 830 183
1735 183 118 132 -43 -10 -6 -272 -260 -662 -944 -88 841 574 -362 -635 -266 -266 367 333 -533 -689 -342 806 918
1758 918 746 193 -403 -871 -528 -24 122 -605 -1260 -715 1196 1445 595 -1268 -1576 -232 934 64 -677
1777 -677 -805 -164 879 1301 995 -419 -575 -743 -19 -145 -285 -267 -208 466 1265 204 -214 -489 -513 -602
1797 -602 -51 719 555 -23 -362 602 1112 790 7 -804 -595 -194 91 65 98 297 295 10 -25 363 111 -387
1819 -387 -590 -397 126 826 723 125 -281 -227 598 1025 72 -959 -1034 -116 697 393 292 142 248 151 -22
1840 -22 -324 -97 -747 -729 -421 640 1182 226 -89 73 193 129 -167 -417 -622 -295 409 178 433 333 21
1861 21 -407 -108 -191 -555 -537 -334 -30 -85 255 690 1035 134 -810 -652 -103 393 281 -446 -221 369 1247
1882 1247 684 367 -580 -960 -396 102 301 -414 -376 93 365 757 108 -245 -736 -799 -160 442 255 -346
1902 -346 -638 202 585 961 24 -1066 -1152 -263 237 323 -185 -108 71 -89 757 421 -279 -832 -750 -106 259
1923 259 175 -440 -275 414 91 -330 -134 -147 -250 -933 -391 -43 512 688 -147 -39 412 843 8 -35 -670
1944 -670 -521 -37 613 935 499 79 172 104 303 -107 -265 -514 -486 -364 293 736 301 -321 -563 101 269
1965 269 186 -744 -728 233 961 1012 359 71 112 -173 -31 -339 -382 183 -185 189 585 647 47 40 76 -234 -16
1988 -16 -227 -134 -62 -474 92 265 884 84 -394 -637 -302 -258 102 -105 -137 88 183 563 686 138 6 -490
2010 -490 -261 287 304 380 -340 46 92 711 705 -30 -1255 -1284 -90 634 274 -336 -372 201 739 519 36 -632
2032 -632 -399 -563 -28 89 560 131 -94 89 855 798 -64 -439 -393 15 228 281 153 53 156 108 -308
2053 -308 -228 -218 -707 -733 -587 -141 130 -25 -87 -35 24 263 -181 -931 -563 -547 -269 291 440 398 428 205 -170
2076 -170 -30 143 -91 -101 -519 523 912 637 124 -428 319 314 261 -701 -341 -364 -10 -26 323 101 -145 -461
2098 -461 -650 -95 89 -332 -549 -477 -21 380 423 107 146 240 135 -373 172 368 494 393 349 368 633 662
2120 662 41 -223 -410 -34 -39 -50 -213 72 78 -71 -78 30 276 -736 -1202 -677 462 765 169 -262 -371 857
2142 857 1046 43 -863 -364 143 112 -56 403 888 633 36 252 960 457 -255 -764 -382 669 1022 187
2162 187 -433 -32 475 720 -506 -923 -534 -430 -423 -163 230 254 84 -330 -316 284 307 14 -597 -341 693
2183 693 944 591 404 459 818 26 -313 106 386 -62 -319 -454 342 933 195 -960 -648 158 737 -69
2203 -69 -1156 -559 357 322 293 -128 332 -103 -551 -570 -8 34 -253 -944 -389 711 1306 -89 -773 -225 620
2224 620 481 -115 -232 471 445 295 173 526 1004 148 -390 -906 -137 326 408 -667 -692 321 876 -222
2244 -222 -579 -199 -64 9 -815 -294 697 636 -85 -561 220 1098 25 -1028 -1742 -105 785 433 -668
2263 -668 -488 1116 1208 -8 -451 -12 371 -286 -615 409 1163 655 -408 -466 650 1352 186 -1517
2281 -1517 -1304 -88 907 -42 -785 -138 155 254 -363 -531 36 -506 -725 -602 335 1203 598 -363 -480 628
2301 628 777 -70 -1032 -471 427 627 -19 -155 358 788 18 -474 -96 644 420 -632 -836 452 1451
2320 1451 830 -559 -727 241 728 -372 -1292 -438 296 386 -556 -208 1072 842 -401 -1107 7 1242
2338 1242 470 -776 -875 532 1420 754 -503 -467 690 356 -689 -932 122 438 -226 -244 272 808 647
2357 647 -572 -817 -328 759 -155 -820 -520 568 1224 -62 -810 -152 525 26 -1164 -548 488 1046
2375 1046 -149 -547 201 1184 921 -848 -1080 488 1003 -107 -858 276 1237 607 -618 -688 575 876
2393 876 -314 -1510 -743 973 1228 -364 -1005 54 964 261 -760 -1096 201 189 -158 -732 208 927
2411 927 204 -626 -682 727 721 -845 -1174 -292 1169 1029 -557 -749 278 783 53 -865 -594 189 400
2430 400 -456 -478 746 1431 314 -726 -490 969 929 -769 -1310 -196 1143 267 -700 -423 892 1219
2448 1219 -726 -1393 -20 790 253 -1281 -726 1124 1467 -140 -1440 -510 1045 342 -694 -507 321
2465 321 1379 256 -563 51 1401 395 -1008 -994 306 874 523 -931 -497 751 1091 -403 -1235
2482 -1235 -441 594 -69 -929 -884 589 777 -190 -781 103 1166 356 -1037 -1139 360 1039 364 -1068
2500 -1068 -255 1163 760 -537 -852 221 742 -444 -1106 -86 1480 1173 -611 -1083 307 1421 -24
2517 -24 -1859 -1180 857 1042 -412 -784 -49 1022 293 -645 -575 390 486 -684 -1344 477 1387 768 -1463
2536 -1463 -783 636 1289 -29 -1128 -893 783 1156 -93 -407 624 1056 -83 -1000 -349 583 218
2553 218 -895 -1185 476 1511 203 -1161 -826 663 911 -714 -1167 -295 787 202 -821 -317 1047
2570 1047 1137 -691 -1690 -231 1108 -84 -900 -1123 691 1450 218 -1017 -291 797 209 -811 -906
2587 -906 298 1423 -4 -1307 -351 1291 938 -834 -1475 -26 1109 176 -995 -752 776 1232 -120
2604 -120 -954 -496 370 -31 -1041 -758 781 1323 -44 -1007 -6 1144 946 -1185 -1209 143 1413 231
2622 231 -1201 -401 1032 851 -667 -723 221 1230 -361 -1495 -642 1292 1231 -324 -1116 247 1063 508
2640 508 -942 -937 454 262 -218 -1017 304 1399 61 -951 -605 853 674 -689 -1480 -398 1443
2657 1443 712 -786 -615 409 842 -5 -961 -591 829 518 -751 -463 709 1222 284 -1211 -683 1014
2675 1014 948 -585 -1423 16 1134 886 -544 -455 480 543 -270 -1037 192 802 29 -1439 -653 939
2693 939 1216 -187 -1420 -471 910 564 -878 -995 736 1152 122 -1024 -238 733 523 -1059 -1160
2710 -1160 375 1384 376 -1048 -475 1190 1464 -586 -1444 -331 743 119 -783 -771 542 1229 115
2727 115 -1023 -67 1000 -63 -1397 -1305 508 1256 -214 -1022 -273 819 557 -577 -1065 332 730
2744 730 -346 -954 -108 1135 857 -296 -1018 368 1090 -40 -1309 -632 757 1203 -168 -1222 249
2761 249 836 289 -503 -509 527 498 -471 -657 555 1199 747 -838 -914 320 531 -458 -1407 -378 791
2780 791 657 -275 -733 321 1030 13 -889 -424 772 754 -441 -1509 86 1541 616 -1000 -1038 451
2798 451 829 -528 -1382 -138 940 440 -656 -471 906 888 -453 -1463 -292 978 456 -739 -657
2815 -657 550 1313 537 -1172 -516 499 161 -736 -536 473 879 258 -1056 75 1250 635 -790
2832 -790 -998 50 851 280 -684 -446 800 775 -158 -730 -329 317 0 -886 -353 713 774 -71 -868 200
2852 200 782 470 -1213 -1471 104 915 578 -922 -10 619 443 -729 -1120 263 814 -239 -637 -457
2870 -457 862 915 -472 -776 -93 997 38 -1375 -840 372 640 -421 -509 188 843 67 -809 -427 375
2889 375 664 -406 -1182 -156 1178 1066 -254 -784 329 390 -182 -654 -425 902 657 -717 -647 433
2907 433 985 114 -1058 -680 770 716 -327 -1129 -88 925 496 -625 -461 334 564 -472 -1060 21
2925 21 597 91 -476 -575 726 533 -438 -1225 -486 596 423 -725 -840 346 787 45 -412 140 293
2944 293 174 -665 -531 314 636 217 -576 -575 818 581 -222 -906 -532 384 339 -296 -155 361 630 -242 -420
2965 -420 170 601 24 -673 -533 157 445 -16 -499 52 1052 764 -554 -864 -40 209 19 -693 -53
2984 -53 849 626 -397 -826 82 806 -376 -1067 -473 566 780 4 -493 -170 610 231 -787 -392 396
3003 396 331 -539 -465 311 824 425 -684 -265 92 401 -186 -639 -267 577 508 40 -226 159 591 -88 -849
3024 -849 -48 475 310 -320 -269 494 898 260 -697 -552 161 342 -218 -579 128 824 292 -435 -245 489
3044 489 301 -579 -841 -369 533 590 -351 -627 343 504 27 -970 -375 520 167 -783 -353 305 571 329
3064 329 -263 -17 369 -201 -495 -727 17 484 354 -353 -105 347 647 31 -371 -130 236 202 -423 -202
3084 -202 82 535 1 -593 -133 473 191 -449 -521 294 401 535 -621 -169 533 286 -634 -394 416 220
3104 220 -448 -566 -212 481 581 -277 -396 262 544 44 -676 -541 -66 185 -39 -348 177 -26 -77 -154 -487
3125 -487 190 112 -251 -374 -160 610 568 -187 -231 164 72 3 -330 -472 -48 314 100 -109 -119 367 162 -438
3147 -438 -383 663 273 -27 -451 52 557 186 -109 -519 17 85 -75 -397 -156 322 -90 -119 69 294 524
3168 524 -100 -740 -326 175 403 -208 -499 347 767 296 -363 -9 237 -168 -556 -358 568 113 83 -7 93
3189 93 233 474 -13 -337 -173 -77 -51 193 259 -19 220 39 31 -287 244 253 -618 -130 232 343 -170 -366 -73
3212 -73 301 287 131 -644 -42 287 364 -86 -343 504 523 -226 -349 242 206 -412 -722 -338 371 439 236 -448
3234 -448 182 243 52 -446 -319 19 41 86 -113 130 562 112 -230 -299 95 95 -114 -179 -214 475 829 129 -23
3257 -23 -256 82 10 -79 -110 94 192 31 -64 395 189 -52 -134 -231 -121 -299 -293 -159 32 433 380 38 95 18
3281 18 165 -325 -323 25 159 70 -145 -43 471 483 -94 -234 -328 360 -398 -88 -221 31 213 170 275 17
3303 17 172 -80 -302 -374 72 271 25 -226 75 7 338 47 -120 -209 -379 77 -17 -6 381 403 125 8
3325 8 -314 157 -101 -204 -290 -489 4 69 211 -97 -3 -155 -291 -297 -158 -431 -406 1 -154 189 377 255 -542
3348 -542 -335 -25 -403 -505 -215 224 111 154 6 441 157 32 -226 -185 85 17 -107 -30 157 409 146
3369 146 -186 -347 -202 111 51 -293 -193 82 101 189 -136 -202 -118 -24 -1 -343 -113 304 131 -93 -172 240 343
3392 343 152 -10 -154 80 194 116 128 391 15 319 67 -28 246 -318 -149 -17 66 -172 -460 83 122 -121
3414 -121 7 -185 154 -147 -274 -149 -85 116 60 6 -126 271 134 485 -68 -523 -22 304 343 -161 -33
3435 -33 -92 156 336 -72 236 -45 -316 -337 -223 246 212 111 514 -32 286 -91 -222 -224 -239 -42 64 93 90
3458 90 225 177 36 -142 -327 32 -253 -91 171 35 641 -100 1 -28 -40 -47 289 -24 -147 -226 153 -50
3480 -50 336 450 -15 -159 -121 339 -76 -95 -191 -116 137 323 80 -131 -313 -123 -194 -331 123 240 -568 130
3502 130 117 15 89 -288 -242 -287 -181 277 -140 17 -183 331 112 255 153 100 -276 -187 -116 326 451 -80
3524 -80 2 -143 186 -68 337 -436 -133 -47 168 91 121 203 -135 107 -69 296 -25 -233 -156 119 -4 -21 139
3547 139 -2 278 349 -173 0 107 -185 -241 -149 377 17 91 233 94 138 -141 -22 33 156 -66 -142 34
3569 34 -14 -32 213 251 138 -115 -63 -198 44 -268 44 -90 267 31 43 -34 -118 51 -206 161 -274 148 280
3592 280 -43 -63 -171 265 -111 -175 -73 -66 -36 -311 317 33 44 -181 25 25 -112 -150 -417 -30 -161 120 144
3615 144 397 218 -51 -50 -350 -99 88 -209 137 -83 396 55 441 71 109 -124 -152 163 -45 -127 23 -91
3637 -91 177 57 278 122 6 -301 -232 122 58 60 100 94 155 153 233 -163 103 -103 -134 54 -192 -20 -172 -130 240
3662 240 278 78 50 -234 -418 75 -71 39 120 99 -112 92 94 -133 -72 255 -214 24 0 73 -24 33 101 192
3686 192 64 -66 -180 -319 74 -60 315 51 5 36 435 -121 19 -104 215 -192 -123 -20 187 66 88
3707 88 -160 117 -264 -99 -227 -339 -66 8 76 -94 193 -145 175 -214 -174 206 -34 -93 -112 -412 83 229
3729 229 211 -70 -148 111 110 -280 -50 -140 -142 -102 51 185 346 188 -331 -175 -222 191 72 57 319 403 653 266
3753 266 -204 -272 27 -144 -109 150 163 191 30 138 224 313 36 -208 -316 -55 -469 245 91 -169 403 259
3775 259 45 -217 -256 99 55 -164 68 50 -105 -200 21 276 77 197 -27 -459 -144 16 4 63 59 3 69
3798 69 -158 -171 -215 -151 -92 -310 -58 116 -36 -110 -57 -33 59 -281 -136 26 126 209 77 171 57 118 -27 -223
3822 -223 -48 115 0 -157 209 72 -35 224 193 197 -48 0 -281 238 212 -185 -110 100 -53 203 144 -108
3844 -108 7 -68 -171 -123 -119 90 -89 469 -77 -91 -81 -232 -381 -274 -44 -61 70 -66 -160 69 456 130 -119
3867 -119 -245 -129 183 -359 -168 -297 11 150 58 13 -140 155 -17 -23 165 -224 -97 356 126 210 -112 157
3889 157 -66 -218 -105 -26 -179 352 77 -178 81 -123 316 143 -68 -130 -173 -51 155 89 -70 318 113
3910 113 208 91 -41 -19 -160 -215 206 175 63 137 -114 15 -25 -143 -263 41 -187 -140 107 81 36 82 -33
3933 -33 206 15 -361 -403 127 14 -156 -152 34 67 -85 134 -98 -70 -8 62 -13 208 127 -40 -212 250 218 55
3957 55 24 139 57 -143 -23 -176 52 283 -98 93 30 -150 -37 -114 142 97 73 -119 131 270 -104 140
3979 140 -154 244 107 72 -30 -86 -1 -35 -8 -37 -11 -103 282 -122 -74 -98 73 47 -95 76 285 134 48 -105
4003 -105 -93 -205 112 108 -48 -182 179 92 -11 31 -20 -225 21 -61 -127 38 44 329 141 72 201 47 -100 -387
4027 -387 -155 -196 -88 346 -41 78 -31 -105 -229 -77 -15 149 -220 -47 97 8 -81 77 135 -139 -59 91
4049 91 -153 98 148 46 97 192 -80 53 -50 -172 -110 -114 -18 287 -35 116 -103 258 82 -138 161 -196 63
4072 63 -101 126 -68 66 51 518 -234 -14 -417 -605 -114 212 -72 -168 137 -233 37 -143 -170 -11 -45 -162
4094 -162 -229 -28 -52 102 56 57 140 -126 199 -7 -4 -70 -27 -80 -61 25 194 166 246 -110 -73 -29 -72 -104 -359 -7
4120 -7 193 191 180 -11 215 57 87 12 111 17 16 335 136 214 26 -48 -98 -86 -22 -99 -116 -135 250 206 -26 -61 -144
4147 -144 -16 -14 -239 -383 -67 -189 101 -88 -208 -300 225 -207 -93 -255 14 145 -50 -190 63 299 255
4168 255 53 303 238 -63 -26 -37 136 259 70 -6 -61 193 -313 -392 7 -191 -42 -85 47 -85 49 -13 249
4191 249 -128 -34 -246 -178 111 70 -142 -55 -88 -39 204 355 138 -144 -60 -14 292 1 -130 75 -60 220 -77
4214 -77 -20 53 33 -82 -556 -72 16 264 113 -116 93 -60 88 -191 -75 -258 -18 -54 -34 414 318 -118 187
4237 187 90 68 161 -3 -194 -98 -135 -26 75 81 117 -117 1 45 -246 -223 -131 9 328 253 -178 197 -35 -64
4261 -64 -107 -129 -101 -59 7 345 -16 -200 263 98 -2 240 -339 -1 -369 177 234 6 -46 82 -78 114 -106
4284 -106 218 -362 -310 -2 59 101 -244 -288 223 64 109 38 -130 90 -179 157 -126 113 282 321 316 -157 -104
4307 -104 93 -444 154 65 292 -69 -75 178 157 73 -231 -12 77 10 258 69 -276 162 -184 51 297 -22
4329 -22 31 -41 -132 160 -426 227 263 143 -13 -21 -132 147 -35 -58 -80 -297 -182 109 60 40 -131 -129 -244 -371
4353 -371 19 -29 18 129 152 -72 -225 -7 27 -210 -439 -85 122 193 -226 -313 70 175 -26 125 89 -94
4375 -94 -431 -5 -11 137 -217 121 -9 142 208 60 -168 54 -197 -355 260 -53 307 160 316 76 -107
4396 -107 110 -2 -11 276 -25 4 40 321 397 -57 -283 102 71 -208 -155 -59 -85 -203 223 232 216 -22 -158 -50
4420 -50 40 -3 -4 128 13 -181 19 -209 67 162 2 105 -20 -87 -96 -213 81 75 114 64 42 89 -150 -78 220
4445 220 -253 -43 -273 -71 84 269 138 -214 -126 -92 259 -207 71 104 -85 -10 -80 -115 225 -210 264 50
4467 50 148 -39 -5 -16 125 -257 41 -8 -133 158 -284 -32 324 -223 40 244 380 344 97 56 -243 351
4489 351 -255 48 -27 -48 128 301 180 -152 257 43 -196 34 30 -29 181 132 195 167 -96 -5 282 -44 -156
4512 -156 -70 60 248 10 435 355 105 -197 233 -202 -296 -158 11 -62 120 -121 -57 326 -62 49 -274 1
4534 1 -202 193 -166 118 -189 -48 -71 -99 41 104 129 -309 3 160 334 109 -193 -70 44 -162 -86 314
4556 314 -215 -88 178 79 150 -160 -96 -162 66 -69 -57 -287 -135 306 6 -371 -62 70 215 -51 -347 -93
4578 -93 -90 -140 61 -190 200 11 34 17 77 55 116 -13 -192 -115 -328 161 -34 -48 -81 178 16 -114 51 -155
4602 -155 -39 287 -14 -91 116 152 -165 122 -61 -240 -57 -151 -137 185 47 86 307 -61 233 -266 -122 210
4624 210 -27 -151 -65 49 29 -250 47 -452 13 83 -75 -16 -4 -152 195 -233 -135 109 -107 -68 -12 49 238
4647 238 17 145 -101 -3 14 101 -40 -243 -64 -247 33 -60 -27 -79 -156 -99 55 -208 -45 -158 -8 64 6
4670 6 41 -21 61 -5 203 30 155 212 252 203 23 59 -151 82 80 -93 -55 65 -3 -61 -196 -182 -204 -179 -62 27
4696 27 -15 9 32 -81 273 45 -222 -45 66 -394 50 31 110 19 -160 -147 181 161 -45 0 178 66 61 -114
4720 -114 -186 -15 -36 -9 -3 15 33 -18 -37 -28 86 68 202 3 -28 167 81 -67 -162 229 -126 268 -197 -92 80
4745 80 -41 437 147 -113 -64 117 -225 47 49 -15 -274 326 -25 69 -151 -20 -146 18 285 45 99 -72
4767 -72 -82 -132 201 20 -127 -238 -83 -175 67 303 31 -111 107 -163 -93 76 -30 -110 56 28 -308 132
4789 132 79 164 69 -69 23 -189 -194 31 -38 135 180 70 9 -127 25 -157 224 -156 -13 -240 -61 -83 139
4812 139 138 -10 -29 108 -92 -51 -99 78 -167 145 182 -2 54 148 -58 216 -17 -238 9 -119 -163 156 133
4835 133 -80 84 -120 -24 -243 230 -3 -351 -329 -205 195 59 118 -1 156 -59 -111 123 47 280 76 -65
4857 -65 -44 -64 17 -289 -148 -99 -21 -120 49 -82 240 58 -112 332 -17 345 241 -279 250 -451 78 247
4879 247 -23 -152 -86 -117 -152 124 51 -25 157 186 149 -164 -301 16 -137 154 -66 -120 -65 82 5 46 -150 338
4903 338 167 -75 172 -82 177 -93 -36 -61 -15 -62 -201 -145 -29 102 67 39 -17 -167 -258 -373 76 -14 -243
4926 -243 125 -156 31 151 60 -19 -99 200 408 68 164 278 -265 9 -221 -225 -58 103 67 -221 -11 71 -47
4949 -47 -84 -100 110 22 250 246 285 122 -94 -44 21 -405 -48 327 -210 -226 -61 -4 41 11 -37 -176 198 -334 -145
4974 -145 53 -45 422 -37 -15 -73 -138 -81 -75 -86 -41 -206 126 -3 56 89 58 -117 -124 -175 307 -235 117 102 28 -17
5000 -17 77 -2 -197 251 9 -279 -271 -61 -192 120 -163 -216 228 50 98 -328 45 -32 73 -414 25 48 266
5023 266 11 -297 122 324 51 -74 157 49 -96 154 -37 -5 160 -123 35 3 120 -82 28 20 184
5044 184 -8 171 -50 -129 255 -41 -305 -199 -41 62 -43 -79 -46 -19 -145 234 -119 -158 107 -142 -318 -135
5066 -135 36 156 -49 -249 16 -196 203 -90 -225 158 13 -87 27 -174 67 -131 -116 245 -181 -89 -206
5087 -206 172 -58 -83 -19 58 37 -33 -119 -74 -181 -197 -178 257 148 194 139 24 -50 75 -223 -204 -165 -158 73 23 144
5113 144 189 -24 201 -156 94 67 -95 65 -119 121 76 46 222 142 190 -39 42 -175 -148 268 -23 69 149
5136 149 -161 90 -113 -36 1 -124 -30 169 183 91 176 153 -101 -275 -39 -60 -247 48 -80 -223 15 -61 -47
5159 -47 382 207 -24 140 25 -153 112 -80 -59 250 -352 -308 87 14 -76 22 -6 3 322 154 96 325 136
5182 136 -4 281 -143 60 -178 17 104 152 -161 67 153 -117 -322 -187 -48 -172 -227 -173 32 52 58 -4 37
5205 37 255 -235 -14 225 174 -97 10 167 182 101 132 -344 -65 277 390 -184 -94 -159 -52 -60 5 138 173 343
5229 343 -79 -299 -71 33 -47 -327 -141 166 -162 19 121 218 107 253 -55 -340 -197 296 27 -139 -13
5250 -13 -21 45 -80 91 116 -68 162 -50 23 178 -117 -212 5 15 -235 -156 -292 36 -219 267 -18 -52 218
5273 218 308 -86 150 191 -44 234 50 162 111 -47 -46 -77 -83 -15 30 294 -16 98 -270 -153 -12 75 -58 -263
5297 -263 -36 -66 -190 -150 78 56 41 345 -196 58 -70 -120 148 53 -148 -376 49 -30 -120 -258 -53 -18 -275
5320 -275 20 -329 -213 -203 -16 -114 87 55 -7 -9 -21 -206 23 3 -239 -192 87 9 6 148 197 -145 10 192
5344 192 -183 61 130 136 107 293 -64 95 174 -7 107 26 -231 -163 211 228 60 346 233 -158 -22 221 203
5367 203 -176 54 -133 52 -148 -77 -268 -69 249 -58 69 -1 -33 10 84 -78 53 50 196 11 -78 -156 129
5390 129 -80 269 -45 -135 5 47 -23 -35 42 -313 -18 140 169 7 72 -239 186 187 324 59 -11 213 -52
5413 -52 -286 -37 355 101 80 -53 88 -396 -21 44 -78 -89 -174 -20 -71 17 -20 -76 45 -86 -428 39 23
5436 23 176 187 -6 56 -49 -58 187 -79 13 68 127 -110 -501 -153 -120 3 -154 -168 231 39 -110 191 -82
5459 -82 -444 -326 389 -12 96 -140 -87 -18 -120 176 112 -115 -193 -236 99 148 168 30 -174 -346 -29 -17 -16 -174
5483 -174 -70 -149 150 -76 -164 127 -214 124 87 95 171 -109 -120 53 -384 121 16 -77 152 -11 -61 -216 157
5506 157 78 -98 -189 154 79 -329 -57 -164 -4 -87 227 -301 -12 7 -31 -282 -20 -263 -193 -81 211 -125
5528 -125 -136 18 6 -284 255 -309 -250 280 -228 137 221 -380 3 154 -330 67 229 84 -135 -36 -88 -169
5550 -169 82 -158 -42 89 -2 123 120 114 197 -14 -20 14 -256 43 -79 -29 -78 -63 -304 -57 117 -109 -53 142
5574 142 111 -2 98 -2 -40 55 24 -156 39 -55 -97 232 -2 272 22 -134 16 -148 -102 259 -96 -5 270
5597 270 -366 82 213 261 226 -179 -328 -238 182 80 321 92 -111 -209 -354 57 238 144 -5 -43 -187 -92
5619 -92 -8 141 -191 21 157 145 -159 -212 -80 -319 -74 154 -110 -163 -79 -106 137 270 -102 29 114 206 158
5642 158 350 -138 -351 -115 -28 -469 -75 93 120 138 228 -44 108 202 26 20 317 56 -3 -136 149 -162 -191
5665 -191 17 34 264 -187 176 -81 -62 -90 75 -178 -92 11 94 185 -144 -170 -157 -135 -107 24 33 -466 -66 -47
5689 -47 3 61 127 36 -96 99 217 75 -16 -73 167 -106 65 -17 -71 -13 99 -53 -98 116 -32 86 329 198
5713 198 244 33 -1 -176 -302 -124 272 40 -164 -160 271 -319 63 -95 -74 100 21 -38 167 -97 40 -103
5735 -103 74 -107 -71 96 -233 128 -70 153 70 185 -24 -135 14 173 -67 66 38 45 66 6 140 97 115
5758 115 -34 -18 184 -198 -72 223 91 -39 -309 -20 55 -35 -281 -223 273 -45 177 -269 -224 283 252 -221
5780 -221 67 -144 32 -80 -87 65 -25 -22 53 -303 23 130 -21 -235 -51 6 89 399 106 -142 -81 29 -43
5803 -43 -170 194 172 117 -19 23 -389 219 33 -240 111 132 -81 49 318 -35 303 -318 -188 155 99 53
5825 53 165 38 137 69 113 36 76 -154 10 -173 -48 -171 -167 122 -96 10 -164 119 117 69 78 233 120 107 -178
5850 -178 43 -60 -201 -2 -245 -44 46 -136 84 468 17 229 40 -402 61 183 -25 -107 -92 -147 -216 -2
5872 -2 -39 300 130 -38 -146 -323 -153 174 136 98 -139 97 0 48 120 -12 52 27 1 -17 147 -26 85 18
5896 18 -190 78 -16 -6 168 -78 -4 -114 18 319 150 -7 -214 -291 -5 -127 206 35 56 327 52 5
5918 5 -119 146 168 178 -200 128 12 -21 192 -80 -15 8 -270 60 156 -9 217 -42 -47 90 -71 -237 -80
5941 -80 -146 -202 174 -214 -47 124 250 -20 -99 289 -147 -155 155 37 -18 152 87 104 -41 155 -208 -101 -144
5964 -144 225 -92 22 -68 -217 62 -125 -213 -127 -153 95 -22 225 -13 -173 -129 16 -169 -133 5 -14 -15 -83
5987 -83 65 172 -178 -34 -12 184 -190 40 -439 -138 -224 -1 -217 -64 147 -33 273 99 -204 -123 193
6008 193 -476 -22 -129 93 -279 363 -129 -20 -80 -44 -37 -40 132 40 97 99 -22 206 45 154 -304 -35 107
6031 107 97 -479 53 -114 209 107 -43 20 -18 101 -165 -43 -132 79 231 -70 -97 -80 21 181 -75 199
6053 199 61 2 76 5 152 -333 -279 -118 55 297 -99 79 70 5 -26 117 16 -210 162 66 -28 -138 -66 -36
6077 -36 -210 152 254 -47 53 -69 82 -169 -109 -166 -43 19 -92 271 152 24 -194 -3 113 126 287 -62
6099 -62 -108 -59 59 -104 268 135 82 -121 -172 434 97 140 -39 159 -55 75 -45 -32 55 129 57 -223 270
6122 270 -69 254 13 -346 -62 -299 -13 -35 244 24 -65 -5 180 -50 -90 -243 148 174 -86 -172 -146 -274
6144 -274 197 149 34 256 56 -235 -108 -197 54 -207 -247 -30 189 -118 129 202 47 -42 -183 10 -72 320
6166 320 103 99 -228 329 100 57 -81 -267 328 -58 118 48 61 301 -79 -20 97 187 -237 -78 -251 -17
6188 -17 -268 72 -30 -59 18 61 26 210 132 20 -27 -297 199 -41 147 73 -26 -136 -161 6 -134 303 -19
6211 -19 6 310 79 77 -22 -242 -60 38 -238 -117 172 -231 -62 -65 -140 48 173 136 28 132 -8 195 -29
6234 -29 -152 -166 -48 -166 -276 327 325 24 -94 37 -234 74 -192 -114 -124 74 -29 -36 -105 -137 -277 -27 291
6257 291 76 189 -146 131 -45 270 -58 -156 -77 -99 -59 -21 261 103 74 -144 -53 -64 -235 269 115 -51 -288
6280 -288 -47 79 -237 -191 16 -167 -121 -25 -56 -189 -113 150 218 -90 -213 -266 -22 -192 40 -29 105 118 -1
6303 -1 123 237 44 106 -137 34 -65 -75 -72 -101 163 -152 134 -77 118 404 159 101 -231 169 -89 147 171
6326 171 57 260 107 70 15 -193 -60 207 -87 -45 -19 -9 0 51 -62 74 272 273 67 -17 36 282 -194 184
6350 184 105 43 60 -114 -257 7 172 269 -132 -199 -173 89 -79 10 304 203 204 -68 -27 66 275 -72 -27 -69
6374 -69 54 276 -150 3 272 -79 -214 -94 5 -115 -92 -41 -20 63 -47 -102 206 183 -236 -105 278 164 210
6397 210 111 103 122 72 29 -63 -151 -58 205 88 0 26 12 -66 95 49 -248 -110 9 96 -2 5 241 34 -96 -92 239
6424 239 270 -252 67 -35 84 -157 -381 -106 -130 236 -124 -168 -60 -192 124 145 18 -94 -74 -57 -168 251
6446 251 60 47 -163 61 -137 -95 -109 -263 -268 270 -286 -147 86 -48 5 36 7 -66 -11 -335 -114 -14 -12 -51
6470 -51 67 346 -76 -38 21 -74 131 -280 -127 -43 236 23 -210 306 -113 49 15 60 -63 -4 261 244 49
6493 49 -62 281 217 79 -238 -257 -99 250 -173 -186 -181 349 -209 92 101 -292 -161 -58 28 86 21 200 -81 -55
6517 -55 -19 -28 72 -361 -92 -50 -88 263 -16 -150 79 14 121 -61 -95 132 25 -48 -27 29 171 -207 -223 -330
6541 -330 -200 18 140 281 -141 16 -240 29 -272 -387 -153 -16 111 -70 -153 106 -122 315 -163 -115 30
6562 30 -72 -102 40 -65 98 118 -208 -27 105 47 -76 233 133 -78 126 -75 -109 102 -24 259 39 -98
6584 -98 190 103 -84 78 -24 68 -143 80 254 84 145 7 -135 -231 179 330 -152 105 236 208 76 279
6606 279 241 -48 23 -121 396 -8 21 201 -158 45 73 171 171 -133 -196 -90 123 2 60 -5 -2 222 -133 23
6630 23 160 -170 -40 -243 -262 160 158 -110 -461 -37 -122 -8 213 115 145 -170 -128 154 31 203 -192 -137 176
6653 176 74 321 130 21 -249 146 204 -42 89 -36 63 -23 42 -5 -65 59 -110 85 -86 213 247 -109
6675 -109 -20 -88 -101 -48 -141 65 334 -34 1 101 148 -23 157 -136 53 -28 75 225 -87 174 -190 44 -291
6698 -291 42 146 -68 81 -58 104 61 17 -219 38 -24 -162 -212 118 -77 -34 26 -61 5 178 -185 -247 134
6721 134 -96 69 -111 59 -266 -105 -104 193 -85 65 -55 7 43 3 -112 168 7 -105 89 122 -24 102
6743 102 317 256 172 133 133 79 -79 -54 304 166 -195 360 -164 -173 153 153 111 -6 -14 182 41 76 32 -167 -271
6768 -271 4 116 -11 -13 92 -238 -11 -82 43 62 23 90 -64 -82 -298 39 153 -187 -2 124 72 -74 -128
6791 -128 3 -159 119 79 249 -267 -77 159 136 274 -145 167 97 18 160 63 -116 -57 -26 54 271 21 -1
6814 -1 220 180 97 37 201 115 -266 291 27 5 -235 126 24 -237 38 494 71 -219 -41 -18 216 -9 -257
6837 -257 260 133 78 70 -268 240 -160 -217 -112 -7 -12 141 76 -193 -133 156 -62 157 263 35 -59 -20 89
6860 89 -107 554 139 -19 320 -14 -197 -202 90 -141 31 -256 80 171 75 108 112 133 -264 150 9 -90 -114 -170
6884 -170 140 89 172 240 154 -32 -56 245 46 103 55 277 177 -62 -45 -124 -36 26 -201 59 207 -181 -255 -389
6908 -389 -5 -238 127 -170 89 328 -77 5 188 115 -13 -46 -198 120 85 212 -359 -298 -26 -40 -101 292
6930 292 4 48 30 3 -282 366 -28 123 -13 6 91 144 456 127 -190 246 -78 65 -193 -74 -157 -53
6952 -53 -50 -330 -182 -127 -365 -109 80 -432 -24 337 -68 -221 627 77 154 -176 -188 -150 -314 146 -193 -204 123
6975 123 -110 122 -11 -321 161 122 -107 263 134 -199 -391 -158 14 -50 -129 255 332 14 -70 -129 202 31
6997 31 232 -20 197 603 196 158 108 -4 152 46 -78 300 397 72 217 -230 -170 22 46 -5 31 32 163
7020 163 92 -74 183 -115 133 -144 -11 -29 -197 -64 -60 -340 289 -112 181 143 37 -150 18 75 145 5
7042 5 166 -226 -28 0 -13 156 2 128 -45 -148 -159 -207 -123 39 -18 -42 17 -30 -204 14 -31 279 -98 332
7066 332 -127 -74 -96 -273 22 -145 286 -426 -108 335 8 -19 -219 157 36 187 -213 -38 -305 261 11
7087 11 77 -64 -332 -61 49 216 -159 28 -96 -76 237 9 128 -18 -113 5 66 14 -60 79 -272 0
7109 0 -25 181 15 -101 23 129 210 -55 10 -259 -137 77 88 17 -136 129 -307 -2 -310 -52 -119 -287 10
7132 10 -237 138 -128 38 308 14 0 -404 -74 -87 -130 -74 25 -133 -65 132 88 6 -276 -260 -423 -175 -111 261
7156 261 71 -100 -113 -37 265 -29 95 12 52 35 -144 60 48 -31 -39 31 -231 61 136 -31 -46 130 -311 92
7180 92 -231 -154 -57 -208 272 285 248 -10 182 207 -256 -26 -257 -293 -120 3 151 -142 25 377 293 12 281
7203 281 -113 160 -7 178 80 252 106 152 -225 234 160 -135 -146 -64 211 -105 -57 -34 133 -212 59 163
7225 163 62 -28 15 109 22 95 44 -82 233 84 301 73 -23 91 -8 -106 178 225 129 -57 126 268 19 38
7249 38 -382 83 15 -243 125 205 91 122 110 -14 110 -224 273 -60 161 397 -125 336 341 -134 241 -268
7271 -268 104 92 99 58 101 123 -11 143 89 283 -217 -274 48 64 -173 -184 70 -29 -301 -121 263 -17 87 37
7295 37 -300 85 -2 309 -193 -38 103 145 -52 -351 95 -307 81 -32 -36 -432 -49 168 26 -336 110 83
7317 83 133 -327 90 -87 -11 -118 137 -117 222 2 103 -83 -104 -243 21 -287 154 491 -7 270 -236
7338 -236 6 -218 116 -17 -165 65 260 18 133 -32 -121 61 273 -68 -76 -84 -304 -190 4 178 163 108
7360 108 304 186 334 -77 -358 1 52 -117 -305 100 418 166 -149 202 -337 20 -93 175 -43 -259
7380 -259 66 185 -137 -280 -41 215 7 -33 56 85 66 -113 -335 114 32 121 -160 19 -88 76 167 -81
7402 -81 171 -170 304 92 32 -263 37 -238 -153 176 27 87 -87 -110 -26 -117 87 -27 90 169 159 -120 -137
7425 -137 61 94 19 180 -7 -44 -57 100 -160 -71 -58 201 -142 52 -131 17 110 -22 -308 -100 88 176 273
7448 273 177 22 -34 47 -130 36 -280 -246 -14 -61 -24 -351 105 266 -52 -107 199 -144 36 -23 60 20 -127
7471 -127 264 0 -133 6 -125 27 -184 166 -82 -379 98 -1 339 64 87 -61 -39 -367 -398 -186 -264 -8
7493 -8 115 -72 -138 225 -119 263 13 -84 -138 -146 22 297 286 -229 130 -84 47 -472 99 72 300 31 231
7516 231 0 -315 -44 -119 -114 179 7 72 -291 184 123 -92 92 -75 -126 -241 -143 167 175 -166 -69 32 113 -135
7540 -135 -149 7 95 138 -167 120 -66 31 -324 71 -74 -149 -109 243 210 -37 -114 -27 -95 -302 55 55 -19 184
7564 184 147 -148 220 -250 70 -76 81 81 -22 246 -10 3 23 -61 -100 77 186 -226 -306 -178 -169 -51 176
7587 176 -347 -175 211 7 -83 -120 -22 102 -19 59 -199 -4 -216 -384 362 -100 60 156 -4 82 -48 -158
7609 -158 -217 17 -117 3 -135 -54 -10 -209 168 201 194 52 172 205 -38 169 -41 40 337 36 -331 10 -64
7632 -64 -187 -180 105 -99 -142 -76 -192 224 -106 -303 214 151 53 18 158 85 -173 -32 -33 279 153 -1 295 78
7656 78 81 -268 55 13 -208 -14 -204 -55 -305 -269 17 -130 26 63 -194 119 -330 -25 294 162 166 48 389
7679 389 -67 -24 130 43 47 -146 75 -69 359 -154 -164 -249 -173 -189 50 223 39 24 122 -24 -114 159 -80 -89
7703 -89 -55 -95 -220 107 7 -53 25 -59 -59 242 -277 -46 -53 -77 60 -92 227 -271 94 -185 -208 -402 -268 112
7727 112 -125 -52 -64 -32 -98 -50 -147 -22 134 -243 -20 -294 -92 228 -245 -126 112 -35 -122 108 -89 -185 -132
7750 -132 -10 147 -64 -76 203 -110 -205 -145 197 -430 1 223 -182 23 19 -102 -107 12 262 -50 -145 108 -201
7773 -201 -155 84 68 -54 305 177 -237 -45 16 -259 -58 -136 228 128 88 117 192 -5 -198 -76 -110 64 147
7796 147 84 -248 147 121 -15 102 -151 -183 -160 430 -42 -28 116 548 -56 -184 42 133 -114 -69 -134 12 41
7819 41 -2 220 -63 22 -241 -49 243 206 -58 -37 -99 -142 -51 -3 -110 129 -27 113 -243 -215 -177 -58 -30 -221
7843 -221 5 -220 -124 49 122 51 74 114 -220 21 -275 43 -244 90 -66 46 -6 -5 -135 -9 -217 73 110
7866 110 -30 20 -224 -73 54 156 -230 -286 368 3 136 337 265 -1 101 139 -199 -117 -108 67 129 64 -149
7889 -149 40 53 178 127 362 -16 -266 103 -46 64 -100 -32 -115 25 181 -7 -169 -232 -114 -67 65 -17
7911 -17 210 -131 -120 -3 -38 190 -345 -24 -111 -85 75 -297 68 -95 -243 -182 -249 -50 -34 -90 -56 -26 169 43
7935 43 -40 110 -178 -109 -154 205 -228 -32 -132 -137 -109 -38 -148 -311 -285 -224 -409 140 -63 15 88 -32 93 -13
7959 -13 -414 106 130 88 -163 -96 0 49 264 23 -129 87 65 -137 150 -17 42 73 55 180 10 254 -66
7982 -66 -164 191 -137 -182 239 22 96 -99 -38 -102 -191 275 -286 72 -355 37 -91 166 73 -68 -49 -124 46
8005 46 -251 157 -55 75 -66 -194 -105 108 -17 167 69 11 22 -125 -161 -223 110 74 90 -252 38 -245 285
8028 285 -115 45 258 -421 -213 -137 220 -45 -137 -128 -23 91 -68 -9 -52 15 -152 -10 -85 140 121 90 207
8051 207 -192 -100 452 -288 -159 -86 -300 73 70 -189 -209 259 223 20 248 122 -1 29 -204 -56 151 -9
8073 -9 75 -103 -68 350 -8 134 -48 168 179 249 105 -396 -13 -165 -175 361 -142 31 265 35 167 135 -216
8096 -216 64 143 -236 -34 341 263 280 -257 -196 95 48 -81 -159 -5 -89 184 329 45 -85 -34 -173 -196 -191 34
8120 34 169 10 89 2 278 125 70 273 74 -200 -158 -189 -26 22 114 -64 99 283 -215 -154 -71 -123 264 44
8144 44 -7 110 90 -117 110 -87 -87 -98 -163 15 223 129 449 41 41 -26 226 -114 2 -98 -37 179 152 102 -168
8169 -168 192 -15 194 41 124 -169 -75 -193 94 200 -221 -40 133 0 -28 -117 -22 69 73 251 -90 122
8191A22
##END NTUPLES=NMR FID
##END=
