##TITLE=1H_EC-3185(1)
 CDCl3, 8 sc, 
 5.4.2019
##JCAMPDX= 6.0         $$ Bruker NMR JCAMP-DX V2.0
##DATA TYPE= NMR FID
##DATA CLASS= NTUPLES
##ORIGIN= UXNMR, Bruker Analytische Messtechnik GmbH
##OWNER= root
$$ XWIN-NMR		Version 3.5
$$ Fri Apr  5 15:23:25 2019 Russian Standard Time (UT+4h)  she@DPX200
##.OBSERVE FREQUENCY= 200.1316
##.OBSERVE NUCLEUS= ^1H
##.DELAY= (6, 6)
##.ACQUISITION MODE= SIMULTANEOUS
##.ACQUISITION SCHEME= undefined
##.AVERAGES= 8
##.DIGITISER RES= 18
##SPECTROMETER/DATA SYSTEM= spect
##.PULSE SEQUENCE= zg30
##.SOLVENT NAME= CDCl3
##.SHIFT REFERENCE= (INTERNAL, CDCl3, 0, 15.7039)
##AUDIT TRAIL= $$ (NUMBER, WHEN, WHO, WHERE, WHAT)
$$ ##TITLE= Audit trail, XWIN-NMR		Version 3.5
$$ ##JCAMPDX= 5.01
$$ ##ORIGIN= Bruker BioSpin GmbH
$$ ##OWNER= she
$$ F:/spectra/data/she/nmr/H-F/1/audita.txt
$$ ##AUDIT TRAIL=  $$ (NUMBER, WHEN, WHO, WHERE, WHAT)
(   1,<2019-04-05 15:22:32.48 +0400>,<she>,<DPX200>,
      <created by zg, POWCHK disabled, PULCHK disabled
       configuration hash MD5:
       00 E9 B6 7A A2 85 ED C7 34 08 36 98 17 FE 4E 26
       data hash MD5: 16K
       F6 BD E1 A9 79 DA 55 61 A1 23 16 A7 15 96 22 5B>)
$$ ##END=
$$ 
$$ hash MD5
$$ 10 F3 4A BD 9C DF 75 9D 2E 94 8C 32 CB 1F 01 BD
##$RELAX= 
##$RELAX= 
##$RELAX= 
##$RELAX= 
##$RELAX= 
##$RELAX= 
$$ Bruker specific parameters
$$ --------------------------
##$DU= <F:/spectra>
##$EXPNO= 1
##$NAME= <H-F>
##$PROCNO= 1
##$TYPE= <nmr>
##$USER= <she>
##$AMP= (0..31)
100 100 100 100 100 100 100 100 100 100 100 100 100 100 100 100 100 100 
100 100 100 100 100 100 100 100 100 100 100 100 100 100 
##$AQSEQ= 0
##$AQ_mod= 1
##$AUNM= <au_zg>
##$AUTOPOS= <>
##$BF1= 200.13
##$BF2= 200.13
##$BF3= 200.13
##$BF4= 200.13
##$BF5= 200.13
##$BF6= 200.13
##$BF7= 200.13
##$BF8= 200.13
##$BYTORDA= 1
##$CFDGTYP= 0
##$CFRGTYP= 5
##$CHEMSTR= <none>
##$CNST= (0..31)
1 1 145 1 1 1 1 1 1 1 1 1 1 1 1 1 1 1 1 1 1 1 1 1 1 1 1 1 1 1 1 1 
##$CPDPRG= <>
##$CPDPRG1= <>
##$CPDPRG2= <>
##$CPDPRG3= <>
##$CPDPRG4= <mlev>
##$CPDPRG5= <mlev>
##$CPDPRG6= <mlev>
##$CPDPRG7= <mlev>
##$CPDPRG8= <mlev>
##$CPDPRGB= <>
##$CPDPRGT= <>
##$D= (0..31)
0 1.2 0 0 0 0 0 0 0 0 0 0.03 0 0 0 0 0 0 0 0 0 0 0 0 0 0 0 0 0 0 0 0 
##$DATE= 1554463351
##$DBL= (0..7)
120 120 120 120 120 120 120 120 
##$DBP= (0..7)
150 150 150 150 150 150 150 150 
##$DBP07= 0
##$DBPNAM0= <>
##$DBPNAM1= <>
##$DBPNAM2= <>
##$DBPNAM3= <>
##$DBPNAM4= <>
##$DBPNAM5= <>
##$DBPNAM6= <>
##$DBPNAM7= <>
##$DBPOAL= (0..7)
0.5 0.5 0.5 0.5 0.5 0.5 0.5 0.5 
##$DBPOFFS= (0..7)
0 0 0 0 0 0 0 0 
##$DE= 6
##$DECBNUC= <off>
##$DECIM= 24
##$DECNUC= <off>
##$DECSTAT= 4
##$DIGMOD= 1
##$DIGTYP= 9
##$DL= (0..7)
0 120 120 120 120 120 120 120 
##$DP= (0..7)
150 150 150 150 150 150 150 150 
##$DP07= 0
##$DPNAME0= <>
##$DPNAME1= <>
##$DPNAME2= <>
##$DPNAME3= <>
##$DPNAME4= <>
##$DPNAME5= <>
##$DPNAME6= <>
##$DPNAME7= <>
##$DPOAL= (0..7)
0.5 0.5 0.5 0.5 0.5 0.5 0.5 0.5 
##$DPOFFS= (0..7)
0 0 0 0 0 0 0 0 
##$DQDMODE= 0
##$DR= 18
##$DS= 0
##$DSLIST= <SSSSSSSSSSSSSSS>
##$DSPFIRM= 0
$$ [...]
##$SUBNAM2= <"">
##$SUBNAM3= <"">
##$SUBNAM4= <"">
##$SUBNAM5= <"">
##$SUBNAM6= <"">
##$SUBNAM7= <"">
##$SUBNAM8= <"">
##$SUBNAM9= <"">
##$SW= 24.9336934301222
##$SWIBOX= (0..15)
0 0 2 0 0 0 0 0 0 0 0 0 0 0 0 0 
##$SW_h= 4990.01996007984
##$TD= 16384
##$TD0= 1
##$TE= 0
##$TE2= 300
##$TE3= 300
##$TEG= 300
##$TL= (0..7)
0 120 120 120 120 120 120 120 
##$TP= (0..7)
150 150 150 150 150 150 150 150 
##$TP07= 0
##$TPNAME0= <>
##$TPNAME1= <>
##$TPNAME2= <>
##$TPNAME3= <>
##$TPNAME4= <>
##$TPNAME5= <>
##$TPNAME6= <>
##$TPNAME7= <>
##$TPOAL= (0..7)
0.5 0.5 0.5 0.5 0.5 0.5 0.5 0.5 
##$TPOFFS= (0..7)
0 0 0 0 0 0 0 0 
##$TUNHIN= 0
##$TUNHOUT= 0
##$TUNXOUT= 0
##$USERA1= <user>
##$USERA2= <user>
##$USERA3= <user>
##$USERA4= <user>
##$USERA5= <user>
##$V9= 5
##$VALIST= <valist>
##$VCLIST= <CCCCCCCCCCCCCCC>
##$VD= 0
##$VDLIST= <DDDDDDDDDDDDDDD>
##$VPLIST= <PPPPPPPPPPPPPPP>
##$VTLIST= <TTTTTTTTTTTTTTT>
##$WBST= 1024
##$WBSW= 4
##$XGAIN= (0..3)
0 0 0 0 
##$XL= 0
##$YL= 0
##$YMAX_a= 154772
##$YMIN_a= -340136
##$ZGOPTNS= <>
##$ZL1= 120
##$ZL2= 120
##$ZL3= 120
##$ZL4= 120
##$ABSF1= 10
##$ABSF2= 0
##$ABSG= 5
##$ABSL= 3
##$ALPHA= 0
##$AQORDER= 0
##$ASSFAC= 0
##$ASSFACI= 0
##$ASSFACX= 0
##$ASSWID= 0
##$AUNMP= <proc_1d>
##$AZFE= 0.1
##$AZFW= 0.1
##$BCFW= 1
##$BC_mod= 2
##$BYTORDP= 1
##$COROFFS= 0
##$CY= 11.3945322036743
##$DATMOD= 1
##$DC= 2
##$DFILT= <>
##$DTYPP= 0
##$F1P= 18.9103706918063
##$F2P= -1.10871071338519
##$FCOR= 0.5
##$FTSIZE= 0
##$FT_mod= 4
##$GAMMA= 1
##$GB= 0.15
##$INTBC= 1
##$INTSCL= 1
##$ISEN= 128
##$LB= 0.24
##$LEV0= 0
##$LPBIN= 0
##$MAXI= 10000
##$MC2= 0
##$MEAN= 0
##$ME_mod= 0
##$MI= 1.114404
##$NCOEF= 0
##$NC_proc= 0
##$NLEV= 6
##$NOISF1= 3.799351
##$NOISF2= 2.8
##$NSP= 1
##$NTH_PI= 0
##$NZP= 0
##$OFFSET= 15.70392
##$PC= 1
##$PHC0= -8852.734
##$PHC1= 15.60028
##$PH_mod= 1
##$PKNL= yes
##$PPARMOD= 0
##$PSCAL= 0
##$PSIGN= 0
##$REVERSE= no
##$SF= 200.130013532006
##$SI= 16384
##$SIGF1= 3
##$SIGF2= 2
##$SINO= 400
##$SIOLD= 16384
##$SREGLST= <1H.CDCl3>
##$SSB= 0
##$STSI= 0
##$STSR= 0
##$SW_p= 3612.71676300578
##$SYMM= 0
##$S_DEV= 0
##$TDeff= 0
##$TDoff= 0
##$TI= <>
##$TILT= no
##$TM1= 0
##$TM2= 0
##$TOPLEV= 0
##$USERP1= <user>
##$USERP2= <user>
##$USERP3= <user>
##$USERP4= <user>
##$USERP5= <user>
##$WDW= 1
##$XDIM= 8192
##$YMAX_p= 0
##$YMIN_p= 0
$$ End of Bruker specific parameters
$$ ---------------------------------
##NTUPLES= NMR FID
##VAR_NAME=  TIME,          FID/REAL,        FID/IMAG
##SYMBOL=    X,             R,               I
##VAR_TYPE=  INDEPENDENT,   DEPENDENT,       DEPENDENT
##VAR_FORM=  AFFN,          ASDF,            ASDF
##VAR_DIM=   8192,          8192,            8192
##UNITS=     SECONDS,       ARBITRARY UNITS, ARBITRARY UNITS
##FACTOR=    0.0002004,     1,               1
##FIRST=     0,             0,               0
##LAST=      1.6414764,     0,               0
##MIN=       0,             -340136,         0
##MAX=       1.6414764,     154772,          0
$$ Real data points
##PAGE= N=1
##DATA TABLE= (X++(R..R)), XYDATA
$$ [...]
$$ plain form
2571 -824 2373 2265 -1562 -2408 1745 2109 -577 163 1708 340 -361 -212 541 3161 1971 -2673 -2534
2588 -2534 1608 2232 -324 -859 -853 190 158 -1497 -777 1125 -1511 -3638 -405 2140 758 -980 -1974
2605 -1974 -1808 1139 1592 -290 632 1826 -497 -890 2179 2974 622 -1225 -1490 1639 3982 803
2621 803 -2060 39 209 -1680 -117 1100 539 -465 -2100 -2670 1379 1966 -2205 -3446 -72 1167
2637 1167 227 -102 -442 88 107 -1530 -344 3690 2033 -2322 -841 1481 1948 1286 -847 -1356 1177
2654 1177 1923 -417 560 1609 -511 -2588 -940 924 1967 609 -2954 -1786 1483 291 -1651
2669 -1651 -195 113 -1312 -609 368 1184 1145 -1341 -3512 217 3001 475 -544 240 258 356 651 278
2687 278 770 1897 -1108 -1470 2062 3180 -744 -1774 -1381 351 1345 -548 -1642 829 719 -2755
$$ packed form
2571h24L197j08l827q46M153L64k686P40J545j368p01J49P53K620j190m644J39
2588b534M142O24k556n35OJ043l2j655P20J902k636k127L233K545j382j738r94
2605a974J66K947M53j882R22J194k323l93L069P95k352j847k65L129K343l179
2621H03k863K099J70j889J563J217n61j004j635n70M049N87m171j241L374J239
2637A167r40l29l40N30J9j637J186M034j657m355J481K322M67o62k133n09K533
2654A177P46k340R77J049k120k077J648J864J043j358l563J168L269j192j942
2669a651J456L08j425P03R77Q16l9k486k171L729K784k526j019P84J8R8K95l73
2687B78M92J127l005l62L532J118l924j030L93J732R94j893j094K471j10l474
$$ plain form
2703 -2755 -1722 1993 720 -1999 -2038 -620 1657 1968 -1159 -2214 593 741 -632 1082 1608 676
2719 676 -93 -1029 -469 2957 1736 -2648 -932 2597 1635 121 408 27 64 -640 -1075 990 2041 -983
2737 -983 -3193 -636 1395 -133 -857 -1228 -1430 491 -13 -1475 657 1130 -1981 -2180 993 2461 1547
2754 1547 -729 -1696 729 2650 223 -993 1807 1067 -1460 0 1822 1611 109 -2679 -2370 1867
2770 1867 2628 -1006 -1716 -113 -834 -518 -433 -424 479 166 -3059 -1267 2498 1243 -2098 -1954 -222 847
2788 847 1359 -275 31 1251 -107 -1620 1429 3218 632 -1482 -395 1179 1913 1148 -1894 -1086
2804 -1086 652 -35 -592 838 877 -1863 -1764 -1178 467 1646 -1278 -3278 -491 2205 -48 -1103 168
2821 168 -190 -529 -662 621 3172 1827 -2062 -2104 2353 2666 399 -100 -37 60 1114 64 -252 1558
$$ packed form
2703b755J033L715j273k719l9J418K277L11l127j055K807J48j373J714N26r32
2719F76p69r36N60L426j221m384J716L529r62j514K87l81L7p04m35K065J051l024
2737i83k210K557K031j528p24l71k02J921n04j462K132M73l111j99L173J468r14
2754A547k276r67K425J921k427j216K800p40k527J460J822k11j502k788L09M237
2770A867P61l634p10J603p21L16Q5RR03l13l225J792L765j255l341J44J732J069
2788H47N12j634L06J220j358j513L049J789k586k114J087J574P34p65l042Q08
2804a086J738o87n57J430L9k740R9N86J645J179k924k000K787K696k253j055J271
2821A68l58l39j33J283K551j345l889m2M457L13k267m99O3R7J054j050l16J810
$$ plain form
2839 1558 417 -2709 -1092 1718 1741 -428 -2266 -2167 775 1151 -2005 -1090 1177 -463 -1973 224
2855 224 1056 134 -981 -1586 126 2753 1580 -1272 -289 1164 -86 421 1448 1171 611 -28 -1264
2872 -1264 943 2670 -385 -2726 -329 1588 604 131 -917 -531 -167 -1637 -1871 1942 1937 -2041 -2455
2889 -2455 205 1101 539 -871 -1278 344 1293 -699 32 2292 703 -1800 -415 757 1868 2124
2905 2124 -1341 -1883 1784 2328 -808 -751 954 -172 -935 -625 722 1767 -879 -3755 -1204 2073
2921 2073 490 -1140 -605 -712 -1302 137 -213 -552 858 -921 -2236 993 3367 817 -1161 -963
2937 -963 93 2096 1095 -558 952 1642 -1501 -1036 2236 1686 -836 -1865 -865 1173 1842 -713
2953 -713 -2505 -196 171 -1554 -365 782 288 -793 -1926 -1164 1483 1554 -2109 -2048 1364 1661 399
$$ packed form
2839A558j141l126J617K810K3k169j838R9K942L76l156R15K267j640j510K197
2855B24Q32r22j115o05J712K627j173k852R83J453j250N07J027k77n60o39j236
2872a264K207J727l055k341K397J917r84m73j048L86L64j470k34L813nl978m14
2889b455K660Q96n62j410m07J622R49j992P31K260j589k503J385J172J111K56
2905B124l465n42L667N44l136N7J705j126p63L10J347J045k646k876K551L277
2921B073j583j630N35j07n90J439l50l39J410j779j315L229K374k550j978J98
2937i63J056K003j001j653J510O90l143M65L272n50k522j029J000K038O69k555
2953g13j792K309L67j725J189J147m94j081j133P62K647P1l663O1L412K97j262
$$ plain form
2970 399 261 106 270 635 -926 983 3582 1089 -2690 -682 1894 1275 135 -990 -867 180 623
2987 623 -484 123 1292 -1669 -2704 -292 1240 1218 -377 -2678 -1085 1563 474 -1986 568 983
3003 983 -1058 -836 1031 1843 869 -1205 -1694 1772 2828 335 -871 502 170 124 631 -99 317 545
3021 545 -1883 -1501 2082 1968 -2340 -2168 -419 796 686 -605 -1310 -27 -273 -2090 -2 2099 415
3038 415 -1585 -880 558 1836 1566 -1024 -1304 1480 582 -641 1020 1991 151 -1190 -450 393 1662
3055 1662 385 -2136 -710 1533 245 -1171 -108 -593 -1080 -858 -1092 758 1780 -1559 -3165 357
3071 357 1758 -500 -530 -16 -144 547 480 -92 1762 1033 -1478 -734 2228 2170 601 -837 -1207 669
3089 669 1707 -500 -1106 1416 -24 -1922 -348 1502 424 -1198 -2063 -1374 1186 1594 -1391 -1663
$$ packed form
2970C99j38j55J64L65j561J909K599k493l779K008K576o19j140j125J23J047M43
2987F23j107O07J169k961j035K412J532k2j595k301J593K648j089k460K554M15
3003I83k041K22J867Q12r74k074m89L466J056k493j206J373l32m6N07p30M16K28
3021E45k428L82L583j14m308J72J749J215j10j291p05J283k46j817K088K101j684
3038D15k000P05J438J278k70k590k80K784q98j223J661R71j840j341P40Q43J269
3055A662j277k521J426K243j288j416J063m85m87K22k34J850J022l339j606L522
3071C57J401k258l0N14j28O91o7n72J854p29k511P44K962n8j569j438l70J876
3089F69J038k207o06K522j440j898J574J850j078j622q65O89K560M08k985k72
$$ plain form
3105 -1663 143 -872 -414 436 731 980 -328 -1622 385 2955 821 -2095 -238 1474 982 930 386
3122 386 -327 407 -69 -1026 1184 2171 -807 -2216 -398 1031 1003 -628 -2104 -959 699 -815 -827
3139 -827 1164 77 -2024 -1496 705 1062 1055 -600 -2055 736 2007 -210 -638 472 642 -232 322
3156 322 931 2298 1005 -2119 -1343 1972 1345 -845 -794 -116 -292 123 -344 -551 763 -382 -2308 -456
3174 -456 2074 435 -1422 -1702 -782 1295 919 -1018 -152 1225 -356 -1235 1746 1962 133 -969 -584
3191 -584 1222 2466 633 -1693 -231 1078 -359 -195 939 437 -405 -907 -887 1271 1394 -1545 -2539
3208 -2539 566 1065 -255 -428 -488 -773 135 -636 -708 1970 1156 -2043 -1066 1429 1658 189 -834 -278
3226 -278 1462 1502 -419 177 1955 -31 -1187 84 1475 1121 96 -1658 -1350 1465 491 -1794 -846
$$ packed form
3105a663J806j015M58Q50K95K49j308j294K007K570k134k916J857J712m92n2n44
3122C86p13P34m76r57K210R87k978j409J818J429k8j631j476J145J658j514j2
3139h27J991j087k101N28K201L57pj655j455K791J271k217m28J110J70q74N54
3156C22O09J367j293l124P76L315o27k190N1O78j76M15m67k07J314j145j926J852
3174d56K530j639j857k80R20K077l76j937Q66J377j581q79K981K16j829j102L85
3191e84J806J244j833k326J462J309j437J64J134n02q42n02K0K158J23k939r94
3208b539L105M99j320j73o0k85R08p71p2K678q14l199R77K495K29j469j023N56
3226b78J740M0j921N96J778j986j156J271J391l54j025j754L08K815r74k285R48
$$ plain form
3243 -846 750 -751 -1009 -221 949 203 -1551 -2244 139 2404 303 -1010 261 543 -13 598 480
3260 480 412 1171 -316 -1143 1803 2792 -458 -1502 114 755 714 275 -783 113 166 -1761 -924 1318
3278 1318 482 -1896 -1600 60 1063 690 -1308 -2069 599 752 -795 233 1430 -191 -991 -230 881
3295 881 1966 901 -1788 -475 2118 1433 -216 -156 211 30 149 15 472 1119 -711 -2885 -247
3312 -247 1956 -143 -1600 -954 -555 572 242 -935 -104 342 -1407 -1341 1224 1522 382 -1065 -639
3329 -639 723 2011 382 -1533 796 1162 -510 -154 1296 958 -268 -1090 -473 1313 2116 -1092 -1608
3346 -1608 436 84 -439 -163 -92 27 -451 -1606 -567 1619 195 -2627 -1293 931 611 254 -439
3363 -439 -547 733 474 -964 441 1960 107 -1335 421 1520 1923 347 -1359 -416 1375 700
$$ packed form
3243h46J596j501k58P88J170p46j754o93K383K265k101j313J271K82n56O11j18
3260D80o8P59j487q27K946R89l250j044J616O41m1m39j058Q96N3j927Q37K242
3278A318q36k378K96J660J003l73j998p61K668J53j547J028J197j621q00P61J111
3295H81J085j065k689J313K593o85j649O0L67j81J19j34M57O47j830k174K638
3312b47K203k099j457O46L99J127l30j177Q31M46j749O6K565K98j140j447M26
3329f39J362J288j629j915K329L66j672L56J450l38j226q22O17J786Q03l208n16
3346a608K044l52n23K76P1J19m78j155J039K186j424k822J334K224l20l57o93
3363d39j08J280k59j438J405J519j853j442J756J099M03j576j706R43J791o75
$$ plain form
3379 700 -582 832 566 -1108 -1025 -172 367 775 -796 -2079 -62 1797 -342 -1419 -528 -248 -649
3396 -649 -388 -73 860 1032 -991 -1119 1916 1856 -478 -685 634 904 902 533 -270 581 670 -1130 -182 2231
3416 2231 800 -1400 -1253 -614 1029 810 -1934 -1468 676 115 -1817 -250 928 -687 -1663 -840 654
3433 654 2110 697 -2004 -401 1412 407 -409 655 907 462 152 -49 667 2132 -673 -2086 450
3450 450 1500 204 -676 -566 -179 376 -724 -1151 780 874 -1816 -1814 1193 1076 -709 -1125 -1057 379 1169
3469 1169 -91 -540 911 83 -1140 210 1646 957 73 -1292 -756 1952 1851 -882 -808 821 189
3486 189 -221 98 959 414 -896 -2079 -294 1886 141 -2117 -818 381 -89 -394 -481 -939 53 -524
3504 -524 -841 386 1403 -396 -1671 -75 840 1013 367 -1050 305 1736 234 -331 1157 889 -761
$$ packed form
3379G00j282J414k66j674Q3Q53N39M08j571j283K017J859k139j077Q91K80m01
3396f49K61L15R33J72k023j28L035o0k334k07J319K70kl69q03Q51Q9j800R48K413
3416B231j431k200J47O39J643k19k744M66K144n61j932J567J178j615r76Q23J494
3433F54J456j413k701J603J813j005q16J064K52m45l10k01P16J465k805j413K536
3450D50J050j296q80J10L87N55j100m27J931R4k690KL007j17j785m16O8J436P90
3469A169j260m49J451q28j223J350J436o89q84j365N36K708j01k733P4J629o32
3486A89m10L19Q61n45j310j183J785K180j745k258J299J199m70l05q7m58R92n77
3504e24l17J227J017j799j275J596R15J73o46j417J355J431j502n65J488k68j650
$$ plain form
3521 -761 -573 789 1461 1070 -1076 -1861 87 855 -514 -328 255 -659 -1029 -459 -45 145 235 -1431 -1650
3540 -1650 1092 1423 -412 -771 54 610 619 120 191 1422 632 -1260 164 2162 822 -440 -452 13
3558 13 1119 799 -902 -671 663 -480 -1523 153 654 -425 -1045 -1351 -320 1266 366 -1963 -634
3575 -634 717 138 -402 789 540 210 -615 -628 1487 2348 -268 -1427 682 1009 444 -88 321 -428
3593 -428 467 -524 -748 1402 479 -1608 -1737 340 782 230 -1156 -1168 104 926 -1178 -678 1129 136
3611 136 -1415 65 1623 1199 -337 -1563 -203 1693 1225 -687 -11 748 -34 -403 464 664 656 100
3629 100 -1328 275 2125 472 -1547 -564 561 77 -282 -178 143 217 -1231 -1838 706 1423 -1011
3646 -1011 -1670 -346 399 804 322 -627 242 703 -548 -458 2028 1266 -753 -670 547 1300 1354 -447 -1499
$$ packed form
3521g61J88J362O72l91k146p85J948P68j369J86N83r14l70N70M14J90R0j666k19
3540a650K742L31j835l59Q25N56Rm99P1J231p90j892J424J998j340j262j2M65
3558A3J106l20j701K31J334j143j043J676N01j079o20l06J031J586r00k329J329
3575f34J351n79n40J191k49l30q25j3K115Q61k616j159K109L27n65n32M09p49
3593d28Q95r91k24K150r23k087j29K077M42n52j386j2J272Q22k104N00J807r93
3611A36j551J480J558m24j536j226J360J896m68j912O76P59p82l69Q67K00qn56
3629A00j428J603J850j653k019R83J125m84l59J04L21P4j448o07K544P17k434
3646a011o59J324P45M05m82r49Q69M61j251R0K486p62k019Q3J217P53N4j801j052
$$ plain form
3665 -1499 725 1330 -534 -186 729 31 -1168 -997 464 1515 188 -2170 -1536 739 156 -855 -459
3682 -459 284 -909 -425 -18 458 1137 -229 -1989 -114 1999 1189 -146 -485 276 1107 679 -340 919
3700 919 1204 -608 -1149 1424 1333 -125 -981 -1210 -166 649 -268 -1207 -96 -37 -1277 -489 569 181
3718 181 -434 -913 -786 1219 1541 -436 -1074 421 908 220 567 517 516 168 -969 -47 1869 936 -866
3737 -866 -761 807 640 -253 -374 -808 80 -239 -931 -127 988 -276 -1563 -905 202 458 214 -1222
3755 -1222 -830 1110 535 -872 170 819 -521 -782 105 987 1503 -276 -1234 -179 1699 355 -160
3772 -160 -14 157 -398 -176 -133 117 715 -1090 -1911 855 1377 -492 -1455 -645 106 249 -131 -667 480
3791 480 261 -1379 -435 1656 839 -691 -806 -410 815 1477 -520 -1093 675 591 -698 303 920 555
$$ packed form
3665a499K224O05j864L48R15o98j199J71J461J051j327k358O34K275n83j011L96
3682d59P43j193M84M07M76O79j366j760J875K113q10j335l39P61Q31m28j019J259
3700I19K85j812n41K573r1j458q56k29J044Q15r17r39J111N9j240P88J058l88
3718A81o15m79J27K005L22j977o38J495M87o88L47n0jl48j137R22J916r33j802
3737h66J05J568j67q93j21m34Q88l19o92Q04J115j264j287O58J107K56k44j436
3755a222L92J940n75j407J042O49j340k61Q87Q82N16j779r58J055J878j344n15
3772a60J46J71n55K22M3K50N98j805q21K766N22j869r63Q10P51J43l80n36J147
3791D80k19j640R44K091q17j530j15L96J225O62j997n73J768q4j289J001O17l65
$$ plain form
3809 555 -675 -786 -59 1464 423 -1833 -929 735 106 -492 -107 -79 -593 -1033 -1327 353 1211 -569
3827 -569 -1860 -54 838 133 -123 -305 -279 503 297 -159 1313 1717 -536 -1094 709 1164 611 -51 -674
3846 -674 113 969 -428 -969 754 265 -1609 -661 228 539 264 -1168 -888 613 1119 -813 -940 570
3864 570 26 -563 -51 608 373 74 -1244 -317 2067 1047 -1050 -232 624 419 450 402 83 779 -372
3883 -372 -1212 621 1377 -589 -1538 -428 317 641 -385 -1593 -628 166 -747 -1205 624 915 -862 -1007
3901 -1007 149 780 828 196 -818 306 1395 -9 70 746 417 -191 -422 -81 741 842 -839 -1542
3919 -1542 866 747 -585 -72 104 -194 -400 -191 -187 568 247 -1360 -933 954 751 -546 -755 -494 600
3938 600 668 -484 119 838 304 -1408 569 1642 703 -379 -517 123 1755 730 -261 432 903 -338
$$ packed form
3809E55j230j11P27J523j041k256R04J664o29n98L85K8n14m40k94J680Q58j780
3827e69j291J806Q92p05k56j82K6P82k06m56J472M04k253n58J803M55n53o62o23
3846f74P87Q56j397n41J723m89j874R48Q89L11k75j432K80J501N06j932j27J510
3864E70n44n89N12O59k35k99j318R27K384j020k097Q18Q56k05L1m8l19O96j151
3883c72q40J833P56j966r49J110P45L24j026j208R65P94r13m58J829K91j777j45
3901a007J156O31M8o32j014J124J089j404P9O76l29o08k31L41Q22J01j681p03
3919a542K408j19j332N13J76k98k06K09MP55l21j607M27J887k03j297k09K61J094
3938F00O8j152O03P19n34j712J977J073r39j082j38O40J632j025r91O93M71j241
$$ plain form
3956 -338 -439 328 539 -65 -734 -1133 76 1010 -675 -1277 -365 373 -381 -188 79 -76 135 -293 -790
3975 -790 1074 1473 -872 -1139 534 1025 605 102 -398 139 683 -604 111 1517 312 -1356 -267
3992 -267 393 747 320 -836 -878 472 723 -1203 -529 464 -476 -1050 -488 408 739 -297 -1635 -395
4010 -395 1716 420 -886 325 258 1 141 182 309 1045 -80 -958 427 1345 351 -1065 -268 -118
4028 -118 169 -110 -781 109 478 -902 -1418 719 754 -706 -1002 -350 123 536 -293 -765 236 697 -694
4047 -694 -246 855 893 -254 -414 131 1197 949 -776 -645 895 897 -396 0 539 154 -514 -808 -354
4066 -354 1656 113 -1406 -564 798 45 -597 -657 -221 10 -63 -958 232 1352 -446 -1357 31 1057
4084 1057 574 174 -513 -227 1245 179 -829 753 583 -251 -604 684 852 565 -560 -991 422
$$ packed form
3956c38j01P67K11o04o69l99J209R34j685o02R12P38p54J93K67j55K11m28m97
3975g90J864L99k345k67J673M91m20n03n00N37N44j287P15J406j205j668J089
3992b67O60L54m27j156m2J350K51j926O74R93r40n74N62Q96L31j036j338J240
4010c95K111j296j306J211o7k57J40M1J27P36j125q78J385R18r94j416P97J50
4028a18K87k79o71Q90L69j380n16K137L5j460k96O52M73M13q29m72J001M61j391
4047f94M48J101L8j147j60N45J066k48j725J31J540Kj293L96N39l85o68k94M54
4066c54K010j543j519Q42J362p53o42o0M36K31p3q95J190J120j798r11J388J026
4084A057m83m00o87K86J472j066j008J582j70q34l53J288J68k87j125m31J413
$$ plain form
4101 422 765 -295 -645 395 -334 -406 -440 -350 -7 -370 -1067 -971 590 823 -756 -915 12 213 410 -101
4121 -101 229 549 379 -820 46 1648 639 -720 -166 644 738 818 -330 -89 638 -254 -907 379 731
4140 731 -422 -1095 -818 -199 614 -172 -1326 -390 599 -24 -539 148 297 -83 -478 -445 966 1454 -406
4159 -406 -1072 619 1631 -49 -198 511 299 436 -91 -36 955 308 -733 -1091 739 709 -573 -972 -944
4178 -944 80 534 -818 -842 329 197 -1022 -456 845 241 -356 -740 -339 1028 588 -757 96 864
4196 864 128 -284 398 575 254 -144 -651 335 1119 345 -930 38 552 -307 -282 -360 69 116 -270 -1016 -60
4217 -60 1116 -541 -1312 -70 484 63 -287 -690 158 584 -332 -378 787 983 -864 -523 376 305 594
4236 594 -281 -652 708 885 -449 -431 639 156 -597 -141 134 722 -296 -1456 -995 785 199 -1166
$$ packed form
4101D22L43j060l50J040p29p2l4R0L43l63o97R6J561K33j579j59R27K01J97n11
4121a01L30L20j70j199Q66J602j009j359N54Q10R4Q0j148K41P27q92o53J286L52
4140G31j153o73K77O19Q13p86j154R36R89o23n15O87J49l80l95L3J411M88j860
4159d06o66J691J012j680j49P09k12J37n27N5R91o47j041l58J830l0j282l99K8
4178i44J024M54j352k4J171j32j219N66J301o04n97l84M01J367m40j345Q53P68
4196H64p36m12O82J77l21l98n07R86P84p74j275R68N14q59K5p8M29M7l86p46R56
4217f0J176j657p71J242N54m21l50m03Q48M26r16m6J165J96j847L41Q99p1K89
4236E94q75l71J360J77j334J8J070m83p53M56K75N88j018j160M61J780n86j365
$$ plain form
4254 -1166 -486 293 27 -238 -159 -359 363 -233 -1409 -26 1137 176 -614 -81 477 247 612 -509 -79
4273 -79 1158 245 -922 627 1192 -298 -655 -327 158 914 -128 -834 -109 323 -846 -795 175 20 -829
4292 -829 -650 -460 525 477 -802 -951 254 831 -242 228 411 330 325 -217 -23 1183 875 -1020 -199 1040
4312 1040 603 -177 -119 -38 121 -35 -294 -200 521 -264 -1259 -324 420 406 -121 -1037 -423 396 350 -751 66
4333 66 1158 3 -265 734 782 535 -226 -798 411 1305 62 -511 -16 757 -49 -92 -123 -4 389 -677
4353 -677 -505 600 849 -648 -992 31 290 -170 -298 -807 109 274 -449 -510 784 682 -850 -172 616
4372 616 690 28 -303 -539 736 227 -428 333 585 -3 -594 4 492 754 142 -1189 -423 856 93
4391 93 -544 -88 210 -187 -277 -496 -71 693 -366 -1444 40 792 -130 -395 -249 310 248 180 -337 633
$$ packed form
4254a166O80P79k66k65P9k00P22n96j176J383J163r61p90N33N58k30L65j121M30
4273g9J237r13j167J549N65j490l57L28M85P56j042p06P25M32j169N1R70j55q49
4292h29J79J90R85m8j279j49J205N77j073M70J83q1nn42J94J206l08j895Q21J239
4312A040m37p80N8Q1J59j56k59R4P21p85r95R35P44j4n27r16O14Q19m6j101Q17
4333F6J092j155k68R99M8k47p61n72J209Q94j243n73M95P73q06m3l1J19L93j066
4353f77J72J105K49j497l44J023K59m60j28n09R16J65p23o1J294j02j532O78P88
4372F16P4o62l31k36J275n09o55P61K52n88n91N98M88K62o12j331P66J279p63
4391I3o37M56K98l97r0k19M25P64j059j078J484P52r22k65J46N59o2o8n17R70
$$ plain form
4411 633 511 -171 -779 395 1179 -53 164 -163 230 760 -74 -571 423 498 -559 -248 225 133 -433 -1056
4431 -1056 -661 463 595 -887 -1163 63 516 -406 -211 92 -218 222 -22 -189 1122 768 -689 -383
4449 -383 766 455 190 209 239 468 366 -292 -118 1173 29 -773 -142 943 416 -317 -684 -664 46 -278
4469 -278 -846 -37 309 -878 -726 459 501 95 -534 -771 418 1449 -225 -475 318 326 103 15 433 606
4489 606 458 -584 -845 880 912 -290 -655 78 -50 -75 -191 -396 160 89 -791 -82 759 273 -711 -722
4509 -722 -180 240 241 -17 -544 371 -104 -750 230 945 -106 -531 34 296 999 643 -706 9 1035 232
4529 232 -343 366 450 -305 -381 -222 364 317 -591 -1151 191 577 -368 -436 -178 -294 180 -383 -230 401 473
4550 473 -511 -678 704 944 -143 -268 -161 316 789 -50 -291 886 523 -575 -153 929 217 -34
$$ packed form
4411F33j22o82o08J174P84j232K17l27L93N30q34m97R94P5j057L11M73r2n66o23
4431a056L95J124J32j482k76J226M53r22J95L03l10M40k44j67J311l54j457L06
4449c83J149l11k65J9L0K29j02o58J74J291j144q02O31J085n27p33l67K0P10l24
4469b78n68Q09L46j187J52J185M2m06o29k37J189J031j674k50P93Qk23q8M18J73
4489F06j48j042k61J725L2j202l65P33j28k5j16k05N56p1q80P09Q41m86r84j1
4509g22N42M20Jk58n27R15m75o46R80P15j051m25N65K62P03l56j349P15J026q03
4529B32n75P09Q4p55p6J59N86m7r08n60J342L86r45o8K58j16M74n63J53O31P2
4550D73r84j67J382K40j087j25J07M77M73q39k41J177l63j098M22J082p12k51
$$ plain form
4568 -34 -575 -350 426 495 -972 -430 218 -280 -677 49 331 42 -380 -1004 -137 907 234 -899 -19 760
4588 760 67 80 182 191 358 36 -306 578 1052 -77 -839 126 508 395 154 -517 -145 497 -102 -340 196
4609 196 35 -663 -905 -156 105 18 -515 -694 -12 650 -297 -575 421 89 -561 -141 398 600 381 -518
4629 -518 -626 1070 765 -79 111 67 88 100 -348 140 430 -34 -805 -84 1066 75 -938 -700 -298 218
4649 218 85 -395 -208 548 -236 -729 230 707 -168 -485 -358 340 952 483 -504 167 515 -115 -191 927
4669 927 490 126 -191 -410 445 808 -302 -946 -14 709 -390 -427 135 118 -182 -516 -224 670 2 -890
4689 -890 -536 657 419 373 -514 -118 -191 171 -188 22 785 171 -839 186 970 631 95 -402 81 429
4709 429 675 -455 171 171 -241 -632 505 168 -143 -388 -1005 95 840 177 -453 -306 61 -112 -163 223
$$ packed form
4568c4n41K25P76O9j467N42O48m98l97P26K82k89m22o24Q67J044o73j133Q80P79
4588G60o93J3J02RJ67l22l42Q84M74j129p62R65L82j13k41o71L72O42n99k38N36
4609A96j61o98k42P49K61q7n33j79O82O62r47k78R96l32o50M20N39K02k19q99
4629e18j08J696l05q44J90m4K1J2m48M88K90m64p71P21J150r91j013K38M02N16
4649B18j33m80J87P56p84m93R59M77q75l17J27O98O12m69r87O71L48o30p6J118
4669I27m37l64l17k19Q55L63j110o44R32P23j099l7N62j7l00l34K92Q94o68q92
4689h90L54J193k38m6q87L96p3L62l59K10P63o14j010J025P84l39n36m97M83L48
4709D29K46j130O26%m12l91J137l37l11k45o17J100P45o63o30J47L67j73n1L86
$$ plain form
4729 223 29 -100 -249 -467 489 1043 -524 -454 -26 303 357 207 159 326 260 -520 -522 622 745 -491 -550
4750 -550 203 260 162 -487 -668 -403 446 -692 -377 404 -84 -814 -652 -93 496 264 -580 -459 806 -39
4770 -39 -608 36 781 -174 -36 -19 15 691 4 -667 35 617 199 -356 -262 -252 78 -390 -779 18 178 -516
4792 -516 -1007 190 439 -63 -453 -410 200 628 -161 -7 527 126 -280 -39 416 643 196 -224 141 394
4812 394 823 -186 -487 425 276 -292 181 181 146 -191 -376 -257 529 75 -714 -533 68 215 -495 59 -230
4833 -230 75 -240 -468 -236 623 96 -639 -143 411 592 377 -170 -31 628 30 -485 614 452 -247 -358
4853 -358 224 645 595 -484 -767 87 556 -190 -727 12 -42 -456 -476 108 53 111 -326 -1195 342 513 -431
4874 -431 -161 313 10 83 94 19 251 371 -564 -203 1078 659 -98 -52 33 138 63 -467 -196 474 205 -506
$$ packed form
4729B23j94j29j49k18R56N54j567P0M28L29N4j50m8J67o6p80kJ144J23j236n9
4750e50P53N7r8o49j81K65Q49j138L15P81m88p30J62N59N89k32q44J21J265q45
4770c9n69O44P45r55J38J7L4O76o87o71P02N82m18n55R4J0L30m68l89P97J60o94
4792e16m91J197K49n02l90M3O10M28p89J54N34m01m06K41M55K27m47m20L65K53
4812C94M29j009l01R12j49n68M73%l5l37j85J19P86m54p89J81O01J47p10N54k89
4833b30L05l15k28K32Q59n27p35M96N54J81k15n47J39O59n98n15J099j62o99j11
4853c58N82M21n0j079k83Q54M69p46n37P39n4m14k0N84n5N8m37q69J537J71r44
4874d31K70M74l03P3J1p5K32J20r35L61J281m19p57M6Q5J05p5n30K71O70k69p11
$$ plain form
4896 -506 30 506 -336 -396 -512 24 293 0 -889 -407 431 -169 -348 25 148 61 -68 -240 214 746 -132
4917 -132 -391 -1 476 236 -351 -20 527 -134 -329 -177 365 567 -567 -720 61 627 -94 -336 -424 -364
4937 -364 167 -356 -436 287 114 -540 -669 578 393 -72 -333 -102 401 407 -247 -100 620 71 -178 149 415
4958 415 359 29 -391 -174 846 234 -385 -116 110 -238 -120 22 -41 -183 -309 -449 92 734 -347 -909
4978 -909 -200 173 -185 -94 59 176 321 47 -567 471 770 -65 -497 262 420 511 574 -288 186 637 -43
4999 -43 -480 365 -239 -424 -142 -214 268 338 -795 -653 150 365 -833 -225 122 -319 -301 -182 -222 474 416
5020 416 -665 -353 699 535 -30 156 -103 493 270 -254 104 641 119 -593 244 435 302 -365 -197
5039 -197 -42 599 -110 -155 30 291 -316 -626 419 -78 14 -218 -355 83 731 -377 -461 57 80 -117 16
$$ packed form
4896e06N36M76q42o0j16N36K69k93q89M82Q38o00j79L73J23q7j29j72M54N32q78
4917a32k59L90M77k40n87L31N47o61j95J52N42K02j134j53P81N66p21k42q8O0
4937c64N31n23q0P23j73o54j29J247j85m65k61K31N03Oo54J47P20n49k49L27K66
4958D15n6l30m20K17J020o12o19K69K26l48J18J42o3j42j26j40N41O42j081n62
4978i09P09L73l58R1J53J17J45k74o14J038K99q35m32P59J58R1O3q62M74M51o80
4999d3m37Q45o04j85K82p2M82P0j133J42Q03K15j198O08L47m41J8J19m0O96n8
5020D16j081L12J052j64n65J86k59N96k23n24L58N37n22p12Q37J91j33o67J68
5039a97J55O41p09m5J85K61o07l10J045m97R2k32j37M38O48j108q4N18K3j97J33
$$ plain form
5060 16 423 57 305 -25 102 451 455 -3 -307 340 491 -227 -229 -104 87 142 -317 -68 451 47 -754 -394
5082 -394 -49 -107 7 -436 -526 381 392 -774 39 434 307 -432 -228 680 420 4 -454 160 804 472 -308
5103 -308 10 212 -186 -166 126 66 297 -45 -608 54 370 -97 -593 -262 3 -312 -211 -104 -57 260 -607
5124 -607 -270 937 282 -598 -323 221 365 327 -344 -199 384 459 -419 204 390 177 116 -68 -5 428 566
5145 566 -755 -483 212 192 -429 200 188 -92 -292 -329 -176 293 49 -748 -346 317 -147 -296 180 392 243
5166 243 130 -95 236 637 -3 -372 101 371 63 -203 -68 22 136 -31 -366 114 579 -197 -327 192
5186 192 375 94 -363 -646 69 559 -330 -480 224 -11 -196 -303 349 1 69 -510 -69 451 562 -239
5206 -239 49 413 186 -32 113 54 347 -19 -412 -149 689 277 -488 76 -1 -27 -184 -479 -272 162 -54
$$ packed form
5060A6M07l66K48l30J27L49Mm58l04O47J51p18kJ25J91N5m59K49N19m04q01L60
5082c94L45n8J14m43r0R07J1j166Q13L95j27p39K04R08k60m16m58O14O44l32p80
5103c08L18K02l98K0K92o0K31l42n63O62L16m67m96L31K65l15J01J07M7L17q67
5124f07L37J207o55q80K75N44J44l8o71J45N83P5q78O23J86k13o1j84O3M33J38
5145E66j321K72O95k0o21O29j2k80k00l7J53M69k44p97M02O63m64j49M76K12j49
5166B43j13k25L31M01o40l69M73K70l08k66J35R0J14j67l35M80M65p76j30N19
5186A92J83k81m57k83P15M90q89j50P04k35j85j07O52l48O8n79M41N20J11q01
5206b39K88L64k27k18J45n9K93l66l93K63Q38m12p65N64p7k6j57k95K07M34k16
$$ plain form
5227 -54 -647 -34 254 -154 -386 -122 121 90 70 -286 138 583 -170 -272 546 120 105 -66 38 324 297 -243
5249 -243 -685 -59 519 -199 -198 -64 -13 -461 -49 10 50 273 -376 -487 370 122 -187 -8 95 42 220 77
5271 77 -263 256 343 -450 122 681 194 -62 -276 -86 416 326 -395 -252 447 99 -526 167 151 -231 -200 -236
5293 -236 66 489 -36 -698 -292 245 -326 -267 116 153 -161 -435 -132 301 763 -238 -329 96 529 262 124
5314 124 134 238 380 -105 -360 255 302 -229 -328 245 196 -65 -161 -67 307 409 -428 -179 310 -66 -614 -255
5336 -255 84 -253 69 -515 -263 568 -6 -445 165 117 267 -358 1 265 226 150 -301 -75 695 129 -292
5357 -292 -60 427 246 -239 -191 -275 7 -102 -469 189 192 -274 -520 -268 240 -145 -272 -395 -92 418 -70
5378 -70 -139 335 394 -282 -102 208 483 515 -183 -228 326 600 65 113 279 67 -129 26 -93 402 231 -399
$$ packed form
5227e4n93O13K88m08k32K64K43l1k0l56M24M45p53j02Q18m26j5j71J04K86k7n40
5249b43m42O26N78p18JJ34N1m48M12N9M0K23o49j11Q57k48l09J79J03n3J78j43
5271G7l40N19Q7p93N72N59m87k56k14J90N02r0p21J43O99l48o25O93j6l82L1l6
5293b36L02M23n25o62M06N37n71N9L83L7l14k74L03M33M62j001r1M25M33k67j38
5314A24J0J04J42m85k55O15M7n31r9N73m9k61r6R4L74J02q37K49M89l76n48L59
5336b55L39l37L22n84K52Q31n74m39O10m8J50o25L59K64l9p6m51K26P70n66m21
5357b92K32M87j81m85M8q4K82j09l67O58Lm66k46K52N08l85j27j23L03N10m88
5378g0o9M74N9o76J80L10K75L2o98m5N54K74n35M8J66k12j96J55j19M95j71o30
$$ plain form
5400 -399 -28 -24 105 -646 -424 27 -151 -262 -88 89 147 -310 -153 -139 207 297 -151 -41 220 334 342 46
5422 46 160 537 85 164 -6 229 -214 -29 -166 120 287 -211 -473 26 57 -199 -295 246 235 46 -599 -787
5444 -787 369 286 -265 -669 236 78 -4 59 -56 336 267 -547 -199 371 536 -380 62 211 252 89 179 85
5466 85 334 -166 -529 -187 187 -75 -522 -154 142 135 48 -538 -628 331 -103 -99 125 187 20 -147 145 349 -22
5489 -22 -111 -482 296 527 -72 -117 229 275 -159 219 -27 301 159 -211 -546 182 506 -4 -649 -6 -62 490
5511 490 -35 -408 -100 377 -405 -360 267 145 73 -256 -354 149 -22 -362 -143 320 103 -229 -198 352 158
5532 158 -187 -155 -59 348 5 -222 9 590 115 -43 18 -94 -108 78 -349 -159 204 -88 -421 91 439
5553 439 4 -364 -239 77 248 -72 -179 459 118 169 -329 77 202 196 17 -105 492 520 129 -155 86
$$ packed form
5400c99L71MJ29p51K22M51j78j11J74J77N8m57J57J4L46R0m48J10K61J14Qk96
5422D6J14L77m52P9j70K35m43J85j37K86J67m98k62M99L1k56r6N41j1j89o45j88
5444g87J156q3n51m04R05j58q2O3j15L92o9q14L48N70J65r16M42J49M1j63R0r4
5466H5K49n00l63L42L74k62m47L68K96pq7n86r0R59m34MK24O2j67j67K92K04l71
5489b2q9l71P78K31n99m5L46M6m34L78k46L28j42l70l35P28L24n10o45O43n6N52
5511D90n25l73L08M77p82M5O27j22p2l29r8N03j71l40K19M63k17l32L1N50j94
5532A58l45L2R6M07l43k27K31N81m75j58O1j12j4J86m27J90L63k92l33N12L48
5553D39m35l68J25L16J71l20j07O38l41N1m98M06J25oj79j22N97K8l91k84K41
$$ plain form
5574 86 116 -385 -123 200 389 -24 -133 -249 -47 176 -439 37 237 75 -647 -37 159 258 -22 -90 -74 432
5596 432 309 -600 171 303 176 111 -5 159 140 289 -461 -131 545 -281 -4 124 142 103 -103 -318 -132
5617 -132 451 133 -490 165 390 -431 -183 -229 83 177 -339 -350 157 360 -38 -399 72 -53 -100 -76 163 137
5639 137 391 -100 -337 423 415 150 -169 -97 74 114 -117 -7 14 -320 -251 -148 327 18 -178 -281 -204 106
5661 106 -131 -342 -121 -58 1 -292 -75 32 258 -196 -400 36 219 154 -28 -66 346 235 -319 328 260 -40
5683 -40 198 -394 212 304 -106 -661 -53 426 16 -275 106 61 282 -74 -482 240 320 -241 -164 150 427 288
5705 288 -35 -94 276 -29 62 255 397 125 -106 232 15 27 48 -393 -211 487 176 -301 -176 -59 103
5726 103 -99 -70 -414 -130 -252 -231 315 332 -123 -587 -211 154 -166 1 65 344 327 60 -515 600 535 48
$$ packed form
5574H6L0n01K62L23J89m13j09j16K02K23o15M76K00j62p22O10J96R9k80o8J6N06
5596D32j23r09P71J32j27o5j16J64j9J49p50L30O76q26K77J28J8l9k06k15J86
5617a32N83l18o23O55K25q21K48m6L12R4n16j1N07K03l98l61M71j25m7K4K39k6
5639A37K54m91k37P60qk65l19P2J71M0k31J10K1l34O9J03M75l09j96j03P7L10
5661A06k37k11K21O3N9k93K17J07K26m54k04M36J83o5j82l8M12j11n54O47o8l00
5683d0K38n92O06R2m10n55O08M79m10k91L81m5K21l56m08P22Q0n61P7L14K77j39
5705B88l23n9L70l05R1J93J42k72k31L38k17J2K1m41J82O98l11m77J25J17J62
5726A03k02K9l44K84j22K1N46J7m55m64L76L65l20J67O4K79j7k67n75J115o5m87
$$ plain form
5748 48 -7 -159 296 90 46 -169 -100 240 -389 -236 313 81 -150 -257 -109 -152 179 -196 -145 40 188 -225
5770 -225 -14 438 8 -137 -223 219 313 415 -135 -573 117 185 188 -2 -98 -79 113 -10 45 542 -124 -186 135
5793 135 679 -178 -66 58 -97 -44 63 -205 118 485 -336 -205 191 294 -250 -53 -176 281 306 12 -265
5814 -265 -68 93 -63 13 247 266 274 -62 -100 408 198 -81 -249 88 288 -142 44 -188 53 68 20 -254
5836 -254 119 -119 -215 -189 -60 273 6 -96 -335 -191 44 -86 137 382 304 63 176 141 354 408 -90 -243
5858 -243 126 191 278 191 213 -164 -139 6 -6 81 -290 -658 -365 -63 -119 -459 -60 3 102 -129 -149 -68 156 194
5882 194 -225 344 259 203 -134 38 -48 -7 76 -210 261 273 -230 88 467 34 5 -347 -56 274 492 -52
5904 -52 -517 65 11 16 72 -47 132 149 -272 -24 190 305 -202 -266 38 -13 -41 -66 164 375 -106 -49 46 72
$$ packed form
5748D8n5j52M55k06m4k15O9L40o29J53N49k32k31j07J48m3L31l75N1J85J48m13
5770b25K11M52m30j45q6M42R4J02n50m38O90O8Lj90r6J9J92j23N5M97o66o2L21
5793A35N44q57J12J24j55N3J07k68L23L67q21J31L96J03n44J97j23M57K5k94k77
5814b65J97J61j56P6K34J9Ql36l8N08k10k79j68L37K00m30J86k32K41J5m8k74
5836b54L73k38r6K6J29L33k67j02k39J44K35j30K23K45p8k41J13l5K13N4m98j53
5858b43L69O5Q7q7K2l77K5J45j2Q7l71l68K93L02n6l40L99O3R9k31k0Q1K24L8
5882A94m19N69q5n6l37J72q6M1Q3k86M71J2n03L18L79m33k9l52K91L30K18n44
5904e2m65N82n4NN6j19J79J7m21K48K14J15n07o4L04n1k8k5K30K11m81N7R5K6
$$ plain form
5928 72 28 -445 260 130 -136 -241 -200 -17 67 -168 -296 174 307 -257 -244 334 112 -314 -30 -319 -80 -293
5950 -293 -45 -50 193 221 -274 21 263 429 112 -307 -140 265 197 -340 -228 339 -349 35 45 -17 -167 -16
5972 -16 -178 -132 331 75 6 -145 56 81 -81 -561 43 93 -6 -166 10 196 -227 -69 -98 277 105 -78
5994 -78 99 -165 205 -248 -205 11 116 -135 -409 -60 1 280 188 -330 -12 228 -98 -279 -134 23 -194
6015 -194 -33 -10 -39 196 -144 -360 254 -235 -174 117 -41 -361 120 -410 -5 -20 221 -221 -165 124 90 -130
6037 -130 -374 -227 32 138 -193 -200 386 -224 -325 93 477 56 -129 -416 -294 316 -78 47 -334 227 -122
6058 -122 88 -94 53 213 207 -379 65 507 571 -336 -97 282 134 353 -179 -24 136 25 132 -100 586
6079 586 -19 -39 151 246 -266 13 -180 -1 354 -78 -60 503 -42 -47 -5 -103 -6 -122 61 -270 575 98 -201
$$ packed form
5928G2m4m73P05j30k66j05M1J83Q4k35j28M70J33n64J3N78k22m26K84k89K39k13
5950b93K48nK43K8m95K95K42J66l17m19J67M05o8n37J12N67o88L84J0o2j50J51
5972a6j62M6M63k56o9j51K01K5j62m80O04N0r9j60J76J86m23J58k9L75j72j83
5994g8J77k64L70m53M3K16J05k51k74L49O1K79r2n18L18K40l26j81J45J57k17
6015a94J61K3k9K35l40k16O14m89O1K91j58l20M81n30M05j5K41m42N6K89l4k20
6037a30k44J47K59J06l31pN86o10j01M18L84m21j85k87J22O10l94J25l81N61l49
6058a22K10j82J47J60on86M44M42O4r07K39L79j48K19n32J55J60j11J07k32O86
6079E86o05k0J90R5n12K79j93J79L55m32J8N63n45nM2r8R7j16J83l31Q45m77k99
$$ plain form
6102 -201 -137 351 -121 -92 180 57 64 49 -216 -128 41 178 -208 -65 233 139 53 -270 149 64 208 -228 -91
6125 -91 -44 -46 -205 -1 -408 -82 -219 -274 -96 239 -224 -137 50 176 27 150 283 -71 253 347 -228 331
6147 331 -224 -176 -48 -290 -11 168 29 -57 334 -141 -148 -327 -165 -142 22 70 -102 -273 -204 -155 236 362 -97
6170 -97 -315 -128 339 140 -188 61 -228 100 91 -334 85 131 -177 -33 157 -82 -173 -70 -328 114 278 -9
6192 -9 -105 16 127 -307 -336 -258 324 -155 80 -110 63 295 -359 -306 61 94 -260 138 -125 23 -64 -218 -153
6215 -153 370 181 -251 -87 258 -69 -181 50 70 320 95 -300 39 21 221 -253 63 86 8 65 -145 -57
6237 -57 -69 70 -414 -24 66 245 -110 214 72 1 357 -64 -133 181 26 -324 130 167 230 -166 30 -53 146
6260 146 -151 -234 435 187 -72 -94 -54 82 -55 -23 -259 -7 266 -248 -357 -166 -89 -52 -22 -63 39 -128 -130
$$ packed form
6102b01O4M88m72K9K72j23Pj5k65Q8J69J37l86J43K98r4q6l23M19q5J44m36J37
6125i1M7kj59K04m07L26j37n5J78L35m63Q7J87J26j49J23J33l54L24R4n75N59
6147C31n55M8J28k42K79J79j39q6L91m75pj79J62K3J64M8j72j71O9M9L91J26m59
6170i7k18J87M67j99l28K49k89L28rm25M19M6l08J44J90k39r1J03k58M42J64k87
6192ir6J21J11m34k9P8N82m79K35j90J73K32o54N3L67L3l54L98k63J48q7j54O5
6215a53N23j89m32J64L45l27j12K31K0K50k25l95L39j8K00m74L16K3p8N7k10Q8
6237e7j2J39m84L90R0J79l55L24j42p1L56m21o9L14j55l50M54L7O3l96J96q3J99
6260A46k97q3O69k48k59k2M0J36j37L2k36K52K73n14j09J91P7L7L0m1J02j67k
$$ plain form
6283 -130 282 505 57 237 195 330 126 -121 -104 106 87 -46 139 -60 133 266 -424 -155 208 123 -194
6304 -194 -278 -260 93 -47 -313 237 294 -26 -25 -311 30 -184 -21 -80 -64 210 333 -59 -143 165 -264 154 38
6327 38 12 68 -308 130 31 323 406 46 1 -37 35 112 -104 -236 439 -30 -85 -73 168 85 -410 -88 -28 37 -26
6352 -26 -171 249 -79 79 -30 311 -84 66 -4 -35 163 183 -322 235 225 98 -117 -123 -64 140 264 17 -256
6375 -256 15 52 19 -110 89 222 -155 -62 63 31 -157 66 -78 -39 13 -128 15 359 122 150 109 288 196
6398 196 31 -364 -19 228 209 -41 -65 -29 173 13 165 161 -113 -91 61 -42 38 -1 149 -181 242 182 -147
6421 -147 -28 -179 55 -211 -93 30 -3 -52 -69 45 210 169 -155 13 78 10 163 -195 250 -214 44 -150
6443 -150 105 -197 -106 -128 175 346 -125 51 -274 -95 296 217 -143 -124 520 168 -332 14 187 254 -220 -114
$$ packed form
6283a30M12K23m48J80m2J35k04k47J7K10j9j33J85j99J93J33o90K69L63q5l17
6304a94q4J8L53j40k66N50N7l20Jk86L41k14J63n9J6K74J23l92q4L08m29M18j16
6327C8k6N6l76M38r9K92Q3l60m5l8P2P7k16j32O75m69n5J2K41q3m95L22O0O5o3
6352b6j45M20l28J58j09L41l95J50p0l1J98K0n05N57j0j27k15oN9K04J24k47k73
6375b56K71L7l3j29J99J33l77R3J25l2j88K23j44L9N2j41J43L44k37K8m1J79r2
6398A96j65l95L45K47j9k50k4L6K02j60J52mk74K2J52j03Q0l9J50l30M23o0l29
6421a47J19j51K34k66J18J23l3m9j7J14J65m1l24J68O5o8J53l58M45m64K58j94
6443a50K55l02R1k2L03J71m71J76l25J79L91p9l60J9O44l52n00L46J73O7m74J06
$$ plain form
6465 -114 -25 283 -54 -69 278 -52 -98 -126 -3 217 213 -48 -232 -121 155 72 -53 93 271 -179 112 220
6487 220 114 9 7 -38 371 207 -122 -171 99 -124 17 -30 -9 188 31 -217 -75 -16 -352 247 22 36 122
6510 122 226 36 -128 100 -37 -243 21 84 -92 37 -348 103 225 214 -174 153 -228 -312 -346 -10 320
6531 320 118 202 -130 -97 216 -70 -316 -4 64 -104 378 254 237 37 227 172 95 76 -113 -11 110 -78
6553 -78 -19 -90 -213 41 215 -267 13 275 111 -325 53 26 16 98 -282 165 206 168 91 201 348 219 43
6576 43 47 -175 249 130 -396 67 98 -132 -247 117 250 -114 -64 128 108 -7 -21 250 12 -22 -170 -4 -395
6599 -395 -368 20 -193 -16 -1 188 82 144 60 39 59 156 238 314 159 8 -262 -86 141 -130 168 425 -223
6622 -223 -105 73 -292 -91 -82 104 -145 43 23 128 -174 -105 -30 12 23 -145 398 -425 -39 -164 154 -45
$$ packed form
6465a14Q9L08l37j5L47l30m6k8J23K20mk61j84J11K76q3j25J46J78m50K91J08
6487B20j06j05km5M09j64l29m9K70k23J41m7K1J97j57k48J42N9l36N99k25J4Q6
6510A22J04j90j64K28j37k06K64O3j76J29l85M51J22j1l88L27l81q4l4L36L30
6531C20k02Q4l32L3L13k86k46L12O8j68M82j24j7k00J90n5p7j9j89J02J21j88
6553g8N9p1j23K54J74m82K80K62j64m36L78k7j0Q2l80M47M1l8p7J10J47j29j76
6576D3Mk22M24j19n26M63L1k30j15L64J33l64N0J92k0j15j4K71k38l4j48J66l91
6599c95K7L88k13J77J5J89j06O2q4k1K0R7Q2P6j55j51k70J76K27k71K98K57o48
6622b23J18J78l65K01RJ86k49J88k0J05l02O9P5M2J1j68N43q23L86j25L18j99
$$ plain form
6644 -45 69 38 294 65 -53 -330 -228 351 -11 220 150 121 -131 -60 -476 268 71 -4 239 65 -93 -47
6666 -47 -33 -479 211 -1 32 -80 -49 403 64 -116 19 -30 -323 125 -91 166 -142 -79 63 -51 200 -24
6688 -24 -121 111 -52 -69 -19 164 132 -323 256 59 352 10 -169 21 7 423 176 -119 164 -138 -116 -147 47
6711 47 -145 -247 117 -72 -35 103 148 -63 13 83 -126 -121 4 -34 167 -198 3 257 163 -115 -139 53 167
6734 167 70 -76 103 -2 162 -114 -407 265 -286 179 -9 139 123 107 44 47 101 233 59 -9 97 164 -225
6757 -225 119 183 327 -63 112 163 31 75 9 73 231 16 -64 -132 -84 -301 -167 25 -196 534 -104 -161 -59
6780 -59 47 -41 -119 51 -118 -78 45 -201 48 122 128 -5 136 43 347 223 -307 195 -128 79 116 84 -201
6803 -201 -158 -101 129 169 53 173 -97 156 -314 -132 2 147 6 -358 -55 -328 -127 39 -265 65 84
$$ packed form
6644d5J14l1K56k29j18k77J02N79l62K31p0k9k52P1m16P44j97p5K43j74j58M6
6666d7J4m46O90k12L3j12L1M52l39j80J35m9k93M48k16K57l08O3J42j14K51k24
6688b4r7K32j63j7N0J83l2m55N79j97K93l42j79J90j4M16k47k95K83l02K2l1J94
6711D7j92j02L64j89L7J38M5k11P6P0k09NJ25l8K01l65K01K54r4k78k4J92J14
6734A67r7j46J79j05J64k76k93O72n51M65j88J48j6j6o3LN4J32j74o8J06O7l89
6757b25L44O4J44l90J75N1j32M4o6O4J58k15q0o8M8k17J34J92k21P30o38n7J02
6780e9J06q8p8J70j69M0J23k46K49P4Oj33J41r3L04j24n30N02l23K07L7l2k85
6803b01M3N7K30M0j16J20k70K53m70J82J34J45j41l64L03k73K01J66l04L30J9
$$ plain form
6824 84 -26 -150 145 52 -50 108 228 -72 179 -216 67 -81 -293 -61 -202 102 -56 29 -4 -158 289
6845 289 -34 34 118 -162 34 22 332 -48 71 -4 2 205 69 115 -136 103 61 41 -204 -228 -8 154 39
6868 39 106 -14 39 51 -149 -51 253 -39 161 154 -13 -148 172 -67 4 181 238 214 -183 134 -134 -352 136
6891 136 -151 -268 -44 -446 -176 180 -154 -217 -143 30 -149 225 -8 -233 -80 101 238 87 98 40 319
6912 319 -338 13 -71 103 -4 206 51 4 -213 -146 -123 97 -203 -395 254 122 53 17 190 264 60 -298
6934 -298 134 -26 351 -255 -521 185 132 64 -253 292 122 64 198 -107 -160 -110 15 531 65 -69 111 -102
6956 -102 92 -153 -23 -46 151 -30 -176 -76 314 -51 -41 -31 410 153 5 242 -2 131 -75 112 106 -110
6978 -110 -233 213 -192 -233 188 241 359 -143 11 94 83 195 298 -75 -152 -253 137 -260 155 -134 -165 -40
$$ packed form
6824H4j10j24K95r3j02J58J20l00K51l95K83j48k12K32j41L04j58Q5l3j54M47
6845B89l23O8Q4k80J96j2L10l80J19p5OK03j36M6k51K39m2k0k45k4K20J62j15
6868C9O7j20N3J2k00R8L04k92K00pj67j35L20k39P1J77N7k4l97L17k68k18M88
6891A36k87j17K24m02K70L56l34o3P4J73j79L74k33k25J53J81J37j51J1n8K79
6912C19o57L51q4J74j07K10j55m7k17O7K3K20l00j92O49j32o9l6J73P4k04l58
6934b98M32j60L77o06k66P06n3o8l17N45j70n8J34l05n3N0J25N16m66j34J80k13
6956a02J94k45J30k3J97j81j46J00L90l65J0J0M41k57j48K37k44J33k06J87ok16
6978a10j23M46m05m1M21N3J18n02J54Q3j1J12J03l73p7j01L90l97M15k89l1J25
$$ plain form
7000 -40 131 -27 12 -114 166 78 160 -5 142 82 217 164 -227 173 82 -198 -102 -18 27 -115 -247 -219 -207 40
7024 40 326 -143 348 136 22 -18 -30 229 38 27 8 -154 -18 139 -68 53 93 -261 13 191 -76 -12
7046 -12 78 289 24 59 148 153 218 -107 174 -169 -16 -411 -267 150 -228 142 218 131 24 -43 -62 -139 -23 -173
7070 -173 152 -415 -112 174 -59 -124 110 -68 -90 -193 95 332 -107 -149 208 126 300 292 91 180 76 -134
7092 -134 -263 94 -311 -318 59 -7 -68 68 9 -16 -34 161 -323 -36 136 46 -15 138 -347 -195 92 260 155
7115 155 423 182 -164 10 164 320 28 266 -176 209 -33 -14 -40 -8 37 -304 169 -31 -4 153 99 10
7137 10 -76 49 193 40 189 -157 8 -10 285 4 219 69 12 218 -233 -42 -56 -60 90 142 -227 147 23
7160 23 -116 -82 -33 220 25 -468 133 -4 293 -189 159 -277 56 -222 73 84 -139 -49 -234 34 -88 -21
$$ packed form
7000d0J71j58L9j26K80q8Q2j65J47o0J35n3l91M00r1k80R6Q4M5j42j32K8J2K47
7024D0K86m69M91k12j14m0j2K59j91j1j9j62J36J57k07J21M0l54K74J78k67O4
7046a2R0K11k65L5Q9NO5l25K81l43J53l95J44M17l78L70P6q7j07o7j9p7J16j50
7070a73L25n67L03K86k33o5K34j78k2j03K88K37m39m2L57q2J74qk01Q9j04k10
7092a34j29L57m05pL77o6o1J36n9k5j8J95m84K87J72r0o1J53m85J52K87J68j05
7115A55K68k41l46J74J54J56k92K38m42L85k42J9k6L2M5l41M73k00K7J57n4q9
7137A0q6J25J44j53J49l46J65j8K95k81K15j50n7K06m51J91j4mJ50N2l69L74j24
7160B3j39L4M9K53j95m93O01j37K97m82L48m36L33k78K95J1k23R0j85K68j22O7
$$ plain form
7182 -21 -215 -114 -260 -176 -160 -4 34 -20 264 -164 149 -38 -197 201 -4 106 -7 -97 117 11 64 351
7204 351 210 -20 121 357 142 5 -389 53 -37 -302 -114 141 -67 118 -37 -315 -41 -118 -246 -261 134
7225 134 191 -107 158 -14 141 -363 68 -153 -42 -149 -180 122 190 -1 -83 41 196 -127 43 -158 -176 324
7247 324 -118 78 89 63 31 -2 -13 223 -1 -250 244 117 117 -59 202 400 175 138 -253 280 102 30 273
7270 273 -131 -84 29 -60 -169 -89 -14 -266 -118 -379 -157 -117 169 -40 21 -37 -101 7 -59 -260 -17 38 -332
7293 -332 97 68 101 -169 200 -53 123 210 -68 -284 -142 149 -161 98 -96 -151 230 -6 -85 -11 -213 110
7315 110 -33 183 -115 -50 20 23 52 208 -207 116 153 -123 -175 -209 32 116 80 176 -67 330 372 -127 222 278
7339 278 -153 -56 212 42 97 154 282 -185 -186 89 -73 283 -36 -24 -102 -65 -1 36 -251 -245 -285 129 -208 -89
$$ packed form
7182b1j94J01j46Q4J6J56L8n4K84m28L13j87j59L98k05J10j13r0K14j06N3K87
7204C51j41k30J41K36k15j37l94M42r0k65J88K55k08J85j55k78K74p7j28j5L95
7225A34N7k98K65j72J55n04M31k21J11j07l1L02O8j91q2J24J55l23J70k01j8N00
7247C24m42J96J1k6l2l3j1K36k24k49M94j27%j76K61J98k25l7l91N33j78p2K43
7270B73m04M7J13q9j09Q0P5k52J48k61K22M0K86k09O1n8o4J08o6k01K43N5l70
7293c32M29k9L3k70L69k53J76Q7k78k16J42K91l10K59j94n5L81k36p9P4k02L23
7315A10j43K16k98O5P0LK9J56m15L23L7k76n2l4K41Q4l6R6k43L97M2m99L49N6
7339B78m31R7K68j70N5N7J28m67jK75j62L56l19J2p8L7O4L7k87Om0M14l37J19
$$ plain form
7363 -89 84 77 -227 -142 -80 0 55 -110 326 -94 95 -284 -132 -23 -16 107 123 -72 21 -66 -94 -153 28 35 2 -54
7389 -54 97 70 -154 -173 -283 -254 -90 -159 -9 -177 66 -211 -339 -117 77 212 -161 -116 -82 -315 17 537
7411 537 16 -80 -96 195 -39 309 282 444 60 108 -140 -40 119 -81 253 -363 -42 40 -295 -142 -176 4
7433 4 -56 142 7 91 -77 -268 117 95 55 -159 -355 -46 193 -14 20 42 156 115 231 -43 277 63 -92
7456 -92 -51 171 95 96 131 -172 -59 182 -153 217 306 -73 84 -180 221 -307 67 -209 -270 95 -97 58 -144
7479 -144 -59 -291 -65 1 6 53 -34 148 219 -148 2 -214 -292 255 -390 325 106 -88 -55 -133 65 40 -172 118
7503 118 199 100 -130 -266 208 -401 -76 -251 -452 -175 -27 -114 -187 69 31 -17 -124 175 -222 -122 52 -168
7525 -168 -182 30 223 156 -52 -105 6 254 108 77 157 -27 -115 141 -382 -268 -72 -128 -12 -127 -32 304 86
$$ packed form
7363h9J73pl04Q5O2Q0N5j65M36m20J89l79J52J09PJ23J6j95R3q7k8n9J81Pl3n6
7389e4J51k7k24j9j10K9J64o9J50j68K43k77j28K22J94J35l73M5L4k33L32N20
7411E37n21r6j6K91k34L48k7J62l84M8k48J00J59k00L34o16L21Q2l35J53l4J80
7433Do0J98j35Q4j68j91L85k2m0k14j96L09K39k07L4K2J14m1J16k74L20k14j55
7456i2M1K22p6JL5l03J13K41l35L70Q9l79J57k64M01n28L74k76o1L65j92J55k02
7479a44Q5k32K26O6NM7q7J82P1l67J50k16p8N47o45P15k19j94L3p8J98k5k12K90
7503A18Q1r9k30j36M74o09L25j75k01K77J48q7p3K56l8m8j07K99l97J00J74k20
7525a68j4K12J93o7k08n3J11K48j46l1Q0j84q8K56n23J14J96n6J16j15R5L36k18
$$ plain form
7548 86 -156 235 60 -263 195 -15 -193 -122 -268 85 149 0 -407 244 222 302 305 86 73 -339 31 91 374
7571 374 -57 -287 -231 -253 -103 -114 145 -37 -125 220 136 -244 -92 139 272 191 129 -72 86 -184 -106 -42 -360
7594 -360 -82 -63 -122 411 -88 -187 -6 315 -126 -40 131 -184 140 119 167 -41 -176 -6 -112 69 -208 -36
7616 -36 -194 194 -184 -168 -187 -294 -57 221 -236 -126 277 57 -161 46 161 -46 -118 -6 -26 263 -53 -72
7638 -72 169 35 275 -472 234 -42 188 -204 112 139 188 250 270 168 86 134 -169 200 -268 147 332 -126
7660 -126 -23 220 12 190 191 238 -52 -70 72 -233 -100 136 -28 324 146 27 66 95 -334 37 -327 -29
7682 -29 -391 268 40 -147 124 142 165 -173 -95 -62 175 -113 159 97 262 51 280 -161 333 309 -108 -112 -99
7705 -99 200 -289 51 91 -67 124 7 -273 -31 -37 10 236 27 -116 -16 272 -280 89 97 6 17 198 -213
$$ packed form
7548H6k42L91j75l23M58k10j78P1j46L53O4j49m07O51k2Q0Lk19j3m12L70O0K83
7571C74m31k30N6k2J50j1K59j82q8L45q4l80J52K31J33q1o2k01J58k70P8O4l18
7594c60K78J9n9N33m99r9J81L21m41Q6J71l15L24k1M8k08j35J70j06J81k77J72
7616c6j58L88l78J6j9j07K37K78m57J10M03k20k18K07J15k07p2J12k0K89l16j9
7638g2K41j34K40p47P06k76K30l92L16K7M9O2K0j02q2M8l03L69m68M15J85m58
7660a26J03K43k08J78JM7k90j8J42l05J33K36j64L52j78j19L9K9m29L71l64K98
7682b9l62O59k28j87K71J8K3l38P8L3K37k88K72o2J65k11K29m41M94k4m17mJ3
7705i9K99m89L40M0j58J91j17k80K42oM7K26k09j43J00K88n52L69Qr1J1J81m11
$$ plain form
7728 -213 -250 -60 7 -198 -43 -64 69 166 5 172 16 -77 50 40 187 101 -274 -157 -252 -51 213 -180 -31
7751 -31 -56 -47 -63 -158 -108 273 159 113 -96 -106 -26 -142 -139 -217 -112 17 211 -33 41 144 3 -106 270 44 -244
7776 -244 17 -163 64 -120 17 -20 269 -83 -37 384 155 -65 2 -29 100 -324 -62 100 -209 70 36 -418
7798 -418 68 -19 -15 -243 98 325 -180 386 -250 86 -21 236 -10 -93 -159 -192 77 -18 -284 178 -409 127
7820 127 31 173 263 -286 218 -68 83 40 -96 182 156 -17 44 -53 -65 -161 187 186 377 -63 129 162 362 126
7844 126 -225 128 72 -47 -332 -353 -46 -2 -339 1 183 14 -282 125 207 -155 33 -147 -93 189 45 -128
7866 -128 -105 -2 -139 87 -222 -209 275 -127 -21 -143 253 -120 -144 79 224 431 -28 -21 47 114 -124 -65 -240
7889 -240 362 -21 89 342 27 151 21 -41 -50 -351 -11 132 -41 217 -213 85 -136 -245 -54 90 -137
$$ packed form
7728b13l7J90O7k05J55k1J33R7j61J67j56r3J27j0J47q6l75J17r5K01K64l93J49
7751c1k5Rj6r5N0L81j14m6k09j0Q0j16Lp8J05J29J94k44P4J03j41j09L76k26k88
7776b44K61j80K27j84J37l7K89l52M6M21k29k20O7l1J29m24K62J62l09K79l4m54
7798d18M86q7Mk28L41K27n05N66o36L36j07K57k46q3o6l3K69r5k66M62n87N36
7820A27r6J42R0n49N04k86J51m3j36K78k6j73O1r7j2r6L48jJ91m40J92L3K00k36
7844A26l51L53n6j19k85k1L07M4l37L40J82j69k96M07Q2l62J88j80N4K82j44j73
7866a28K3J03j37K26l09J3M84m02J06j22L96l73k4K23J45K07m59PO8O7k38N9j75
7889b40O02l83J10K53l15J24j30o2rl01L40J43j73K58m30K98k21j09J91J44k27
$$ plain form
7910 -137 -79 -167 -23 -253 503 -103 -431 25 -166 277 -163 -8 86 251 194 -56 -333 -290 52 36 178 139
7932 139 -153 74 -277 215 289 391 40 -185 98 -28 -144 7 -13 308 2 361 -169 198 -125 -429 -150
7953 -150 -112 -111 -265 -328 161 425 53 -136 151 -170 102 -306 103 146 91 -57 59 122 24 -89 -266 180 73
7976 73 -183 -56 44 38 -144 33 21 85 18 26 -133 74 313 149 52 51 -221 157 -224 3 38 157 -46 86
8000 86 -106 16 -27 8 -87 58 212 -36 -380 119 163 284 -121 154 134 28 92 71 56 -97 66 170 -202
8023 -202 -431 2 239 88 -80 -49 -113 -26 132 -29 30 -16 -116 -82 129 -336 -272 420 -35 -114 -401 183 -93
8046 -93 -221 -109 109 22 6 -88 -76 68 -40 -57 51 -342 50 -116 -57 168 305 -25 -68 218 177 -202 370
8069 370 212 157 -29 -54 -94 330 -57 -108 30 -214 97 90 -131 -122 -38 -231 57 -13 40 148 94 -56 -80 -156 -152
$$ packed form
7910a37N8q8J44k30P56o06l28M56j91M43m40J55R4J65n7k50k77M3L42j6J42l9
7932A39k92K27l51M92P4J02l51k25K83j26j16J51k0L21l06L59n30L67l23l04K79
7953a50L8Jj54o3M89K64l72j89K87l21K72m08M09M3n5j48J16O3r8j13j77M46j07
7976G3k56J27J00oj82J77j2O4o7Qj59K07K39j64r7jk72L78l81K27L5J19k03J32
8000H6j92J22m3L5r5J45J54k48l44M99M4J21m05K75k0j06O4k1j5j53J63J04l72
8023b02k29M33K37j51j68L1o4Q7J58j61N9m6j00L4K11m65O4O92m55p9k87N84k76
8046i3j28J12K18q7j6r4J2J44j08j7J08l93L92j66N9K25J37l30m3K86m1l79N72
8069C70j58n5j86k5m0M24l87n1J38k44L11pk21RQ4j93K88p0N3J08n4j50k4p6M
$$ plain form
8094 -152 -124 74 20 93 51 244 134 -219 -331 -205 206 14 345 298 -119 -125 -186 -164 67 -74 -344 10 -23
8117 -23 230 -50 -154 -160 23 -8 -418 151 -40 -153 -20 -220 179 -176 -121 2 196 136 -129 250 -9 181
8139 181 -63 127 -80 328 5 -38 106 249 364 74 90 -265 259 40 135 -244 98 -133 60 38 228
8160 228 120 3 267 101 -22 21 -271 -23 -174 1 -89 -47 166 -104 -112 -102 10 228 213 -111 -57 43 -4
8183 -4 -295 -408 96 -124 -146 125 125 -136
$$ packed form
8094a52K8J98n4P3m2J93j10l53j12J26M11j92L31m7m17oo1K2K31j41k70L54l3
8117b3K53k80j04oJ83l1m10N69j91j13J33k00L99l55N5J23J94o0k65L79k59J90
8139A81k44J90k07M08l23m3J44J43J15k90J6l55N24k19R5l79L42k31J93k2J90
8160B28j08j17K64j66j23M3k92K48j51J75r0M2K13k70qJ0J12K18j5l24N4J00m7
8183dk91j13N04k20k2K71%k61
8191a36
$$ Imaginary data points
##PAGE= N=2
##DATA TABLE= (X++(I..I)), XYDATA
$$ plain form
0 0 0 0 0 0 0 0 0 2 -7 8 -8 8 -8 16 -16 16 -24 26 -32 36 -42 50 -58 66 -76 86 -99 112 -127 143 -161 180
32 180 -201 225 -251 279 -311 344 -381 421 -466 517 -573 632 -702 782 -869 969 -1086 1223
50 1223 -1389 1587 -1837 2160 -2592 3203 -4132 5713 -8900 17826 -91556 -340136 -89158
63 -89158 138698 42945 -109642 -72193 -12175 -20325 -38375 -35577 -43426 -20689 16199 -71
75 -71 -38047 24111 109498 58592 -46522 -29415 29819 27908 39777 60954 -5937 -53989 20501
88 20501 66577 -11827 -60775 -14635 11863 -7278 5389 29983 -6710 -58346 -30982 26140
100 26140 9362 -34668 -19059 10604 12876 19101 2005 -52104 -50884 9179 21210 3264 23905
113 23905 29708 -7059 -24385 -25635 -29853 23874 104604 66673 -69055 -86286 50504 102507
$$ packed form
0@%%%%%%%KrJ5j6J6j6K4l2L2m0N0n8O8p8R2j08J24j42J62j85K11k39K70l04L41
32A80l81M26m76N30n90O55p25Q02q87R83j090J205j334J484j651J838k055K309
50A223k612K976l424L997m752N795p335R845j4613K6726j09382k48580K50978
63h9158K27856r5753j52587L7449O0018q150j8050K798p849K2737L6888j6270
75g1l7976O2158Q5387n0906j05114J7107N9234j911J1869K1177o6891m8052P4490
88B0501M6076p8404m8948M6140K6498j9141J2667K4594l6693n1636K7364N7122
100B6140j6778m4030J5609K9663K272O225j7096n4109J220O0063J2031j7946K0641
113B3905N803l6767j7326j250m218N3727Q0730l7931j35728j7231J36790N2003
$$ plain form
125 102507 -25638 -100902 -2108 67671 6153 -27269 7644 -1251 -27617 -13466 -15756 -22284
137 -22284 29456 52494 -16366 -50476 12379 49854 8615 -19571 -6590 -20824 -37384 22931
149 22931 80407 13492 -72430 -39289 5624 -26560 -13370 52927 25040 -45396 -11251 43643
161 43643 6077 -32690 4639 43336 33968 17036 9511 -5406 -11218 9087 14296 -15382 -9914
174 -9914 33216 7722 -67207 -53720 16447 15551 -23710 -28398 -27357 -16406 25601 22971 -38838
187 -38838 -40793 32425 53365 390 -18349 20306 31265 -624 4162 42370 27221 -21101
199 -21101 -18882 5326 8167 26579 37938 -9902 -47884 -25839 -19198 -26948 22123 57837 -6213
212 -6213 -75257 -45210 15334 14611 -14013 -10189 2856 -5747 2292 25612 2361 -34860 -3687
$$ packed form
125A02507j28145p5264R8794O9779o1518l3422L4913q895k6366J4151k290o528
137b2284N1740K3038o8860l4110O2855L7475m1239k8186J2981j4234j6560O0315
149B2931N7476o6915q5922L3141M4913l2184J3190O6297k7887p0436L4145N4894
161D3643l7566l8767L7329L8697r368j6932p525j4917n812K0305N209k9678N468
174i914M3130k5494p4929J3487P0167q96l9261m688J041J0951M2007k630o1809
187c8838j955P3218K0940n2975j8739L8655J0959l1889M786L8208j5149m8322
199b1101K219K4208K841J8412J1359m7840l7982K2045O641p750M9071L5714o4050
212f213o9044L0047O0544p23k8624L824J3045q603Q039K3320k3251l7221L1173
$$ plain form
225 -3687 37374 13520 1300 33951 24263 -19732 -15288 12480 17169 26034 26108 -18380 -51687 -10333
239 -10333 46335 28026 -33919 -42326 523 7067 -18109 -12981 522 -4795 1465 4966 -22102
252 -22102 -24823 13800 16124 -6882 17185 39329 -6278 -48736 -19936 30802 42681 24676
264 24676 8551 -5741 -23128 -19282 10166 21403 10212 7611 -1732 -20595 133 28207 -6697
277 -6697 -45242 -14929 21914 13625 3668 165 -23002 -31231 -1867 20668 4788 -15396 -8108
290 -8108 3142 -8369 -8521 22772 26818 -9823 -22881 -6766 1455 21708 44507 16367 -23520
303 -23520 -7694 14130 -5546 -12211 19833 33700 5884 -19467 -12974 1967 -5413 -17147 -7010
316 -7010 6070 6032 1352 -17493 -36034 -12633 17381 -3096 -19415 12579 24290 -12909 -27808
$$ packed form
225c687M1061k3854j2220L2651r688m3995M444K7768M689Q865P4m4488l3307M1354
239a0333N6668j8309o1945q407M2849O544k5176N128J3503n317O260L501k7068
252b2102k721L8623K324k3006K4067K2144m5607m2458K8800N0738J1879j8005
264B4676j6125j4292j7387L846K9448J1237j1191k601r343j8863K0728K8074l4904
277f697l8545L0313L6843q289r957l503k3167q229K9364K2535j5880k0184P288
290h108J1250j1511j52L1293M046l6641j3058J6115Q221K0253K2799k8140l9887
303b3520J5826K1824j9676o665L2044J3867k7816k5351O493J4941p380j1734J0137
316g010J3080l8m680j8845j8541K3401L0014k0477j6319L1994J1711l7199j4899
$$ plain form
329 -27808 -887 17633 10656 -1575 -301 15276 23133 10131 -7419 -13253 1289 22697 15863
342 15863 -9878 -8306 6998 2582 2448 12726 -3971 -29026 -20883 -5311 -943 13625 23851
355 23851 -1079 -34540 -37641 -11500 16074 17201 2816 -2063 210 -695 1869 -932 -8904 3199
369 3199 16741 5360 4378 25435 14675 -23375 -26101 4609 24112 19328 246 -13420 -4375
382 -4375 5956 -3086 -11568 -4544 7215 5385 -14273 -21458 7726 25241 -5310 -30042 -10651
395 -10651 7185 1987 -2135 -2469 3571 13515 4305 -18447 -17782 2788 14563 16562 13962 8377
409 8377 3424 -7009 -16705 -4052 15741 18489 13927 5864 -10911 -10528 8324 4130 -17250 -16609
423 -16609 -152 10427 10541 -1514 -16582 -16371 -13097 -12583 2161 18527 11012 -10827 -22155 -9913
$$ packed form
329b7808K6921J8520o977j2231J274J5577P857j3002j7550n834J4542K1408o834
342A5863k5741J572J5304m416j34J0278j6697k5055Q143J5572M368J4568J0226
355B3851k4930l3461l101K6141K7574J127j4385m879K273r05K564k801p972J2103
369C199J3542j1381r82K1057j0760l8050k726L0710J9503m784j9082j3666R045
382d375J0331r042q482P024J1759j830j9658p185K9184J7515l0551k4732J9391
395a0651J7836n198m122l34O040R944r210k2752O65K0570J1775J999k600n585
409H377m953j0433r696J2653J9793K748m562q063j6775L83J8852m194k1380O41
423a6609J6457J0579J14j2055j5068K11L274N14J4744J6366p515k1839j1328J2242
$$ plain form
437 -9913 19024 24767 -7494 -24214 -966 18832 15728 10581 8220 4537 -642 -11530 -8596 17717
451 17717 28020 6054 -10316 -4763 4337 3611 -10300 -20762 -4145 15173 5620 -10154 -9842
464 -9842 -10804 -15395 -12140 -4619 3186 7920 346 -6852 -1276 -732 -5475 2053 9364 8518 13902 15475
480 15475 1852 -5939 -1482 3513 12164 16284 1228 -10400 -1711 5487 177 -3940 -2930 -971
494 -971 -6446 -18324 -10953 17127 18830 -10279 -23485 -12610 -2950 2528 2117 -892 7376 9820
508 9820 -11085 -20502 1863 17366 4490 -9153 -1379 20117 24484 427 -16534 -5958 5351
521 5351 6575 12799 14899 4335 -5641 -14611 -17193 2005 18403 491 -19197 -12833 -2839 -2708
535 -2708 -3111 -3836 -4671 -3319 -2724 -306 4005 1053 924 8226 5994 -2087 2041 4433 -887 4684
$$ packed form
437i913K8937N743l2261j6720K3248J9798l104n147k361l683n179j0888K934K6313
451A7717J0303k1966j6370N553R100p26j3911j0462J6617J9318r553j5774L12
464i842r62m591L255P521P805M734p574p198N576N44m743P528P311q46N384J573
480A5475j3623p791M457M995Q651M120j5056j1628Q689P198n310m117J010J959
494i71n475j1878P371K8080J703k9109j3206J0875R660N478m11l009Q268K444
508I820k0905r417K2365J5503j2876j3643P774K1496M367k4057j6961J0576J1309
521E351J224O224K100j0564r976q970k582J9198J6398j7912j9688O364R994J31
535b708m03p25q35J352N95K418M311k952j29P302k232q081M128K392n320N571
$$ plain form
551 4684 12210 5385 1575 -188 -13998 -14277 10398 20758 3016 -11756 -8331 2396 2262 -8249
565 -8249 -7719 5826 8863 1525 273 -2417 -7252 -6744 -12194 -13254 12454 28204 -1038 -27420
579 -27420 -13625 4191 2173 1883 7689 7498 -274 -6830 -93 13316 14789 4794 -6114 -12125
593 -12125 -1124 19164 12763 -8568 -4244 5883 -8860 -14245 1775 3484 -6606 -3245 3109
606 3109 64 -3594 -4671 -6396 -7866 -2743 11046 17207 1322 -14154 -10058 -3568 309 10364
620 10364 8565 -3312 2427 10057 -5858 -14912 3431 14078 5334 2088 7308 7928 785 -8545
634 -8545 -5763 8820 13765 1222 -13099 -15304 168 13369 -1015 -19523 -10196 -2465 -14539
647 -14539 -9014 14050 13515 -5194 -11918 -8630 -1198 11079 12777 2560 768 11121 15195 5716
$$ packed form
551D684P526o825l810j763j3810k79K4675J0360j7742j4772L425J0727j34j0511
565h249N30J3545L037p338j252k690m835N08n450j060K5708J5750k9242k6382
579b7420J3795J7816k018k90N806j91p772o556O737J3409J473r995j0908o011
593a2125J1001K0288o401k1331M324J0127j4743n385J6020J709j0090L361O354
606C109l045l658j077j725j470N123J3789O161j5885j5476M096O490L877J0055
620A0364j799j1877N739P630j5915r054J8343J0647q744l246N220O20p143r330
634h545K782J4583M945j2543j4321k205J5472J3201j4384j8508R327P731j2074
647a4539N525K3064n35j8709o724L288P432J2277J698j0217j792J0353M074r479
$$ plain form
661 5716 -4055 -378 4571 -3869 -2639 16940 14787 -10021 -13504 -4489 -12150 -9886 11111 9990
675 9990 -9359 -12383 -3605 -3078 -4437 -380 2017 -68 -2591 116 1706 -1896 2326 8457 -4066
690 -4066 -11986 9532 20021 -2619 -9279 10880 13098 -2946 -6123 -360 4076 8715 7707 437
704 437 -791 -13 -5748 -12269 -7654 8117 11087 -8388 -17039 892 6555 -9789 -12527 -2522
718 -2522 -2514 1263 11996 6966 -4644 -6008 -7799 -7306 8132 21106 10515 -6590 -7439 2569 6330
733 6330 1726 1974 4732 -5560 -8418 10847 16030 -4048 -9786 -967 -5112 -5193 8393 7420 -5904
748 -5904 -5886 -1288 -4078 -2465 2244 -4129 -14346 -7795 12372 14824 -7867 -16728 888 3978 -8551
763 -8551 1129 17495 9349 -2416 -597 -1767 -42 9433 7061 -3667 3405 14958 5652 -10776
$$ packed form
661E716r771L677M949q440J230J9579k153k4808l483R015p661K264K0997j121
675I990j9349l024Q778N27j359M057K397k085k523K707J590l602M222O131j2523
690d066p920K1518J0489k2640o660K0159K218j6044l177N763M436M639j008p270
704D37j228P78n735o521M615J5771K970j9475q651J7931N663j6344k738J0005
718b522QL777J0733n030j1610j364j791M93J5438J2974j0591j7105q49J0008L761
733F330m604K48K758j0292k858J9265N183k0078n738Q819m145q1J3586r73j3324
748e904J8M598k790J613M709o373j0217O551K0167K452k2691q861J7616L090j2529
763h551R680J6366q146j1765J819j170J725R475k372j0728P072J1553r306j6428
$$ plain form
777 -10776 -11184 1318 4295 -4611 -3175 7052 -446 -14471 -8477 1911 -2278 -3692 -3147 -8578
791 -8578 -2198 12117 5787 -8003 -4740 705 -3196 1458 11943 10320 -528 -3911 3343 8379
805 8379 2565 -955 2487 -2076 -4776 9409 16471 1291 -9675 -10802 -13603 -2707 17326 10402
819 10402 -11276 -10560 107 -6564 -12058 322 11428 1842 -12606 -5385 10011 5210 -7080
832 -7080 -3917 824 534 8719 10076 -4108 -3770 10403 3520 -7875 3680 12441 -996 -8854
846 -8854 2838 11750 2313 -9978 -6776 3019 710 -2947 2324 1001 -5616 -1782 -441 -9269 -5400
861 -5400 3591 -2255 -5193 6898 8054 -5428 -9886 -5677 -3369 3064 12094 13523 4122 -9113
875 -9113 -9691 3877 11096 6847 3529 74 -2052 3608 4682 -2087 982 4600 -9788 -13686 6794
$$ packed form
777a0776m08J2502K977q906J436J0227p498j4025N994J0388m189j414N45n431
791h578O380J4315o330j3790L263N445l901M654J0485j623j0848l383P254N036
805H379n814l520L442m563k700J4185P062j5180j0966j127k801J0896K0033o924
819A0402k1678P16J0667o671n494J2380J1106r586j4448P221J5396m801j2290
832g080L163M741k90Q185J357j4184L38J4173o883j1395J1555Q761j3437p858
846h854J1692Q912r437j2291L202R795k309l657N271j323o617L834J341q828L869
861e400Q991n846k938J2091J156j3482m458M209K308O433R030J429r401j3235
875i113n78J3568P219m249l318l455k126N660J074o769L069L618j4388l898K0480
$$ plain form
890 6794 13690 -3354 -13763 -8589 -1484 1209 -158 -3329 -3772 -3399 -1828 2992 4023 2380 -17
905 -17 -9206 -10246 12555 23773 1622 -12215 1496 5408 -3124 1114 9652 5287 -1194 -634 918
920 918 -255 -2866 -4071 -3173 -1092 4604 8610 -3751 -16463 -7592 2659 -1480 496 6673 -4069
935 -4069 -12320 919 10057 651 -7058 -3989 744 4324 5601 5797 5036 294 -4725 -1538 3719
950 3719 6673 6446 -2831 -9173 4514 14878 429 -11746 -4857 -1967 -4082 3001 9120 4070
964 4070 -5459 -14571 -13308 1293 10860 4405 -5627 -7232 -940 3315 -2348 -5492 4162 5430 -5547
979 -5547 -1195 12231 7097 -4801 -4170 100 2546 8570 7712 -327 -2520 852 1501 2125 1298 -2161
995 -2161 -4510 -4701 515 7340 781 -11967 -7448 637 -5543 -6329 4172 3571 -4238 -3058 1274
$$ packed form
890F794O896j7044j0409N174P105K693j367l171m43L73J571M820J031j643k397
905a7r189j040K2801J1218k2151j3837J3711L912q532M238Q538m365o481N60J552
920I18j173k611j205Q98K081N696M006j2361j2712Q871J0251m139J976O177j0742
935d069q251J3239R138r406p709L069M733L580J277J96p61m742n019L187N257
950C719K954k27r277o342J3687J0364j4449j2175O889K890k115P083O119n050
964D070r529r112J263J4601R567o455j0032j605O292M255n663l144R654J268j0977
979e547M352J3426n134j1898O31M270K446O024q58q039k193L372O49O24q27l459
995b161k349j91N216O825o559j2748M519Q085o180p86J0501o01p809J180M332
$$ plain form
1010 1274 1454 901 -3759 -6247 4260 14770 11205 506 -5899 -3425 2547 2902 3652 10970 6649
1025 6649 -10047 -9603 4863 7304 -1364 -6227 -8239 -3805 5698 3389 -5183 -4278 -3121 -7665 -5857
1040 -5857 4434 9525 2567 -8997 -8432 5373 9276 -344 -2864 233 -2009 1180 9622 7226
1054 7226 -279 -2938 -6434 -4615 7608 10449 374 -4855 -2188 -459 -821 -1281 -368 816 -2231
1069 -2231 -2880 6204 6674 -7531 -11467 -1806 2877 3377 4562 -1549 -5570 -1587 -1041 -2334 3259 3712
1085 3712 -5143 -6235 3096 9929 5760 -6905 -10811 991 9351 4340 2068 3799 -766 -3560
1099 -3560 1229 4359 5136 2190 -7803 -8615 6198 12216 968 -8772 -9470 -6316 -922 1872 2590
1114 2590 2655 -4644 -12521 -6221 4739 3547 -702 -2707 -2377 3655 8627 2951 -2106 734 -177 -382
$$ packed form
1010A274J80n53m660k488J0507J0510l565j0699o405K474N972L55P50P318m321
1025F649j6696M44J4466K441q668m863k012M434R503k309q572R05J157m544J808
1040e857J0291N091o958j1564N65J3805L903r620k520L097k242L189Q442k396
1054G226p505k659l496J819J2223K841j0075n229K667J729l62m60R13J184l047
1069b231o49R084M70j4205l936R661M683N00J185o111m021L983N46j293N593M53
1085C712q855j092R331O833m169j2665l906J1802Q360n011k272J731m565k794
1099c560M789L130P77k946r993q12J4813O018j1248r740o98L154N394K794P18
1114B590O5p299p877O300J0960j192m249k005L30O032M972n676n057K840r11k05
$$ plain form
1130 -382 8605 12413 3488 -4113 -4211 -5 4526 1826 -2851 -583 642 -5181 -4407 571 -1860 -6927
1146 -6927 -8169 -6026 2116 7461 -2445 -9997 -1023 4772 105 -1249 1699 3340 3910 3421 4331 8254
1162 8254 4353 -7093 -6046 5256 10519 7540 -261 -6675 -4633 504 -3041 -3838 2895 585 -7384
1177 -7384 -5400 2405 3104 -2088 -8970 -8907 2000 8266 4047 917 -1085 -5667 -2960 4827 6429
1192 6429 4148 449 -4654 -894 7862 5506 -1812 -1675 -1573 -3477 424 5158 5311 1709 -6341 -9300
1208 -9300 704 7135 200 -4466 -134 1842 1598 -46 -3580 -2778 -660 -2831 -129 8967 5281
1223 5281 -6062 -9380 -3195 2211 4696 -613 -4265 1591 3490 -2641 -2557 3033 936 -2114 -1445
1238 -1445 2889 9113 7134 -5028 -8333 2370 7317 3713 752 -1985 -3461 306 2543 1705 1019
$$ packed form
1130c82Q987L808q925p601r8M206M531k700m677K268J225n823P74M978k431n067
1146f927j242K143Q142N345r906p552Q974N795m667j354K948J641N70m89R10L923
1162H254l901j1446J047J1302N263k979p801o414K042N137l545p97O733k310p969
1177g384J984P805O99n192o882O3J0907O266m219l130k002m582K707P787J602
1192F429k281l699n103L760Q756k356p318J37J02j904L901M734J53l602q050k959
1208i300J0004O431o935m666M332J976k44j644l534Q02K118k171K702R096l686
1223E281j1343l318O185N406K485n309l652N856J899o131Q4N590k097l050O69
1238a445M334O224j979j2162l305J0703M947l604k961k737j476L767K237q38o86
$$ plain form
1253 1019 -6318 -12293 -4007 5930 4253 -727 -4440 -8182 -5766 -193 1774 3201 4519 -2381 -4534
1268 -4534 3546 8474 3127 -2006 -3225 2841 10566 6902 -313 614 -601 -5989 -1845 6617 4632
1283 4632 -3435 -6701 -5343 633 2609 -5313 -8962 -1873 1495 -803 -1198 -823 511 114 -4828 -3223
1299 -3223 7588 7946 -2648 -3415 5199 6874 3453 -764 -4384 -246 4921 3608 3658 4511 -2719 -8440
1315 -8440 -4045 1565 3157 1760 -3241 -4111 390 -694 -4255 -855 665 -4408 -3580 2929 4682
1330 4682 3725 -1796 -7952 -3082 6382 4441 -117 2529 1629 -2716 -1475 3053 4760 1357 -5983
1345 -5983 -4499 6035 7346 -1094 -2881 -1010 -2127 -1340 780 552 2894 3849 -4776 -6911 2638
1360 2638 5232 -3074 -7091 -2526 5109 5325 -2568 -5371 -676 -2080 -4823 2030 6560 924 -2025
$$ packed form
1253A019p337n975Q286R937j677m980l713l742K416N573J967J427J318o900k153
1268d534Q080M928n347n133j219O066P725l664p215R27j215n388M144Q462j985
1283D632q067l266J358N976J976p922l649P089L368k298l95L75J334l97m942J605
1299c223J0811L58j0594p67Q614J675l421m217l620M138N167j313N0Q53p230n721
1315h440M395N610J592j397n001q70M501j084l561L400J520n073Q28O509J753
1330D682r57n521o156M870R464j941m558K646r00m345J241M528J707l403p340
1345e983J484J0534J311q440j787J871j117P87K120k28K342R55q625k135R549
1360B638K594q306m017M565P635K16p893k803M695j404k743O853M530n636k949
$$ plain form
1375 -2025 -1323 -1353 2242 3982 -1295 -1741 4125 4919 1661 1015 909 -1068 -1079 -1235 3539 6581 -528
1392 -528 -7097 -1430 2683 -938 -2313 -1999 -4805 -3431 186 734 2251 654 -8223 -8598 2400 7037
1408 7037 2109 -1053 -1536 364 2496 719 983 5102 2784 -2878 111 6012 6524 2499 -5184 -8233
1424 -8233 1669 8870 878 -3611 67 -1616 -6745 -3423 1960 1436 -2035 -5287 -2561 3143 1115
1439 1115 -3961 -2901 -1050 211 4536 2947 -1769 1165 2997 -1913 -18 6876 2106 -4720 -159
1454 -159 6135 5257 1333 -3418 -3471 -1194 -871 1391 6197 1150 -7283 -4875 17 1024 1044 -2072 -6338
1471 -6338 -648 5970 303 -3754 -223 -942 -3990 -1466 4122 7249 4089 -5068 -6345 2669 6139
1486 6139 852 -791 229 1605 3220 166 -1980 2829 1722 -6056 -3135 6242 3694 -2884 -2972
$$ packed form
1375b025P02l0L595J740n277m46N866P94l258o46j06j977j1j56M774L042p109
1392e28o569N667M113l621j375L14k806J374L617N48J517j597q877l75J0998M637
1408G037m928l162m83J900K132j777K64M119k318n662K989N901N12m025p683l049
1424h233R902P201p992m489L678j683n129L322N383n24l471l252K726N704k028
1439A115n076J060J851J261M325j589m716K934J832m910J895O894m770o826M561
1454a59O294q78l924m751n3K277L23K262M806n047q433K408M892J007K0l116m266
1471f338N690O618n667m057L531p19l048K524N588L127l160r157j277R014L470
1486F139n287j643J020J376J615l054k146M809j107p778K921R377k548o578q8
$$ plain form
1501 -2972 -1388 -838 101 -1888 -2585 838 1221 -1446 -649 665 242 -1606 -4943 -1713 6524 5447
1517 5447 -3162 -1174 3060 -2531 -3714 3997 4942 -699 -1540 1015 2756 2026 -2207 -3804 349 2751
1533 2751 1539 1703 343 -995 -359 -3979 -4821 4492 6147 -5598 -7415 3018 4843 -1382 -4057
1548 -4057 -3140 -914 836 -475 890 4878 973 -5398 -3256 2254 5206 3689 -2056 -2882 5056
1563 5056 6546 -1276 -1837 1690 -1381 -2729 2569 4280 2172 -808 -6611 -6007 1485 2865 -1333
1578 -1333 -1698 -774 -1358 -1425 -1556 -405 1339 -2298 -4058 3808 6363 -1848 -3043 1639 908 -731 2293
1595 2293 2088 1194 2340 599 -808 3260 3679 -1493 -4020 -544 5193 5732 -2085 -5794 459 158
1611 158 -5990 -2331 4326 -691 -5767 -3010 -443 757 456 -4686 -6409 1368 6140 3471 840
$$ packed form
1501b972J584N50R39j989o97L423L83k667P97J314m23j848l337L230Q237j077
1517E447q609J988M234n591j183P711R45n641q41K555J741p30m233j597M153K402
1533B751j212J64j360j338O36l620q42R313J655j1745j817J0433J825o225k675
1548d057R17K226J750j311J365L988l905o371K142N510K952j517n745q26P938
1563E056J490p822n61L527l071j348N298J711k108k980n803O04P492J380m198
1578a333l65R24n84o7j31J151J744l637j760P866K555q211j195M682p31j639L024
1595B293k05q94J146j741j407M068M19n172k527L476N737N39p817l709O253l01
1611A58o148L659O657n017n076K757K567J200l01n142j723P777M772k669k631
$$ plain form
1626 840 -139 258 1037 161 3418 8435 3917 -4792 -1379 4731 2204 -749 -1277 -3783 -2710 1269
1642 1269 30 -1530 -687 -4044 -6028 -1449 2585 1219 -1557 -2858 -333 3181 1024 -2023 930
1657 930 1378 -2202 861 5617 2497 -1675 -2605 -2788 1325 5766 998 -3765 1769 4111 -590 -2230
1673 -2230 428 1900 880 -2348 -735 5499 2378 -5878 -5196 -42 788 565 -122 -3329 -1060 2224
1689 2224 -2212 -3714 3053 2708 -3221 -2793 2906 5226 2694 -2443 -2352 1700 1299 -835 2427 3467
1705 3467 -1419 -2375 -333 -372 1482 1724 -3595 -2847 3516 2929 -962 342 604 -2878 -2653 1409 4880
1722 4880 3725 -3681 -6326 251 1852 -2452 -2232 84 -1234 -1197 -595 -1164 1411 1881 -4647 -4166 5968
1739 5968 8826 1199 -2433 568 3943 4182 319 -463 3123 1338 -2595 218 3157 -702 -4517
$$ packed form
1626H40r79L97P79q76L257N017m518q709L413O110k527k953n28k506J073L979
1642A269j239j560Q43l357j984M579M034j366k776j301K525L514k157l047K953
1657I30M48l580L063M756l120m172r30j83M113M441m768m763N534K342m701j640
1673b230K658J472j020l228J613O234l121q256O82N154Q30k23o87l207K269L284
1689B224m436j502O767l45n929M28N699K320k532n137R1M052m01k134L262J040
1705C467m886r56K042l9J854K42n319P48O363n87l891J304K62l482K25M062L471
1722D880j155p406k645O577J601m304K20K316j318L7O02n69K575M70o528M81J0134
1739E968K858p627l632L001L375K39l863p82L586j785l933K813K939l859l815
$$ plain form
1754 -4517 -5274 -3926 2716 3557 -4232 -6653 -72 716 -2768 -278 1393 -84 -828 17 2951 5492
1770 5492 666 -4598 -1036 2673 2565 3671 2373 -1059 -1350 -317 -1111 2752 4870 -1825 -4694 1906
1786 1906 4444 46 -2377 -2185 -1400 -682 -1235 -576 3047 -55 -6206 -5188 441 2632 1466 -2615
1802 -2615 -4167 1813 4967 -741 -1829 3071 1580 -2452 993 5496 4827 1285 -3143 -2876 3197
1817 3197 3328 -1264 -1860 -159 402 571 -687 -3152 -744 -1029 -4430 -322 5069 1663 -4637 -3055
1833 -3055 -1083 -44 1787 567 -1416 -365 -525 -551 2636 1659 -2599 -2853 162 2479 4975 2094
1849 2094 -3234 -656 2635 -304 -603 3956 2078 -2565 -1829 1271 2413 1668 -3839 -5453 488 2269
1865 2269 -617 -1503 -712 -1780 -2415 -3096 -1923 3671 3854 -3328 -3386 3259 3432 -776 -1313 38 1911
$$ packed form
1754d517p57J348O642Q41p789k421O581P88l484K490J671j477p44Q45K934K541
1770E492m826n264L562L709j08J106j298l432k91J033p94L863K118o695k869O600
1786A906K538m398k423J92P85P18n53O59L623l102o151J018N629K191j166m081
1802b615j552N980L154n708j088M900j491m032L445M503o69l542m428K67O073
1817C197J31m592n96J701N61J69j258k465K408k85l401M108N391l406o300J582
1833c055J972J039J831j220j983J051j60k6L187r77m258k54L015K317K496k881
1849B094n328K578L291k939k99M559j878m643P36L100J142p45n507j614N941J781
1865B269k886q86P91j068o35o81J173N594J83p182n8O645J73m208n37J351J873
$$ plain form
1882 1911 3546 621 95 3170 1076 -4200 -1922 2450 3060 1188 -1982 -2862 1121 1627 -2567 -1758
1898 -1758 177 -2178 -2292 1847 1813 -153 -2496 -4337 -1779 3572 1906 -1882 -376 1219 -203 -137
1914 -137 1637 1328 -501 -2835 -1009 5662 6545 -1683 -5273 -657 1309 1353 1715 710 -356 -123 -2896
1931 -2896 -1694 4063 2405 -4788 -5220 805 4522 2761 -3166 -5543 -306 1868 -1645 23 3509
1946 3509 -68 -3939 -1484 1544 3336 1205 -3778 -3056 3618 4441 685 -98 123 -1004 -615 932
1962 932 2325 3668 249 -4453 -393 3854 494 -3309 -1301 -56 158 546 -306 -257 -567 -4402 -4412
1979 -4412 2700 3915 -1023 -2956 -1299 187 1744 134 -1573 1650 2034 -1497 246 5365 3477
1994 3477 -1823 -3539 -525 4586 5406 -594 -3240 812 1682 -2051 -505 816 -745 -2728 -3181 -938
$$ packed form
1882A911J635k925n26L075k094n276K278M372O10j872l170q80L983N06m194Q09
1898a758J935k355j14M139l4j966k343j841K558N351j666l788J506J595j422O6
1914a37J774l09j829k334J826O671Q83q228l590M616J966M4L62j005j066K33k773
1931b896J202N757j658p193m32O025L717j761n927k377N237K174l513J668L486
1946C509l577l871K455L028J792k131m983P22O674Q23l756p83K21j127L89J547
1962I32J393J343l419m702M060M247l360l803K008J245K14L88q52M9l10l835j0
1979d412P112J215m938j933J657J486J557j610j707L223L84l531J743N119j888
1994C477n300j716L014N111Q20o000k646M052Q70l733J546J321j561j983m53K243
$$ plain form
2010 -938 3420 1368 -5873 -5821 -170 1267 1064 944 -820 -1231 -530 -770 1414 4511 1041 -2588 605
2027 605 4210 3415 1784 -1213 -1510 1456 2001 39 2357 1844 -3166 -3928 938 1674 -916 -2369 -3193
2044 -3193 -451 1810 -1356 -2764 -225 -1424 -3091 4 2410 2144 1237 -2858 -2963 2719 5263 -293
2060 -293 -2242 1773 3113 1586 774 690 1790 -216 -3766 -896 5288 3222 -2894 -2927 -2033 -380 1429
2077 1429 11 -2609 -203 -75 -2963 -869 2370 184 -3597 -3108 149 3638 3086 -1679 -2792 986
2093 986 116 27 2854 2898 -613 -1262 111 2294 3643 -421 -4281 -829 3001 946 486 995 -1856
2110 -1856 -2383 -1120 235 2345 2240 -2961 -4238 1674 3871 209 -2988 -3424 -137 2709 32 -915
2126 -915 2289 475 -5950 -2898 4331 3315 -1241 -2392 -1240 2060 3238 -126 -1585 274 868
$$ packed form
2010i38M358k052p241N2N651J437k03j20j764m11P01k40K184L097l470l629L193
2027F05L605p95j631k997k97K966N45j962K318n13n010p62M866P36k590j453q24
2044c193K742K261l166j408K539j199j667L095K406k66r07m095j05N682K544n556
2060b93j949M015J340j527q12q4J100k006l550K870O184k066o116l3Q94J653J809
2077A429j418k620K406J28k888K094L239k186l781M89L257L489n52m765j113L778
2093I86q70q9K827M4l511o49J373K183J349m064l860L452L830k055m60N09k851
2110a856n27J263J355K110j05n201j277N912K197l662l197m36L287K846k677r47
2126i15L204j814o425L052P229j016m556j151J152L300J178l364j459J859N94
$$ plain form
2141 868 674 1971 2585 1720 29 -3756 -1698 4699 3408 -3802 -2911 1497 -109 -1886 -804 -724 -2308
2158 -2308 -2848 -2109 1637 2975 -1371 -3987 -1451 674 888 1433 756 -78 1454 -125 -810 3254 4032
2175 4032 -1810 -2821 1952 4450 3096 -328 -2344 49 1251 -1354 -532 3303 1260 -3572 -3217
2190 -3217 -41 1701 -391 -4894 -4802 1040 2163 -2102 -1709 -105 -1624 -1369 674 1715 3367 2102
2206 2102 -1454 -631 5371 4941 -248 -1477 686 3006 3138 437 -205 470 -3322 -5244 714 3425
2222 3425 -2275 -4374 -2135 -1753 -355 550 -1773 -1931 -327 -336 514 3349 2855 -484 -2611 -1616 3097
2239 3097 5194 199 -2920 1402 2091 -1732 -785 2354 100 -1818 -1469 537 3058 2468 -2657 -3769
2255 -3769 643 2139 281 -420 -979 119 229 -2168 -1509 2422 -121 -4106 -1607 2655 1858 -58
$$ packed form
2141H68j94J297O14q65j691l785K058O397j291p210Q91M408j606j777J082Q0j584
2158b308n40P39L746J338m346k616K536K125K14N45o77q34J532j579o85M064P78
2175D032n842j011M773K498j354l424k016K393J202k605Q22L835k043m832L55
2190c217L176J742k092m503R2N842J123m265L93J604j519K55K043J041J652j265
2206B102l556Q23O002m30n189j229K163K320J32k701o42O75l792j922N958K711
2222C425n700k099K239L82J398R05k323j58J604rQ50K835m94l339k127R95M713
2239C097K097m995l119M322O89l823R47L139k254j918L49K006K521n90n125j112
2255c769M412J496j858p01n59J098J10k397O59L931k543l985K499M262p97j916
$$ plain form
2271 -58 -2083 -3138 563 2780 238 355 2440 99 -2255 81 2787 2100 -615 -3018 -890 2780
2287 2780 1519 -958 -291 -1091 -2563 221 2291 1350 402 -1230 -3064 82 3834 261 -3263 -1557
2303 -1557 1892 879 -381 -711 -448 -1654 -4284 -1724 4107 2765 -3019 -2845 322 1689 2192 785
2319 785 -1356 1189 3730 977 707 3458 2130 -2216 -2504 581 3444 1647 -3351 -3949 235 -121
2335 -121 -2608 -1860 -1070 -2041 -1431 -784 -121 1659 446 -3735 -1127 3958 2911 252 346 974 1083 1174
2353 1174 510 1573 2292 -948 -1966 2067 2778 -149 -1530 -2068 -1268 1526 471 -1929 95 1075
2369 1075 -3075 -3445 1736 2310 -1878 -3269 -1191 1888 1836 -1261 -2054 428 201 -990 1426 2782
2385 2782 1602 354 -1831 -1747 3656 4503 -1643 -2950 1744 2531 -304 -476 -144 -257 -1762 -2259 544
$$ packed form
2271e8k025j055L701K217k542J17K085k341k354K336K706o87k715k403K128L670
2287B780j261k477O67q00j472K784K070r41r48j632j834L146L752l573l524J706
2303a557L449j013j260l30K63j206k630K560N831j342n784J74L167J367N03j407
2319G85k141K545K541k753k70K751j328m346k88L085K863j797m998n98M184l56
2335a21k487P48P90r71O10O47O63J780j213m181K608N085j047k659R4O28J09R1
2353A174o64J063P19l240j018M033P11k927j381n38Q00K794j055k400K024R80
2369A075m150l70N181N74m188j391K078L079n2l097p93K482k27j191K416J356
2385B782j180j248k185Q4N403Q47o146j307M694P87k835j72L32j13j505m97K803
$$ plain form
2402 544 2908 -544 -3943 -2336 380 587 468 -1060 -2021 843 1241 -1009 493 2239 -1246 -3223
2418 -3223 863 3265 1869 -811 -2386 -308 1527 580 -593 1320 850 -1009 83 1503 1657 1194
2434 1194 -2204 -3049 1876 4356 -666 -2285 -127 -378 -1477 -644 232 429 -546 -3215 -2001 2295
2450 2295 1718 -1824 -2969 -991 1329 2784 277 -855 1384 1100 -1970 578 4603 1770 -1231
2465 -1231 -481 1027 2315 1548 -1646 -2183 508 597 -682 673 305 -1495 -2401 -2145 -119 2591 -558
2482 -558 -3969 -903 2265 -452 -1346 178 373 -1038 118 1493 2686 2641 -1171 -2338 1472 3176
2498 3176 1506 -372 -622 540 1972 221 -1597 1003 734 -3516 -1605 2920 1943 -1551 -2762 -2588
2514 -2588 170 1794 -799 -1544 373 108 -1358 -611 1041 1017 -744 -1969 -539 4220 2941 -1919
$$ packed form
2402E44K364l452l399J607K716K07j19j528r61K864L98k250J502J746l485j977
2418c223M086K402j396k680j575K078J835r47j173J913m70j859J092J420J54m63
2434A194l398q45M925K480n022j619K158k51j099Q33Q76J97r75k669J214M296
2450B295n77l542j145J978K320J455k507j132K239k84l070K548M025k833l001
2465a231P50J508J288p67l194n37K691Q9j279J355l68j800r06K56K026K710l149
2482e58l411L066L168k717q94J524J95j411J156J375J193m5l812j167L810J704
2498C176j670j878k50J162J432j751j818K600k69m250J911M525r77l494j211J74
2514b588K758J624k593p45J917k65j466P47J652k4j761j225J430M759j279m860
$$ plain form
2530 -1919 -1729 981 454 261 1149 927 720 96 -1250 582 2530 482 -2462 -700 1328 1480 159
2547 159 -1302 -980 69 -1136 -2526 1525 2325 -1811 -2681 190 766 396 -557 -2326 -468 2063 -66
2564 -66 -361 1563 777 -1754 -1623 1431 2825 2613 -1128 -1821 2064 2297 -1170 -917 1353 302 -436
2581 -436 376 545 1455 -280 -3630 -2507 1975 1872 -1731 -2167 -988 -431 85 -1377 -1008 871 -497
2598 -497 -2457 919 3448 1235 -1344 -984 86 2339 2821 -240 447 1966 -242 -1062 1924 2444
2614 2444 -326 -2268 -1202 1545 2647 -1118 -3867 -908 267 -1358 -772 958 -425 -1492 -1939
2629 -1939 -927 1512 2659 -1830 -2718 1741 2637 1033 130 -269 605 1022 -701 100 3490 1550 -3039
2646 -3039 -1010 2107 1377 -320 -1590 -1878 743 1886 -847 -1158 687 -1050 -3076 -274 1730 1136
$$ packed form
2530a919J90K710n27j93Q88k22k07o24j346J832J948k048k944J762K028J52j321
2547A59j461L22J049j205j390M051Q00m136q70K871N76l70r53j769J858K531k129
2564f6k95J924p86k531J31L054J394k12l741o93L885K33l467K53K270j051p38
2581d36Q12J69R10j735l350J123M482j03l603m36J179N57N16j462L69J879j368
2598d97j960L376K529k213k579L60J070K253M82l061O87J519k208q20K986N20
2614B444k770j942J066K747J102l765k749K959J175j625N86J730j383j067m47
2629a939J012K439J147m489q88M459Q96j604r03l99Q74M17j723Q01L390j940m589
2646c039K029L117p30j697j270k88K621J143k733l11J845j737k026K802K004n94
$$ plain form
2662 1136 -475 -2705 -1548 2296 1216 -1488 -215 905 -285 -137 1246 1136 752 -1144 -2284 1192
2678 1192 3584 563 -1478 -89 231 44 240 141 370 504 -1179 -1649 1732 2125 -1870 -2839 -759
2695 -759 866 1316 -333 -1960 59 967 -2328 -1402 2477 1005 -2132 -1361 998 2646 1685 -1392
2711 -1392 -2091 1527 1484 43 645 1274 -505 -672 -669 -51 2670 1279 -2479 -1750 2427 1092 -1350 -885
2729 -885 -760 -412 -230 -967 520 1402 -1607 -3551 -315 2048 176 -1064 -676 -362 1190 726 -391
2746 -391 478 1369 -915 -991 2175 2756 732 -1138 -1563 579 2658 -613 -1487 955 885 -1471 -675 1391
2764 1391 449 -1748 -2249 -1488 1877 2221 -1838 -2554 -65 -143 -335 147 624 401 232 -1573 -474 2947
2782 2947 1694 -2040 -1339 1687 2198 1443 -57 -404 791 601 -1330 1119 2786 -437 -2605 -469
$$ packed form
2662A136j611k230J157L844j080k704J273J120j190J48J383j10l84j896j140L476
2678A192K392l021k041J389L20j87J96r9K29J34j683m70L381L93l995r69K080
2695g59J625M50j649j627K019R08l295R26L879j472l137P71K359J648r61l077
2711a392o99L618m3j441O02O29j779j67LO18K721j391l758P29M177j335k442M65
2729h85J25L48J82p37J487Q82l009j944L236K363j872j240L88L14J552m64j117
2746c91Q69Q91k284p6L166N81k024j870m25K142K079l271q74K442p0k356P96K066
2764A391r42k197n01P61L365L44m059p16K489p8j92M82M77k23j69j805J099L421
2782B947j253l734P01L026N11p55j500l47J195j90j931K449J667l223k168K136
$$ plain form
2798 -469 1138 988 -700 -2734 -1410 877 363 -1319 398 -163 -1996 -1617 177 1399 1773 -843
2814 -843 -2187 543 3240 719 -1341 331 707 289 741 1239 2030 971 -2778 -2298 2269 2704 -883
2831 -883 -1418 -251 -815 290 -91 -1218 -11 -228 -2220 -1110 2225 1024 -1583 -2174 -1269 1541 1802
2848 1802 -1243 -1023 1609 695 -1359 539 2235 -10 -346 193 1136 2946 1068 -2196 -410 1107
2864 1107 143 -75 752 298 -541 -778 -1905 88 1877 -1412 -3116 -136 1475 210 -710 -961 -607
2881 -607 -11 -614 -692 1878 2007 -1972 -2274 1271 2115 396 -187 -619 674 1931 19 -271 1987 37
2899 37 -1719 -112 1126 1572 591 -1603 -2314 1190 1606 -1496 -2027 653 -128 -1209 -319 666 888 -1448
2917 -1448 -3036 -537 3158 1110 -1365 -359 448 -13 998 754 469 1003 220 -1032 1155 3271
$$ packed form
2798d69J607j50j688k034J324K287n14j682J717n61j833L79J794J222L74k616
2814h43j344K730K697k521k060J672L76m18M52M98P91j059l749M80M567M35l587
2831h83n35J167n64J105l81j127J207k17j992J110L335j201k607n91R05K810K61
2848A802l045K20K632r14k054J898J696k245l36N39R43J810j878l264J786J517
2864A107r64k18Q27m54q39k37j127J993J789l289j704K980J611j265r20k51L54
2881f07N96o03p8K570J29l979l02L545Q44j719n83m32J293J257j912k90K258j950
2899C7j756J607J238M46r81k194p11L504M16l102n31K680p81j081Q90R85K22k336
2917a448j588K499L695k048k475J006Q07m61J011k44k85N34p83j252K187K116
$$ plain form
2933 3271 333 -2214 -968 1116 1816 749 -1530 -334 1135 -1611 -2021 1431 1106 -1631 -2233 -604
2949 -604 371 1020 -1306 -2713 -90 1049 -393 -160 1144 434 -879 -747 540 2159 1737 -1493 -1653
2966 -1653 2085 2322 -366 -416 -173 -174 280 -362 272 1937 130 -3452 -1280 1831 742 -1428 -1195 -817
2984 -817 33 626 -593 -881 425 -1346 -1887 1210 2112 606 -776 -1773 -255 2790 989 -1550 220
3001 220 2043 -410 -400 1545 1547 -101 -1400 -1196 1727 2387 -585 -1918 -181 301 -558 -35 -244 -694
3019 -694 -249 -1337 -1260 1770 1547 -2559 -2650 618 1723 638 -542 -951 175 687 -1102 377 2537
3036 2537 620 -1340 -195 1732 1764 1014 -1507 -1626 1716 1199 -931 706 1360 -886 -1526 -679 764
3053 764 999 -456 -2744 -796 1847 43 -1800 -651 48 -430 -204 70 1180 1566 -952 -2645 1217
$$ packed form
2933C271k938k547J246K084P00j067k279J196J469k746m10L452l25k737o02J629
2949f04R75O49k326j407K623J139j442K33J304p10j313J32J287J619m22l230j60
2966a653L738K37k688n0K43jM54o42O34J665j807l582K172L111j089k170K33L78
2984h17Q50N93j219k88J306j771n41L097R02j506j382r97J518L045j801k539J770
3001B20J823k453J0J945Kj648j299K04K923O60k972j333J737M82q59N23k09m50
3019f94M45j088P7L030k23m106r1L268J105j085j180m09J126N12j789J479K160
3036B537j917j960J145J927L2p50k521j19L342n17k130J637O54k246o40Q47J443
3053G64K35j455k288J948K643j804j843J149O99m78K26K74J110L86k518j693L862
$$ plain form
3070 1217 2892 126 -741 706 495 1075 729 -91 760 745 -1534 -1238 2107 1698 -765 -1743 -1441 697
3088 697 1156 -1058 -2025 245 74 -2296 -595 1572 -41 -1900 -1498 -50 2095 1654 -1272 -1797 677
3105 677 879 478 1004 973 462 -89 -787 828 2821 514 -2326 -409 1694 681 58 -620 -1232 -467
3123 -467 -456 -1376 385 1490 -1752 -2737 -103 1369 474 -1007 -1783 152 1450 -105 -433 1051 1156
3140 1156 -1542 -474 1710 1701 820 -372 -1129 1043 2778 -123 -1343 414 525 -172 12 656 652 -276
3158 -276 -2697 -1597 2185 1197 -1806 -1505 -137 -385 -151 -250 -1006 179 1 -1665 263 2558 625
3175 625 -2118 -781 701 1752 1178 -735 -260 1098 201 -871 1365 1733 -723 -1334 -211 819
3191 819 1749 26 -2691 -1060 1531 -91 -777 343 -143 -1245 -1181 -416 940 1250 -1530 -2285 927
$$ packed form
3070A217J675k766q67J447k11N80l46q20Q51j5k279K96L345m09k463r78L02K138
3088F97M59k214r67K270j71k370J701K167j613j859M02J448K145m41k926n25K474
3105F77K02m01N26l1n11n51o98J615J993k307k840J917K103j013o23o78o12P65
3123d67J1r20J761J105l242r85K634J472q95j481p76J935J298j555l28J484J05
3140A156k698J068K184rq81j192p57K172J735k901j220J757J11o97J84O44mr28
3158b76k421J100L782r88l003L01J368k48K34r9p56J185j78j666J928K295j933
3175F25k743J337J482J051n74j913M75J358q97j072K236L68k456o11J123J030
3191H19R30j723k717J631K591j622o86J120m86j102O4P65J356L10k780p55L212
$$ plain form
3208 927 1844 -322 -835 -29 -177 540 27 120 1788 1150 -1914 -1084 2285 1708 -669 -1080 48 1109
3226 1109 1158 -830 -780 961 -628 -1961 -188 1237 323 -1034 -1740 -1168 1036 713 -1786 -819 850
3243 850 -440 -892 481 1025 -115 -901 -1026 944 2973 401 -1236 326 1117 349 406 582 142 919
3261 919 -528 -916 1237 1701 -1306 -2278 9 759 73 -554 -1258 -479 83 -1279 -1060 1519 879 -1834
3279 -1834 -863 841 1092 582 -1090 -1169 1057 1821 -83 150 1307 132 -1123 193 1309 1373 143
3296 143 -1648 -592 2052 1004 -1383 -1175 -727 -390 -58 -427 -128 301 -1261 -2568 325 2118 -238
3313 -238 -1345 -377 312 975 850 -783 -36 775 -180 -457 1987 1644 -479 -1272 -44 1009 2059 291
3331 291 -1525 515 1316 -654 -669 853 3 -1562 -864 -196 1413 861 -1641 -1907 577 625 -615 -512
$$ packed form
3208I27R17k166n13Q06j48P17n13R3J668o38l064Q30L369n77k377m11J128J061
3226A109M9j988N0J741j589j333J773J425r14j357p06N72K204l23k499R67J669
3243H50j290m52J373N44j140p86j25J970K029k572j637J562P91p68N7J76m40P77
3261I19j447l88K153M64l007r72K287P50o86o27p04P79N62j362K19K579o40k713
3279a834R71J704K51n10j672p9K226P64j904K33J157j175j255J316J116O4j230
3296A43j791J056K644j048k387K08M48L37L32l69K99M29j562j307K893J793k356
3313b38j107R68O89O63j25j633P47Q11r55k77K444l43k123p93J228J053J050j768
3331B91j816K040Q01j970j5J522q50j565O98O68J609n52k502k66K484M8j240J03
$$ plain form
3349 -512 -264 -172 -49 -723 -117 1602 657 -2069 -778 1954 1271 202 -253 -340 526 990 -462 232 1860
3368 1860 -41 -1651 173 1673 558 -974 -1675 -635 1345 413 -1492 -311 337 -1183 -1158 264
3384 264 630 281 -968 -1832 532 2387 -67 -1717 76 894 326 321 446 884 556 -1089 -508 1862
3402 1862 2302 -1233 -1094 690 900 299 -625 -1070 -193 224 -1240 -869 1265 -188 -2198 -1340 24
3419 24 944 139 -1281 -1451 1192 623 -822 55 1745 145 -828 514 1405 2097 624 -1682 -432
3436 -432 2028 746 -744 377 674 -120 -294 -543 52 587 -1231 -1881 153 1640 -323 -1504 -546
3453 -546 -190 147 -175 -665 551 869 -1246 -1425 1654 1483 -791 -1271 -183 1040 1613 22 -973 963
3471 963 302 -1103 177 1953 914 -627 -895 -429 1593 1402 -1176 -1851 544 632 -459 -283 238
$$ packed form
3349e12K48R2J23o74O06J719r45k726J291K732o83j069m55q7Q66M64j452O94J628
3368A860j901j610J824J500j115j532p01J040J980r32j905J181O48j520K5J422
3384B64L66l49j249q64K364J855k454j650J793Q18n68nJ25M38l28j645N81K370
3402A862M40l535J39J784K10o01r24m45Q77M17j464L71K134j453k010Q58J364
3419B4R20q05j420j70K643n69j445Q77J690j600r73J342Q91O92j473k306J250
3436d32K460j282j490J121K97p94j74k49N95N35j818o50K034J487j963j181R58
3453e46L56L37l22m90J216L18k115j79L079j71k274m80J088J223N73j591r95J936
3471I63o61j405J280J776j039j541k68M66K022j91k578o75K395Q8j091J76N21
$$ plain form
3488 238 -498 -1120 -1461 78 1707 -63 -2440 -737 1279 267 -276 -67 -713 24 317 101 990 1616
3506 1616 -528 -1322 567 1685 966 207 -987 116 1979 295 -1033 277 382 -1029 -703 737
3522 737 1003 24 -1507 -1919 216 1162 -474 -1069 253 -232 -765 303 573 473 296 -895 -311 2110
3540 2110 2015 -139 -736 537 974 940 447 385 1054 365 -1227 -199 1539 156 -1924 -957 3 512
3558 512 1 -1664 -1083 191 -218 -1346 201 776 -420 -1006 -474 367 1645 604 -1535 111 2059
3575 2059 806 128 732 343 -36 -407 -84 1643 1577 -1128 -2030 645 1496 -190 -849 -380 -287 41 -93
3594 -93 -343 468 169 -1776 -1324 1191 1109 22 -880 -760 413 827 -530 -671 1140 355 -1280 11
3612 11 1980 448 -701 -949 -433 2016 1350 -1062 -593 800 -147 -635 611 543 -193 -636 -1371 85
$$ packed form
3488B38p36o22l41J539J629j770k377J703K016j012n43K09o46P37K93k16Q89O26
3506A616k144p94J889J118p19p59j194J103J863j684j328J310J05j411L26J440
3522G37K66r79j531m12K135R46j636n95J322m85n33J068K70j00j77j191N84K421
3540B110r5k154n97J273M37l4m93o2O69o89j592J028J738j383k080R67R60N09
3558E12n11j665N81J274m09j128J547N75j196n86N32Q41J278j041k139J646J948
3575B059j253o78O04l89l79l71L23J727o6k705r02K675Q51j686o59M69R3L28j34
3594i3k50Q11k99j945M52K515q2j087r02J20J173M14j357j41J811p85j635J291
3612A1J969j532j149k48N16K449o66k412M69J393r47m88J246o8p36m43p35J456
$$ plain form
3630 85 1889 55 -1837 -568 843 414 -102 -15 16 -46 -580 -1415 894 1616 -605 -1617 512 1306
3648 1306 582 -263 -642 322 1073 -43 -547 1538 587 -1530 -841 740 1088 679 -929 -1219 277 1050
3666 1050 -822 -916 285 -444 -1246 -650 798 1159 16 -2073 -1126 1541 749 -937 -403 628 25
3683 25 348 602 764 615 31 -1478 460 2162 728 -769 -620 366 850 594 -859 -249 366 -915
3701 -915 -1708 513 650 -1285 -1617 -738 186 1143 33 -1303 -382 775 -32 -31 1100 697 -186 -367 469
3720 469 1486 1557 -856 -1219 674 1136 -97 143 134 -564 -337 -704 -229 1194 251 -2010 -1122 871 568
3739 568 -675 -736 -553 -100 240 -575 120 1141 -419 -1632 -143 1120 685 142 -401 -364 1241 1236 -372
3758 -372 313 856 -97 -611 696 1283 651 -914 -1749 10 1371 -309 -1421 -217 -226 -726 -191 -222 -222
$$ packed form
3630H5J804j834j892J269J411m29n16Q7L1o2n34q35K309P22k221j012K129P94
3648A306p24q45l79R64P51j116n04K085r51k117O89J581L48m09j608k90J496P73
3666A050j872r4J201p29q02N96J448L61j143k089R47K667p92j686N34J031o03
3683B5L23K54J62j49n84j509J938J702j434j497J49R86M84k56j453O10O15j281
3701i15p93K221J37j935l32Q79R24R57j110j336R21J157q07JJ131m03q83j81Q36
3720D69J017P1k413l63J893M62j233K40ro98K27l67M75J423r43k261Q88J993l03
3739E68j243o1J83M53L40q15O95J021j560j213J489J263m35n43n43L7J605nj608
3758c72O85N43r53n14J307N87o32j565q35J759J361j680j112J204rn00N35l1%
$$ plain form
3777 -222 -136 -891 -1261 800 1529 -635 -1263 -274 836 622 139 58 534 571 -799 -214 1551 697 -887
3796 -887 -850 637 1027 879 -549 -1419 452 608 -705 196 910 -217 -1272 -648 36 886 -351 -1929
3814 -1929 -1173 992 123 -1216 -170 412 -450 -617 -562 320 1770 -230 -1755 202 1941 247 -204
3831 -204 31 427 749 388 -239 722 996 -767 -1391 508 1320 -293 -856 -1090 -58 775 -433 -1252
3849 -1252 136 282 -1539 -736 704 806 -690 -917 -516 961 1372 -320 -639 855 199 -442 -22
3866 -22 843 578 -15 -574 557 1967 676 -1325 -611 621 469 23 80 -433 -77 -374 -1180 56 1329
3885 1329 -860 -1915 -443 723 392 -365 -877 -666 891 131 -466 1196 1499 -845 -851 506 1369 843
3903 843 -189 -1186 532 1458 95 -246 442 -81 -479 -530 -176 727 247 -1096 -1323 615 848 -933
$$ packed form
3777b22Q6p55l70K061P29k164o28R89J110k14m83q1M76L7j370N85J765q54j584
3796h87L7J487L90j48j428q70J871J56j313R01P14j127j055O24O84Q50j237j578
3814a929P56K165q69j339J046N82q62j67N5Q82J450k000j525J957J739j694m51
3831b04K35L96L22l61o27R61K74j763o24J899Q12j613n63k34J032Q33j208q19
3849a252J388J46j821Q03J440J02j496k27M01J477M11j692l19J494o56o41M20
3866b2Q65k65n93n59J131J410j291k001P14J232j52m46N7n13L56k97q06J236J273
3885A329k189j055J472J166l31p57n12K11J557p60n97J662L03k344oJ357Q63n26
3903H43j032r97J718R26j363l41O88n23l98n1L54R03m80j343k27J938K33j781
$$ plain form
3921 -933 -735 321 40 -520 5 -65 547 296 -1497 -94 1443 498 -537 -582 191 796 610 119 -232
3940 -232 648 316 -969 709 1320 393 -1063 -605 33 1073 263 -1173 -1076 382 -492 -1456 207 361
3958 361 -387 -804 -905 400 1096 -397 -1524 73 923 174 -28 265 193 498 -308 -308 959 1291 -857
3977 -857 -1163 665 1103 -176 -348 -403 65 409 -190 -327 707 136 -1427 -798 657 351 -262 -827 -845
3996 -845 723 522 -533 -599 580 92 -588 244 1025 397 -68 -1140 192 1806 791 -743 168 1253
4014 1253 260 56 427 551 290 -324 -1232 152 1193 -400 -1471 -736 289 147 -87 -499 8 506
4032 506 -602 -806 995 1242 -862 -881 -29 689 1142 342 -894 443 1076 -153 -151 997 572 -578
4050 -578 -408 55 1109 517 -1464 -817 803 749 -791 -239 187 14 -598 -650 -146 1124 123 -1533
$$ packed form
3921i33J98J056k81n60N25p0O12k51j793J403J537r45j035m5P73O05j86m91l51
3940b32Q80l32j285J678O11r27j456M58O38J040q10j436R7J458q74r64J663J54
3958C61p48m17j01J305O96j493j127J597Q50p49k02K93p2L05q06%J267L32k148
3977h57l06J828M38j279j72n5M68L44n99j37J034n71j563O29J455l06o13n65j8
3996h45J568k01j055o6J179m88o80Q32P81o28m65j072J332J614j015j534R11J085
4014A253r93k04L71J24k61o14r08J384J041j593j071P35J025j42k34m12N07M98
4032E06j108k04J801K47k104j9Q52P18M53q00j236J337O33j229KJ148m25j150
4050e78J70M63J054n92j981O47J620n4j540N52M26j73o12n2N04J270j001j656
$$ plain form
4068 -1533 -583 1090 401 -610 -294 170 252 164 -253 348 841 -347 -1200 636 1487 325 -264 -343 287
4087 287 1043 307 -800 -41 735 -482 -848 791 599 -358 -1009 -944 222 710 -383 -1352 180 373
4105 373 -601 -22 515 191 -215 -645 -294 952 1350 -937 -901 918 866 376 134 343 787 488 -681
4124 -681 316 1453 456 -1161 -290 569 516 -159 -794 -555 167 218 -797 -70 576 -882 -1178 -1 455
4143 455 496 16 -1099 -176 734 127 -729 332 620 -163 47 -26 713 777 -167 -884 725 1430 -248 -452
4163 -452 39 -58 198 287 -24 67 436 -1036 -1111 795 487 -648 -958 -424 167 640 -462 -394 274 648
4183 648 -453 8 1393 467 -383 -146 325 1100 916 -550 -353 898 318 -529 78 225 -3 -502 -529
4202 -529 -291 736 242 -1115 -284 781 -89 -871 -108 -155 85 -344 -631 264 1067 -539 -832 576 1247
$$ packed form
4068a533R50J673o89j011L16M64Q2q8m17O01M93j188q53J836Q51j162n89p9O30
4087B87P56p36j107P59P76j217l66J639j92r57o51O5J166M88j093r69J532J93
4105C73r74N79N37l24m06m30L51J246L98k287L6J819n2m90k42K09M44k99j169
4124f81R97J137r97j617Q71Q59n3o75o35K39P22N1j015P27O46j458k96J177M56
4143D55M1m80j115R23R10o07q56J061K88p83K10p3P39O4r44p17J609P05j678k04
4163d52M91r7K56Q9l11R1L69j472p5J906l08j135l10N34N91M73j102O8O68L74
4183F48j101M61J385r26q50K37M71P75j84j466J97J251n80q47O07J47k28m99k7
4202e29K38J027m94j357Q31J065q70p82P63m7K40m29k87Q95Q03j606k93J408O71
$$ plain form
4221 1247 -104 -92 2 289 444 309 -142 801 790 -573 -469 360 907 162 -561 -675 -19 884 -419 -1231
4241 -1231 320 133 -711 -256 252 454 -218 -1193 -542 645 448 -1162 -204 829 171 -211 70 179
4259 179 482 127 -461 219 1582 599 -814 -161 459 450 176 -511 -447 649 -322 -971 213 839 -692
4278 -692 -1175 -234 393 275 -3 -848 -311 565 -625 -522 415 205 -655 -216 283 722 536 -114 -692 465
4298 465 1112 74 -81 586 63 -355 -46 -131 800 296 -1178 -568 575 422 -896 -743 -133 -450 284
4317 284 -614 -542 533 -143 -1115 -114 696 -126 -832 -404 103 1109 982 -666 138 1362 -40 -313
4335 -313 567 723 -7 -246 -113 37 1322 189 -898 -41 495 -448 -231 52 -474 -371 -889 -691 145
4354 145 669 -793 -1174 384 636 43 -286 -351 187 682 -92 -161 703 665 -677 -16 1222 1133 77 -494
$$ packed form
4221A247j351J2R4K87J55j35m51R43j1j363J04Q29N47p45p23j14O56R03j303q12
4241a231J551j87q44M55N08K02o72r75O51J187j97j610R58J033o58l82K81J09
4259A79L03l55n88O80J363r83j413O53O20rk74o87O4J096r71o49J184O26j531
4278f92m83R41O27j18k78q45N37Q76j190J03R37k10q60M39M99M39j86o50n78J157
4298D65O47j038j55O67n23m18L09q5R31n04j474O10J143j53j318J53O10l17P34
4317B84q98P2J075o76r72J001Q10q22p06M28N07J006j27j648Q04J224j402k73
4335c13Q80J56p30k39J33J50J285j133j087Q57N36r43K17K83n26J03n18J98Q36
4354A45N24j462l81J558K52n93l29o5N38M95p74o9Q64l8j342O61J238q9j056n71
$$ plain form
4374 -494 -495 736 644 -537 -347 620 -16 -1089 96 403 309 56 -1172 -474 535 409 -942 -79 44
4393 44 -316 -367 247 -237 444 -102 -779 503 1449 214 -827 459 365 333 246 -454 309 704 26 -520
4413 -520 856 846 -281 -618 -209 299 517 -32 -956 -14 275 -676 -702 736 19 -902 -593 -26 962 566
4433 566 -724 -874 722 460 -428 155 664 326 -47 109 304 1222 542 -592 -247 758 598 -249 -283
4452 -283 -177 246 123 -379 -368 697 -457 -1284 134 749 97 -522 -941 -114 184 199 -592 28 346 -314
4472 -314 -347 643 872 70 -158 -429 605 1067 209 -875 136 474 -66 -82 90 155 -153 -839 -585 533
4492 533 292 -1280 -934 20 305 -308 -38 -342 28 49 -452 16 1171 568 -720 -213 377 522 462 47
4512 47 -88 697 421 -179 176 426 -101 -506 151 846 979 -41 -1206 -553 711 64 -903 -320 190
$$ packed form
4374d94jJ231r2j181J90R67o36j073J185L07r4k53j228O98J009j26j351Q63J23
4393D4l60n1O14m84O81n46o77J282R46j235j041J286r4l2q7p00P63L95o78n46
4413e20J376j0j127l37M09N08K18n49r24R42K89r51k6J438p17r21L09N67R88l96
4433E66j290j50J596k62q88N83N09l38l73J56J95R18o80j134L45J005j60q47l4
4452b83J06M23j23n02J1J065j154q27J418O15o52o19m19Q27K98J5p91O20L18o60
4472c14l3R90K29q02k28k71J034M62q58j084J011L38n40j6J72O5l08o86K54J118
4492E33k41j572L46R54K85o13K70l04L70K1n01M68J155o03j288N07N90J45o0m15
4512D7j35P85k76o00L55K50n27m05O57O95J33j020j165O53J264o47r67N83N10
$$ plain form
4531 190 -545 -131 25 82 220 -682 -1170 202 1242 57 -378 64 235 60 -25 -212 221 627 -438
4550 -438 -490 1114 825 -372 -425 38 151 373 24 -108 314 120 -458 -294 735 127 -488 -625 -99 565
4570 565 513 -805 -743 469 -2 -855 50 340 -327 -452 -208 117 908 314 -304 -81 1262 559 -97 79
4590 79 154 8 144 -225 618 882 -690 -1169 -215 736 -28 -151 -869 -500 268 -236 -570 -236 368 -720
4610 -720 -888 307 557 130 -499 -521 48 1065 -213 -201 689 26 -374 182 909 309 17 -623 -369 1010
4630 1010 573 -528 -465 60 304 -309 -238 265 115 -187 -799 -134 879 -269 -1093 -281 220 36 315
4649 315 -244 -245 383 124 -431 384 1212 -90 -404 170 133 370 374 -609 -60 538 -92 -362 338 397 -342 -764
4671 -764 -30 263 344 -767 -1236 4 622 -220 -486 56 28 -238 -535 86 522 366 -991 -835 916
$$ packed form
4531A90p35M14J56N7J38r02m88J372J040j185m35M42J71j75q5j87M33M06j065
4550d38n2J604k89j197n3M63J13K22l49j32M22j94n78J64J029o08o15j37N26O64
4570E65n2j318O2J212m71q53R05K90o67j25K44L25P91n94o18K23J343p03o56J76
4590G9P5j46J36l69Q43K64j572m79R54R51p64j23p18L69P68n04l34L34O04j088
4610g20j68J195K50m27o29k2N69J017j278J2Q90o63m00N56P27o00k92o40K54J379
4630A010m37j101O3N25K44o13P1N03j50l02o12O65J013j148q24Q12N01j84K79
4649C15n59jO28k59n55Q15Q28j302l14N74l7K37Mr83N49N98o30k70P00N9p39m22
4671g64P34K93Q1j111m69J240O18q42k66N42k8k66k97O21M36j56j357J56J751
$$ plain form
4690 916 673 -174 -430 -348 295 450 200 153 622 449 -557 21 645 326 -302 -734 -351 476 456 -726
4710 -726 -536 267 -159 -339 94 -18 -175 -384 -392 -53 739 246 -649 -224 587 -117 278 193 251 197 -166 -452
4732 -452 571 756 -225 -538 642 541 244 65 -452 -200 224 -177 -376 758 250 -815 -901 276 101
4751 101 -312 -354 -403 -43 620 -423 -269 639 190 -714 77 677 692 327 -803 -282 879 439 -93 -8
4771 -8 447 399 -208 101 105 252 45 -807 -318 612 370 -882 -130 278 -132 67 -484 -190 35 -532 -967
4792 -967 770 1038 -378 -458 131 442 515 489 -255 362 599 -198 -279 877 240 -319 -269 -22 367 652 -152
4813 -152 -721 -61 239 -637 -502 186 -137 -704 -510 26 526 195 -824 -477 547 547 -73 -7 223 259 -65
4834 -65 -105 114 903 129 -1045 292 905 215 26 -351 -238 308 141 -606 -134 515 -190 -708 70 227
$$ packed form
4690I16k43q47k56Q2O43J55k50m7M69j73j006N78O24l19o28m32L83Q27k0j182
4710g26J90Q03m26j80M33j12j57k09qL39P92m93q95M25Q11p04L95q5N8n4l63k86
4732d52J023J85r81l13J180j01k97j79n17K52M24m01j99J134n08j065q6J177j75
4751A01m13m2m9L60O63j043J54R08m49r04P91O00J5l65j130N21J161m40n32Q5
4771hM55m8o07L09MJ47k07q52M89R30k42j252P52M08m10J99n51K94K25n67m35
4792i67J737K68j416q0N89L11P3k6p44O17K37p97q1J156o37n59N0K47L89K85q04
4813a52n69O60L00q76J35O88l23n67J94N36N00l31j019L47J024%o20O6K30L6l24
4834f5m0K19P89p74j174J337O13o90j89l77J13N46j67p47M72O49p05n18P78J57
$$ plain form
4854 227 334 -445 -1004 -162 370 -55 -614 -167 74 -154 -255 296 445 -113 -710 -653 225 950 -307 -622
4874 -622 -48 515 -156 129 354 281 655 -410 -110 605 298 -697 -357 18 68 174 16 -787 -273 -278 -415
4895 -415 -56 640 -69 -920 -276 415 253 466 -500 -268 588 173 73 269 780 -95 32 -154 366 427
$$ packed form
4854B27J07p79n59Q42N32m25n59M47K41k28j01N51J49n58n97N7Q78P25j257l15
4874f22N74N63o71K85K25p3L74j065L00P15l07r95L40L75N0J06j58q03N14nj37
4895d15L59O96p09q51O44O91j62K13r66K32Q56m15j00J96N11q75J27j86N20O1
$$ [...]
8191b46
##END NTUPLES=NMR FID
##END=
