##TITLE=1H_EC-3182
 CDCl3, 16 sc, 
 13.3.2019
##JCAMPDX= 6.0         $$ Bruker NMR JCAMP-DX V2.0
##DATA TYPE= NMR FID
##DATA CLASS= NTUPLES
##ORIGIN= UXNMR, Bruker Analytische Messtechnik GmbH
##OWNER= root
$$ XWIN-NMR		Version 3.5
$$ Wed Mar 13 14:18:00 2019 Russian Standard Time (UT+4h)  she@DPX200
##.OBSERVE FREQUENCY= 200.1314
##.OBSERVE NUCLEUS= ^1H
##.DELAY= (6, 6)
##.ACQUISITION MODE= SIMULTANEOUS
##.ACQUISITION SCHEME= undefined
##.AVERAGES= 16
##.DIGITISER RES= 18
##SPECTROMETER/DATA SYSTEM= spect
##.PULSE SEQUENCE= zg30
##.SOLVENT NAME= CDCl3
##.SHIFT REFERENCE= (INTERNAL, CDCl3, 0, 15.7039)
##AUDIT TRAIL= $$ (NUMBER, WHEN, WHO, WHERE, WHAT)
$$ ##TITLE= Audit trail, XWIN-NMR		Version 3.5
$$ ##JCAMPDX= 5.01
$$ ##ORIGIN= Bruker BioSpin GmbH
$$ ##OWNER= she
$$ F:/spectra/data/she/nmr/H-F/1/audita.txt
$$ ##AUDIT TRAIL=  $$ (NUMBER, WHEN, WHO, WHERE, WHAT)
(   1,<2019-03-13 14:16:42.82 +0400>,<she>,<DPX200>,
      <created by zg, POWCHK disabled, PULCHK disabled
       terminated by command 'halt'
       configuration hash MD5:
       00 E9 B6 7A A2 85 ED C7 34 08 36 98 17 FE 4E 26
       data hash MD5: 16K
       98 05 E8 3C A5 BD EA 4D 6F 8D 8A 13 4A 1E 8A F0>)
$$ ##END=
$$ 
$$ hash MD5
$$ 50 94 9E F7 7A 3B 72 59 47 94 53 40 91 D6 17 B9
##$RELAX= 
##$RELAX= 
##$RELAX= 
##$RELAX= 
##$RELAX= 
##$RELAX= 
$$ Bruker specific parameters
$$ --------------------------
##$DU= <F:/spectra>
##$EXPNO= 1
##$NAME= <H-F>
##$PROCNO= 1
##$TYPE= <nmr>
##$USER= <she>
##$AMP= (0..31)
100 100 100 100 100 100 100 100 100 100 100 100 100 100 100 100 100 100 
100 100 100 100 100 100 100 100 100 100 100 100 100 100 
##$AQSEQ= 0
##$AQ_mod= 1
##$AUNM= <au_zg>
##$AUTOPOS= <>
##$BF1= 200.13
##$BF2= 200.13
##$BF3= 200.13
##$BF4= 200.13
##$BF5= 200.13
##$BF6= 200.13
##$BF7= 200.13
##$BF8= 200.13
##$BYTORDA= 1
##$CFDGTYP= 0
##$CFRGTYP= 5
##$CHEMSTR= <none>
##$CNST= (0..31)
1 1 145 1 1 1 1 1 1 1 1 1 1 1 1 1 1 1 1 1 1 1 1 1 1 1 1 1 1 1 1 1 
##$CPDPRG= <>
##$CPDPRG1= <>
##$CPDPRG2= <>
##$CPDPRG3= <>
##$CPDPRG4= <mlev>
##$CPDPRG5= <mlev>
##$CPDPRG6= <mlev>
##$CPDPRG7= <mlev>
##$CPDPRG8= <mlev>
##$CPDPRGB= <>
##$CPDPRGT= <>
##$D= (0..31)
0 1.2 0 0 0 0 0 0 0 0 0 0.03 0 0 0 0 0 0 0 0 0 0 0 0 0 0 0 0 0 0 0 0 
##$DATE= 1552472202
##$DBL= (0..7)
120 120 120 120 120 120 120 120 
##$DBP= (0..7)
150 150 150 150 150 150 150 150 
##$DBP07= 0
##$DBPNAM0= <>
##$DBPNAM1= <>
##$DBPNAM2= <>
##$DBPNAM3= <>
##$DBPNAM4= <>
##$DBPNAM5= <>
##$DBPNAM6= <>
##$DBPNAM7= <>
##$DBPOAL= (0..7)
0.5 0.5 0.5 0.5 0.5 0.5 0.5 0.5 
##$DBPOFFS= (0..7)
0 0 0 0 0 0 0 0 
##$DE= 6
##$DECBNUC= <off>
##$DECIM= 24
##$DECNUC= <off>
##$DECSTAT= 4
##$DIGMOD= 1
##$DIGTYP= 9
##$DL= (0..7)
0 120 120 120 120 120 120 120 
##$DP= (0..7)
150 150 150 150 150 150 150 150 
##$DP07= 0
##$DPNAME0= <>
##$DPNAME1= <>
##$DPNAME2= <>
##$DPNAME3= <>
##$DPNAME4= <>
##$DPNAME5= <>
##$DPNAME6= <>
##$DPNAME7= <>
##$DPOAL= (0..7)
0.5 0.5 0.5 0.5 0.5 0.5 0.5 0.5 
##$DPOFFS= (0..7)
0 0 0 0 0 0 0 0 
##$DQDMODE= 0
##$DR= 18
##$DS= 0
$$ [...]
##$SUBNAM2= <"">
##$SUBNAM3= <"">
##$SUBNAM4= <"">
##$SUBNAM5= <"">
##$SUBNAM6= <"">
##$SUBNAM7= <"">
##$SUBNAM8= <"">
##$SUBNAM9= <"">
##$SW= 26.0245685251456
##$SWIBOX= (0..15)
0 0 2 0 0 0 0 0 0 0 0 0 0 0 0 0 
##$SW_h= 5208.33333333333
##$TD= 16384
##$TD0= 1
##$TE= 0
##$TE2= 300
##$TE3= 300
##$TEG= 300
##$TL= (0..7)
0 120 120 120 120 120 120 120 
##$TP= (0..7)
150 150 150 150 150 150 150 150 
##$TP07= 0
##$TPNAME0= <>
##$TPNAME1= <>
##$TPNAME2= <>
##$TPNAME3= <>
##$TPNAME4= <>
##$TPNAME5= <>
##$TPNAME6= <>
##$TPNAME7= <>
##$TPOAL= (0..7)
0.5 0.5 0.5 0.5 0.5 0.5 0.5 0.5 
##$TPOFFS= (0..7)
0 0 0 0 0 0 0 0 
##$TUNHIN= 0
##$TUNHOUT= 0
##$TUNXOUT= 0
##$USERA1= <user>
##$USERA2= <user>
##$USERA3= <user>
##$USERA4= <user>
##$USERA5= <user>
##$V9= 5
##$VALIST= <valist>
##$VCLIST= <CCCCCCCCCCCCCCC>
##$VD= 0
##$VDLIST= <DDDDDDDDDDDDDDD>
##$VPLIST= <PPPPPPPPPPPPPPP>
##$VTLIST= <TTTTTTTTTTTTTTT>
##$WBST= 1024
##$WBSW= 4
##$XGAIN= (0..3)
0 0 0 0 
##$XL= 0
##$YL= 0
##$YMAX_a= 283155
##$YMIN_a= -531622
##$ZGOPTNS= <>
##$ZL1= 120
##$ZL2= 120
##$ZL3= 120
##$ZL4= 120
##$ABSF1= 10
##$ABSF2= 0
##$ABSG= 5
##$ABSL= 3
##$ALPHA= 0
##$AQORDER= 0
##$ASSFAC= 0
##$ASSFACI= 0
##$ASSFACX= 0
##$ASSWID= 0
##$AUNMP= <proc_1d>
##$AZFE= 0.1
##$AZFW= 0.1
##$BCFW= 1
##$BC_mod= 2
##$BYTORDP= 1
##$COROFFS= 0
##$CY= 11.3945322036743
##$DATMOD= 1
##$DC= 2
##$DFILT= <>
##$DTYPP= 0
##$F1P= 18.9103706918063
##$F2P= -1.10871071338519
##$FCOR= 0.5
##$FTSIZE= 0
##$FT_mod= 4
##$GAMMA= 1
##$GB= 0.15
##$INTBC= 1
##$INTSCL= 1
##$ISEN= 128
##$LB= 0.24
##$LEV0= 0
##$LPBIN= 0
##$MAXI= 10000
##$MC2= 0
##$MEAN= 0
##$ME_mod= 0
##$MI= 1.114404
##$NCOEF= 0
##$NC_proc= 0
##$NLEV= 6
##$NOISF1= 3.799351
##$NOISF2= 2.8
##$NSP= 1
##$NTH_PI= 0
##$NZP= 0
##$OFFSET= 15.70392
##$PC= 1
##$PHC0= -8867.062
##$PHC1= 26.20026
##$PH_mod= 1
##$PKNL= yes
##$PPARMOD= 0
##$PSCAL= 0
##$PSIGN= 0
##$REVERSE= no
##$SF= 200.130013532006
##$SI= 16384
##$SIGF1= 3
##$SIGF2= 2
##$SINO= 400
##$SIOLD= 16384
##$SREGLST= <1H.CDCl3>
##$SSB= 0
##$STSI= 0
##$STSR= 0
##$SW_p= 3612.71676300578
##$SYMM= 0
##$S_DEV= 0
##$TDeff= 0
##$TDoff= 0
##$TI= <>
##$TILT= no
##$TM1= 0
##$TM2= 0
##$TOPLEV= 0
##$USERP1= <user>
##$USERP2= <user>
##$USERP3= <user>
##$USERP4= <user>
##$USERP5= <user>
##$WDW= 1
##$XDIM= 8192
##$YMAX_p= 0
##$YMIN_p= 0
$$ End of Bruker specific parameters
$$ ---------------------------------
##NTUPLES= NMR FID
##VAR_NAME=  TIME,          FID/REAL,        FID/IMAG
##SYMBOL=    X,             R,               I
##VAR_TYPE=  INDEPENDENT,   DEPENDENT,       DEPENDENT
##VAR_FORM=  AFFN,          ASDF,            ASDF
##VAR_DIM=   8192,          8192,            8192
##UNITS=     SECONDS,       ARBITRARY UNITS, ARBITRARY UNITS
##FACTOR=    0.000192,      1,               1
##FIRST=     0,             0,               0
##LAST=      1.572672,      0,               0
##MIN=       0,             -531622,         0
##MAX=       1.572672,      283155,          0
$$ Real data points
##PAGE= N=1
##DATA TABLE= (X++(R..R)), XYDATA
$$ [...]
2260A249L41j303m66J315L35j549N07J898j122p11J153L98j154k36J206M51j373
2277I39R2J204m96j463Q67J288j391p25R83Q54j408n85J369j59j605K64J384j333
2295G9j032J055Q05q69j451J556K07j485m4L10O56j643Q26P79o95j234M73J536
2313a71j021j417J407Q53j517k70J550m71j343N93J201n05j167J421K05q49j9
2330a520Q71P27j511J71J807m25r98L27J628p04j127P49J026j424K57J200M06
2347A460j389LJ808p55p48K26J544p51n65O02O98j148m60Q62Q01j445j63J348
2365A928j47j369M77J018p33q75N55R49j425m33Q15K95j040k42R24l09j324R85
2383D9K47n24j069J111Q13j669l67P40M53j547M26R27j94j262O85O55p86o52O81
$$ y = [1249, 1590, 287, -179, 1136, 1471, -78, 429, 2327, 1205, 494, 1647, 2045, 891, 655, 1861, 2312, 939, 1031, 2235, 1739, 276, 1143, 2431, 1040, 315, 1298, 2152, 744, 159, 1528, 1369, -236, 28, 1412, 79, -953, 102, 907, 38, -1413, 143, 350, -1135, -1179, -869, -213, -1856, -1030, -251, -946, -2180, -1707, -171, -1192, -2609, -1202, -349, -1866, -2136, -586, -1057, -2400, -1807, -606, -1111, -2278, -857, -652, -1501, -1520, -649, 78, -1433, -1262, 545, 120, -878, -551, 1077, 373, -754, -5, 1021, -403, -146, 1054, 1460, 71, 74, 1882, 1127, 379, 605, 2149, 1398, 833, 1435, 2133, 985, 525, 1387, 2188, 743, 580, 1928, 1781, 412, 889, 1907, 1174, 299, 854, 1803, 378, -55, 760, 1055, 15, -227, 697, 388, -936, 49, 296, -228, -1297, -186, 627, -1042, -1409, -669, -216, -1763, -1337, -410, -604, -1866, -1181, -526, -1312, -1964, -1283]
2402a283R99j422m15J358K57j190l02J821p25q05M26J434q68p97J131K21k54k64
2420f78Q48K06j437L21J706M7j697R25O36l52o26J145N87j205m39Q93N30j183
2438B27O31O05M4r58P40Q34j461k08J249K06j264l26J367j67j560M07J164p05
2456H25j119J041N05o77q78J147K06j086q44J668k10j243j42J693j225j137J118
2473c58N25j273n59R13N77j157o79J750j59j115K05O49m14p87O51J153j566q4
2491a728J095K86j513K69J282l97q30k2J538k50j140Q49R67j354l66J631J33q32
2509c82l86J487k18r61R93M95j43j023N79R53p20j034J490J75p67Q7Q59k50r60
2528B74L46J229r15m18J080K16j175p4P80k05j324N39J439r15j048P41O85p99
$$ y = [-1283, -284, -1706, -2121, -763, -506, -1696, -1998, -177, -902, -1707, -1281, 153, -715, -1512, -381, -160, -414, -678, 170, 376, -1061, -740, 966, 1013, -684, 241, 877, 525, -101, 1044, 1631, 426, -13, 880, 1410, 227, 858, 1463, 1507, 549, 1289, 2123, 662, 454, 1703, 1909, 645, 319, 1686, 1519, -41, 366, 1530, 825, -294, 747, 1252, 575, -303, 844, 1050, -36, -880, 788, 578, -665, -807, 886, -339, -1476, -358, 167, -1106, -1665, -752, -175, -1332, -2011, -261, -420, -1535, -1330, -681, -1095, -1882, -1231, -78, -1644, -1728, -633, -347, -1860, -1591, -309, -706, -1536, -1558, -20, -270, -1410, -561, 406, -948, -1314, 317, 450, -382, -768, 719, 501, -460, 533, 1028, 885, -138, 441, 1394, 674, -360, 1130, 1305, 538, 625, 1484, 1234, 274, 620, 1849, 934, 516, 1596, 1812, 637, 563, 1343, 1138, -186, 353, 1792, 877, -171, 570, 1255, 456]
2546D56o79Q79M62j426j89P57Nr88n6Q68j68j165N47N25j015j82J083k77p78m24
2566a765J135j12o44L60Q12n64q23Q44N9m15j132J799O24j459J4P10K61j021K79
2585a038J319o66q40J006O39q76l75O64P75q14k29J203j09j246O07J147j207Q2
2603D2N05O91n07l59J043j32q25n6J280r98m95P69L62o9j009J062L65o89p72J185
2623A393N1j348K75J003k96j100M24M32r30l30J072K35j414l99Q53M30q11m43
2641i03J098n50q88N24J299j449l92O42L93q81p40J427l19q00K84J165m86j380
2659a956J336N34o15p62Q46O62q21o38J297K36j753J123P87l68j215J161L27k37
2677e6o04Q54N71j049j89J022J80r49M79P17m08n47N02J091j150m26J152R8r01
$$ y = [456, -223, 656, 1118, -308, -497, 260, 265, -723, -779, 89, -79, -1244, -697, -172, -1187, -1369, -286, -563, -1341, -1765, -630, -742, -1386, -1026, -214, -778, -1601, -757, -698, -1113, -2245, -446, 178, -1281, -1267, -557, -296, -1317, -1038, 281, -385, -1225, -219, 420, -456, -831, -167, 608, -206, -435, 768, 659, -587, 20, 1167, -40, 42, 547, 1238, 731, 372, 1415, 1283, 458, 402, 1682, 684, 189, 958, 1320, 1251, 242, 1304, 1669, 980, 208, 1393, 1444, 96, 371, 1374, 1078, -22, 402, 834, -96, -426, 646, 881, -533, -932, -79, 351, -460, -903, 195, -355, -1243, -719, 580, -869, -1261, -619, -226, -1107, -1847, -420, -739, -1539, -1255, -90, -576, -1956, -620, -86, -701, -1463, -617, 45, -776, -1414, -117, 119, -1634, -511, 276, -92, -1307, -146, 181, -56, -660, 194, 765, -284, -473, 549, 729, -220, 259, 976, 568, 21, 523, 1614, 464, 38, 1190, 1288, 387]
2696C87J8P26L53j515N95J215j216l70N73O49j158l0R68j82j383L90P71N43j787
2715d53J0R83j23j063P08N4j57n04L35L62p16l22R34J10j498Q61L88n61o60M83
2735h29N92k79o55R60k91q46K31J157q54n67L58P59n43n94N88Q32n75n43J275
2754A76l92o35k42J263k82r50N91J175q65j75Q84J6p76j08R22M31j412O83R89
2773A293m43m94L69R32j003q08J109O19j397J78J313k30j330K06Q17j03j142Q54
2791G40N63j077m74R47N00j147k98J050m24o03PO27k56q63Q91L90o49j132J216
2810HM65j458J37J305o46r69M82R60j134j81K05R27q20o14J238l19m31l93R51
2829b87k95j077O69J110n67o60R75J10m77p07O85N97j115K46J398r03n43K79J058
$$ y = [387, 405, 1131, 1484, -31, 564, 1779, 563, 193, 766, 1415, 257, 227, 1195, 1013, -370, 20, 791, 1334, -453, -443, 540, 417, -646, 62, 116, -41, -545, -210, 152, -564, -886, 48, 158, -1340, -479, -91, -652, -1312, -829, -237, -516, -1171, -211, -502, -1348, -1117, 40, -814, -1381, -1023, -264, -807, -1401, -813, 19, -556, -1099, 176, -216, -851, -1093, 170, -112, -1062, -471, 704, -161, -336, 548, 564, -212, -320, 602, 1033, -379, 304, 1293, 850, 356, 725, 1657, 654, -154, 955, 1574, 177, 355, 1668, 1438, 108, 314, 1131, 1028, -114, 740, 1303, 226, -248, 699, 1199, 52, -246, 804, 380, -223, -216, 411, 155, -708, 183, 573, -76, -1208, 8, 473, -985, -848, 457, -189, -1158, -676, 284, -850, -1031, -826, 101, -719, -1333, -95, -414, -845, -1238, -287, -582, -1659, -990, 120, -447, -1107, -132, -22, -499, -1206, -521, 76, -1039, -793, 605, -298, -841, -562, 496]
2848D96l70q38R15L91q02j20J045Or84K52P51Q6p48Q5J016n33k52M48K84q96J70
2869D02O77K5r57p5J405p70n19J90M16n30j73Q07j4n43n06N29J69q24K52Q80p83
2890E8p49N72Q94q49n90P76j17q82M7Q32r1n17J94L72m04r22P64J53q3m04J36
2911h10L21m26j48Q64J12p03n5J095o56q55L66R91r86o4P93M46o02n96J176N5
2931C18q09K46Q69o32n38R62K82o50K0Q48j43r44L24O36k89m27J67J349j203m66
2951h0N17M53n41p7J038k46r57M04M03M87j194j08J149p94r03Q24J91p90K94R42
2971A012m31m03j56L05j34p43J95R56j250K9K3M31o23j32Q41r7r45L82N22l42
2991e60k72M92J18m27n06Q91j7o00j87N98N26r92M27M24l86o41N32Q49l56q46
$$ y = [496, 126, -712, 203, 594, -208, -328, 717, 723, -261, -9, 742, 828, 80, 165, 1181, 648, 396, 844, 1128, 232, 402, 1079, 1104, 147, 72, 1477, 707, 188, 378, 794, 264, 91, 898, 884, 341, -165, 364, 533, -291, -39, 841, 58, -691, -119, 775, -74, -664, 112, -5, -887, -840, -8, -99, -616, -422, -50, -454, -1376, -612, -459, -542, -946, -810, -489, -915, -1063, -199, -87, -790, -845, 250, -406, -1261, -895, 96, -890, -954, -161, 285, -317, -913, 263, 318, -491, -245, 624, -8, -546, 416, 698, 48, 68, 916, 773, -171, 153, 789, 500, 73, 240, 1589, 386, -80, 437, 890, 349, 272, 1310, 1064, 107, 511, 914, 1401, 207, 99, 1248, 454, -449, 375, 566, -224, 70, 1012, 581, 178, 22, 327, 193, -550, -355, 601, -649, -620, -597, -166, -789, -921, -80, -177, -1122, -740, -218, -560, -832, -340, -222, -649, -1155, -264, -281, -881, -1068, -470, 56, -936, -509, -85, -471, -1112, -580, 269, -87, -933]
3011i33R18K02n84n9R87k54q35M42P07n06n21O89P58q47k34Q91M90j433J97J120
3031A195l19q54N60J67n9q73P08R23j224l77O76P82j027P3K32L60j000N31M97
3050I71o88n06N36L30o57j68R47m58m87l34O97L37q64L17K42n06o14Q50J75j011
3070h91Q0N62j8o27O8M50N24j189M43L78Q2q25M34N76j073RP46lm00l27R94n2
3092e9j094M90O23l65m3K42K68k96j62O13J77o96N31O41m17o74Q03Qj81o18J006
3113G97P5o86O9N85k71n12K27N01k88k64K39O13q59l23J053J42j008O15j67J24
3133F62j184Q52M49m74m20N55K68l85r38O04N53j405L24R30n34j48K97L64o10
3152b40m38K67P99q02l72J000k44l78l16P52n28k80J62M11l52q21R70L79p67j59
$$ y = [-933, -15, 187, -397, -456, 531, 277, -558, -116, 591, 85, -436, 253, 1011, 164, -70, 821, 1311, -122, 75, 1195, 876, 22, 582, 749, 690, -183, 525, 1448, 224, -153, 523, 1305, 278, 351, 583, 943, -57, 474, 971, 283, -223, 313, 643, -14, -182, 765, 307, -180, -514, 183, 520, -344, -27, 215, -291, -905, -55, 120, -891, -811, -249, -267, -894, -826, -376, 148, -1041, -598, -220, -138, -963, -529, 47, -1026, -1017, -271, -274, -674, -1001, -7, -59, -1153, -663, -40, -405, -448, -206, 62, -234, -396, 217, 394, -302, 229, 870, 453, -221, 582, 590, 409, -209, 797, 872, 186, 255, 840, 569, 57, 284, 785, 497, 233, 472, 1085, 226, -97, 956, 1098, 90, 705, 538, 662, -522, 330, 779, 305, -115, 440, 708, 323, -615, -11, 542, -863, -539, 391, -143, -291, 6, 370, -240, -678, -411, 388, -414, -786, 214, -30, -408, -724, 28, -500, -780, -618, -207, -559, -1380, -410, -31, -798, -957]
3172i57J136l56n44j87J421o55m61M84L74o36k87N00M02n73n92J303jq84M89M83
3192D59l27k11J85N41n67n42R34K13k58J75k59R2o52N43K30J26m66L22M26r24
3212D0P4M66J55j000M17N57m5n72K61J27k8p87K76M37r42J99N99r5m80o8M39J23
3234A53n41m4N13m91k78N92J6k48o34Q11L1j76m49P47k79l36L71n20K34l82M06
3255e04O51n38p68R74P96q78o74J082m08l93P41n5n7m58N64k19l62L03Q2P03p49
3276a67J28K66j9l52L27M88m34m97M83P52o83l13K50K93l35PM45m02k43M03K07
3297F04o42j32N25K65n41J31J58J84p83M43K31kk69n0L50n41o38O76L50n34k23
3318d38Q37l02k45oK05P6r12M96K71k46p08P78q0m47L27N59n59m4k76Q48j45m90
$$ y = [-957, 179, -177, -721, -908, 513, -142, -603, -119, 255, -381, -668, -168, 234, -339, -931, 372, 371, -513, -24, 459, 132, -79, 106, 647, 80, -462, 472, 685, 427, 602, 343, 435, -217, 326, 556, 682, 216, 538, 964, 40, 114, 580, 735, -265, 152, 709, 664, 92, 353, 480, 452, -335, -59, 378, -564, -365, 234, 139, -341, -409, 30, 153, -388, -432, 81, -410, -688, -96, -80, -328, -962, -151, -120, -296, -745, 2, -277, -613, -242, -762, -528, -910, -504, 147, -391, -1159, -185, 611, -267, -941, 141, -267, -660, 81, 26, -31, -489, 75, -144, -506, -203, -121, 582, -167, -39, 227, 208, -144, 183, 671, 237, -260, 223, 975, 292, -21, 229, 522, 187, 194, 639, 237, -6, 397, 604, -38, -170, 355, 620, 79, 210, 368, 552, -231, 212, 443, 441, 172, 122, 472, -69, -707, -31, 319, -215, -438, 399, 97, -148, -154, 51, 127, -785, -289, -18, -264, -972, -194, -274, -721, -394, 165, -394, -438, -714, 134, -11, -501]
3340e01k31P31P6j99J06N21p80k07O25J99o14j71O14m7o54O44J35l52k37L04K2
3361a6j10K29O66l45m08j05N02M0n70L86L69n54j51N69o8j79j08O19l95n92N91
3382C70K90o10l45P59L83j025Q3P60j60k58l64K78J19k15l49M53l74l79M9Q28
3402B93q97O43r9P1k90J78J97m07n14P65J52j32n42k39J111o35O4J74L21j189
3422i75P04K50mp63K59L45M45q23L88j12J87j39J42k53q0K94K24q8l47M65n1l13
3444b45K48q6L79l29k41Q40k98m11L67K36o30L63L42q1j2m40K85M34q41K21K68
3465C69J34p13M74%J15k76n8M51j27n79M10K8lm59K79K54p1l76L26k47m49O91
3487A73j85k48l83Q89j41n72M3j55M43l05j59P89p08o0M05J1k00m38Q65K0o37
$$ y = [-501, -732, -1, 75, -124, -18, 503, -277, -484, 141, 340, -274, -445, 169, 122, -532, 112, 247, -105, -342, -38, -16, -126, 103, 769, 424, 16, -89, 413, 453, -117, 269, 638, 84, -67, 502, 434, 255, 147, 766, 371, -221, 370, 660, 50, -295, 464, 847, -178, -95, 665, 505, 247, -117, 161, 280, 65, -284, 169, -205, -584, -535, 293, -604, 39, -60, 11, -279, -101, 96, -311, -825, -60, 92, -40, -582, -821, 290, -345, -281, -107, 214, -975, -271, -21, -25, -788, -529, -184, 261, -562, -174, -286, -99, -238, -96, -349, -429, -135, 89, 1, -346, 119, 68, -245, 3, -83, 296, -33, -274, 566, 268, -143, 224, 460, -170, 193, 535, 454, 442, 2, 287, 721, -120, 101, 369, 503, -210, 264, 264, 379, 103, 45, 496, 369, -210, 200, 228, 225, -234, 45, 299, 228, -148, 178, -69, -518, 173, -12, -260, -643, 246, 105, -467, -424, -579, -136, -441, -600, 189, -519, -579, -174, -163, -363, -801, 64, 84, -553]
3508e53J52Q85r57j97J99N50J41o98M8P42n16l21Q09j78j03j44K95k7j99j43P79
3529E64k30q22N87O35p25J01M7M6l39L74O88l87n88J45O24n01l99O61J49m92K05
3550C43j98L31k98J34L29l84k46J30N0N9m40J30N95o45m3K61N5m64j49P84J7o55
3572c04l6K15J75k67j74Q57r10k9N25l54J24l73K17L00m41k63M10K25j30J68J74
3593A09l65p1L70J23j257N94N84m67k2P45J11p48J27K72N4k82l5R3O2l94O7O09
3615B79Oo72L04O02l42k49L83j13l29j11N24J63r02M40N63k2p88M56K96l82j11
3636eR6N27j218L70Q76J37p52J10m8J07l4N6L10j40m47J6Rl51L62L61n7o24J86
3659a53L71l02n61L99M22r28M52L86k20l88J84M58l02k97O50k54l70l44N28Q8
$$ y = [-553, -401, 484, -473, -670, -471, 79, 220, -478, -430, 312, -204, -525, 284, 106, 3, -141, 154, 127, -72, -215, 564, 334, -488, 99, 734, 9, 110, 157, 203, -136, 238, 926, 539, -49, 96, 720, 219, -180, 481, 630, 138, 343, 145, 476, 178, 312, 641, 257, 11, 141, 191, 250, -190, -60, 535, -110, -153, 108, 163, -301, -450, 334, 351, -304, -340, -125, 50, -217, -391, 466, -444, -473, 52, -302, -178, -551, -334, -34, -475, -738, -328, -103, -233, -65, 109, -256, -327, 43, 166, -1091, -497, 87, -380, -402, 343, 454, -294, -167, 105, 159, -123, -158, -65, -3, -397, -330, 279, 285, -387, -83, 519, 177, -72, 311, 198, -131, -242, 282, 445, -457, -17, 546, 524, -264, 192, 488, 106, -5, 91, 618, -600, -230, 646, 783, 31, 141, 93, 200, 166, 222, 532, 392, -55, -39, -30, -381, -19, 342, 285, -339, -153, 218, -84, -645, -246, 176, -752, -300, 86, -134, -522, -338, 120, -182, -479, 171, -83, -453, -797, -269, -181]
3679a81j53j14M74j88n57O27Q1l19J27R2K17l98n0M85k56k04K95K07K61q73N03
3700G6o4l3J26j17K23l5m60N52L29p72O87l48L8j94K55k57L83k89J78N7j4j57
3722A64N3K20n53j1j37J63j74O45Rk60n86J129k23o76m99J146n32j18J9P08j34
3743C53n40N04l21l54k9M29J73j68m03o8L83n88K33l2M44n46j10L02r6J94M20
3764A80Q2k76o49L79O8n02j35R90n37O4J054m70k18n19O41K28j4n94O84k75J9
3785B00o38M31J64L22p69L02j5p2K95K64m74j01K19K50k60k47J210p49o22M90
3805B00J27K4j22k95P33l29k59M28M0j100P24o2O4l13o5L61n4o99P39jo59J50
3827c68M28n7l35K39M71p49J05J34J85J29l89K20n8M43l16l76J41l09J51M87k11
$$ y = [-181, -334, -448, 26, -162, -719, -92, -11, -330, -203, -111, 106, -292, -342, 143, -113, -317, -22, 185, 446, -427, 76, 12, -21, 105, -12, 211, 176, -284, 268, 597, -175, 512, 164, 202, 8, 263, 6, 389, 100, 278, 335, 321, 164, 217, 437, -116, -127, -264, -101, -275, 370, 379, 119, -467, 662, 439, -237, -736, 410, -122, -240, -221, 487, 353, -187, 317, -4, -358, -387, 42, 215, 47, -356, -424, -41, -629, -396, -428, 16, -530, -640, -338, -434, -240, 180, 262, -14, -663, -284, -216, -718, -853, 137, -400, -336, 718, 248, 30, -489, 152, 380, 366, -228, 456, 181, 200, -438, -7, 157, 479, -290, 12, -3, -75, 220, 484, 10, -91, 128, 378, 118, -129, 1081, 332, -290, 200, 327, 351, 229, -66, 667, 338, 79, 507, 547, -553, 171, 109, 173, -140, -205, 156, 102, -597, 142, 141, -518, -368, 60, 3, -332, -93, 378, -371, -266, -132, 53, 182, -207, 13, -45, 398, 82, -294, -153, -462, -311, 176, -35]
3848c5o18Q06K2k72J65K44j83M5n19M80Q2l88N3J59j13k37L89L70k95n81Q49j39
3870B84j34m93R79q25P3N93r3oo11J50O64l05l08M58j19j42M6R9k53k3Q1M01k68
3893B48l58M45k53Nj18l23R48o85O7L54j06m66N9Q3l86J08K98j8O2j05K25j43
3915e9k1K59l27M1l41R9L01k30NL81J39m19n42P10J5m05J65K69r1j30o4K32j06
3938a19l08K06j53M5J67L60N0q07M92L70k23m52O78J60m03k98j67M16L48k24J31
3959B69j20o21N18K6L94m7Q4m92M17k08J24l91L35K18m17j98K67k1L17o58L95
3980A91n9J02l65J18J99N16p86M52k14j65J92l76L48R1m71M47l02K8pK98l90k46
4002c99L82K28r8R2o13K58J66m51R8l04K33K38j02l1L04j50L30n43M77k10M18
$$ y = [-35, -653, 153, 175, -97, 68, 312, 129, 174, -345, 135, 217, -171, -118, 41, -72, -309, 80, 450, 155, -426, 423, 284, 150, -343, 636, -189, -116, 477, 384, 378, -233, -83, 581, 276, -32, 426, 307, 165, 211, 310, 57, 34, 115, 516, 248, -110, 335, 82, 87, -31, -354, 594, -91, -24, 330, 224, -242, -183, -100, -486, -378, -80, -98, -36, -141, 84, -59, -80, 179, -148, -107, -448, -349, -48, -278, -273, 108, 247, -172, -714, -4, 11, -394, -229, 40, -51, -181, -245, -13, -119, -427, -221, -374, -329, -162, 198, 248, -559, -67, 303, 80, -372, 306, 466, 63, -235, -402, 14, 362, 138, 269, 149, -472, 46, 72, 466, 419, 503, 11, 428, 220, 344, -47, 288, 506, 89, -109, 158, 137, 454, -204, 191, 132, 234, -131, -13, 186, 702, -84, 368, 154, -11, 181, -195, 153, 244, -227, 220, -82, -54, -61, 237, -153, -399, -17, 211, 113, 205, -408, -150, 16, -435, -337, -641, -408, -170, -272, -303, 1, -149, 181, -362, 115, -95, 323]
4023C23j27o62N95k16m71N31j20L95k12n99N23J24K19q2j0k72j11O52m18q2l6
4044e6J49J10j65K09j57J14q6j20N09q23K89J34K5j22L28K3N4o9j41l40R1M43
4066C99k52N24n87o68Q79j25p5J66n14L53n85O31L24m55k25j18j0M2L45l4j37
4087a22k83L41j36L95k44M21n52L99n83J67k99O18l7l1O0l68Q2K36l31K87M3K56
4109C19k76l85o2M04N0m79O31j00l21Q3M22k08k73N8L04j31k17M79j67J17l94
4130a46J97rj33j85M56l40m0L35J09m0j58j23Q33n63k89P22k55k84K57j84n66
4151d06Q51j66j97R8o05L60J81J36l37K68k76O8R7k80J25m29M34L38n14K8N91
4172C65k17n95K02N00J5l69k12L13J21k11K02l48P0K83j32L5l40L78o99Q56l69
$$ y = [323, 196, -466, 129, -87, -558, -27, -147, 248, 36, -563, -40, 84, 303, 221, 211, -61, -172, 480, 62, -20, -56, 93, 203, 38, 247, 90, 204, 118, -2, 507, -316, -27, 107, 132, 10, 338, 361, 415, 346, 205, -135, -44, 399, 147, 671, 84, -584, 295, 170, 95, 261, -253, 100, -485, 146, 470, 15, -210, -328, -338, -296, 49, 15, -122, -405, -64, -200, 195, -49, 372, -180, 219, -364, -197, -496, 122, 85, 54, 114, -254, -172, 64, -267, 20, 63, 319, 43, -342, -404, 0, 50, -429, 202, 102, -219, -136, 286, 78, -195, -137, 167, 36, -181, 298, 131, 248, -146, 51, 42, -91, -276, 180, -160, -200, 135, 244, 204, 46, -77, 756, 193, -96, 626, 371, 87, 344, 160, -406, 445, 279, 82, 180, -425, -65, 116, 252, -85, 183, -93, -25, 72, -208, -83, -512, -78, 260, -254, -226, 365, 148, -447, -245, 255, 270, -99, -311, 2, 123, -88, 114, -234, -164, 119, -13, 22, -318, 60, -639, 217, -152]
4193a52j72j87M42K23R4k79J93l18J94j36K46n7K30m42m44K94K97o11P10M1j71
4214ep1n8L07j68K03J23K59k71o52K20N36o2n83N47l32m69N25j26O57n51j58P97
4236F68k08n65K25j14N8m21K59J82m24J12K28j38k93K87j42L94k71j03J46L37
4256B17o91O20l60k34MM14P7l09J07N40J78q78j09K51R2k40K62o2J83J8k61Rl11
4279d83L76K14m87N6M09o5k66M24n0J91n85J70j9K29k54qM85p7k10k75K92j29
4301f2K76m61J42j2K81l34N90o80M62l47m2M28p5J52l09l44O00k89k73K17L07
4322B27Rl46K58m02J47L8j53K03j00lK18n17J66Q28o31j87J68l60J06K65o2L26
4344A98j60J52m33M72J66l08k26L7N55p12K19m8K68l88L28k2J47p63K93J34J93
$$ y = [-152, -324, -511, -69, 154, 248, -31, 162, -156, 38, -98, 148, 91, 321, -121, -565, -271, 26, -585, 125, 166, -5, -76, -134, 173, 5, 208, 331, 590, 319, -333, -113, 423, 361, -222, 325, -7, -476, 49, -77, 580, 29, -129, 668, 460, -105, 120, 6, 64, -357, -98, 84, -340, -228, 0, -138, -431, -144, -286, 108, -163, -266, -120, 217, -474, 146, -214, -448, -444, -30, 47, -262, -155, 385, 563, -315, -424, -173, -81, -321, -59, -121, 62, 80, -181, -172, -483, -107, 107, -380, -324, 85, 20, -246, 178, 128, 319, -266, -96, -115, 114, -140, -148, 337, 260, 50, -225, 67, -62, 214, -247, -105, -117, 164, -170, 420, -260, 202, -145, -187, 241, 166, 318, 9, -335, 265, -24, -297, -80, 227, 236, -110, 148, -254, -107, -69, -222, -19, -119, -122, 96, -421, -255, 573, -58, -245, -77, -437, -331, -66, -128, 198, 38, 190, -243, 229, 395, 87, -139, -102, 453, -259, -40, -88, 180, -208, 120, 98, 245, -518, -225, -91, 102]
4365A02o3k4N59l79j14k95o3M5P1J93l16J68K63n0Q3r4K11j72M9m55M72l44OK29
4389H2p4j19j34L73k33R2L12l2j6n6k39L49k81J34j98K84K61o22j83L5O9J26j35
4412b05R2J87L8J91m21K0j41K71j17J09K46P5n18K10j70J48l26j45P37n40K92
4433C3k57O04n53J08k0L82m96O0N22p19J56p5J30m02O10k34M62j31m47K31R9q2
4455a9K04k10J64p21M68O4J76r3J69j10j23j29k32K26L4J83M90k06k26k01J59
4476F7K11n53L66L37k03l66L45m18M3M9J33k51K60M5M82n71l9N6J44j8L66l27
4498A58k96J87k39L75k67j91L46K62o74P69l43k66J92mM72o41l35N59o7k44q6
4519c33K82L5o4j12L2Q44m76m60M77k38k16L43m95M65k59j99M36j90l72N03L25
$$ y = [102, 39, 15, 574, 195, 81, -214, -277, -232, -161, 32, -284, -116, 147, 97, 180, 86, 297, 125, 174, -281, 191, -153, -147, 82, 8, -111, -245, 128, -105, -13, 299, 267, 251, 195, -44, 305, 24, 158, -40, 244, 505, -117, -300, -265, -196, -70, -205, -113, 74, 112, 303, -118, -98, -239, 32, -85, 24, 270, 345, -173, 37, -133, 15, -311, -456, 281, -259, 33, -224, 380, -173, -65, -85, 297, -199, -139, 383, -336, -180, -255, -125, -527, 83, -151, 311, 180, -267, -36, 63, -19, 185, -25, 139, -582, -114, -50, 126, 33, 202, 92, -31, -160, -392, -166, -132, 51, 541, 335, 109, -92, 67, 278, -275, 91, 428, 225, -141, 204, -214, -171, -122, 11, -240, 20, 65, 547, -24, -63, -7, 137, 119, 485, 158, -138, 49, -190, 185, -82, -273, 73, 335, -339, 430, 87, -179, 13, 9, 481, -160, -495, 64, -3, -247, -333, -51, -16, -80, -192, -160, 684, 208, -252, 225, -13, -229, 114, -381, 84, -175, -374, 62, -128, -500, 3, 328]
4540C28j163J197J92l6l32J47L32m89q1JM17p90J38K87P7q96P59J09k89J25k12
4561a79K37L12j97p75Q69j09k60J33K58l07j40KK91m46L97K6j57k14N29J77q57
4582d10M33k6q9j13j31M29k04q7J84M3j16j78J88L74k97J58k51j16K32r5P9p3
4604f6j09q6j0K1j81L53M7k32K4K08K75o54M04N04j37m41j69O15o20Ql2K01P18
4627F41l65n24L43k28k40O19Ok97Q7K25j60j6j23N06p12n1N52j01l42L97j014
4648g97P14L55j77J95k63j39O6j06o7K66R1j12L27n13J35Mk64J68J99l9p7m15
4670d49O20k78K19R2m44L13k7l16Q0J82L4J42k87m50M79p3q5M24l39J96l1J28
4692A30K60m5p83O08j25l57L72Km0J67o57M22r0j87J28K44Q0J78m44o7L87o68
$$ y = [328, -835, 362, 554, 518, 186, 333, 665, 176, 95, 96, 513, -277, -139, 148, 225, -671, 88, 197, -92, 33, -179, 58, 370, 173, -602, 267, 158, -102, 31, 289, -18, -158, -156, 135, -311, 86, 112, -45, -259, 270, 447, -410, 23, -3, -92, -205, -336, 93, -111, -198, -14, 29, -87, -265, -77, 297, 0, 158, -93, -209, 23, -72, 7, -66, -175, -261, -271, -250, -431, -78, -31, -263, -239, -31, 244, -410, -6, 498, 361, -80, -249, 366, -254, -246, -278, -77, 641, 276, -248, 95, -133, -373, 246, 252, -45, 42, 267, 107, 91, -32, 474, -238, -289, 263, 162, -180, 217, -797, -83, 272, 95, 290, 27, -112, -46, -152, -219, 47, 138, 26, 353, -160, -25, -21, -285, -117, 82, 43, -34, -449, 171, -107, 112, 204, -240, 73, 46, -270, -190, -8, 26, 168, -119, -569, -90, -163, -248, 176, -163, 33, 2, 130, 390, 345, -438, 170, 45, -312, 60, 62, 22, 189, -468, -46, -136, -323, -195, 49, 129, 307, -137, -204, 183, -485]
4714d85J025m83o9p5j33k01L34J98L12n9j4k67K9l92M99k62N41p50J82K91j11
4735A10l35J55O9l83L29O2K20o65K89M15l3n59K96N15J19l55m02KL20j02J0j92
4757a15L02l21J19j78L18k29j4L97j37j30J53m01N42m14O10p36k1L44k34J8N18
4778C91q3j28m97P19l40k66L48k76K68J03q19O51R5o21K05L66n4n2L1O0k94L12
4800A19K78j81L3j40K34m43k54M29N56n72J38j11k41L02o20N32p5L15j13P4K10
4821D70q80O97n50l8K35K39K42l17l43j3O34p23J72N56l0l08K45k66K5k43K44
4842D8J26N5m57K2j4rj66J21K13l44M85L61o67J19J31J97n01R12m54o55M31K51
4864B05K16l32k82M35m96L76J74j86j99L8O4K54m80oL79K34m8j66M2l04k6j62
$$ y = [-485, 540, 57, -12, -87, -220, -421, -87, 111, 423, 364, 350, 83, 112, -280, 219, -43, 498, -252, -70, 221, 110, -225, -70, -1, -384, -55, 7, 227, -438, -149, 266, 233, -326, -30, 485, 604, 249, -153, -151, 169, 67, 77, -115, 187, -134, -15, -193, 125, -104, -118, 279, 142, 12, 165, -236, 306, -108, 502, -234, -255, 89, -145, -127, 391, 308, 180, -317, 402, 62, -204, 144, -132, 136, 239, -580, 71, 166, -455, -250, 116, 62, 10, 41, 101, -193, 119, 397, 216, 249, 109, 343, -100, -354, 75, 631, 59, 197, 86, -155, 147, -473, 59, -16, 299, 186, 260, 470, -410, 287, -263, -301, -66, 173, 415, 98, -245, -258, 376, -347, -175, 381, 351, 43, 288, 22, 47, -196, 48, 174, 229, -228, -206, -220, -229, -395, -274, -61, -405, 80, 441, -226, -107, 24, 221, -280, 632, 178, -477, -46, 205, 421, 89, -193, 242, -254, 122, 296, 110, -89, -51, 13, 267, -213, -219, 160, 394, 346, 180, 222, -82, -108, -270]
4886b70M00N7k03J36k86K30j15l3J37M93j24k85q0n21O26L3q9k48M60m97N8K02
4908H1L92k01k66q2N3J67n50N24j7l4K65n62L19L04l05j39k36K15j09M9q0M41
4930B29n26L18j84j63N5K34Jk87J9J69Q7r7q8M17k55j01O3K28m14L70Q0q9j97
4953a31K64j48j31L73j97j79J44J29k48L38k16j86L68j16l04L55L28j69j46J83
4973C11L41o44J07K15j37l31M46j32k77M4L91n77P20l02k88K56j72R1m45M71j36
4994d8K48k87J00j18K56k91j49L72J81N78l23k81l45K78%m15L51k21N95m13K74
5015C42l2k74J63r7J39j55k70rL49j36L58k94o0L13l31k1k09J19M14m33M0K18
5037A34j86m1K05P5J87k36qMK36n54K71Pk93J95J34ol6r7J47l2k0o5P5l07J73
$$ y = [-270, 130, 187, -16, 120, -166, 64, -51, -84, 53, 546, 422, 137, 57, -464, 162, 195, 106, -142, 318, -179, -121, 81, 473, 272, 6, -76, -23, 144, -406, 118, 101, 67, 332, -230, 89, 393, 88, -51, -287, -72, -181, -132, -212, 229, -297, 21, -163, -326, -271, -37, -36, -323, -304, -135, -48, -145, -233, 184, -71, -172, -109, 119, -295, 75, 155, 66, -131, 133, -15, -146, 227, 30, -149, -5, 124, -124, 214, -2, -188, 180, 64, -240, 115, 443, 274, 128, 311, 652, 8, 115, 330, 193, -138, 308, 176, -101, -57, 334, -243, 477, 175, -113, 143, -29, 62, -383, 88, -48, 200, -87, 13, -105, 151, -140, -289, 83, 264, 842, 519, 238, -107, 171, 171, -244, 107, -114, 481, 68, 342, 310, 36, 199, 102, 241, 86, -184, -193, 156, 20, 378, 84, 24, 337, 6, -15, -224, -105, 309, -124, -84, 134, -52, -93, 112, 187, 374, 138, 130, 134, 370, -184, 87, 94, -199, -4, 130, 124, 88, -9, 138, 106, 86, 21, 96, -211, -38]
5062c8K12j66J81n09N63L9r9j0K48m72j14l4M24l62Q3K51j62j80K19L14j44m07
5084a63N61m96K58j37r5k58O60J08j21q27N48k14l3K30L9l09P89p48L5K23m52
5105d02L28J49P5m71Q8R1M1p3L15j64J24k99l1J83l00M32j72J39k07K9j8O1L30
5128B48r8j04N9j91J93L2j80k1l09L59L29k09L9o6j5ML65N2l98k16R1Q8M1J68
5152B61j18l5l90l9O79j84M26q79N06l62K46j02J01l30J90J19M3j24J15J21o56
5173d12K85J20l31M09M0n40J009m97J43j27k52r8j44O15j27k64j26M71r5j92M07
5194B94m89J50K07L0l25O28j05o28N46l94J03j26K25l20K70K03l18l46O03j02
5214A06K65k64p9m1p8j34O08l03k6N5k69R0O9M60o04J90M1Q7n28L21M38Nj95r7
$$ y = [-38, 174, 8, 189, -320, 243, 282, 183, 173, 421, -51, -165, -199, 225, -137, -54, 197, 35, -145, 74, 388, 244, -163, 398, -98, 160, 23, -72, -330, 330, 438, 317, -510, 38, -176, -209, 21, 60, -249, 540, -208, -173, 50, -402, -74, 75, 150, -321, -233, -142, -101, -174, 141, -23, 101, -198, -229, -46, -346, 86, -86, 53, -154, -125, -143, -82, 248, 150, 46, 105, -86, 107, 139, -41, -62, -371, -12, 317, 108, 147, 81, 66, 70, 435, 487, 89, -127, -36, 52, 93, 261, 143, 108, -282, -321, 358, 174, 600, -279, 227, -135, 111, 9, 110, -220, -30, 89, 132, 8, 123, 244, -412, -127, -7, -338, 71, 111, -429, 580, 83, 226, 99, -153, -251, -395, 220, 93, -171, -297, 174, 79, -113, 294, -195, -45, 162, 192, -133, 495, 390, -238, 308, -86, 17, -109, 116, -204, 66, 269, -49, -395, 208, 106, 371, 107, 28, -13, -91, -225, 383, 80, 54, 109, -160, -70, -1, 459, -145, 45, 86, 173, -355, -34, 404, 409, 214, 117]
5238A17j27m7q5J40R3r7l30Q2O94l77k53M01k88J54j40K63k09m3M24m34k43L49
5260D4J5P1m8K07l18nR3n97O85m73M28l41J90j07P7j14N5M95o8j9m60K19q7j42
5284b00j48L22k0L41n79M01R6j12m0j8m57O43Qk03P5r1j44m3k59Q10q47N17Q9
5307A41j34K18K49n65j26j63P48j67j28j2j89L35j36K20k22l9l3Ol37K08k4j61
5329c11O09n3j83k8k7M4J01j57J99l30k51N35j34J01n06N04l98M12k90O1p2J52
5351b2j49K07j69k10M78M6m13M23n78N80l15L4J18K95k97j3M60k49p2k11J27o58
5373e88R29k04m2j77L9L25m42L67k45j57J61k1L98l97K80j89N4J58L3LL5n09L61
5396A72M24m84J53k88O5RL28n54P32q63O61k30QO0j40k33J57j24m4N39j38l47
$$ y = [117, -10, -57, -142, -2, 91, -6, -336, -254, 440, 63, -190, 211, -77, 77, -63, 200, -9, -52, 372, -62, -305, 44, 59, 130, 82, 289, -29, -34, 59, -538, 147, -326, 102, -239, -49, -156, -79, -193, -138, 357, 289, 270, -190, 29, -58, -200, -348, -26, -46, 295, -284, 117, 213, 101, 61, 43, -414, 229, 237, 34, 109, 18, -126, -169, -428, 382, -465, 52, 141, 7, 225, 474, -91, -217, -380, 368, 201, 73, 61, -128, 207, 71, 291, 69, 30, -3, 3, -334, -126, -150, -311, 298, 245, 62, 34, 7, 51, 152, -5, 194, -136, -387, 148, 14, 115, -391, 113, -285, 127, -163, -102, -174, -22, -171, 36, -133, -343, 135, 181, -232, 191, -387, 193, -122, -88, 30, 325, 28, 15, 475, 226, 154, -57, 70, -588, 341, 137, 95, -82, -43, 282, -160, 207, -38, -195, -34, -55, 343, -54, 226, 37, 91, 249, 282, 285, 320, -189, 172, 596, 112, 265, -23, 42, 51, 379, -175, 557, -306, 355, 125, 133, 193, 53, -180, -23, -147, -191, 348, 210, -137]
5418a37j2N6J03j7o19Q44m24o2K88o51M54k0J93m83L52J20J39o80O56N58o99Q1
5440D0rJ06k01j25L60l96n7O32p67N26n10L42L40n57J51Q7J62K01j68j94J29k47
5462a55K80l17R6J62J27n06L97N4K16j62O3j27k9l40L41J75rR3n34K79k8R2m72
5485c04J21K05K7k69M16n02N61o44Q91q18N02j6k03J11k11r0K56k00m9M04k22
5506c4j10%m8M15j40m4L2K7m22k05L55m4L36j98O23r30M25n34O20l65K82M98p64
5529b25N52k72k7j82j09J05M5j83L54m88M00K99l0k57j37k19L56L63p12N74P0
5550B77o59l2L80J54j98P1l37l1k63O11L46l13m5j13O19l64o9n18M73L7J6j7q4
5573e9J47k00L96n91O85l17j09O2k03J92L31m92K41m53K38K68pRo1j28J6J93o9
$$ y = [-137, -149, -93, 10, -7, -626, 218, -206, -268, 20, -631, -177, -197, -4, -487, -135, -15, 124, -556, 100, 658, -41, 40, 31, 137, -64, -189, 171, -225, -282, 350, -417, 109, -401, -59, 281, -276, -125, -38, 124, 325, 157, -37, 92, -155, 125, -192, -96, 66, 193, -313, 84, 138, 354, 192, 255, 128, 99, -241, 100, 275, 266, 359, -175, 104, 76, 168, -304, -183, 22, 49, -220, 196, -306, 255, -389, 502, -316, 186, 170, -33, 78, -133, -223, 33, -167, -216, 188, -34, -144, -144, -192, 223, 83, 39, 71, 98, -324, -529, -174, -218, 118, -80, 543, -387, 38, -496, 124, -241, 41, 539, -225, 327, 55, 28, -154, -263, -158, -113, -296, 58, -430, -30, 269, 239, -18, -155, -374, -18, 345, -367, 207, 277, -382, -414, -34, 120, -78, -7, -344, -375, -638, -27, 319, 6, -39, -152, 467, 103, 34, -484, -11, 26, 42, 25, -59, 88, -112, 284, -307, 378, 61, -48, 14, -189, 3, 334, -158, 83, -370, -132, 136, 129, 138, 77, -51, -35, 158, 89]
5596H9n9j09J17O7P9k01L37m58j0J63qm2L24K36l39k42l03Q0K55L12l79j77K31
5619c7K23J30j34o2Q8M8l71m03R77p1k27m00K37J22m75K90K98m32J17K9K4O13
5641E84n40j31J99J19l98K08k41K13J8J74k73Q7L9P1K09l78L34n40J31N57o25
5662a83J20p7J56p2p4k06L88M29m38j56K44k43l04O40m21K54K81k84k46N6o9J53
5684e2l68M68q1J59j88J55J27n82L95J63m22j65M4N26j84j3N8k05J42Q8K87j66
5706A86k8k04L37n89M35q3r7l30N24j05K80o02L38l4M19m3l86K2m88K82M89k66
5728E7J33J51l99K04l40K84K80Lm36L14n6O5j66j51J45J75k48J56R2l57K28n84
5750d50J79L43m34J80J09J01j59l06Q19p62L07L71m13k12M99l0l43j72J01J57
$$ y = [89, 30, -79, 38, 105, 184, -17, 320, -138, -148, 15, 7, -35, 289, 525, 186, -56, -359, -279, -24, 288, -91, -268, -37, 186, 316, 182, 120, 208, 256, -115, -518, 459, 388, 161, -239, -2, 120, -355, -65, 233, -199, -82, -53, -29, 584, 44, -87, 112, 231, -167, 41, -200, 13, 31, 205, -68, 19, 58, 129, 338, -40, 294, -246, -115, 442, -183, -63, -140, 16, -56, -130, -336, 52, 481, 43, -113, 131, -112, -416, 224, -197, 57, 338, 54, -192, -136, -205, -52, -420, 48, -33, 126, -62, 93, 220, -362, 33, 196, -226, -391, -347, 179, -5, -18, 40, -165, -23, 65, 352, 186, 158, -46, 291, -298, 137, 54, -43, -373, 151, 46, 326, -276, 62, 28, 447, 404, 18, 40, -448, -166, 323, 57, 190, 341, -58, 146, -194, 90, 370, 373, -63, 251, 195, 260, 94, -57, 88, 263, 15, 171, 263, -94, 134, -450, -271, 72, -362, -182, -73, 28, -131, -437, 382, -380, -73, 298, -115, -327, 172, 142, -201, -373, -272, -115]
5770a15N9RK23j98m01M14K2L15j60j21k26O7J96l85J55M8M89l53k09K28r0Q7N63
5793F17m97J81m28oR6K73k52l7l70M00J81m30K75k4L03j55J5j57k60M66J05l46
5815e0n2K54l66N9M11o86J98k7p1M38k16K28j69L24k92J55K3p2l80O15n19l3J02
5838a26j14K97k15l03M84m63P96l7k56l15J80jl2J65k60O5j33N33qj80jm03K60
5861f7R0J12K7k24K26m1J29m2m75R2K51k79J4N84j60k82r2J24K05L88o18K43k10
5884eJ48K48l96N0R4Q5k51J57k59N3K98K59m66N44l74J39n28P21o82J08k18M11
5906A36m50J97K23m32Q0J79jK06N3k80M23J48j45r52R04l51L14n25L22k53O9j39
5928b74M64Nm09L26J46k87K68n73R6L21n5j35J36r0Q1J58m49J66l85N11Q3k12
$$ y = [-115, -56, -47, 176, -22, -423, -9, 13, 328, 168, 47, -179, -112, 84, -301, -146, -98, 391, 38, -171, 57, -33, 54, 617, 120, 301, -127, -133, -37, 236, -16, -53, -423, -23, 158, -272, 3, -21, 282, 127, 142, -15, -275, 191, 296, -50, -102, 152, -214, -155, 256, -430, -232, -259, -330, 108, -108, 120, -49, 275, -17, 138, 161, 89, -291, 324, -195, -228, -126, -240, 57, -158, -461, 23, -440, 356, 319, 63, -252, -72, -73, -105, 60, -200, -135, -268, 265, 257, 77, 76, -327, -67, 23, 135, 162, -62, 164, 123, 252, 210, -265, -173, 78, -201, -187, 397, 237, -45, -137, -13, 192, 580, -38, 205, -5, 143, 391, -5, 45, 139, 224, -27, 130, -129, -76, 222, 481, 15, 559, 185, 324, -204, 517, -165, -57, -275, 136, -314, -117, 106, -326, -246, -67, -68, 138, 191, -89, 334, 482, 337, -615, 289, -62, 252, -273, 49, -204, -135, -274, 190, 195, -214, 112, 258, -29, 239, -334, -238, 83, 28, -107, 29, -61, 20, 178, -271, -105, -490, 21, 104, -108]
5950a08K61o07L63K44j40j25L03k1o11O33k91J52K58l43J02p7j53K63l92L34O6
5971A11k96j1K59P0n2j5j08N62l0m73k45R2M54n21L8Q5l72K87L81k41J34k98L69
5994A80l81K71j04l3p7k64O24j77l8PN90m10k12J17m85P12o57N28k42R4l95M07
6016E5N9L01p65J52R7K50k10K81m13J34m0pk35L09L51q6m43L31m45J56k6M4M01
6039B51mR6l07L72q32K62L37k24N34k82j96K37k02Ll33J98O4l5J21k76M14k84
6061h6N06k44k97q4L35m4k16q9N4k14P07l68M09k50l14M5J73J10k31J69m2l01
6083b72K17k1J07k02q0R0K03r5J99K6o21J97N01k10n4o3k4M4k53L34K6j19l42
6106d12L4J31K70l48J13K99j71k11M54l40L81j57p4rQ6k51L65p3j76M09q22M96
$$ y = [-108, 153, -454, -91, 153, 13, -112, 191, 170, -441, 192, -99, 53, 311, -32, 70, -7, -160, 103, -289, 45, 111, -185, -196, 63, 133, 81, 66, -42, 520, 490, 17, -228, -136, 318, -203, -165, -80, -452, -165, 216, -25, 109, -189, 180, -201, 70, -34, -67, -144, -408, 216, 39, 1, 8, 598, 188, -24, 93, -392, 320, -337, 191, -51, 43, -352, 55, 114, 415, -350, -198, -101, 149, -61, 220, -193, -59, -99, -106, -341, -32, 319, 233, -210, 121, -324, -168, -194, -150, 251, 247, 343, 36, 408, -424, -162, 175, -49, 485, 203, 7, 244, 42, 45, -288, -90, -26, -61, 60, -216, 198, -86, 420, 176, -121, -205, 130, 86, -130, -219, -165, -379, 328, -40, 369, 119, -195, -150, 23, 133, -98, 71, 29, -272, -55, -76, 31, -171, -251, -161, 42, -53, 146, 172, -449, -252, 249, 39, -15, -78, -102, -58, -311, 23, 49, -70, -412, -378, -247, 23, -325, -212, 87, -84, -295, 159, -181, 200, 43, -31, -40, 46, -205, 160, 87, -89, 320, -502, -6]
6128fJ1qL48o72N02L4l3J06l52M49n82J40L65j25m42q8J31L94l65J0J36l4j2K89
6152A96m53M93l31N31k95m26j32O12l41N02p01O00l59O4L9Q7l62J82L41m9n5m81
6174c38M85j15M1J81l22Q0J68m08K99p8k86K93M09m95M54m77m2j02J33O62p52
6195b10K37K15l2r2j96L61j88N0L36q84L03k79M6N19k44PK91m67j25P7j26o9M12
6218e8J1qL22m87r6L0N07l95K66J17j82l52O27r4N7m00j87P1J27J25J13Lk34N0
6242f7j1J3o1N44k52k81N6K22P6l47K32k4K36l38L3m5Q4j89r7R6J79j71M11n0
6266B49p28P89l87L63l54OJ0o34N01k62J49N42K59j62o9k30J89k04j00J94o1j60
6288a00l2Q7m19O47k36k5L4R0K25p4k01J11J8Q0m38K00k13L59j78j27M78l23k03
$$ y = [-6, 5, -3, 345, -327, 175, 209, 176, 282, -70, 379, -203, -63, 302, 177, -265, -353, -222, 172, -193, -183, -47, -81, -93, 196, -257, 236, -95, 436, 141, -285, -417, 195, -146, 356, -345, 255, -104, -40, -1, 86, -276, -94, 247, 198, 143, -338, 147, 32, 73, 254, -68, 12, 180, -228, 71, -7, -293, 0, 409, -86, 368, -109, -151, -253, -120, 542, -210, 27, 242, 210, 118, -78, 283, 95, 145, 481, -403, -100, -379, -333, 186, -58, -51, 240, -227, -352, -275, -401, -470, -58, -47, -55, 267, -220, -316, -286, 221, -174, 92, 209, 27, -325, 302, 208, 265, -135, -322, -251, -124, 1, 114, 117, -117, -67, -78, -65, -126, 418, 166, -115, -59, 163, 239, -108, 124, 100, 336, -2, 31, -14, 70, -119, -216, -120, 59, -112, 299, 249, -479, 310, -77, 286, -68, -62, -52, -686, -185, -447, -298, 244, 503, 341, 272, 42, 231, 27, -73, 121, 60, -100, -132, -45, -464, 183, -53, -78, -44, 46, 271, 197, -4, 107, 125, 205, -233, -33, -246, 113, -65, -192, 286, -37, -240]
6311b40L92j98j02Jk1J46M17k63r1J85J41n23N4Nl21L37J81l52P0N71n85M12r8
6334A18n0M82n66L99j59n95J87R9p3N64j18m70L45n13K66k7M77j25n86K85J01
6355D1l71O56k66N9J15l39K29j02R3l40K45j76j29P4O11o41k12J35O38J06l00
6376A26L76l57j31J80j23L03j13m29J57M6r3Q5j07K29o19O26j8j90p3K8J38j08
6398f7N1K53p37L46L03K5j21k88K52o2K75J19r8J43l40j68j29J55L64k35rm82
6420d50K95L71K9l25K51N2j91k18L13j11l5M47m32k03K11O5m3L03n45J85l5m97
6442e63L97J4K36j32K4o2J94k30mJ97k6l34M39J4r1j60J37k36K2K8k10O00M5m43
6466a44P27n96J79L67p46M0j46M67L9j57k70J4M84j58K13j99m79Q9P75m59P5m8
$$ y = [-240, 152, -46, -148, -147, -168, -22, 395, 132, 41, 226, 367, -156, -102, -97, -418, -81, 100, -252, -182, 389, -196, 216, 118, 68, 550, -16, 383, 224, -371, -184, -85, -158, 406, 288, -182, 163, -350, -84, -111, 366, 241, -345, -60, 41, -330, 326, 60, 119, 234, -105, 124, 22, 115, -225, 20, -156, -285, -211, 400, -241, -453, -318, 320, 426, 126, 502, 145, 14, 194, 71, 374, 261, -168, -11, 35, -58, 27, -80, 149, -470, 156, 138, -52, -125, -97, 41, -67, -16, 237, -500, -154, 149, 174, 53, -235, 17, -45, 230, 349, 251, 394, 54, -114, -243, -88, 276, 41, 32, -450, -155, 216, 245, -80, 171, 223, 32, -186, 127, 16, -19, 428, -4, -207, 4, 69, 26, 329, -216, -31, -66, -563, -166, -152, 84, -48, -24, -86, 108, -122, -126, 71, 45, -289, 150, 164, 73, -87, 50, -186, -164, -136, -346, 254, 299, -144, 583, -13, 166, 533, -213, -173, -319, 148, 187, 30, -240, -226, 258, 100, 313, 114, -365, -276, 499, 40, 115, 67]
6488F7J63Q8j73l75K13l7k18j9Q64m78l9l07R79n54L40l60j9J20k26l10K87J26
6510A32J20j61M10l36n05N47l95L17Rn5J32Q0m40M1M4o9K11M7J8j39P7l05j99
6533d19P53j94l87K31j67l0Q2k29L51k26J99l58M43j38J14L24m54J74l3K88n83
6554b59LM40k94J46K22M00q22N72l40L54o05J90L82n61J38q7j61M14M82n23m6
6575D5K05k46j13K00Q3p2Ll34P33m49k99K43J90j09J01J99m31l3K9K13Q6j42n2
6598E0J12K36p22Q48o81l29M09j59J77P1q3j05N48j65n27O69j52L1p7O8k7k88
6620i6j62M28m51L67k45j31L64J20L85r74J117q68q0M61q2R6k90j78M91j81l93
6641c02K6L76J19q57O99l19K88j83L91j41k58L21J13p5o63P83n6k25j36J39R7
$$ y = [67, 230, 318, 145, -230, -17, -54, -272, -291, 573, 95, 56, -251, 728, 174, 514, 154, 135, 255, 29, -281, 6, 132, 252, 91, 501, 165, -340, 207, -188, 129, 138, 83, 215, 295, -145, -104, -60, -129, 82, 129, 147, 8, 85, -220, -419, 334, 140, -247, -16, -183, -213, -131, -360, -9, -235, -36, -394, 49, -89, 25, 349, -105, 69, 36, 324, -259, -256, 184, -110, 36, 258, 658, -164, 408, 68, 422, -183, 7, 389, -172, -34, -121, -282, 132, 614, 91, 45, 250, 4, -109, 91, 174, 102, 105, -229, 504, 55, -244, -1, 189, 80, 181, 380, -51, -84, -55, 158, 244, 102, 50, 162, 398, -324, 524, -157, -486, -77, -236, -59, 12, -71, -176, 372, 207, -320, 349, 197, 228, 151, 219, 192, -96, -258, 170, -281, 86, -159, -290, 74, 194, 579, -395, 722, -146, -226, 235, 153, 249, -41, -219, 272, 91, -302, -276, 100, 219, -638, 61, -258, 30, -153, 238, 97, -161, 160, 273, 198, -465, 318, 262, 37, -99, 40, 137]
6662A37K68l70J32J02l99l62M03J16r1m9M08p4j13p0J1m12J34L21j68o8J93j00
6684e1K57M1o06O14m52l36N02L39J15n43R8K66j90k37l50L10K9L98K43l47p9J14
6706A35j9n61N71m19J67k4K87j13l42L25j88L35k27K58N6j14KK80k08l81O30o09
6728a59Q0r6j21M22o60M78j74K32K92l72L5r9O9p2J88m18O80l44J93p4J60j95
6750D5rk36R9k23K9M07M6j96k11N77J55l54N3k71l53N92k24q6K46J2k60K55J59
6773B52p34M06L3k01L62j3k18j10M05o2k08j05J62j77jJ02J57k42M41j34o9l6
6795A0M1k05k82N87j63j46k12q1N42r9N79o29M0o7L42n12Q7J59J44P5j26m76N59
6818A67K70m11j23K16J11p0j70q6l02L64J19K89J01l88n16M68j9l35M16k02K22
$$ y = [137, 405, 35, 167, 269, -130, -492, -89, 27, -64, -113, 295, 221, 108, 38, 49, -363, -229, 92, -76, -144, 49, -51, 206, 247, -359, 255, -197, -533, -31, 308, 423, -120, -22, 244, 54, -183, -533, -223, -194, 204, 447, 100, 21, 135, 116, -445, 126, -293, -126, -150, 137, 24, -318, 7, -181, 154, -73, 185, 241, 127, 129, 409, 201, -180, 450, -159, -79, -175, -296, 126, -534, -56, -230, 2, 294, -78, -43, -142, -73, -145, 43, -375, 305, -39, 154, 80, 240, 45, 36, -200, -101, -324, -295, 112, 158, -38, -249, 328, 483, 129, 182, -89, -442, 150, -74, -160, 86, 98, -162, 93, 252, -482, -76, -43, -244, 118, 105, -113, -223, 182, 120, -88, -193, -31, -208, -209, -107, 50, -192, 249, 115, 46, 10, 51, -154, -436, 151, -12, -158, -370, -451, 91, -8, 571, -58, -18, -85, 257, -255, -168, -9, 135, 210, 84, -392, 167, 437, 26, -97, 119, 230, 160, -10, -96, -398, -34, 85, 374, 475, 87, -429, 39, 20, -315, 101, -101, 121]
6839A21q0p1Rp3K41J12p8m80M1L25o1j36m0P36o35l55P95k34m35MJ18K68l27L60
6863A25J72l58k52K46L35n86M40j05Q6l20j44L05o3k88M64j1L11n35j34O83m82
6884a11P3K1j07j38K32q0L93k73Pj21N79m63j03k57J40Q3K59L99n22M00k04n58
6906c51K89M51l84k88k16J29M50o16K06mL15J68J74j63j73j53K80j99o8j38j9
6927c10J25L2k2K22M85l74k2N0q2J03j75K5j23N7R5r4l61M75J07j51k45M4L31
6950A92k07j18J91q4j65R4J4L91k54j89K70j16o3O4K8Q3k60J70L40o19K57K24
6972B43J95j05p00N57l68ML98k52M6l51M31r5j66J02k64N35o56M50L89k10l01
6993a18N05j19m74J93k70M19l1l42k37N32k51J72M05o70L96K65l34j01j5J48J27
$$ y = [121, 41, -30, -21, -94, 147, 259, 181, -299, -258, 67, 6, -130, -170, 566, -69, -424, 371, 137, -298, -294, -176, 92, -235, 125, 297, -61, -313, -67, 268, -318, 122, 17, 103, -217, -361, -56, -119, -407, 57, 46, 357, -178, -312, 371, -111, -38, -17, -124, -262, -30, -110, 283, 10, 17, -104, 475, 12, -91, -348, -208, -125, 134, 533, 11, 411, 207, -351, -62, 389, 5, -283, -499, -370, 80, -536, -330, -334, -19, 149, 323, 160, -13, -166, 114, -85, -153, -291, -310, -185, -153, -175, 47, 532, 158, 136, 186, 104, 207, 32, 57, -66, -9, 86, -8, -369, 106, 213, 62, -183, -139, 192, -15, -133, 58, -26, -191, -97, -83, 308, 54, -135, 135, 19, -44, 20, 48, 131, -129, 41, 381, -238, 19, 243, 438, 333, -367, 190, -178, -174, 224, -28, 18, -333, 98, 3, -163, -61, -325, 210, -446, 4, 393, 183, -118, 387, 268, -206, -13, -283, 136, 105, -237, -474, 58, -193, -21, 384, -286, 110, 375, 41, -60, -75, 73, 200]
7014B00n9k07k45J64Pj56L89n02J28m53N23M68k13N49n71L04m06N6%J1j62P1M88
7037C84m74j01JK93m47K68L07o90N19J47k01k77M32j70O3l44M84l55j12M58k31
7058d6k35m9O24J36j29m56j39P19j51j52K1k27L21j67k31M20l10n5K80p2j95N08
7080D15m43l4M60n74L44J51n45J29L70o47L67P8M81j148L68K65j39L0j2l11K41
7101a54K63j31n3J38l92K25J98n48J30K81k7k87L35P3Mk91M48j89k95M52K74k53
7123B01m1l99K19j39K26j08k25k7K46k20N97k38l83L69RQl3J13k37k25L74Nj83
7146i1l41P95m21O4j57M38k10k27K85J38l00n57J134m52l9m71K37L61K14k95N8
7167A63n90J50M10k8p1l0M4L7M2J00N3j63m61L65K73m20l7k22L52O3r3M59m86
$$ y = [200, 141, -66, -311, -147, -140, -296, 93, -409, -281, -734, -211, 257, 44, 593, 22, 326, -80, -24, -24, -13, -175, -104, 384, -90, -191, -190, 103, -344, -76, 231, -459, 60, 207, 6, -271, 161, -9, 54, -290, 194, -161, -273, 185, -46, -281, -330, 294, 430, 301, -155, -294, 425, 274, 122, 143, -84, 237, 70, -161, 259, -51, -106, 174, 102, -93, 415, -28, -62, 398, -176, 168, 319, -226, -97, 273, -374, -7, 71, 552, -596, -228, 37, -102, -72, -84, -395, -154, 109, -22, -75, 63, -329, -104, 94, -454, -324, -43, -70, -357, -22, 51, 55, -236, 212, 23, -272, 180, 454, 201, 160, -239, -20, -159, 67, -41, -266, -293, -47, -267, 330, 92, -291, 78, 87, 95, 62, 175, -62, -287, 87, 92, -91, -432, 363, -58, 6, -151, 287, 77, -150, 135, 273, -27, -584, 550, 98, 59, -412, -175, 186, 400, 105, 163, -427, -277, 133, 105, 34, 4, 48, 85, 127, 227, 280, 117, -344, 21, 294, -126, -163, -385, -33, 30, -63, 396, -90]
7190i0J91K04l72K26j54m2P24p14M19n14k17M4K20M17K35p16L06j23K53k42K42
7211B97l21N99o14j94L01j10l04N31j53j09J15j98K01j46L53l23J47J80j57j22
7231b7P35p33k33P3j18J68k03L43OL88o75j20L61K50k59Q4K24M0N6o15j03M80
7253A22k31j70O91k59l51M56l71O16n33J63j2n4K29m31L05M6o18O06M45j099L63
7274h7l24K30K69m99J09K40j09M37l88J40K52k13j92R9m22j98M89K77m17M40m12
7295b79M03k6l23J47n7L67j96L62m94L7K78m89K62K65R6p45M21j64J87n23K98
7316a73Q4l7LL81j20Pk07Q3L64k57l91J50K45R4r3k9l09j07L31O9l56O46m92Q8
7340b6L67l86k23N90o33J41j59J19M72l85K71l07J99k66M87n46K66j27R3L6m39
$$ y = [-90, 101, 305, -67, 159, 5, -37, 687, -27, 392, -122, -339, -295, -75, 342, 577, -139, 167, 44, 297, 55, 297, -24, 575, -39, -233, 68, -42, -346, 185, 32, -77, 38, -160, 41, -105, 248, -75, 72, 252, 95, -27, 708, -25, -258, -185, -303, -135, -338, 5, 11, 399, -276, -396, -35, 215, -44, 40, 264, 304, 360, -255, -358, 122, -109, -279, 412, 153, -198, 258, -113, 503, -30, 133, 121, 67, 296, -135, 170, 216, -402, 204, 649, -450, -87, -411, -181, 88, -411, -302, -62, -171, 266, -122, 18, 270, 57, -135, -36, -458, -656, -167, 110, -307, 133, -279, 124, 98, -225, -78, -135, 232, 36, 398, -96, -59, 219, -270, -8, 257, 353, -392, 29, -135, 52, -471, -173, -89, -126, -123, 258, 138, 145, -62, 21, 385, 128, -263, -113, 132, 226, 133, 104, -205, -312, 19, 88, -268, 378, -114, -26, 341, -45, -268, 322, -311, -170, -329, -210, 262, -123, 148, -159, 40, -226, 261, -285, -19, -146, -53, -17, -456]
7361d56O24k13J22k78j40K49KJ85l89pL92p1K1K84J54o00K99j34j70M35o12r4
7383c97O08k46j08J92k83N89l29L36R5n99J09j95M68m88M59J3j08l03J71k28M94
7404B50k0n05K56k29M82l85N48m0J56p23N11m37O17l79n09R0q7J61j47R8N38j00
7426A46m58J88O54n80j23K32j75O55o43J34K13l03o0N6l13P4L33p1J39l50J80
7447g2K00l7p4J7j31q9j03M23j81k06k70K18k75J83O98RKp32O20K09q91K78N79
7470C75k27l21p2L27L6Ok99JJ52J03J71j30L47k57k56J22J96o77P17m40j61O58
7492C71o2l60L75o38O6O82m43K83l44J08m82L85k96L85J75j57L79n01l80N33J39
7513B18j45j65L43J65m67N43m40o7l24O85n73L89k74op9l31M24k60L38J34k26
$$ y = [-456, 168, -45, 77, -201, -341, -92, -90, 95, -294, -301, 91, 20, 41, 325, 479, -121, 178, 44, -126, 309, -303, -397, 211, -35, -143, 49, -234, 355, 26, 362, 457, -142, -33, -228, 240, -248, 211, 224, 116, -187, -16, -244, 250, 230, -275, -19, -248, 234, -151, 397, 357, 513, -210, 301, -136, 481, 102, -407, -317, -404, -243, -390, -292, 246, 146, -312, -124, 530, -50, -173, 59, -116, 539, -104, 30, 243, -60, -120, -64, -377, -303, 30, -41, 98, -252, -72, 128, 91, 17, 34, -97, -186, -289, 134, -47, -253, -523, -305, -580, -397, 301, 310, 312, -420, 200, 409, -482, -204, 375, 148, -173, -245, 82, 118, 124, -175, -174, -22, 81, 252, 122, 469, 212, -44, 78, 274, -403, 314, -126, -287, 371, 309, -51, 324, -314, -248, 434, -9, 274, -70, 38, -444, -59, -355, 30, 205, 48, 427, -74, -454, 79, 218, 73, -92, 251, 416, -51, 492, 52, -15, -339, 346, -227, 162, -112, -118, -197, -528, -104, -364, -26, 108, -118]
7534a18Q3J26l09N69q06O34M70o60k09N13n69k47N09j03J10M7o6J94j24N42m27
7555A59k30k17N36o30R17q99M02O7j12M8j6j78K36k17j0J1J46M15k6l15J92o79
7577d00M31K44o90L38K42k61J56k5l12Q6jJ96K84J06m97N21J3j49m19M43Q4o13
7599b23j64O37k26j21m09J060m99J4N7r7o8K56K6j54k77j44K66J69j30Q0j53L5
7621f5Q4l1n55K91N86l06J20LK6l20J70j40L49l1J44k71k11P3j33J09J46j10J39
7644F7L69l87j78N4L73k5l95L7K69k25j5K97j90J84m9k36j26J6K40k16J73P1J28
7667B36j53M61n55J48j12K00qJ75m88j18k00O56k36J19j96J50L19k48k8K73l73
7688B2j87J90J01l26NJ31r2K12k69P3l16j06K85M50J06k74k30N53l06J80k67k59
$$ y = [-118, -35, 91, -218, 351, -455, 179, 649, -11, -220, 293, -276, -523, -14, -117, -7, 40, -26, 168, 44, 586, 159, -71, -288, 248, -382, 535, -364, 38, 105, -7, 41, 25, -153, 83, -134, -144, -133, 13, 428, 402, 87, 279, -400, 31, 275, -415, -77, 165, -96, 60, 35, -277, -191, -192, 4, 288, 394, -103, 418, 431, 282, -137, 306, 390, -223, -387, 250, 24, -97, -506, 554, 55, 69, 126, 29, -39, 217, 243, 89, -188, -332, -66, 103, -27, 53, -100, -65, 19, -12, -567, -276, 310, 4, 124, 127, 153, -167, 3, -137, 212, 181, 325, 54, -157, -84, -217, -108, 38, -72, 67, 436, 49, -129, -75, 298, 273, -122, -85, 184, -41, -56, 241, 51, 235, 186, -50, -176, -160, 80, -136, 37, 108, 236, 83, 544, -11, 137, 25, 225, 217, 392, -96, -214, -414, 242, 6, 125, -71, 79, 398, 150, 122, 395, 22, -165, 25, 126, -200, -195, -64, -156, 56, -213, -140, -456, -562, -277, 173, 279, 5, -225, 328, 22, 202, -65, -324]
7710c24L17o60Q08k71L36l99J86K3J02j24K46O5n00j05Q05o36j24K83K00J77m54
7731d9q8j51K4NJ54L68n40N37k23k42K40L6N2l7r1J15j26l44K47K90j95k57J49
7754a26K00K16k51r5J5l6p3Q9oj13Q2m60M22L06n53P34m94K84L32j8m98K21L22
7777E00n37M0J61n8p6M6Q9J4l13Q3o4K96J36r6K0K31n66k60P89m16l15K10J10
7800B4n01O70n08M58m44N28J61k44j3K09j78K34k49l26J3K74j94j8J53O3p0p4
7822c2N9j81M7L38o47K43L90J87n05k03N75n34J9J03N9l04M3L22n27N86K5K64
7844C27j73k00j2k91J82QM31j34k89j09L68k70N00k92N6P2k31L33j90k47J00K48
7866A87n20J60K78J8k47K49n85P12n26j53K70J07m07J38R7K16J18n4k97M38n36
$$ y = [-324, -7, -667, 141, -130, 206, -193, -7, 16, 118, -6, 240, 305, -195, -300, 505, -131, -255, 28, 228, 405, -49, -137, -288, -264, -259, -105, 263, -277, 260, 37, -205, 35, 71, 123, 86, -5, 110, -16, -360, -113, 177, -18, -275, -126, 74, 290, 39, -56, -41, -77, -150, -61, -67, -180, -98, -558, -136, 170, -383, 351, -143, 141, 473, 455, -43, 178, 500, -37, 3, 164, 106, 30, 76, 165, 179, -134, -51, -115, 181, 317, 221, 241, 472, -94, -354, 435, 19, -296, -86, 24, -477, 193, -315, 143, -301, 227, 388, 144, 131, 340, 162, 396, 147, -179, -166, 108, -86, -104, 49, 112, 42, -32, 27, -154, -107, 231, -416, -173, 217, 404, -101, -304, 271, -263, -244, -141, -82, -386, -343, -21, -548, 38, 63, 327, 154, -46, -58, -349, -167, -159, 272, 138, -151, -260, 108, -162, 338, 46, 102, 174, -57, 276, 86, -161, -61, 187, -333, -173, 105, 123, -124, 125, -460, 252, -274, -427, -157, -50, -457, -319, -222, -6, 112, 58, -239, 199, -337]
7887c37L6M22nj92Nk22k06J14K46O70n72L1P5N89r14P51k98P6k41%k75M15j12
7910E6p8j55j5J8pK96l59L17j13N4Q6R7m93j72J90O48k84k71K00k6L41l66j82
7933b18J73k06M50l92k78M50l48M35J97M6l63J88k66J32J66O6j61k98O11j31p0
7954A83o25M62n1K34l76M40l29M02K9l54J14j67k88P21l48k86Q52q37J60L2J21
7975H9j85Q5q5R6J79l37J18J25k50L8k4k26J50K31q1K2k14O32m1l66J29J82j60
7998A07K5n40J30k95J17k01O03P9K88j95K15m81N18o80N98j10l08N16m20K35k98
8019i7JN19q34N30k60N3N0K68R3Q3J32l68m09K33N0J70o2k90K71L3k33J3M47l20
8043G3K48j45l38L06J7k22O21o69J31N46m14n17K62l5J21n9K23k96P92o53k47
$$ y = [-337, -301, 121, 116, -76, -71, -293, -499, -385, -139, 531, -41, -10, 65, 654, -260, 491, 193, 269, 28, 28, -247, 168, 56, -22, -177, -192, -174, -181, 115, -244, 73, -40, 14, 100, 197, -296, -468, -278, 370, 86, -185, 15, -11, 330, -36, -218, -45, -251, 199, -193, -471, -21, -369, 66, 263, 309, -54, 134, -132, 0, 166, 232, 71, -227, 384, 253, 183, -442, 20, -31, 203, -173, 267, -62, 340, 369, 15, 129, -38, -326, 395, 47, -239, 613, -224, -64, -32, 89, -96, -11, -96, 0, 179, -158, -40, 85, -165, -127, -151, -377, -227, 4, -77, -55, -269, 363, 322, -44, 85, 267, 107, 132, -408, -278, -573, -456, -657, -54, 25, 313, 118, 333, -148, 370, -310, 288, 178, -130, 386, -34, 201, -97, -96, 423, -411, 119, -141, -88, -38, 230, 323, 406, 538, 170, -239, -6, 44, 214, 152, -138, 133, 166, -67, -54, 393, 73, 321, 176, -162, 144, 161, -61, 560, -109, 22, 568, 154, -363, -101, -136, -15, -74, 149, -147, 645, -8, -255]
8064b55P6M7J82j73K30J46k02o13O17p4l33K13j93L88k02j32J12M73k28k18L21
8085A82j32o9j10N71m67J3O1P0k21l4n6K45j13O27n25J43p3q6J01N7L70n95o4
8108a05K35J70l91k25N14m1j54k44K13J84p1m6N17k85j15j89K51k03J25j6l08
8129a84K07m08M91o7j00L28j28j78l76J46J9L59k59m10N67J25k46L0kK61k45L5
8151c5R9o33M99j1K73J00q0l42K09N35k35m74KL40k13k05J22L5K78k4l42M11n6
8174B53k14K50j55K92l55n6j1OJ71l74K81n9J38k47j25J64K21
$$ y = [-255, -179, -132, 50, -123, 107, 253, 51, -562, 55, -19, -352, -139, -332, 56, -146, -278, -166, 307, 79, -139, 182, 50, -19, -129, 442, -25, -12, 49, 119, -102, -136, -192, 53, -60, 567, 42, 185, 112, 26, 127, 184, 554, -41, -105, 130, 300, -91, -316, 198, 157, 3, -241, -28, 156, 85, 39, 556, 271, 156, -33, 218, 15, 140, 124, -184, 23, -385, 106, 39, -61, 267, 139, -39, -415, -269, -250, 109, -150, -560, 7, 132, -114, -84, -86, 175, -70, -35, 64, -569, -70, -81, 192, 292, 212, -130, 79, 614, 379, -95, -93, 247, 34, -171, -49, -14, 264, 240, -102, 309, 253, 39, 289, 134, 426, 71, 15, 4, 10, 181, -193, 88, 29, 167, -80, -205, -41, 180]
8191A80
$$ Imaginary data points
##PAGE= N=2
##DATA TABLE= (X++(I..I)), XYDATA
0@%%%%%%%J1k7L2l2L2l2M8o4Q0r6J12j36J52j76K08k41K78l25L76m26M83n47O20
30C30p00P86q81R87j101J225j366J521j687J867k066K289k535K806l111L451l832
47b017M268m771N351o033O853p858R124j0772J3017j6277K1470l1053N4562k16039
61a80175l51447L85071L27483r7808k53266J14211K39870l0471k32415n16J92437
72A12974L9465j91303o8218J69260J05567j89180j98909J09001K59835R679j91060
83c2889k5262J80955K6480k00217p7611J91205J27889j32641j26691R7091R7652
94A25961j20004j37756R9551J80514k4437j58640j9388J19750J4550j35544n1093
105a06536J37144J07368j06235j41809O6912J50072o1185k01486P289K32030P9313
$$ y = [0, 0, 0, 0, 0, 0, 0, 0, 11, -16, 16, -16, 16, -16, 32, -32, 48, -48, 64, -72, 80, -96, 112, -129, 149, -176, 200, -226, 257, -290, 330, -370, 416, -465, 522, -579, 646, -720, 801, -886, 981, -1085, 1204, -1331, 1475, -1636, 1815, -2017, 2251, -2520, 2831, -3202, 3651, -4207, 4917, -5855, 7162, -9115, 12355, -18698, 35864, -180175, -531622, -146551, 180932, 83124, -170142, -55931, 183939, 153468, -78947, -79463, 112974, 152439, -38864, -107082, 62178, 167745, -21435, -220344, -111343, 148492, 158171, -32889, -58151, 122804, 149284, -50933, -128544, 62661, 190550, 57909, -68782, 28309, 125961, 5957, -131799, -32248, 148266, 123829, -34811, -54199, 65551, 80101, -55443, -106536, 30608, 137976, 31741, -110068, -43156, 106916, 45731, -155755, -148466, 83564, 162877]
116A62877j94010j29052J30439J17464j14844j17596J09659J43210q1052j63674
126a36579K5871J45104j722j36777j7155J51955P6597j31834j31802P4098J46433
137F4189l0503j45105J0224J59373K9870j54598o7389J26040P5793j07533o3253
148a02892J27566R9189j18197j38282P0743J46785k0217j24237K543J20210K5876
159H9087j14186o0827R4310R4911n8368j04999L8890J23226j1980j40586l0488
170h1010J33026O4866j03572o7609R2762O6824j00193r1717Q5136J14026n0293
181F2246j12971K1421J02051o455j05933k7801R0473N7830o3045p2587L6392P1418
193E3039l0306q9777J0844J02383J4271j03829l7264R2889M2428r8218o0779R4378
$$ y = [162877, -31133, -160185, -29746, 87718, -27126, -144722, -35063, 108147, 27095, -136579, -110708, 34396, 32674, -104103, -121258, 30697, 107294, -24540, -156342, -82244, 64189, 33686, -111419, -101195, 58178, 88048, -66550, -133939, -7899, 67894, -39639, -102892, 24674, 123863, 5666, -132616, -61873, 84912, 64695, -59542, -56999, 63211, 89087, -25099, -85926, 8384, 103295, 44927, -60072, -21182, 102044, 90064, -50522, -81010, 52016, 116882, 13310, -54299, 38463, 105287, 5094, -86623, -1487, 112539, 62246, -50725, -29304, 72747, 66292, -39641, -67442, 23031, 80861, 17816, -54771, -18379, 53039, 22733, -67044, -56200, 46183, 60454, -43375, -80639, 12250, 54678, -43540, -104319, -9941]
205i941Q3346p5435r8005M6430R2227l0035r2133J2725R4316J6917q2072m2973
217h4633N7644N3862m0693o2569L2843Q2307q256r1619j5554Q8825L3522q2425
229c6746m0781Q7983O1419p7202p7018N9538Q4265l7500p7307K7218Q0151o981
241D7039p3797j2359O2698L0384m4558l6513L8627N1595k6379o6859O609P4254
253E0741J5886o9513k5798O9932L5180p2304n1444O4411O4125n1316o7208L7539
265B31O5978k7950p0720R159O3723O256n3780j9943M2723K6598l8104m4628K1297
278a9160N5031m872o1564j3113N7819J9349o2754l3795O1937M6234n6261n7093
290f8242M2896N7223l5521o1372K4772O0857j0021n6717m099M6955J3582l9697
$$ y = [-9941, 73405, -2030, -100035, -53605, 38622, 8587, -83546, -70821, 23495, 40412, -41660, -84633, -26989, 26873, -13820, -76389, -43546, 38761, 30505, -61114, -76668, 12157, 45679, -36746, -77527, 10456, 71875, -5327, -82345, -22807, 61458, 23958, -53349, -26131, 54020, 47039, -26758, -39117, 23581, 53965, 9407, -27106, 11521, 63116, 36737, -30122, -23513, 50741, 66627, -2886, -28684, 41248, 76428, 4124, -47320, 17091, 81216, 29900, -37308, 231, 66209, 38259, -32461, -23302, 40421, 46677, -7103, -27046, 15677, 42275, 4171, -40457, -19160, 35871, 30999, -30565, -43678, 14141, 33490, -29264, -63059, -1122, 45112, -11149, -68242, -25346, 31877, -3644, -65016, -40244, 20613, 10592, -46125, -50224, -3269, 10313, -29384]
302b9384k4213L1680L8513j5859m5425K286M8021R705m9196j5829N5937L1078
314C7314n3097m1425M7705N0236l6790m9439L3630N4054k1726n1450J2233M9927
326C1172J16m0191p613L7362J9561k6027k8090J4113L5445j589l6722l968M2402
339C5971J4323m7295k6633M5575L7058l9572m1506L3939M2766k9860m6886K1310
351h10M5215j2818m3944K529L7029M336l3804j5508K1226K1429j4209k7747L885
364a3191K9650J512l8878j4344M0285K4357m0454l5051L3084L6311l0552m1444
376d8715K5032M1864j9181m2210J1303L8126n402l4258k996K8901J1953k0524
388a6107j7679J2514K2049l544k6462l333L2361J5318l2113k2310L1491K9850
$$ y = [-29384, -53597, -21917, 16596, 737, -44688, -42402, 5619, 15324, -33872, -49701, 6236, 37314, -15783, -57208, -9503, 40733, 3943, -45496, -11866, 42188, 20462, -30988, -18755, 31172, 31288, -8903, -16516, 20846, 40407, 14380, -13710, 403, 35848, 34259, -2463, -6431, 35971, 50294, 2999, -23634, 21941, 58999, 19427, -22079, 11860, 54626, 24766, -22120, -810, 44405, 31587, -12357, -9828, 27201, 31537, -2267, -17775, 3451, 24880, 10671, -17076, -13191, 16459, 17971, -20907, -35251, 5034, 29391, -11063, -46114, -13030, 23281, -7271, -48715, -23683, 18181, -1000, -43210, -31907, 6219, 817, -33441, -36437, -7536, 4417, -16107, -33786, -21272, 777, -2767, -29229, -32562, -201, 15117, -16996, -39306, -7815, 22035]
400B2035k7569l0097K7423L6354k2066l5756J8737L6971j1132l1921P914L1833
412B2726P12k5350n447K0321J3647j1645j6233N031K2501M397k5038j2121K5938
425A9439J9549k5419k3471K4960K7464k4253l2552K0608L3555j5803l4084R364
437f43L0955p088k8800l76K2603L528j7956j0643R638J2738n245j9179m832J9475
451D175J0904k2241j8751J9817K0183k1223k6458J9195K7874j7870l0581J3291
463b1685K9416j1073k9152N826K5781q39k1912l309J6211P063r051j0637M177
476a9184J4258M030j5196q965J7499J5491j6453j8400J8742K4080j5963k5599
488b5660J6168K8340j0897k6014J0574K7202n634k1674K641J9997K114j3721k748
$$ y = [22035, -5534, -35631, -8208, 28146, 6080, -29676, -10939, 26032, 14900, -17021, -9107, 22726, 23438, -1912, -7359, 12962, 26609, 14964, -1269, 3762, 26263, 30660, 5622, -6499, 19439, 38988, 13569, -9902, 15058, 42522, 18269, -14283, 6325, 39880, 24077, -10007, -643, 30312, 23224, -5576, -5952, 16651, 20179, 2223, -8420, 1218, 13956, 8711, -10468, -15300, 4175, 15079, -7162, -25913, -6096, 14087, -7136, -33594, -14399, 13475, -4395, -34976, -21685, 7731, -3342, -32494, -26668, -887, -1726, -23638, -26947, -10736, -3673, -12724, -23361, -19184, -4926, -896, -16092, -25057, -7558, 7933, -8520, -26920, -8178, 15902, -61, -25660, -9492, 18848, 7951, -18063, -7489, 19713, 14079, -7595, -4954, 15043, 17157, 3436, 688]
501F88R690P749l196q854j824J1716Q200j2255j2391J4330J6558j4988k0361J3743
515H805K3587j3336k5508J0705K4202q841k4367M747K0987l504j8453r04J2762
528A0882J573j0197o475L007O890L91j0104p274R590J0366j2892j6525J1386J8342
542H960j1516k2608R815K1263r617k3286P497K1353o043j9553L086J6195j224
555e678j2968l58Q487L990m556m151k87P145N335p626p847R239J4005q260j6236
570a9766J0873J9583q715j8821Q829K1914o163j9542O687J8947k799j5190K530
583a633J4003M68q194r91N095M504m57m007l412O226Q382p390j1359P680J4924
598B3839p361j7621P391J8514p393j8985M967J8332n530j7606L403J4129l442
$$ y = [688, 10378, 18127, 14931, 6077, 4253, 15969, 24169, 11914, -477, 13853, 30411, 15423, -4938, 8805, 32392, 19056, -6452, 4253, 28455, 19614, -4753, -6, 20981, 17477, -976, -1880, 10882, 12455, 2258, -4217, -1210, 5680, 6071, -4033, -11307, -1717, 8649, -4243, -20768, -9382, 8960, -2556, -25164, -15349, 5914, -3703, -26989, -19492, 1861, -4182, -23735, -20649, -4454, -5678, -18646, -19004, -10517, -6527, -11083, -15234, -15521, -8376, -3041, -10667, -18514, -9275, 4730, -3530, -19766, -8893, 10690, 1975, -16846, -8017, 13897, 7734, -11808, -5121, 13826, 11027, -4163, -1633, 12370, 12838, 4644, 3653, 8748, 13252, 12795, 8788, 5376, 11602, 19984, 12594, 1235, 8915, 23839, 16478, -1143, 6248, 24762, 17369, -1616, 3351, 21683, 16153, -1453, 1950, 16079, 12637]
611A2637j2990N09P552P0n726k894N15J953J970n388p621M417R529o503j3475
626a5445M723J4883p174j7115N859J6610n873j7575M972J5089m022j4315K701
639a6682J2328k042r286J076N510P47j180j328j521K773O145k854q011M697J2627
654B999m538j2805N920J6121m535j5394N283J7325l154j4334L684J4827j527j1026
668a154K296R485q32n011J146K827J007K304j719m951L334P768k442j0943L026
683F141J2882l682j4413L102J4870l878j5020K717J4169l240j4161K620R968l207
697H868q917P90N008j185l768m76j792k38L050j609o998m6Q521k200j1366J094
713a1264J2526l389j4093K313J3615k988j3867K074J1975j726j0810J223Q660
$$ y = [12637, -353, 156, 7708, 7778, 2052, -842, -327, 1626, 3596, -1792, -9413, -4996, 4533, -1970, -15445, -10722, 4161, -3013, -20128, -14269, 2341, -3532, -21107, -16135, -1046, -5068, -19383, -16682, -4354, -6396, -15682, -14606, -9096, -8349, -9529, -10857, -12378, -9605, -3460, -6314, -14325, -9628, 2999, -1539, -14344, -8424, 7697, 3162, -12232, -6949, 10376, 7222, -7112, -3428, 11399, 9872, -1154, 1142, 10627, 9795, 4784, 5930, 8757, 9764, 12068, 10349, 5398, 8732, 16500, 14058, 3115, 6141, 19023, 15341, 928, 4030, 18900, 15022, 2, 2719, 16888, 13648, -513, 2107, 12075, 8868, -49, 741, 5749, 4564, 796, 320, -1472, -1710, 1340, -269, -7267, -7313, 1208, -992, -12358, -11264, 1262, -2127, -16220, -13907, -292, -3280, -17147, -15073, -3098, -4824, -15634, -14411, -5751]
726e751j331n931K031L071l66J79M67k149L53O170j78p753K061J0876m66j1653
742a0370K048J3456o89j2723K636J3567r83j1118K483J1344j202q447K617O577
756I196o96k702J864R32r17K282J179m906n0P307k43q758J80R807J87j1966Q36
773C532J1186j370j1753M44J1010k592r982J299O849k408n968J154K364k152j820
788b07J386k493k037K911P89o265j909P090N22r696j481R971l93j1336R6J0797
804b255p46j0735N49R272r62q490J530O112j158m134K017J955j500J177J734k382
820h016r99O012J797o930o69R718J258r144j20J0821O47r360J162J0499l01q148
836a773J501P890k79n683K405M340j559j296K027M78k290K567K740m082k383O107
$$ y = [-5751, -7082, -13013, -10982, -7911, -8277, -8098, -7631, -9780, -9427, -3257, -3435, -11188, -9127, 1749, 1283, -10370, -8322, 5134, 4445, -8278, -5642, 7925, 6942, -4176, -1693, 9651, 8449, 2, 2619, 9196, 8500, 5798, 7662, 8594, 7677, 9959, 11138, 6232, 6182, 13489, 13246, 4488, 4668, 14475, 14662, 2696, 3532, 14718, 13348, 1595, 2039, 13049, 10457, 475, 1774, 8623, 6215, 247, 1401, 3765, 1613, -207, 1179, -1314, -3351, -440, 349, -5916, -7825, -735, -213, -9909, -11390, -1419, -1812, -13148, -13052, -2255, -3001, -13736, -13187, -3915, -4877, -13367, -11837, -5725, -6883, -11017, -9000, -7045, -8545, -7368, -5634, -8016, -9015, -3003, -1206, -8136, -8805, 913, 2171, -6973, -7093, 3728, 4375, -4985, -3823, 6676, 6375, -1773, -272, 7618, 7339, 1656, 4061, 8401, 6842, 5546, 7573, 8051, 5761, 8328, 11068, 6986, 4603, 10710]
852A0710K351p647k151Q676R11q867j382R054J5r719j73Q562j629q018J042N182
868F917k134n110J802K361l464j098J846k108l200K909J755n370k980N615J776
883d83q137j859Q158J108r243j411Q540r2q259O3P594j114o314J567M984j783
899f681l021K650J654k513R72L392k276k280M109L646m836k395P260L124p511
914d706j289Q780J653p090K56Q310l18o530J405O879j124m683K804L788k389j664
930D082L718N70l461J896L502l009l756M707L128o051k702O786J839o906k395
945A948P507j05p249m28O846j612o521J337M123k336m352K387J344l205j932L309
961A061j460m036J882K809m375l798M820K396o387k301N949K062p438j501O467
$$ y = [10710, 13061, 5414, 3263, 11939, 12850, 3983, 2601, 11655, 11670, 1951, 1778, 10340, 8711, 693, 1735, 6917, 4783, -327, 1475, 3836, 372, -726, 1120, -988, -4188, -1279, 476, -4894, -7874, -2259, -483, -8620, -10479, -2321, -1213, -10456, -11867, -3327, -3419, -11678, -11615, -4021, -5135, -11449, -9882, -4898, -6681, -9702, -7052, -5398, -7911, -6939, -3547, -5823, -8103, -3994, -348, -5184, -7579, -319, 2805, -4706, -5995, 2785, 4438, -2652, -2396, 5914, 5596, -934, 471, 7350, 6226, 1543, 4347, 8135, 5746, 4082, 7800, 8370, 4909, 6805, 10307, 7298, 3542, 8249, 11377, 5326, 2624, 9410, 11249, 4343, 1948, 9455, 9350, 2101, 1673, 8519, 6907, 386, 1723, 5846, 3510, -842, 1545, 2889, -316, -2248, 1061, -399, -4435, -2553, 256, -4119, -7917, -3097, -701, -7088, -9389, -3440, -1378, -8816, -10317, -3850]
976c850N14o789K06N996p29n170J599M206k014k793L014J574l062R35L750j049
992c662l769L591M241m031k912N989K991n120j393O413J905o083j62O894M77n495
1008a26J762N387j294l823K593L447k839j599L979Q66m147J291L684k115l849
1023C217L286L801m143l740N184K287o076k491O163N37o669P8N186o33o108J215
1039A094L439k435l780K585J520l638j362L254r63m726J668K831k830l945L432
1054c856L250n149l277N288J460n367j975N772P61n704p7N398p29m826J790M029
1070c212k669j746L015J686k987m20M539p10l747K659M342k947k895M299L578
1085B785l967k484N912K469n712n2O163M07m959R36N003j406l187K666L027k451
$$ y = [-3850, -3336, -10125, -9919, -3923, -4652, -9822, -8223, -4017, -6031, -8824, -5810, -4236, -7298, -6363, -2613, -3662, -7431, -3840, 401, -3630, -6542, -553, 2438, -2682, -4075, 2338, 4243, -1840, -2002, 4892, 5369, -126, 1636, 7023, 5729, 1906, 4499, 7946, 5107, 3508, 7487, 8353, 4206, 5497, 9181, 7066, 3217, 6503, 10304, 6161, 2421, 7605, 9892, 3816, 1325, 7488, 8025, 1356, 1434, 6620, 5987, -121, 1094, 4533, 2098, -1682, 903, 2423, -1215, -2577, 677, -286, -5012, -3344, -513, -3343, -7288, -3856, -606, -5755, -9032, -3744, -2284, -7651, -9626, -3854, -3093, -8797, -8874, -3476, -4205, -9031, -7241, -3212, -5881, -7627, -4612, -2926, -5913, -6333, -1794, -2504, -6251, -3592, 750, -2197, -5092, -793, 2785, -1182, -3666, 2246, 4715, -997, -1049, 5114, 5521, 562, 1498, 6501, 5095, 1908, 4574, 7601, 5150]
1101E150k356L807P19l185L00M147j635l862K628L432l226m412N023K743n448
1116C825k637M761J409o201m16N099o44n355N16L805k917l308K129J983l465j750
1132c166L347o22m629J232L825k968m035K824L759m366l359M061K291m997j657
1147h460M960M26m735N5M269p63l984K166L253k212k136K998J883l598N2M464
1163a362l22l641J690M729k002l466L517M139l791k199N077J979m637o26N002
1178D087J015m630R10M808o27l865K151L639k965k103L786J075l784K72L678q25
1194F622l993J760L774l188m056M034L426m754k988M618J201n482m75L939l05
1209D133m867R56L031k345l490K303K005l623j158K805K05m459J26M331k462m197
$$ y = [5150, 2794, 6601, 7320, 4135, 4435, 8582, 6947, 3085, 5713, 9145, 5919, 1507, 6530, 9273, 3825, 1188, 5949, 7358, 1157, 741, 5840, 5196, -159, 357, 4162, 1245, -2063, 66, 2049, -1416, -3166, 181, -441, -5070, -3838, -13, -2981, -7016, -4192, -433, -4799, -8158, -4097, -1806, -6803, -8460, -3500, -3074, -7809, -7754, -3485, -4248, -8232, -6066, -2813, -5025, -7161, -4163, -2280, -5878, -5826, -1362, -1684, -5325, -3635, 1094, -908, -4374, -857, 3282, -509, -2708, 2369, 4348, -289, -915, 4087, 5102, 472, 1382, 6190, 5563, 1698, 3849, 7488, 4523, 2420, 6206, 7281, 3497, 3769, 7447, 6622, 2629, 4389, 8163, 4975, 919, 4953, 8379, 3625, 637, 5255, 6456, 974, 499, 4438, 4133, -734, 222, 3253, 908, -2582, -279, 1726, -1897, -3055, -250, -45, -4504, -4378, -47, -2509, -6706]
1225f706K023L541l600k776L275K672m181k449M953Q10m569l04M645n46l627J258
1241e581L673j922k858L612J942l354p48M186j37l500J322M558k009k920L265
1256d71L609l209k518M306J949k921j117M758N96l998P49M506j571l546K379K907
1272F408k440j477K965J864l781k06L404r43l284J446L326k564l290K127K852
1287F407l718k075L712J028m674j074M311j56m711P28L082j692l439K112J403
1302A244l014k172L644k31l934J16L803j158m274K025L071k393m017L086K495
1317a709l239k300M185R14m097k78M130m97l285J281L253j894k230K530K598k808
1333c446j201L569O14k734M11L977m85l823L145K776k335k999L837L203l460j528
$$ y = [-6706, -4683, -1142, -4742, -7518, -4243, -1571, -5752, -8201, -3248, -2438, -7007, -7311, -2666, -3212, -6839, -5581, -1908, -3830, -6688, -3076, -1134, -4488, -5236, -1050, -1187, -4687, -3365, 1193, -816, -3736, -471, 3138, -71, -2589, 1717, 3666, 745, -372, 4386, 4982, 984, 1733, 6239, 4668, 1122, 3501, 6408, 3968, 2491, 5456, 7320, 3539, 3333, 6737, 5794, 2510, 3956, 7282, 4718, 1428, 3555, 6407, 2689, 614, 4326, 5354, 680, -394, 3917, 3761, -950, -222, 2860, 1168, -2271, -159, 1244, -1770, -3942, -298, -529, -4463, -4347, -544, -1702, -5976, -3951, -880, -3273, -7290, -4204, -1709, -4948, -7248, -3063, -2149, -6246, -6524, -2394, -2891, -6176, -4895, -1642, -3536, -5766, -3236, -638, -3446, -4647, -1078, -464, -3198, -2787, 1190, 705, -3118, 27, 2803, 468, -2531, 1306, 4509, 1049, -479]
1349d79M187J043l893M56L542Q2l608K247K544k048j704K778R12k715q92L585
1365F037J00m071Q03M009k282l899K665K505l281k493L147J877m147j595L242
1380B617L76l990M80K457j360k921J405K566l376j762K836J41l288m86L394j098
1396b009l670J039L274j928l355K910K211k919k317M145N64l063j126M083k40
1411b401l444J324L167j572k252K019K319k339r61L483O93l128P58L969o26l062
1427b053J867L294j846k716K700L039l119j002L674Q60l559L16L677p77k440J391
1443C306K659k372k049K729J617k842q77L076o5l515M72L436j262m008K172K588
1459E065k296k531K067K024l513j482L235K81m407Q60K743j401l468J351K465
$$ y = [-479, 3708, 4751, 858, 1314, 4856, 4938, 1330, 3577, 6121, 4073, 2369, 5147, 6059, 3344, 2452, 6037, 6137, 2066, 2869, 6878, 4596, 697, 3362, 5867, 2586, 93, 3240, 5117, 970, -625, 2617, 2993, -997, -517, 1940, 580, -2341, -936, 1630, -1746, -3508, -672, -531, -3819, -4305, -911, -2009, -5679, -4640, -1366, -3294, -6649, -3739, -1528, -4447, -6764, -2619, -2055, -5118, -6244, -2161, -2401, -5845, -4521, -1354, -2926, -5178, -3159, -840, -3179, -4140, -657, 36, -3092, -2334, 1635, 1009, -2053, -186, 3108, 1262, -1454, 1246, 4285, 1166, 164, 3838, 4698, 1139, 1455, 5132, 4355, 1915, 3306, 5965, 3593, 1544, 4273, 5890, 3048, 2171, 5247, 5182, 1667, 2139, 5575, 4313, 305, 2477, 5065, 2769, 238, 2305, 4329, 816, -666, 2569, 2850, -1557, -697, 2046, 645, -2823, -1472, 993]
1474I93k611k835L106Q74l044n83L232m71l438O41L106j851l183K276K304k419
1490c903k492L341J563l201n94L290M50l882J148L061m76k930K199K488j903j912
1506c753L159J550l449L70L149J55k865R37L965j293k608K270K630k532j836K956
1522B805J861l118l32L757j279k494J329K393j184k238K527J503k230k041L130
1537D389Q15l785K66L145j162l544J708K759k363k974K230J957l104j664K895
1552A568P77l757L25K230l51l716J467J895k213j612J879J496l736m07K959l58
1568a554l175P14K659j101k698J631K390j903k614K895J509k547j156L488J7k812
1584d257L61L562j758j897J621K971k402j310K868J492k917m98M039j78l134Q29
$$ y = [993, -1618, -4453, -1347, -473, -3517, -4100, -868, -1339, -4777, -4136, -1030, -2881, -6064, -3788, -1484, -3903, -6395, -3054, -1491, -4692, -5286, -1996, -1546, -5428, -4280, -1219, -1695, -4625, -2426, 62, -1841, -3753, -594, 956, -2493, -2123, 1026, 1181, -1684, -747, 3218, 1925, -683, 1587, 4217, 1685, -151, 2805, 4666, 1548, 1216, 4973, 3694, 1200, 2529, 4922, 3738, 1500, 4027, 5530, 3300, 1259, 4389, 5204, 1419, 1685, 4830, 3668, 124, 1832, 4591, 2228, -746, 1484, 3441, 337, -1327, 1568, 2345, -1412, -1087, 1143, 792, -2924, -1457, 438, -1775, -3387, -1508, -12, -3748, -4155, -1196, -1554, -4729, -4015, -1356, -2457, -5155, -3524, -1134, -3037, -5651, -2756, -1247, -3794, -4950, -1462, -1445, -4257, -3896, -334, -2092, -3989, -2368, 603, -1799, -3109, -241, 1251, -1666, -2164, 1875, 1697, -1437, -608]
1600f08L263q52k630J613L199j882j610K623J038k462n1K758n0l111R93K580j891
1617B920j782K129J399k440r98K349P89k650n75K869r68k587R81K350j760k037
1633a1J381J587k673j396J891O69k507n49K304o01k594Q05K228j614j954J891
1649a143O39k448r95K639j60k630o3L124j197k458J104K550k006j792J905J563
1665a368k462n48K680J298l350N83K482o01k119J367K493j870j476K661J635k660
1681a255l03L423l7k355M37K572k42k645J664J912j134k199K670J339k290m60
1697A097K750J02k741Q97K541j079j840J130J974k624j341K069J070k587r52K627
1713C093K85k898J54K580j797j846J544J343k620j297K092Q93l331n96L078p87
$$ y = [-608, 2655, 1803, -827, 786, 3985, 2103, 493, 3116, 4154, 1692, 1641, 4399, 4349, 1238, 2231, 4811, 2920, 1138, 3267, 4666, 2226, 1228, 3577, 4366, 1716, 1141, 4010, 3042, 455, 1436, 3786, 2026, -11, 1370, 2957, 284, -1112, 779, 1448, -1059, -1608, 696, 95, -2499, -1694, 534, -1080, -3034, -1143, -504, -2952, -3947, -1308, -1468, -4098, -4161, -1037, -2234, -4692, -3588, -1038, -3044, -4836, -2931, -1368, -3830, -4378, -1698, -400, -3750, -3167, -685, -1286, -3405, -2038, 455, -1415, -2891, -230, 1405, -1255, -1558, 1865, 1828, -527, -90, 2482, 2240, -405, 1259, 3171, 2037, -162, 2508, 3847, 1557, 1097, 3847, 3949, 1208, 2105, 4646, 3567, 1727, 2857, 4831, 2207, 866, 2935, 4005, 1418, 466, 3093, 3378, 480, 634, 3214, 1417, -429, 1115, 2458, -162, -1459, 633, 1526, -1805, -2401, 677, -110]
1729a10k199M25K261j571k531K124J342k159j629K519M92k679PK506o78k539J000
1746c419K587k086j810K687J029k126o96K214J082k533Q9L171n74k499J309K794
1762A219j906j251J796J487k091p57K701P26k716O58K798l38k602J658K079j717
1778A744j488K301J042k003l36J857M72k410P87K148r45j789J117J579j455k172
1794D49K372P88k183j371L086m37k735M37J866o22k612J509J671k331j255J974
1810F06P19k530p74K448j95k598j70J989m19k755J697J315j861j125J792J379
1826d82k878L3K531p11k694J006K432r66j958J448J689j466j341K247P83k497
1842b824L92K476l56j758R16K141j858j136K042J546j736p76K336M74j905l97
$$ y = [-110, -2309, -1884, 377, -1194, -3725, -1601, -259, -2418, -4047, -1528, -1036, -3715, -3708, -1202, -1880, -4419, -3419, -832, -2918, -4728, -2041, -1012, -3138, -3834, -1620, -538, -3071, -2982, 189, -385, -2884, -1575, 1219, -687, -1938, -142, 1345, -746, -1503, 1198, 1924, -792, -134, 2664, 2326, -276, 1382, 3461, 1744, 256, 2557, 3599, 1596, 1260, 3117, 3589, 1179, 1966, 4114, 3169, 1380, 2497, 4076, 2621, 449, 2821, 3609, 1426, 55, 3141, 2704, -31, 406, 2272, 1650, -962, 547, 2218, -113, -1368, 606, 1325, -1205, -1979, 469, 274, -2324, -2494, -505, -924, -3679, -1982, -667, -2528, -3653, -1861, -482, -3360, -3327, -796, -1507, -4201, -3195, -763, -1729, -3687, -2239, -550, -2016, -3357, -1110, -327, -2824, -2432, 44, -312, -2070, -1154, 987, -871, -2007, 35, 1581, -155, -931, 1405, 1879, -26, -423]
1858d23K470q1j663Q41K074j286j331J926R66j197j609K415M86k198j26K201o67
1875B798j856J189J466j762j502J722J647k566o61K075l63j859J90K144j244k687
1891a269J123K252j976j833J353P18j528q34J806M53k120M5J645j141j906J250
1907a962J830k200j253K509K05j761q45K260R5k097M97K125j186j530J447J476
1923c90j668q68K123P06k125L0J947J20k145J352J927p68j819J569K000k083p07
1940g99K339O45j873k39J908M14k601J593J768j292j589J298J638j461r10J409
1956B248R70j592k34J566J01k736J069J410j100j032Q87J195j914o63J342O5j674
1973i2%K037o89k049K48J963j527j156J172O43j745j028K208m64k152P06J469
$$ y = [-423, 2047, 1966, 303, 1144, 3218, 1932, 601, 2527, 3493, 2296, 687, 3102, 3588, 1390, 1264, 3465, 2798, 942, 2131, 3597, 1835, 333, 2055, 3702, 1136, 475, 2550, 2187, 328, 518, 2662, 1418, -1269, -146, 2106, 130, -1703, -350, 368, -1160, -1994, -188, 265, -1855, -1810, -165, -1306, -3212, -1962, -132, -2332, -3585, -1076, -871, -2632, -3477, -1217, -1122, -3219, -2722, -597, -1783, -3313, -1866, -390, -2058, -2926, -803, -97, -2222, -2192, -245, -125, -2270, -918, 1009, 241, -1578, -9, 1991, -92, -799, 1540, 2185, 312, 73, 1981, 2395, -206, 1387, 3155, 1863, 274, 1572, 3210, 1749, 839, 2248, 3218, 1626, 1392, 2958, 3059, 323, 1392, 2802, 1702, 670, 1557, 2752, 838, 175, 1517, 1582, -92, -92, 1945, 1256, -793, -545, 1418, -109, -1265, -93, 550, -1195, -2223, -15, -479, -2631, -1925, -456]
1990d56m20k229J458R86j408r80J140J192j837m40J651L12k361Q77J805j015j172
2007b897M84J605r92j063J883J133j461o56K012J67k080Q85K122p76j555J212
2023B3J861j343j238J865O66j772J11J951L47k335Q62J815p77j609J510P63j103
2040A597o91J586P51k090K21O12J084k592M83K068j221j747J829M14j611j368
2056f75K365j75j583M1J582p81j481L15J430q84j617O25J214j236j295J650J19
2073c86j554j86J392l28j980J401R20q00j109J014J540k227p57J740N88j963N07
2090b188J953j317j104O63K126j484j321J855J270j668r16J930N82j539O84J572
2106A098o17j674J085K002j089j662K037Q76j202r15J493R48j828JK220p45j448
$$ y = [-456, -876, -3105, -1647, -661, -2069, -3049, -1909, -717, -2554, -2994, -1343, -1031, -3392, -2515, -710, -1725, -2897, -2413, -808, -1800, -2863, -980, 153, -1308, -1964, 48, 215, -1865, -980, 1142, 366, -1189, 23, 1884, 541, -697, 1168, 1834, 62, 173, 2124, 2471, 136, 998, 2813, 2036, 427, 1937, 2700, 1597, 906, 2492, 3243, 1153, 1374, 1986, 3070, 478, 961, 3029, 1808, 61, 1890, 2304, 693, -675, 1690, 1515, -68, -27, 1555, 774, -707, -392, 1038, 154, -1463, -838, 376, -860, -2155, -505, -386, -1940, -2126, -734, -1062, -3042, -1641, -721, -1521, -2630, -1616, -76, -2303, -3060, -1320, -732, -2695, -2188, -235, -1552, -2656, -1993, 133, -1351, -2672, -817, 453, -1215, -2131, -201, 381, -1158, -474, 1098, 481, -1193, -108, 1894, 805, -857, 1180, 2056, 854, -61, 1432, 2380, 552, 553, 2773, 2028, 580]
2123E80J053P51j095m85P87R35q57p05J573N1k240Q05R89l59j447R34P55j713
2141C12p39J372P76j876k82J557k66j677j05J742p66j833J032J253j212j191J714
2158a89L74j854o22J810m80j638O97J219o18j329J029J145j213j221J853M13j509
2175b133M74R58R7j868O03J561q55o34O35J360j698n1J506J042j985K38J624j34
2193G40j333O86J794q93j388J300J163j498k44J153O91j590k32J825k25j462R31
2210A418J399j031j189J501J93j125p95J556J22j770L06J634q74j570J165N92
2226A532r23j082J365O59j599q66J870l55j687M17J391n51j565P97N65r56r43
2243a931J601K22j716J84Q37j32j482N60J189n98j238P51J100j137l46J059M16
$$ y = [580, 1633, 2384, 1289, 804, 1591, 2526, 1669, 964, 2537, 2588, 348, 1153, 2142, 1783, 336, 1270, 2025, 312, -427, 945, 1721, -155, -437, 1120, 854, -823, -928, 814, 48, -1785, -753, 500, -712, -1903, -189, 185, -1669, -2291, -481, -961, -2599, -1902, -683, -1301, -2630, -1601, -456, -1669, -2890, -1037, -624, -2133, -1659, -701, -604, -2472, -1869, -308, -1163, -1797, -1162, 198, -1500, -1551, -45, 997, -988, -750, 874, 740, -593, 93, 1887, 994, -394, 906, 2069, 571, 327, 1480, 2171, 581, 349, 2174, 1949, 487, 1418, 2817, 1786, 597, 2098, 2291, 1166, 371, 1927, 2049, 279, 585, 2219, 1345, -225, 940, 1532, 609, -473, 892, 1551, -48, -914, 956, 601, -1086, -669, 722, 171, -1394, -597, -32, -988, -1931, -330, -108, -1824, -1640, -803, -935, -2417, -1857, -668, -1266, -2504, -1753, -653, -1790, -2136, -1077, -661]
2260f61q45k82J267J81j570L59J762n99j734J226J641j093j092J807K1j147M02
2277c57J034L41j273K60J633p72r59O70J316j140l05J347O2j059J27J038j82j494
2295B87R74J225j037q59R51O87j580k08J322K57j272j26O99M72k051J287L55p58
2313F25j441J593K08j183l96J259k72j420j00J315l54j348P81Q70q09j118Q83
2330i07J092j132q42J008l2j186N6J590o55j418Q38J155j022p98R91O84j098m8
2348a724J195K28j094J73J622p48r77Q05R10j236J99J216L5r51l46J663j36j202
2366c68Q9J421l65j186J343J087j259q22J751J44j155o2J333k08j103Q72M55n41
2384A426q63N82Q49j186o26J154N89j274l53J059m12j230M62J086p28j071Q55
$$ y = [-661, -1506, -1788, -521, -340, -1910, -1551, 211, -388, -2122, -896, 745, -348, -1440, 367, 388, -759, -357, 677, 1018, -255, 5, 1638, 866, -93, 577, 1893, 753, 448, 1795, 1857, 798, 925, 1963, 1781, 287, 1261, 2486, 1449, 590, 1541, 2228, 648, 440, 1762, 2019, 747, 621, 1320, 1792, -259, 1028, 1383, 625, -816, 777, 985, -198, -594, 665, 393, -1027, -1127, 188, -166, -1514, -733, 137, -672, -1790, -907, 185, -947, -1789, -781, -813, -1999, -1943, -353, -1008, -2426, -1588, -433, -1455, -2253, -1262, -578, -1676, -1724, -529, -301, -1395, -1222, 400, -348, -1325, -520, 390, -846, -647, 569, 604, -347, -693, 970, 834, -368, -279, 1142, 777, -409, 934, 2021, 762, -60, 1691, 1835, 680, 618, 1951, 1743, 640, 1512, 1967, 1426, 563, 1145, 1994, 808, 182, 1336, 1925, 651, 298, 1357, 945, -285, 177, 1263, 535, -536, 319]
2401C19N46j066n91R39n1j019P4N36R4j345Q75P27q70q93Q33J43q44m01J258J93
2421e43j510O29O98j41j245Q96R89r36o60J185M10j086k99J353L02j430O51R35
2439A98J42j586O49J576j098o20J208O19j195o65J829l74j326N60J623l75j279
2456a14J125N70m71o55Q87M23j065l36J404L17j663M74R74m13j345J183N41j027
2474H09l59M82O90j711J01J074j02j043M54M46k56j186O67P24j669r5J209N33
2492G68j445o0R36p07r66L91J082r03m55K8J104r21o48Q00O19j030j95P72M08
2511d22j514L84J388l26j026O48N43q70k07O13Q81j597L35J144q5r70N52J316
2529G87o25o08P63N40q20n72J222J75p73K08Q30j55j141J344M04j062m74J174
$$ y = [319, 865, -201, -792, 147, 96, -923, -849, -313, -219, -1564, -689, 38, -832, -1725, -892, -749, -1593, -1994, -736, -543, -2053, -1424, -726, -867, -2112, -1216, -227, -1163, -1823, -638, -228, -1314, -1613, -260, 42, -1388, -737, 198, 340, -1246, -597, 979, -119, -739, 469, 1088, -107, -772, 1057, 683, -643, -83, 1540, 1165, -114, 1011, 1581, 1110, 455, 1342, 1765, 700, 364, 1768, 2085, 422, 896, 1870, 1457, 112, 1295, 1836, 809, 450, 932, 1622, -89, 12, 1086, 984, -59, 395, 841, 585, -601, 66, 790, -879, -974, 235, 768, -677, -737, 199, -508, -1474, -1083, -1, -904, -1359, -1331, -227, -1148, -1796, -996, -377, -1407, -1602, -830, -422, -1936, -1552, -164, -490, -1516, -868, -325, -1195, -1402, -789, 92, -1505, -1170, -26, -111, -1081, -529, 787, 162, -446, 317, 857, 37, -535, 687, 862, 89, 297, 1127, 972, -169, 1175, 1579, 517, 43, 1217]
2547A217M28q28l89J136j6j016M75P65n64p32j93J810j555k62O16Q27j328o0P94
2566A125j0j327J6J325n61j114O31O17j085p59J018O86j481n05J190k27n48J83
2584h26P08m41p21L99M49o09o84J414k90j103j39J335N71j232R9Q05r78j98J154
2603b87M71j169k65O12J111j463J37Q74q8q22P59Q50n91o57O09Q75o31q21J481
2622I85L8r83m6J654q36p58L98Q13j48j188P91P49q27n00R81N84j232Q5Q28j88
2642A200j125J63J825j513m47L87P31j134M8L58N41j482M90R21l27j080M40P48
2660G44o52p37K24M10p02m54J262M2j386l20J126O8r66R36R9o28o70J256J87q54
2680a015m86P55O50j300L33J130m46j014O72M31l19m78J001K23j180J75J286l96
$$ y = [1217, 1645, 817, 428, 1564, 1548, 532, 1007, 1772, 1208, 476, 283, 2093, 538, 276, 892, 1719, 391, 331, 1125, 1115, -212, -196, 1129, 568, -546, 85, 702, -383, -1142, -124, 562, -919, -1424, -234, -461, -1009, -826, -118, -559, -1280, -881, -432, -1041, -1725, -311, -601, -1704, -1843, -508, 63, -1169, -1070, -265, -1243, -1441, -287, 184, -985, -1250, -638, 473, -990, -853, 21, -67, -889, -130, 720, 129, -528, 81, 956, 325, -496, 985, 1023, 40, -6, 1648, 812, 54, 452, 1265, 1117, -71, 720, 1469, 642, 142, 1123, 1707, 475, 560, 1388, 1200, 75, 238, 2063, 550, 103, 490, 1221, 87, 135, 493, 1034, -448, 42, 963, 636, -444, -4, 744, 92, -645, -421, -11, -713, -1167, 95, 137, -1249, -1569, -443, -375, -1341, -405, -306, -934, -1604, -348, -161, -1015, -1501, -746, -96, -1396, -1063, 67, -379, -1393, -721, -290, -609, -1087, -86, 137, -1043, -868, 418, 22]
2698B2l58k87J535n86j243J212Q85q44l60J068p2n89m83J817n92o57L94N39r54
2717D47l46P68R02r56o45O82N04j284J12J128j77r89M44L79o5j029Q82K47p63
2736B41n03J275k01j090M38Q92p81j139M56O87K7r24P61K36j171j19J100J45j253
2755i23m38J129oj266N73Q65o44o40R49J39q65p4J031Q6j496N30R63J15j264N98
2775f38N53j54o94R05L8o43R6J159j25p91NJ132p8j353N69J047p61p13R17N71
2795A042q21k88Q67L58j092L16Q86p67r2J19J154p38r27J140j4j137M6J215m33
2814H34r03L97R65n52q23L95Q17r65p43R77M39j093l44J090m33o16M63Q1n56n49
2834a119N80N75n32k18L92k72l19o3M33N31j005K91N50m43m74N26R5q35L44Q80
$$ y = [22, -336, -623, 912, 326, -917, 295, 1180, 336, -24, 1044, 972, 383, -100, 1717, 1125, 468, 862, 1401, 447, 101, 869, 1771, 815, 170, 852, 1356, 72, 184, 1312, 1135, 146, 590, 969, 904, -125, 757, 1004, 241, -262, 1013, 812, -278, 160, 1052, 271, -868, -412, 275, 302, -622, 139, 375, -796, -915, 185, 330, -923, -1361, -232, -238, -1504, -931, -66, -710, -1350, -401, -262, -1127, -1201, -170, -84, -1580, -1050, -87, 28, -1236, -638, -85, -239, -933, -28, 10, -633, -537, 622, 497, -294, -289, 843, 765, -588, -19, 1028, 267, -446, 471, 1042, 221, -67, 800, 1158, 66, 382, 1268, 501, 409, 528, 1682, 944, 17, 1157, 1143, 6, 52, 1267, 834, -69, 328, 1293, 741, -82, 313, 1130, 165, -578, 399, 838, -255, -599, 491, 58, -558, -95, -14, -570, -1119, -539, 36, -496, -714, -322, -594, -913, -976, -543, -12, -1017, -726, -176, -619, -1093, -567, -472, -1307, -963, -83]
2854h3R8j129j86J575j38j394L59R83m52q21J050N97p32l19P87L3q59N42M14J10
2874D35q43M11J303q25o95J109J72p66J61L36j43o47L73J147m46j419Q46N66k97
2893G78n95J063l06r57L43J128q20k38k39Q38m49q02L03N52n71l36L49O19q43
2912a83j23M99k3n67j74J044m17j059J34J057q19j11o9N54l66o01R00q5l62o03
2932a374J241k22q73Q71m0n02l39Q38M08q00m9P63l5q13M19Q16l22q20Q85J10
2952A62k05p11J624p57l31L84N83j67o95p8J055q23j8Q59M21o83n04R29K39r39
2972C45O4O58j69q53J72Q79n40n32L87Q56j157j83R46l12p37L46O07l6q37L82
2992B86L40k52o82L47k67l05K98P47l66o69L76N25q53m84N96N61n82p94J244l2
$$ y = [-83, 15, -1114, -1300, 275, 137, -1257, -898, 85, -367, -1188, -138, 459, -273, -592, 195, 228, -631, -89, 325, 435, -408, 3, 1306, 481, -214, 895, 1067, 301, 462, 798, 655, 8, 381, 1528, 1082, -337, 509, 1075, 778, 183, 1246, 940, -17, 326, 1454, 634, 396, 157, 995, 546, -256, 47, 599, 28, -308, 41, 660, -183, -306, 193, 170, -397, -571, 473, 56, -1003, -869, 188, -631, -742, -811, -257, -623, -1224, -324, -409, -771, -1374, -133, -355, -1228, -357, -397, -899, -1238, -400, 8, -792, -841, -78, -113, -926, -507, 309, -13, -833, 52, 162, -43, -754, 870, 113, -218, 166, 749, 582, -113, -191, 864, 41, 23, 882, 1303, 620, 116, 1045, 1284, 345, 409, 1067, 898, 45, 217, 1096, 556, 24, 411, 1267, 110, -73, 873, 561, -176, 170, 777, 741, -96, 286, 626, 374, -308, 39, -228, -533, -235, 512, 146, -523, -147, 378, -475, -959, -363, 198, -384, -1178, 66, 34]
3012C4j156L20O82K04j127J44N29R5q50L18O42n43j98P90j29p07J80Q81q7p39
3032g17M07M17j44q24P59Q05j094k9M82K23n76K56K10M53o90J56M67k05n66L07
3052I7J018q46l72M35J165j173m39O32N45j082O92N22q50k40L49O11q38l32M34
3071C28J036j140n74J027m9p57L17L05p26k99N94N56q52l07O96n23l06J41P82
3090B49J1j612R22M42o91K23j7Q2L0n54N18q9n56R6Q31N6r44M78L05m41l81O27
3112d15J88l89k82J155J83j044N93M66r26L86m95Q31m2p99J055j2n30M62K73j50
3132E08p55M91k5L42l75K4R47j257J59L98K58q01O73n2K71p23L22K73k24o95M97
3153B56P38j061q9R01J26j187N0P96K1m86m93P69o10o12J103k27l51o42J088M52
$$ y = [34, -1122, -802, -120, 84, -1043, -899, -370, -275, -1125, -807, -165, -708, -906, -116, -245, -952, -772, 109, 22, -717, -310, 107, -37, -861, -102, 703, -391, -420, 62, 285, -291, -35, 175, 628, -62, 94, 561, 356, -210, 97, 1115, 269, -103, 332, 1497, 324, -115, 517, 1062, -20, 672, 1194, 344, 104, 453, 1064, 226, -106, 328, 1364, 224, -350, 677, 628, -129, 188, 493, -233, -532, 62, 618, -234, -541, 155, -368, -674, -533, 249, 260, -1352, -430, 12, -679, -456, -473, -391, -361, -915, -397, -486, -1042, -946, -115, -59, -1003, -525, -220, -661, -1042, -415, -227, -616, -898, 257, 440, -604, -11, 455, -471, -85, -580, 251, 209, -590, 465, 453, -77, 385, 658, 508, -247, 244, 219, 561, 186, 210, 1157, -100, 59, 457, 715, -86, 587, 535, 806, 83, 405, 678, 454, -241, 256, 994, -67, -156, 745, 871, -316, -266, 530, 551, 65, -428, 341, -269, -881, 222, -5, -356, -998, 90, 542]
3173E42p83l69N76J4p10M14N49o52l16M75l20K23m77P16n6m87p6M94M04p53M68
3194a24m1m3l13L44j92k14n84N40O61l58j1N74j13l86o1O82k17m80Q70J9l85k66
3216i8L99j76m71K60P12L2l30J7K67l31l45N19Q4m83M01J88j38l70j53P04l88
3237C00o95P96M80m89k31L31J50r90k40Q90K31m70m48R36o64o39Q37J55m35j91
3257c86L7P15p48k65O29Oj010M32Q50o72m36O75L15n95o35O50O44q88K38L51Q1
3278a2o54K21O11l26j52j24M16k27k16P83k94k06j09M05P9o23O25J90k74j31J36
3299A18N23r92K87N78K7q51K60N19L5o85L31R98r70n07R83L0n19l34N24ll19N52
3321E85k74q8l64L58L79j77p40Q12n3k02p61O06K77o20L2J005q26l70K29K5J50
$$ y = [542, -241, -610, -34, -20, -730, -316, 233, -419, -735, -260, -580, -357, -834, -118, -174, -661, -737, -243, 161, -592, -124, -165, -208, -521, -177, -369, -583, -1167, -627, 34, -324, -335, 239, 126, -260, -321, 361, 144, -336, 534, 553, 168, -98, 301, 125, -346, -86, 626, 658, 328, 345, 612, 281, -64, 455, 539, 56, 457, 645, 507, 137, -16, 688, 300, -395, 401, 881, 392, 161, 492, 642, -348, -588, 302, 533, 63, -385, 551, -113, -752, 85, 240, -195, -386, -349, 366, -382, -647, -18, -12, -1022, -590, 260, -412, -848, -173, 142, -453, -1088, -438, 206, -682, -444, -93, -12, -666, -445, 166, -160, -312, -436, -20, -247, -463, 320, 26, -180, -289, 116, 195, -428, 197, 387, 113, -18, 118, 641, -351, -64, 514, 541, -310, -50, 469, 504, -181, 150, 1148, 178, -329, 654, 684, 165, -169, 355, 352, 33, 585, 311, 223, -141, 217, 596, 419, -321, 491, 438, 236, -525, 81, 358, -262, -230, 775, -51, -421, -192, -167, -17]
3342a7j335J058O73p11n22Q01k30o46Q60K12n38n41N09O78p32m61L01J94l0N8
3362d19Q21l51l18k99P46K2o89%M47K14p77Q54j75o39N5J343q19n62M68K26K64
3383D12k60l34O49l94q1N73j18m02k28M03N9k12J15Q70r22M1L29J95o40j83O14
3404D86n1k46q8L25l9n02J57O65m68m90L9O29k57k31O70p21J22L0M5K85j012N07
3426a45M17m42j50P73l60j71q21P59K57r44K58O97l18n4r0L59m96l3K52O4K65
3447G7m97L34l0p34P63J42m19J29J92J82J43r27P62N00q58K16L56q0m39L56J41
3468C09n7j69j65J042q21K88L21l40l52O1j28J96k5k37P33m00n78N80M35o57j99
3489a63J40L79q8o11P27Qj48r6J96l86l49N30K02p25K02L89N1o94K8N53k54j65
$$ y = [-17, -1352, -294, 379, -332, -854, -53, -283, -929, -69, 143, -395, -936, -427, 251, -481, -942, -641, -447, -477, -419, 402, 51, -267, -566, 180, 202, -487, -487, -40, 174, -603, 251, 76, -563, -508, 835, 16, -546, -78, 148, 412, 152, -182, 467, 73, -8, 565, 447, 45, -183, 220, 279, 67, 182, 1052, 130, 171, 500, 695, 55, -128, 486, 435, 189, 101, 426, 387, -115, 42, 707, 239, -251, -212, 417, 160, -71, 599, -122, 0, 30, 75, 360, -652, -145, 272, -170, -320, 453, 93, -78, -899, -140, 117, -827, -569, 128, -190, -244, -334, 25, -471, -504, -252, -188, 77, -420, -86, -116, -850, -87, 55, -364, -235, -43, 139, 282, -645, 117, 617, -241, -25, 331, 251, -188, 168, 309, 252, 83, -82, 960, 139, 427, 748, 408, 56, 117, -11, 185, 160, -77, 656, 256, -322, 258, 693, 36, -163, -23, 356, 268, -343, 384, 392, 244, 148, 344, -42, -391, 139, 341, -384, -182, 207, 258, -436, -408, 145, -109, -274]
3511b74k72M20j82k52L70K06n19O2K83j12m3k03N19P6l83l88P51j50m79N93J60
3532A83k69l16N92J07q80J53N93R8n90L88J72l91nJ20O44j073J76N36j3j15k37
3553a27P01o44j15M85M08m54n3K18O2o48N05L53k77k80k0M01j52l23M00K85l35
3574C90m88O20L39m96l07M05o6o59L28J1J99o63L58K79n1o51N97L1o15J35M72
3595A68j32n61K17L63j41l63J70L52o19k39K81P94k59m17P41n25q51J248l69l10
3615d52K0L48P2k84J2L60M0j16k00M23l83m76R17N18j048k2O7M40m17QM12m69
3637b30K42q2M49j77j16p2m9J26J04J47k30J82k54M87J81o90K35N06j94m11j5
3658A39R97p49O0j52k2M2l78N47qo57N07k08q3l79J01M75Q4k76q1l9J00J34L22
$$ y = [-274, -546, -126, -308, -560, -190, 16, -503, -441, -158, -270, -313, -516, 3, 79, -304, -692, 59, -91, -570, 23, 183, -86, -402, 190, 297, -583, -430, 163, 261, -329, 59, 231, -160, -165, -45, 599, -474, -298, 238, 225, 110, -127, 574, -70, -185, 300, 708, 254, 201, 419, 481, -167, 338, 691, 414, 134, 114, 515, 363, 40, 440, 725, 390, -98, 522, 861, 365, 58, 463, 397, -262, 66, 77, 276, -387, -29, 250, 199, -452, 145, 176, -439, -304, 168, 36, -525, -308, 55, -86, -449, -279, 73, -546, -785, -504, 290, 31, -386, 355, -170, -1021, 227, -142, -452, -432, -84, -12, -296, -284, 76, 116, 0, -200, 223, -160, -636, 281, 799, -249, -271, -204, 236, -181, -173, 239, -230, 12, -70, 379, 202, 86, 14, -35, 91, 195, 342, 112, 294, 40, 527, 708, 18, 253, 759, 565, 154, 139, 1136, 387, 447, 295, 273, 315, -63, 484, 476, -181, 326, 118, 35, -344, -243, 232, 316, 40, -41, -80, 20, 154, 476]
3681D76n63l03J42N52n00l05L60O6L49o40j7K26j70O8j7K9m1N44q4K8m76J66O6
3704d4O5o9r0J73k70J63n73N59j16j92M34j31n93Q29L15r14M19J2j00R9N0J53
3726A79p5j80J30O07n85qK63K57k51k66L08J50j59l4j5j40J20j90J25L97p88L73
3748B18k4J30o62P81N8q69j66O43K70l53k00K01j6n17N19K01m80R7L70l2j75L2
3770B6J37l40K39o39R9k40L65L57K07k94J05O6k93j01J21J89k70J2l7P27o31K36
3792D1J8K96o42K66r4l2J47j62M48n82K76L99l28L5r4K8m1J97n26O12K27m2m1
3815D06K7j9m30L69J54m93M26j86j27MJ8j71M74n89K32k6M9j86L16K72o18R1J16
3838A09M55n19k69M70l5n84M17J30K97p99m14R95m14N2R6k8r2M9K74p00O15l71
$$ y = [476, -87, -390, -248, 304, -196, -501, -141, -75, 274, -366, -383, -157, -327, -259, -276, -247, -288, 256, 172, 200, -276, -110, -44, 21, -48, -138, 35, -235, -72, -645, -86, -202, -394, 40, -91, -684, 145, 460, -454, -35, -23, -123, -24, 26, 179, 104, -76, 54, 661, 76, 68, 331, 588, 337, 71, 379, 529, 370, 336, 321, 181, 301, 111, 236, 633, -155, 218, 194, 324, -338, 443, 501, -368, -534, 109, 379, 26, -174, 27, 11, -506, 13, 214, -266, -169, 201, 169, -6, 26, 163, -177, 62, -577, -478, -718, -353, 4, 211, -83, 22, 88, -205, -306, -185, 4, -266, -254, -291, 436, -195, 41, 59, 355, -287, -21, -115, -147, 0, -162, 286, -296, -20, 379, 51, 86, -8, 20, -21, 176, -350, 262, 489, 447, 406, 433, 414, -16, 353, 507, 14, 440, 254, 127, 131, 149, -22, 452, -137, 95, 69, 118, -68, 248, 520, -98, -7, 109, 564, 45, -224, 246, 211, -373, 44, 174, 471, -328, -742, 253, -161, -109, -13, -41, -133, -84, 190, -510, 105, -266]
3860b66K36j26m73O26J11m29rO91r8k1p68Q30l29l00M15p9j41j98j05L11k86J03
3882c05J22L6l8R2J16K12q21O35L42l93K02j67j68k4m88P93M2j15l66Q62l66m90
3904b87M5P41k21j87l14M86l05K06N0K71l19l64N42k74k1J11L18l87O6l53O62
3925D66l93r9j11J07r3J48j03q4K61l39J01p0k98M47pm23L03L37Q6p22L52L1K04
3948A01o22J38J65R2k85j02M95n0q8K71k59k4r3N78l33o7j8K81p99R95r1n8M2
3971B69r17Q25L82o93J55K48L3m94M06M2j72L8J08j17j48JK03P9k24r8M02l3n49
3994b54M31k6q5k43p7O77j97j34k5K22n65M79M1jm92L52J32p25L54P0M85l82k52
4017b15O11m31m04M53K3r7o06P40l51M03p6L04k85l76j72O17k55j79M92k89j06
$$ y = [-266, -30, -156, -629, -3, 108, -321, -330, 361, 263, 242, -526, 304, -25, -325, 90, 11, -130, -328, -433, -122, -408, -305, -183, -147, -185, -93, 23, 235, -586, 49, 391, -2, 200, 33, -135, -159, -647, 146, 188, 73, -293, 569, 203, -287, -242, 499, 278, 91, -223, 263, -42, 164, 214, 485, 166, -198, 344, 70, 49, 160, 478, 91, 157, -196, 466, 73, -26, -137, -30, -123, 25, -78, -162, 99, -240, -139, -209, -507, -60, -67, -490, -187, 150, 236, -486, -134, -103, 101, -521, -383, -218, -126, -411, -513, -18, -68, -156, 115, -144, -168, -261, 317, -16, -83, -101, 180, -619, 376, 285, 227, 269, -648, 177, 559, -134, 21, 269, 302, -192, 214, 256, 84, 122, 230, 113, -35, -34, 169, 248, 24, -74, 328, 295, -254, 177, 151, 66, -177, -254, 423, 226, 92, 67, 289, -276, 203, 244, 243, -249, 103, 235, -490, -136, -66, 419, 37, -215, 396, -35, -439, 14, 37, -60, -666, 74, -277, 126, 50, 354, 69, -307, -479, 138, -117, -296, 196, -93, -199]
4038a99j0L60l98m57N47O5j21L12j19N06o52L28j97K29j89k6J76l75J85J88k26
4059g3J7N53p20N75k73m46J99K53M31m22K52m4m30nQ1N7m34P37J52j89l87k73
4081c89P04l56K27j81L54m49l20M96m01r2L81J14j08o7J39P7m45j82J89K64j23
4102a68q2K51o0j54q9K05M08o92J96M45p63O69l23K11m07k96O06J91m83L92L04
4123C61m68l24J60N40m69K57l18J42k24J55k6j49M76j26K88o28N87j49k10M87
4143C62l03n92M84J34o8K36n3k28p4J63K0l42K83p3K9k7J88N3j79K63o0n9j03
4166E4j01j82L80k81K70L82p98j30J95L45J84j77jj38m56M1M37M6m39K03P53p20
4188a33k5K54J34q96O95pj69l80K28n7M50k16J07j05j72k32Q08l79k23J72J08
$$ y = [-199, -209, 151, -247, -704, -157, -92, -213, 99, -20, 486, -166, 162, -35, 194, 5, -21, 155, -220, -35, 153, -73, -56, 497, -223, 352, 79, -367, -168, 85, 516, 94, 346, 302, -128, -133, -52, 5, -429, 308, 460, 271, -116, -389, 315, -41, 186, 5, 359, -90, -410, 86, -315, -407, -26, 88, -20, -87, 52, 129, -316, -498, -309, -45, -168, -250, 1, -59, -213, -302, -97, 311, -381, -185, 260, -503, 166, -157, 54, -353, -649, -43, 148, -335, 57, 361, -107, -431, -271, 269, -200, 57, -261, -119, -343, -188, -214, -363, 113, -13, 275, -353, 234, 85, -125, 362, 59, -533, -49, 85, 17, 253, 200, -28, -102, 61, 81, -261, 22, -51, -22, -49, 139, 192, 13, 276, 216, 157, 54, -47, -229, 151, -130, 140, 522, -276, -406, -211, 134, 318, 141, 140, 2, -454, -413, 24, 70, -369, -166, 587, -133, -158, 96, 230, -666, 29, 22, -147, -527, -299, -356, 94, -122, -15, -120, -292, -524, 284, -95, -318, -146, -38]
4209c8J18j36K64j56n00N42l31J54o00N95L06J09o4j45r3l9k82J51P4k03Q1M81
4231B88j61m40M0N36m2R3j60j40J1K79j94j78J46j53J12k17L21j26m7K88m77k
4253b23n4N35m65l44O29j3k99L88l0j23j07J87k40nM99l01m45L72Mj10m4k64L92
4276f1l61J99J20L3M53o04QR1N30o45J08J55m15L16j99j27M37k6qk35k68J75L28
4299DJ57k18j63M94o13K31K62K79l07k41M36r9l71k38K51K40k71M04K56p24J14
4320a17N05k28k29Q9K11k94K60j01k5K49p56P55k09l06n15R48o8l23L03M9k60
4341f2J61P2M25o13J52j90K05k50N32m50j66J21k01K83j31J65N4k16K38k84R9
4362e6K71j58l22J81L34m20j78K87n1n82J32P48l1j04Nm05j4M91k1J5m71K2K28
$$ y = [-38, 80, -56, 208, 52, -448, 94, -237, -83, -683, -88, 218, 327, 263, 118, 25, -14, -296, -145, -71, -274, -193, 288, 127, -313, -273, 263, 221, 314, 154, 14, 25, 304, 110, -68, 78, -75, 37, -180, 141, 15, -32, 256, -221, -223, -277, 258, -207, -551, 78, 65, -234, 154, 124, 1, -106, 81, -159, -164, 335, 34, -411, -39, -35, -145, -189, -453, -61, -422, -223, -103, -70, 383, -221, -213, -122, 408, -237, -129, 26, -389, -73, -272, -399, 38, 12, 4, -231, -499, -324, 4, 161, -57, -220, 274, -339, -108, 154, 433, 126, -115, 321, 222, -149, -387, -136, 104, -167, 237, 493, -231, -117, 388, 160, -69, 20, 231, -63, 197, 96, 71, 320, -436, 319, 110, -196, -711, 237, 169, -154, 149, 198, -62, 99, 171, 596, -17, 135, -55, 150, -100, 432, -18, -184, -63, -264, 19, -112, 53, 107, -109, 129, -155, -56, 215, 57, -265, -84, 250, -170, -348, -61, -112, -694, -562, 186, 155, 51, 56, -349, -363, 128, 107, 122, -349, -327, -99]
4385i9l22L71k98J70L9L96l16M77q70P93P1L90p18J46J68K7q08L35M0N2k44J45
4407e5o5J77K29n2j69M93n96K63K41q67M91l92K16j07J76K8J10l2k1l32L87j68
4429d5J41k90M25lo3j93l89r6N43l66K12L74p1n09O54l75P0K82n62L37r4j28N3
4452i3J65k51n7L39k06k60M22K51j00m30N41J35j023O82r9J99M88o62k26L9k0
4473a66M47m43k30K98M23k74k8j57K8L81j117M91O55O3m12R8j38J38J25j75j30
4494a23K28m62P02Q7p47rL76K10o06M98k24P0j1K60m29r1K05L44j66n6l42r8K35
4517a49K37j40K84p9n33Q91O2m92m06M31J54m26J64Q9N5l72M75m27R2n7N1k73
4539c69J6N42p4M00m26m05K03j36j70L00J27p2l35N55j77m63O69k93K42n8M04
$$ y = [-99, -421, -50, -348, -178, -139, 257, -59, 418, -452, 341, 412, 802, 84, 230, 398, 425, -383, -48, -8, 44, -200, -55, -120, 57, 286, 234, 65, 558, -38, 225, 466, -401, 90, -302, -86, -193, -17, 11, 121, 89, 68, -264, 123, -45, 96, -194, 231, 228, 165, -28, -417, -513, 30, -336, -124, 250, 179, -330, 324, -51, 19, 301, -261, 76, -18, -146, -93, 72, -179, -236, 103, -103, -363, 59, 310, 210, -220, 321, 456, -567, 115, 16, 215, 703, 41, -185, -146, -166, 281, -162, -392, -94, 329, 55, 27, -130, -102, 279, -838, -347, 308, 371, -41, 57, -81, 57, 182, 7, -123, 105, -357, 345, 432, -315, -324, 52, 262, -344, 154, -70, 0, -11, 249, -180, -271, -66, 278, 112, 56, -286, -384, -149, 88, -52, 232, 153, -380, 511, 573, 81, -325, 106, 260, -166, -2, 87, 142, -230, 245, -182, -90, -147, -96, -369, -353, 189, 115, 515, 89, -316, -113, -249, -419, -119, 8, -64, -399, 156, -21, -484, 185, -108, 134, 76, 480]
4560D80o3l33j86l09P32m65K96j61J66J15j86l77J75J00K66k13j55K81O1j49n1
4581B4L76j78k96k38q1L92k57K94p94N76J39j28K56k86j71M77j21k44R1k1o3M22
4603A69q8J21K06l19l91J9N03k61k65M06Q2k03q6J36o6R2k56k5K26n19N42l44
4625c21k66M50N38j76p61J83K24J62n77Q47L00k30m78R0j19l8LQ8K50j73l35j03
4647d42K70J24ML56l29J34l21O71L2m47m1J9k59K5K53M43p02K87M13j69k38P0
4669A53j34N1k4j08J25m07N09p8l3j80m31M65J31j85R7jJ82k53N6K75q6Q8m52
4692b40M49n08n05P72K63k88O5j47J29j42L25m03M60o9L94k58o48M25l7j27L36
4713B46l79l17M40l98N52k65L24j73J94J77m0l84K35m39L42L60l03o07j73O90
$$ y = [480, 417, 84, -102, -411, 321, -144, 152, -9, 157, 272, 86, -291, -116, -16, 250, 37, -118, 163, 224, 75, 24, 400, 222, -74, -312, -393, -1, -258, 36, -758, -182, -43, -171, 85, -201, -372, 105, -16, -260, -169, -190, -253, 169, 81, 202, 408, 89, -302, -283, 220, -41, -306, 100, 182, -21, -107, 29, -37, 55, -201, -226, 0, -519, 23, -321, -587, -137, 401, 225, -536, -353, -129, 33, -544, 303, 603, 373, -105, -15, -134, -172, -169, -81, 169, -4, -339, -442, -172, -48, -44, 312, -17, 117, -204, 467, 499, 52, 11, 30, -229, -204, 49, 492, -210, 77, 490, 321, 83, 153, 19, 70, 46, -62, 63, -344, 165, 87, 54, -126, -557, -92, 39, -146, -49, -50, 132, -121, -65, 210, 124, 212, -240, 209, -299, -804, -32, 231, -57, 8, -139, -10, -152, 173, -230, 230, 161, 555, 297, -351, 74, 37, -90, 246, -133, -450, -10, -408, 144, -121, 203, 30, 224, 401, 361, -23, 212, -227, 115, 475, 172, -435, -608, 82]
4733H2j03J12k83J38K39l70L06l68O13m07K77m42M07k81Q8J68o76N20m1j77R4
4754a04o7J33m17P94m31L3N13o11N59p7k41m16K83k39o8Q02n95n5r2L64om27N26
4777A61k92O1Q6K60m57j31L07K9j74J97k06L2P4n12M20O38l79j37O0N71p22o17
4799g31J066j76l30m8K18N2j61j64O09j25m33M28m28N41j64l05O09k45l8k32K60
4820B03j39o9%K19l11R5J27m30N05m6p26O51j35M94O0m71j32L96l54J93K7m5O2
4843A74k18O3K23m34K61J03k06J62L45n03R3l5k21N22m12P1j00o6q8L8O0R0k10
4866b88k57P35j61J49j32L2k42L60k11j91L10k91M43k68m91N00k73O6j77N32O5
4887B10n20L60J91rm42N23p49N56j50k0J74Q3J15l28K87n82K1N31l52L97j54L8
$$ y = [82, -21, 91, -192, -54, 185, -185, 121, -247, 366, -41, 236, -206, 201, -80, 8, 176, -500, 20, -21, -198, -104, -171, -38, -455, 339, -92, -59, 454, -157, 402, 325, 84, -332, -49, -288, -356, 446, -149, -204, -296, 68, 62, -365, 161, -131, -70, 16, 276, -181, -312, -5, 24, -150, 47, -159, -127, -53, -565, -145, 493, 114, -23, 37, 608, -114, -731, 335, 159, -171, -219, -1, 51, -110, -274, 335, 210, -223, 205, -223, 318, 154, -151, 458, 213, 175, -57, 203, 64, -5, -5, 214, -97, -2, 125, -305, 200, 154, -572, 79, -56, 438, 498, 27, -105, 291, -63, 130, 157, 112, 174, -44, 19, 242, -192, 69, 172, -34, 128, 473, -30, 63, 28, -193, 329, -83, -12, -112, -178, -266, -228, -168, -78, -288, -545, 190, 29, 178, 46, 78, -164, 196, -15, -206, 104, -187, 256, -12, -503, -3, -276, -210, -387, 145, 210, -310, 50, 241, 232, -210, 313, -436, 120, -30, -50, 124, 207, 322, -6, 281, -301, -280, 251, -101, 296, 142, 180]
4909A80l2j58J61p8l44O5o5M27j63j12J49J53k52M2Q5L59k54j55k16M56j78k42
4931a72J67J19j75R9N3P1o8j98L9l19L82P1J53k2l26M07j36o8m5K9k18j73K54
4954g6J35n9m4N02k97n94N38j95j32Q2M45J03n85N56l19l0j68k27J8Q63k82n40
4976c06M10jl06L29J83k75k40J94M38j25l94K45o11P10o48M32m7O3L58n18o7j28
4998c04M52J89n13L90L25m98J34J71p56J98K50J70j25l25K75L50J24m76k07M27
5018B51o66O26k77K63R3K3n09M48o19L24nJ00J68n0k63J52q7m02K36M60o9j05
5040I2l95M55j66L86m99k58N20j29m46M98q4L96j42j55J34j25n20M50O5L4j06
5061EQ1K11o09K2K90L97o39L0M83l5r4j92j26L52m6K99j94k01l51L53M7p5L18
$$ y = [180, 148, -10, 151, 73, -271, -206, -271, 156, -7, -119, 30, 183, -69, -27, 58, 417, 163, 8, -208, 248, 70, -172, -5, 114, -61, 38, 91, 162, 94, -104, -65, -384, -2, 69, 222, 200, -126, 281, 145, 77, 32, 61, -157, -330, -76, 59, 0, -44, 458, 161, -433, 105, -90, -222, -140, 305, 408, -177, 379, 60, 30, -138, -365, -347, 516, 234, -306, 104, 103, -203, 126, 309, 34, -206, -12, 426, 301, -93, 152, -459, 251, -397, 35, -12, 51, 409, -109, -176, -304, 148, 337, -176, 214, 539, 41, 175, 346, -410, -212, 38, 208, 83, -242, 33, 383, 507, 31, -176, 251, -415, 211, -66, 197, 290, 313, -196, 252, -367, -43, -48, 52, 220, 170, -93, 59, -28, -430, -194, 266, 197, 92, -303, 152, -14, 372, -127, -385, 135, 6, -440, 58, -26, 370, 228, 73, 207, 82, -438, 12, 77, 111, 5, 86, 297, -312, -290, 0, 397, -242, -212, 271, 236, 142, -50, -176, 176, 130, 429, 235, 34, -317, 36, 83, 8, 326]
5084C26m11J27n03N00L01n09L72l59M19m30P0j28L99J50j53l23L42l19j48P81
5104E04n20l08L33n9j10k7L99p14Q65k53K47j44n58M18l60M82k83M00n36K11q6
$$ y = [326, -85, 42, -461, 39, 340, -169, 203, -156, 263, -167, -97, -225, 174, 324, 171, -152, 190, -129, -277, 504, -16, -324, 9, -50, -160, -187, 212, -502, 363, 110, 357, 213, -345, 73, -287, 195, -88, 312, -224, -13, -99]
$$ [...]
8191B43
##END NTUPLES=NMR FID
##END=
