##TITLE=1H_EC-3181(1)
 DMSO, 40 sc, 
 4.3.2019
##JCAMPDX= 6.0         $$ Bruker NMR JCAMP-DX V2.0
##DATA TYPE= NMR FID
##DATA CLASS= NTUPLES
##ORIGIN= UXNMR, Bruker Analytische Messtechnik GmbH
##OWNER= root
$$ XWIN-NMR		Version 3.5
$$ Mon Mar  4 16:06:53 2019 Russian Standard Time (UT+4h)  she@DPX200
##.OBSERVE FREQUENCY= 200.1316
##.OBSERVE NUCLEUS= ^1H
##.DELAY= (6, 6)
##.ACQUISITION MODE= SIMULTANEOUS
##.ACQUISITION SCHEME= undefined
##.AVERAGES= 40
##.DIGITISER RES= 18
##SPECTROMETER/DATA SYSTEM= spect
##.PULSE SEQUENCE= zg30
##.SOLVENT NAME= DMSO
##.SHIFT REFERENCE= (INTERNAL, DMSO, 0, 15.7039)
##AUDIT TRAIL= $$ (NUMBER, WHEN, WHO, WHERE, WHAT)
$$ ##TITLE= Audit trail, XWIN-NMR		Version 3.5
$$ ##JCAMPDX= 5.01
$$ ##ORIGIN= Bruker BioSpin GmbH
$$ ##OWNER= she
$$ F:/spectra/data/she/nmr/H-F/1/audita.txt
$$ ##AUDIT TRAIL=  $$ (NUMBER, WHEN, WHO, WHERE, WHAT)
(   1,<2019-03-04 16:05:41.46 +0400>,<she>,<DPX200>,
      <continue with go, POWCHK disabled, PULCHK disabled
       configuration hash MD5:
       00 E9 B6 7A A2 85 ED C7 34 08 36 98 17 FE 4E 26
       data hash MD5: 16K
       3B AD DA 47 66 06 38 0A 73 22 BB 28 AE D8 BA E7>)
$$ ##END=
$$ 
$$ hash MD5
$$ CF DC 3C 39 2B 13 7E CE 59 FD AB 62 B6 E0 F8 F7
##$RELAX= 
##$RELAX= 
##$RELAX= 
##$RELAX= 
##$RELAX= 
##$RELAX= 
$$ Bruker specific parameters
$$ --------------------------
##$DU= <F:/spectra>
##$EXPNO= 1
##$NAME= <H-F>
##$PROCNO= 1
##$TYPE= <nmr>
##$USER= <she>
##$AMP= (0..31)
100 100 100 100 100 100 100 100 100 100 100 100 100 100 100 100 100 100 
100 100 100 100 100 100 100 100 100 100 100 100 100 100 
##$AQSEQ= 0
##$AQ_mod= 1
##$AUNM= <au_zg>
##$AUTOPOS= <>
##$BF1= 200.13
##$BF2= 200.13
##$BF3= 200.13
##$BF4= 200.13
##$BF5= 200.13
##$BF6= 200.13
##$BF7= 200.13
##$BF8= 200.13
##$BYTORDA= 1
##$CFDGTYP= 0
##$CFRGTYP= 5
##$CHEMSTR= <none>
##$CNST= (0..31)
1 1 145 1 1 1 1 1 1 1 1 1 1 1 1 1 1 1 1 1 1 1 1 1 1 1 1 1 1 1 1 1 
##$CPDPRG= <>
##$CPDPRG1= <>
##$CPDPRG2= <>
##$CPDPRG3= <>
##$CPDPRG4= <mlev>
##$CPDPRG5= <mlev>
##$CPDPRG6= <mlev>
##$CPDPRG7= <mlev>
##$CPDPRG8= <mlev>
##$CPDPRGB= <>
##$CPDPRGT= <>
##$D= (0..31)
0 1.2 0 0 0 0 0 0 0 0 0 0.03 0 0 0 0 0 0 0 0 0 0 0 0 0 0 0 0 0 0 0 0 
##$DATE= 1551700956
##$DBL= (0..7)
120 120 120 120 120 120 120 120 
##$DBP= (0..7)
150 150 150 150 150 150 150 150 
##$DBP07= 0
##$DBPNAM0= <>
##$DBPNAM1= <>
##$DBPNAM2= <>
##$DBPNAM3= <>
##$DBPNAM4= <>
##$DBPNAM5= <>
##$DBPNAM6= <>
##$DBPNAM7= <>
##$DBPOAL= (0..7)
0.5 0.5 0.5 0.5 0.5 0.5 0.5 0.5 
##$DBPOFFS= (0..7)
0 0 0 0 0 0 0 0 
##$DE= 6
##$DECBNUC= <off>
##$DECIM= 24
##$DECNUC= <off>
##$DECSTAT= 4
##$DIGMOD= 1
##$DIGTYP= 9
##$DL= (0..7)
0 120 120 120 120 120 120 120 
##$DP= (0..7)
150 150 150 150 150 150 150 150 
##$DP07= 0
##$DPNAME0= <>
##$DPNAME1= <>
##$DPNAME2= <>
##$DPNAME3= <>
##$DPNAME4= <>
##$DPNAME5= <>
##$DPNAME6= <>
##$DPNAME7= <>
##$DPOAL= (0..7)
0.5 0.5 0.5 0.5 0.5 0.5 0.5 0.5 
##$DPOFFS= (0..7)
0 0 0 0 0 0 0 0 
##$DQDMODE= 0
##$DR= 18
##$DS= 0
##$DSLIST= <SSSSSSSSSSSSSSS>
##$DSPFIRM= 0
$$ [...]
##$SUBNAM2= <"">
##$SUBNAM3= <"">
##$SUBNAM4= <"">
##$SUBNAM5= <"">
##$SUBNAM6= <"">
##$SUBNAM7= <"">
##$SUBNAM8= <"">
##$SUBNAM9= <"">
##$SW= 24.9336934301222
##$SWIBOX= (0..15)
0 0 2 0 0 0 0 0 0 0 0 0 0 0 0 0 
##$SW_h= 4990.01996007984
##$TD= 16384
##$TD0= 1
##$TE= 0
##$TE2= 300
##$TE3= 300
##$TEG= 300
##$TL= (0..7)
0 120 120 120 120 120 120 120 
##$TP= (0..7)
150 150 150 150 150 150 150 150 
##$TP07= 0
##$TPNAME0= <>
##$TPNAME1= <>
##$TPNAME2= <>
##$TPNAME3= <>
##$TPNAME4= <>
##$TPNAME5= <>
##$TPNAME6= <>
##$TPNAME7= <>
##$TPOAL= (0..7)
0.5 0.5 0.5 0.5 0.5 0.5 0.5 0.5 
##$TPOFFS= (0..7)
0 0 0 0 0 0 0 0 
##$TUNHIN= 0
##$TUNHOUT= 0
##$TUNXOUT= 0
##$USERA1= <user>
##$USERA2= <user>
##$USERA3= <user>
##$USERA4= <user>
##$USERA5= <user>
##$V9= 5
##$VALIST= <valist>
##$VCLIST= <CCCCCCCCCCCCCCC>
##$VD= 0
##$VDLIST= <DDDDDDDDDDDDDDD>
##$VPLIST= <PPPPPPPPPPPPPPP>
##$VTLIST= <TTTTTTTTTTTTTTT>
##$WBST= 1024
##$WBSW= 4
##$XGAIN= (0..3)
0 0 0 0 
##$XL= 0
##$YL= 0
##$YMAX_a= 933448
##$YMIN_a= -1190085
##$ZGOPTNS= <>
##$ZL1= 120
##$ZL2= 120
##$ZL3= 120
##$ZL4= 120
##$ABSF1= 10
##$ABSF2= 0
##$ABSG= 5
##$ABSL= 3
##$ALPHA= 0
##$AQORDER= 0
##$ASSFAC= 0
##$ASSFACI= 0
##$ASSFACX= 0
##$ASSWID= 0
##$AUNMP= <proc_1d>
##$AZFE= 0.1
##$AZFW= 0.1
##$BCFW= 1
##$BC_mod= 2
##$BYTORDP= 1
##$COROFFS= 0
##$CY= 11.3945322036743
##$DATMOD= 1
##$DC= 2
##$DFILT= <>
##$DTYPP= 0
##$F1P= 18.9103706918063
##$F2P= -1.10871071338519
##$FCOR= 0.5
##$FTSIZE= 0
##$FT_mod= 4
##$GAMMA= 1
##$GB= 0.15
##$INTBC= 1
##$INTSCL= 1
##$ISEN= 128
##$LB= 0.24
##$LEV0= 0
##$LPBIN= 0
##$MAXI= 10000
##$MC2= 0
##$MEAN= 0
##$ME_mod= 0
##$MI= 1.114404
##$NCOEF= 0
##$NC_proc= 0
##$NLEV= 6
##$NOISF1= 3.799351
##$NOISF2= 2.8
##$NSP= 1
##$NTH_PI= 0
##$NZP= 0
##$OFFSET= 15.70392
##$PC= 1
##$PHC0= -8867.507
##$PHC1= 19.80014
##$PH_mod= 1
##$PKNL= yes
##$PPARMOD= 0
##$PSCAL= 0
##$PSIGN= 0
##$REVERSE= no
##$SF= 200.130013532006
##$SI= 16384
##$SIGF1= 3
##$SIGF2= 2
##$SINO= 400
##$SIOLD= 16384
##$SREGLST= <1H.CDCl3>
##$SSB= 0
##$STSI= 0
##$STSR= 0
##$SW_p= 3612.71676300578
##$SYMM= 0
##$S_DEV= 0
##$TDeff= 0
##$TDoff= 0
##$TI= <>
##$TILT= no
##$TM1= 0
##$TM2= 0
##$TOPLEV= 0
##$USERP1= <user>
##$USERP2= <user>
##$USERP3= <user>
##$USERP4= <user>
##$USERP5= <user>
##$WDW= 1
##$XDIM= 8192
##$YMAX_p= 0
##$YMIN_p= 0
$$ End of Bruker specific parameters
$$ ---------------------------------
##NTUPLES= NMR FID
##VAR_NAME=  TIME,          FID/REAL,        FID/IMAG
##SYMBOL=    X,             R,               I
##VAR_TYPE=  INDEPENDENT,   DEPENDENT,       DEPENDENT
##VAR_FORM=  AFFN,          ASDF,            ASDF
##VAR_DIM=   8192,          8192,            8192
##UNITS=     SECONDS,       ARBITRARY UNITS, ARBITRARY UNITS
##FACTOR=    0.0002004,     1,               1
##FIRST=     0,             0,               0
##LAST=      1.6414764,     0,               0
##MIN=       0,             -1190085,        0
##MAX=       1.6414764,     933448,          0
$$ Real data points
##PAGE= N=1
##DATA TABLE= (X++(R..R)), XYDATA
0 0 0 0 0 0 0 0 0 -40 40 -40 40 -80 80 -80 120 -120 160 -200 240 -280 320 -369 440 -504 584 -664 758
27 758 -864 972 -1107 1240 -1394 1569 -1750 1959 -2181 2428 -2701 2988 -3319 3670 -4065 4505
43 4505 -4986 5530 -6127 6805 -7582 8464 -9501 10707 -12166 13950 -16186 19120 -23096
56 -23096 28877 -38105 55212 -97899 443601 442248 -459735 -571211 -638805 -611926 -462009
67 -462009 150493 722929 933448 600351 96419 -336604 -528223 -652678 -633879 -307516
77 -307516 334209 770429 721748 382685 105564 -177467 -515122 -711825 -510495 -16529
87 -16529 473957 685581 610099 403086 168276 -196024 -624263 -757069 -387315 144305
97 144305 420381 468800 511447 452882 89590 -436569 -724709 -587976 -202058 132875 310764
108 310764 447240 559194 409955 -87263 -547842 -578237 -321282 -123463 27594 310673
118 310673 582901 536001 168674 -220471 -413915 -408880 -308792 -172885 47533 373631
128 373631 576805 395039 -19127 -266621 -287967 -335451 -404982 -221617 215148 525885
138 525885 468539 198356 -19114 -141183 -285151 -449082 -425997 -79414 349663 471349
148 471349 282283 122456 77047 -95655 -407331 -509578 -243815 121559 289677 272729
158 272729 228858 196372 61458 -217465 -439498 -359871 -47984 172680 193555 218170 313811
169 313811 248491 -65766 -354185 -367822 -197924 -43971 45552 151490 293426 340779 149848
180 149848 -181521 -353882 -258165 -128840 -113727 -38461 213045 395142 261601 -37966
190 -37966 -199753 -188282 -168155 -183663 -116122 98100 325402 337015 111841 -99140 -129645
201 -129645 -123688 -222106 -258296 -50089 233088 298016 153051 26900 -7611 -72567 -214692
212 -214692 -299064 -187429 57487 218594 176338 74512 74148 66406 -107626 -303806 -260853
223 -260853 -25788 127536 116871 100722 152036 146847 -13939 -224970 -286549 -146247 24059
234 24059 63842 46402 126943 216969 104308 -151020 -264101 -159407 -48689 -42825 -22283
245 -22283 98576 208917 157481 -31140 -174475 -157347 -74196 -67461 -90503 14230 196489
256 196489 218235 39463 -108975 -95666 -62639 -126014 -170010 -62335 122722 199173 109563
267 109563 -17536 -44413 -22053 -88171 -200057 -163128 40001 174350 111142 8949 19286
278 19286 45073 -49684 -181218 -172348 -19094 113092 111813 44269 38147 74707 16356 -143456
290 -143456 -208947 -86015 59622 66798 17028 55151 125071 74933 -81000 -172579 -115644
301 -115644 -13778 12040 -14632 18592 117381 137326 5879 -127386 -106385 -13039 -7813
312 -7813 -55127 -9274 115182 154399 48633 -73492 -86637 -35832 -33068 -75639 -52033 70864
324 70864 158030 93603 -32734 -59952 -12750 -32260 -109783 -98467 27478 123021 90648 6178
336 6178 -13792 16461 -1844 -84345 -113702 -21618 91021 93500 18340 4277 53874 40665
348 40665 -65639 -125413 -54048 48777 64250 18760 17234 68733 72194 -23254 -114337 -85185
360 -85185 13584 42555 -3930 -2463 72737 99919 8736 -91010 -77639 1852 26309 -8154
372 -8154 -5476 66750 113770 51499 -55743 -76653 -13427 12762 -31008 -40096 42389 115138
384 115138 78478 -14765 -45091 -4345 8288 -42607 -69367 -5266 80399 80426 5863 -29065
396 -29065 11189 31410 -25113 -71489 -18042 70722 81290 18751 -12748 18984 34353 -20958
408 -20958 -76299 -43303 43866 76180 31588 1386 33433 54809 -3638 -79033 -69609 5244
420 5244 39983 7778 -8529 32560 67224 27035 -46427 -57471 -1001 34604 6522 -15170
432 -15170 23870 72333 47190 -26100 -50827 -3463 30416 5077 -19004 17181 71350 60728
444 60728 -9167 -48876 -19090 12428 -14021 -47834 -14766 52128 62488 4752 -34112 -8200
456 -8200 20699 -8144 -49094 -26324 39854 64603 21915 -15056 4588 33642 8095 -42774
468 -42774 -34309 27611 59402 26992 -7610 8528 36880 11934 -43722 -53765 -1216 35286
480 35286 13869 -17118 695 35922 22733 -32499 -51457 -8606 30165 16067 -13004 2303
492 2303 42189 38304 -14174 -44843 -13780 24994 12479 -15324 280 44357 48197 1819 -34616
505 -34616 -19701 10727 1580 -30606 -23116 23022 43814 9202 -28449 -14711 16165 7199 -27799
518 -27799 -24524 17219 39754 12966 -21291 -17726 9558 6660 -26539 -33797 5456 39979 21688
531 21688 -13827 -12577 13709 7472 -30849 -44580 -10653 22447 15160 -8656 -5127 20049 23650
544 23650 -8643 -34812 -14264 20431 15978 -13742 -13652 16476 23371 -11082 -37660 -21297 8424
557 8424 6693 -15588 -16112 9152 21580 -3614 -36435 -31920 -1396 4230 -18614 -22616 11421
570 11421 33480 11887 -17937 -13552 9346 11264 -11739 -19622 3204 26593 15012 -15132 -22067
583 -22067 929 8220 -18073 -33964 -8011 18753 8194 -18643 -20247 -2293 502 -18653 -31832
596 -31832 -16267 11367 15632 -3826 -10868 7972 19445 -1619 -24280 -11261 15029 13923 -5867
609 -5867 -9021 6077 11603 -3275 -22743 -21606 -1683 7865 -6802 -17833 -2137 13278 -960
622 -960 -25719 -24166 -2104 4760 -9787 -13917 2631 16543 11292 -7195 -13682 -524 12005
635 12005 404 -15932 -5232 16250 11740 -12153 -19459 -4087 3514 -9713 -19432 -9085 9686
648 9686 10918 -3580 -13835 -7406 3683 -3024 -20578 -14573 10312 17858 989 -6189 6096
661 6096 14663 3586 -10396 -8917 5022 9789 -419 -10604 -7018 6247 2639 -13356 -16121
674 -16121 1569 11458 -1012 -10666 175 8576 1774 -9531 -11502 -3009 6195 5745 -1129 1963
688 1963 15911 18049 2739 -8949 349 10005 403 -9027 -903 9762 6660 -3300 -7581 -6012
702 -6012 538 1304 -6005 -7345 4549 10977 276 -10407 -3778 6832 2424 -7516 -3188 8731
716 8731 11399 5338 1632 2669 7357 9488 577 -7107 1022 11097 4850 -6827 -2611 8565
730 8565 4040 -8211 -9137 -18 5146 2955 -28 676 3561 5772 -922 -10662 -6606 6865 7369
745 7369 -2768 -157 11319 12080 698 -2315 2958 6594 3651 -5 -1188 542 4392 2097 -4794
760 -4794 -4340 5898 8773 -1441 -3194 7279 10705 1030 -4122 500 2020 225 -1958 -1564 1796
775 1796 7869 9637 3363 -690 5630 7225 -1780 -6869 1328 6590 1326 -2402 660 3773 1702
790 1702 908 1081 1447 6450 9166 2936 -1770 2811 6661 282 -5458 278 7072 4644 820 4153
806 4153 6415 5165 3182 1108 -1788 -938 2736 -1101 -5149 166 5910 2467 -3418 -650 4255
821 4255 2310 -769 759 3537 2586 2361 1485 -1648 -1164 2809 2911 -1629 990 7489 4501 -1220
837 -1220 -431 2809 537 -3161 -1337 96 -998 -890 -1005 -1965 -3508 893 2073 -3147 -2547 2978
853 2978 3324 -2209 -1692 3125 93 -2436 -1358 -372 -1443 -56 2498 1661 -140 3467 3486 -1588 -3644
870 -3644 -341 431 -4046 -3831 -226 157 -3395 -2223 -816 -995 -1245 2422 661 -2156 222 2038
886 2038 -2335 -5591 -2302 451 -1959 -2151 1594 2602 840 702 2145 -807 -2531 -755 -1411 -5907
902 -5907 -3980 278 -2206 -4735 -669 1651 -961 -2097 70 640 -1758 -1316 -667 -3186 -4755 -2887
918 -2887 -1191 -3208 -2940 2309 2886 -1499 -146 2145 -1596 -3222 -2133 -1356 -4189 -4026 -1310 -1223 -3339
935 -3339 -1733 575 -1186 -2028 151 374 -3003 -3131 294 -1813 -5054 -2086 -195 -2339 -2190 1280
951 1280 1296 -170 1467 1907 -181 -2591 -1271 -1070 -3725 -3222 505 479 -2041 -565 972 -1488 -2264
968 -2264 159 -135 -2286 -1084 883 -1918 -2460 -223 574 -549 -1012 2292 2364 384 415 2516 1288
985 1288 -216 769 2033 -820 -1072 706 -227 -2922 -390 2059 -255 -1412 -23 1247 -771 -192
1001 -192 1271 922 -1777 -314 305 -1037 -790 1714 3200 1303 2142 3844 1841 -95 1751 1609
1017 1609 -363 -1781 433 52 -1427 -1442 61 572 -280 762 1122 -178 -783 817 -982 -1864 -1397
1034 -1397 418 -637 -982 1379 1658 713 2020 3243 2381 837 203 87 -1380 -1754 -1264 -613 -1353
1051 -1353 -1536 372 85 -1024 68 1277 -1293 -1140 -572 -1064 -1552 -751 617 -567 519 1904 2989
1068 2989 2149 1372 2955 1505 871 785 1010 -372 -315 -167 -247 -824 -560 1453 801 -42 915 1337 372
1087 372 764 1416 910 629 843 1598 1236 1291 2230 3059 2507 3078 3574 2625 1890 1884 2513 945 -10 833 1518
1108 1518 -41 716 1230 781 1894 1942 1885 1031 2120 1755 2421 695 1071 2094 1338 995 1677 2520 2384
1127 2384 2921 2779 2372 2185 2415 1399 -591 -642 -484 -871 -2216 -1618 -116 203 -303 -235 416 477 44
1146 44 268 65 -583 289 212 -860 -873 1265 1259 828 839 1322 1678 451 -1313 -1414 -1458 -2410 -2996 -3078 -3114 -2666
1168 -2666 -1443 -1266 -2897 -623 -221 -2015 -2045 -1283 -668 -962 -2242 -1769 -192 469 -300 -9 233 1293
1186 1293 1160 -422 -1253 122 -424 -1579 -2861 -2558 -816 -1701 -2739 -2428 -1735 -651 -1109 -2349 -734
1203 -734 -568 -28 -567 -1012 -579 1103 -9 -786 -211 1622 1412 237 -18 479 845 1042 -730 -1370
1221 -1370 -467 -400 -1100 -2360 -1610 -191 65 -673 -833 1258 2040 872 -580 546 935 1224 -148 -1162
1239 -1162 24 1012 -125 -919 256 807 1255 275 -927 -920 703 -551 -2736 -2481 -1336 -1090 -2394
1256 -2394 -2083 -622 1334 782 -84 -342 1017 1474 -172 -1392 -190 91 453 -1109 -2327 394 595
1273 595 -901 -1875 -1097 3 -694 -2485 -3743 -2326 -1139 -2529 -3355 -2477 -1056 692 -620 -750 777
1290 777 2129 585 -1145 -730 191 61 -394 -1024 -392 520 921 -1101 -1078 -124 137 -607 -2376 -2117 -1178
1309 -1178 -1151 -3212 -2984 -616 -550 -535 -782 197 1954 2425 459 -596 965 1771 1138 -1339 -547 1026
1327 1026 760 254 -588 1150 1148 962 -537 -464 502 -131 -1049 -1953 -1164 840 -220 -2254 -775 1272
1345 1272 1444 577 -770 776 2515 2170 369 103 1341 1836 396 -288 -327 1682 1835 -125 -904
1362 -904 1428 2660 404 -559 109 13 256 -227 -1607 -523 725 1484 -110 576 2420 2850 1505
1379 1505 718 1443 2520 737 -488 -803 471 427 218 222 588 1342 1533 -58 -92 903 1433 61 -1189
1398 -1189 -159 1152 1328 -127 542 750 2137 1389 836 384 1765 2258 517 -2145 -496 1734 1214
1415 1214 -521 -839 1465 2129 -42 -77 744 1548 1454 156 -1541 -754 1355 -111 -1964 489 2034
1432 2034 1436 -329 753 1982 2213 882 -135 28 592 1187 -106 -998 101 1475 1533 -903 18
1449 18 2617 1744 -379 -753 932 1454 488 -1318 -927 -336 902 321 -778 576 2308 1549 -107
1466 -107 -1166 1624 1405 301 -1636 -68 -49 -284 215 -507 -205 1376 599 -640 -367 1159 1196 -925
1484 -925 -1439 -604 650 -490 -1842 -385 731 940 -44 -512 454 546 1713 -528 -789 -3 1159 -872
1502 -872 -1784 -919 1341 103 -1729 -524 977 1130 -373 -750 -835 -605 453 -889 -2674 -175 1731
1519 1731 -182 -1506 -248 1260 355 -522 -540 114 683 -2 -840 -1079 315 380 -452 -911 -173 1347
1537 1347 729 -938 -879 331 11 -1273 -1713 -607 -344 -182 -835 -1373 359 372 533 -421 -104 526 806
1556 806 -374 -1635 -209 663 -734 -1154 147 76 812 -46 -704 382 559 182 -946 -1340 -702 -609
1574 -609 -1226 -2647 -367 313 -98 -917 -931 60 191 -99 -905 -570 -82 97 -1975 -1419 -269 750 -652
1593 -652 -1202 337 548 303 -672 -191 306 100 -270 -953 -1287 -505 406 -389 -1443 -214 824 -343
1611 -343 -1379 -148 223 -589 41 -1255 -985 -502 166 -447 -854 -450 252 1182 -812 -438 435 454 -1662
1630 -1662 -351 -480 -410 -1207 -663 -887 -830 908 -375 559 -47 930 195 56 -767 -66 277 -671 -953
1649 -953 339 -403 254 -243 40 -371 364 38 -695 -975 -741 -1050 -1982 -1334 -164 427 -102 -429 812
1668 812 1382 324 383 976 508 515 400 352 -145 379 1270 -84 -130 255 222 214 -538 -592 32 -836 -986 -404
1690 -404 -862 -485 -436 346 -79 -225 684 182 484 1433 1517 1459 3 1099 614 441 464 358 512 266 136
1711 136 392 -163 -246 770 172 -616 -288 -173 -899 -934 -345 -473 261 -408 -17 352 997 643 1013 690
1731 690 442 248 872 398 459 1112 782 139 562 125 -160 431 252 162 -310 277 495 122 -33 -142 -261
1752 -261 -421 -204 874 565 770 974 1135 959 453 47 333 36 230 201 253 -472 366 -227 -284 417 569
1773 569 924 -170 -448 -135 393 -92 -417 512 556 491 543 739 867 1130 1264 299 636 -70 -214 -556 115
1794 115 -600 6 -244 -818 -131 -418 -477 -381 2 -937 -863 -131 -388 -92 136 269 -258 781 1383 777 771
1815 771 1047 1156 373 440 808 53 143 -274 420 122 -1206 -267 -9 -484 -1347 44 -324 -744 -425 52
1835 52 -556 -23 417 144 710 604 820 1354 507 449 1062 995 328 293 110 -600 -110 -146 -479 -136 189 -37
1857 -37 -435 200 -234 -234 -751 -143 -1195 -739 145 147 -396 -132 -172 559 899 -316 438 371 82 314 365 -95
1879 -95 -700 -287 -805 -76 5 -1042 -367 117 -474 313 79 119 -161 -288 466 -910 -235 94 -313 -14
1899 -14 234 155 190 -11 333 -285 338 -151 -251 -456 -315 -1101 -623 -687 -256 399 48 50 -321 -73 469 267
1921 267 241 -371 -195 316 240 -667 -574 468 359 -35 455 -14 -68 691 -335 -164 -351 -1102 -987 -521 -802
1942 -802 52 -602 -906 -229 218 -107 -154 114 145 616 497 -332 11 721 980 481 1070 589 396 708 304
1963 304 -122 276 445 -627 21 -69 -441 53 -952 -721 743 133 -420 -632 455 308 -157 -74 -803
1982 -803 67 473 159 -152 -43 760 555 -167 358 172 676 -231 -311 -586 -655 175 -485 -714 128 669 38
2003 38 511 -518 1045 582 -472 -271 131 116 -196 -525 225 277 821 -12 -377 31 1005 272 -239 -762
2023 -762 627 485 12 -373 -561 337 192 303 -670 633 476 432 -660 130 612 541 223 -698 46 900
2043 900 172 -384 -578 843 873 255 -604 -6 630 344 -654 129 25 205 -109 -125 -229 294 243 -358 -347
2064 -347 746 851 -131 -5 -154 835 542 -177 -707 -50 858 104 -800 81 580 969 103 -525 -471 1198
2084 1198 246 -972 -200 141 712 42 -773 -18 953 232 -585 -938 318 90 -259 -1161 -932 699 571
2103 571 -478 -973 227 891 74 -699 68 1068 583 -896 -900 151 2153 477 -465 -657 350 451
2121 451 -43 -233 316 901 -213 -729 -87 85 496 -281 -1713 -183 957 712 -939 -719 796 1151
2139 1151 222 -1155 -430 906 805 -740 -829 106 1275 28 -641 -789 1233 712 -1274 -621 230 1068
2157 1068 -318 -412 -1071 465 1029 -330 -819 -179 2298 257 -762 -1395 437 1200 -357 -1808 109
2174 109 1096 335 -1224 -1174 349 1006 -50 -1205 -373 1165 968 -1791 -1424 -145 1520 -147 -1588
2191 -1588 -1240 1685 918 -489 -1337 236 1503 129 -1834 -806 1364 1062 -979 -1831 -50 1392
2207 1392 -192 -2372 -1362 -76 1635 -778 -1980 -624 1016 480 -1493 -1583 427 1951 359 -1539
2223 -1539 -535 1470 1447 -706 -1734 286 2453 213 -1798 -1439 1346 437 -1099 -2042 -204 1771
2239 1771 336 -1805 -1121 463 1162 -859 -1533 -224 1345 1357 -1592 -848 1187 2807 -163 -915 -178
2256 -178 1888 1284 -1180 -1443 714 1545 -786 -2018 -1143 1717 1394 -1390 -1317 757 1671 -29 -1425
2273 -1425 -856 2358 1971 -1036 -1938 624 2276 1140 -1077 -957 2150 2349 -720 -2166 -257 1683
2289 1683 514 -1245 -1938 1136 1708 -914 -2311 -917 2114 1597 -1364 -1862 969 2588 60 -1755
2305 -1755 -887 1192 2262 -1175 -2216 533 2326 337 -1745 -1254 1331 1158 -951 -2553 -447 1321
2321 1321 -192 -2144 -1842 589 1944 -742 -1682 305 2481 377 -1381 -1336 732 2401 -596 -1781
2337 -1781 -827 2691 2090 -947 -1494 1420 2266 78 -2321 -1336 872 1234 -1244 -3222 583 2197
2353 2197 104 -2213 -1457 1431 1842 -1189 -1799 340 2492 1432 -2159 -1411 1843 2169 -826 -1652
2369 -1652 -68 2817 1353 -1991 -1734 989 2489 23 -3018 -652 2596 1115 -1403 -2273 1201
2384 1201 2574 788 -2170 -977 2419 1689 -838 -2151 694 2133 995 -2221 -1513 2399 2147 -735
2400 -735 -2984 -249 2609 595 -2090 -1659 1460 2262 -516 -2615 -84 2239 1919 -1857 -1908 1242
2416 1242 3288 250 -2710 -360 2576 1767 -1569 -2801 1302 3519 279 -2440 -1583 2077 2664 -1758
2432 -1758 -2143 572 2966 522 -2417 -2075 1906 2501 -836 -2854 360 3147 1344 -2412 -1747 1712
2448 1712 3319 -368 -2645 -382 2862 1477 -2210 -2406 1052 3017 134 -2708 -1299 2417 1530
2463 1530 -2166 -2750 1093 2432 372 -2720 -1540 2096 2266 -905 -2661 441 3341 -102 -2157
2478 -2157 -1437 1398 2488 -1678 -3414 183 3288 1598 -2401 -2359 1476 3432 -686 -3069 -882 1887
2494 1887 1573 -2727 -2629 1043 3281 -365 -2857 -24 2667 2186 -671 -2174 703 2859 838 -3066
2510 -3066 -1358 2658 1977 -1233 -3641 139 2684 1517 -2518 -2391 1874 2470 -930 -3023 -444 1985
2526 1985 934 -2352 -2771 1917 2696 -404 -2922 -742 2587 2068 -2488 -3096 1570 2936 -483 -2852
2542 -2852 -1015 2831 1848 -2060 -3172 940 2731 297 -3255 -1721 2092 2023 -1784 -3103 -287 2763
2558 2763 1369 -2805 -1457 2057 2391 -1017 -2319 -539 2993 1155 -2364 -2780 1388 2491 -823
2573 -823 -3139 -168 2900 2376 -1577 -2672 833 2695 -556 -3445 -1423 2415 1978 -1685 -3054 364
2589 364 2861 674 -3119 -845 2625 2060 -1134 -3084 120 3360 792 -3063 -1620 1717 2524 66
2605 66 -3207 -1002 3378 2098 -2917 -2500 1863 2854 -1204 -2811 -668 3626 1503 -2085 -3148 772
2621 772 2782 425 -2753 -1395 2518 2228 -1532 -2956 307 3283 1220 -2881 -1498 1710 2876
2636 2876 -510 -3082 -326 3415 1300 -2548 -2457 1814 3061 -934 -2955 -1003 3485 1692 -2511
2651 -2511 -1738 1033 3163 -387 -3377 -824 2287 1841 -1571 -2289 1064 2909 1041 -2051 -2117 2096
2667 2096 2719 -1846 -2927 576 2553 614 -2787 -1262 2421 2479 -801 -2885 -9 3006 1274 -2490
2683 -2490 -1785 1853 3070 -457 -2709 -38 2947 1938 -2345 -2313 1338 2766 446 -2939 -656 2110
2699 2110 1744 -1980 -2709 1325 3210 228 -2417 -1363 2672 2152 -846 -2230 212 2881 1177 -1955
2715 -1955 -1865 2412 2693 -776 -2605 484 2312 1302 -2291 -2139 2122 2028 -239 -2846 -1000 2597
2731 2597 2424 -2438 -2326 1023 3590 907 -3130 -491 2829 1818 -1505 -2177 431 3314 809 -2142
2747 -2142 -809 2556 2549 -1522 -2968 -213 3195 1253 -2598 -1581 2183 2446 -268 -2878 222 2530
2763 2530 1002 -1977 -2117 1026 2168 -111 -2998 -215 1847 1486 -2106 -2421 1079 2191 228 -2283
2779 -2283 -670 1872 1721 -1897 -2686 310 2177 -24 -2863 -2069 2557 2753 -1500 -2552 596 2740
2795 2740 1938 -2353 -1500 2011 2287 -1209 -2394 -25 2780 1238 -1949 -1385 1447 3244 -452 -2260
2811 -2260 -520 1763 2278 -2239 -1799 293 2351 653 -2448 -806 2471 1641 -638 -2018 846 2335
2827 2335 130 -2223 -986 1673 1993 -862 -2195 446 1974 1012 -1978 -1927 1301 2191 -1210 -2793
2843 -2793 -925 2204 333 -2467 -1754 1089 3140 266 -2423 -782 1948 2113 -1352 -2200 504 2484
2859 2484 -206 -2490 -1196 1314 2035 -1245 -2006 721 2583 399 -1717 -1478 864 1665 -778 -2202
2875 -2202 -24 1970 549 -1684 -2180 1275 1475 -753 -2194 -638 2299 1371 -2050 -1888 1050 1662
2891 1662 -334 -1735 -1266 1865 1953 -1853 -1322 976 1529 615 -2280 -1236 1576 1487 -1019 -2237 -174
2908 -174 2012 660 -2067 -838 1243 2143 -908 -2470 -47 1764 623 -1402 -1084 1015 1734 -233
2924 -233 -2434 -687 1239 1231 -2141 -1786 1087 1762 421 -1463 -913 1473 1462 -1859 -1706 111 2508
2941 2508 123 -1396 -583 1972 1625 -1117 -1879 -323 1478 77 -1733 -1210 928 1357 -259 -1498
2957 -1498 -264 1864 606 -1235 -1915 518 1644 -486 -1636 109 1205 794 -1206 -1728 329 1332
2973 1332 -201 -1777 -860 1086 1805 -1098 -1583 324 1133 229 -2063 -1353 946 1436 -684 -1387 -151
2990 -151 1044 106 -1280 -1573 1633 1261 -327 -1018 220 1537 849 -921 -1104 1171 1481 612 -1608
3007 -1608 -502 1072 859 -1518 -1434 1137 896 475 -1526 -868 1844 722 -837 -1269 69 1523 254
3024 254 -245 -805 1533 1191 -1001 -991 72 2256 1053 -1594 -1074 1004 1955 -731 -1220 -129 1073
3041 1073 924 -1117 -1310 608 1914 -177 -1431 -85 1698 1166 -1112 -1382 519 890 393 -958
3057 -958 -160 947 1461 -676 -1551 883 947 673 -1126 -1161 1388 994 -606 -1372 -209 1296 546 -1356
3075 -1356 -692 636 1116 -441 -274 105 1186 619 -229 -890 321 799 68 -966 -611 1116 641 -896
3093 -896 -1517 206 994 652 -977 132 775 520 -830 -1250 -33 1817 -26 -749 -770 1396 1252 -712
3111 -712 -605 111 1296 1015 -1191 -258 885 1374 -43 -1133 -606 560 -12 -490 -927 411 1074 219
3129 219 -988 112 988 789 -437 -1364 -205 377 261 -1193 -727 828 630 -1223 -502 -246 710 535
3147 535 -880 154 826 369 -146 -817 -71 141 244 -631 -679 399 861 -36 -466 -189 667 708 -891
3166 -891 -1111 999 946 576 -914 -469 328 640 -199 -574 444 497 196 -370 -648 420 722 -497 -709
3185 -709 1149 465 -449 -641 -333 629 358 -240 -1243 -482 282 209 -1106 -181 110 612 69 -661 -472
3204 -472 422 641 -801 -429 70 311 -4 -584 -308 587 165 -587 -563 -41 27 -341 -715 -1006 -358 325
3224 325 -549 -607 -446 580 266 -815 145 214 -309 52 -759 -570 701 299 -621 -259 276 358 -474 -318
3244 -318 365 310 242 -421 -671 246 752 131 60 -184 783 87 -450 -653 -163 584 602 -324 -13 -55 308 25
3266 25 338 70 -7 -82 -455 -568 401 0 -80 309 -511 494 345 -708 -916 261 289 591 -596 357
3286 357 303 795 -796 -343 138 287 776 -372 -362 1499 468 -366 -87 769 357 827 -25 -196 334
3305 334 511 -748 228 362 -400 397 -156 -89 149 262 -49 -584 523 1055 60 -246 -321 193 122 190 -602
3326 -602 292 411 543 -264 -263 413 235 31 -139 -79 452 364 -390 -322 -570 -41 541 -344 -658 13 -251 -323
3348 -323 -616 -264 70 40 75 -572 102 341 -179 -1025 29 174 -454 233 -752 -610 409 57 432 117
3368 117 251 11 -267 -79 280 441 -158 -323 567 411 228 -11 -767 -67 -106 -402 -752 -583 395 -415
3388 -415 253 -505 -191 379 -64 -146 -359 -12 -312 204 -234 -304 276 615 216 -204 286 -296 -416 373 391
3409 391 481 389 -367 182 406 146 5 -470 -68 43 175 191 343 -453 45 -275 476 -264 259 127 -221
3430 -221 -10 137 13 684 -122 341 289 -209 -467 -495 -289 -431 693 75 192 310 151 196 624 623 297
3451 297 83 -212 -17 240 147 -88 186 -332 199 389 416 -396 208 528 -358 37 339 -707 88 -94
3471 -94 -995 64 22 556 -556 631 5 -221 -453 -550 153 114 367 299 -180 219 -65 111 -48 -606 -66
3492 -66 -56 105 277 163 -269 -28 -525 -175 -420 454 -91 236 439 -88 231 5 -361 163 407 -442 278
3513 278 -233 -49 -281 -505 -151 -480 173 -255 21 221 -149 56 -720 -194 -1 566 -255 -188 -79 617
3533 617 -310 -40 -307 -30 157 18 -547 340 -128 -161 326 201 -252 -466 263 582 -15 -120 229 -705
3553 -705 -33 -118 -138 24 14 -796 629 800 320 -140 -28 -265 429 -378 137 -265 -67 -156 -156 88 398 244
3575 244 262 -146 -90 238 -14 -453 -200 -623 -64 67 -546 282 -565 -13 -687 -878 113 63 89 -29 107
3596 107 -155 52 -66 424 86 -73 445 -361 227 -147 -121 49 -368 -319 -201 194 304 -447 248 -449 -219
3617 -219 -423 438 63 295 520 -340 226 -17 207 77 -180 -21 -21 -184 167 -107 89 -73 -98 262 -16
3638 -16 -165 -157 -1 -264 353 -356 -671 122 163 -41 -759 57 253 478 653 370 262 14 87 113 -472 370
3660 370 429 -277 -52 -567 -384 107 -183 31 47 313 8 -323 272 -46 180 -280 105 101 566 -42 152
3681 152 615 -699 -98 295 685 -219 111 2 429 -278 214 376 -143 -41 -390 116 -323 716 -353
3700 -353 -25 -351 238 -402 135 -337 393 -191 217 237 -322 -516 -97 -18 156 -147 -451 685 751 314 -123
3721 -123 -308 262 -356 107 -190 75 93 -568 90 -905 -312 -317 -250 -347 150 360 121 675 -68 -227 430 -155
3743 -155 183 313 74 -370 -343 -98 940 157 -27 -303 -421 -127 -581 97 -223 404 712 -19 -600 -711
3763 -711 -305 219 516 599 248 5 448 -384 595 429 135 -402 426 -13 -646 -432 -714 -137 -391 109
3783 109 -292 -19 -156 -102 356 18 336 -809 -688 153 -110 92 -560 -520 -172 287 -414 -411 -181 172 145
3804 145 519 -148 -113 -302 -255 -217 130 -120 127 408 -8 404 723 -552 -170 451 534 -68 96 -6 -217
3825 -217 -206 -323 153 -89 536 -592 -117 293 59 652 277 -524 113 578 -214 26 182 140 380 -224
3845 -224 527 410 122 -768 511 -280 340 -502 339 -121 119 -256 -362 -195 83 -8 -286 460 81 -282
3865 -282 -530 250 -199 729 -98 -52 -410 40 310 -39 168 132 -35 490 575 -80 -173 420 7 146 -55
3886 -55 203 -151 -169 -165 376 115 199 -348 -253 323 -130 267 175 19 -538 46 -469 81 -54 -364 787 1265
3908 1265 -206 -409 15 -336 -173 68 -72 -338 140 184 12 354 195 347 210 -689 27 -182 725 -34
3928 -34 -389 68 -129 -221 151 553 135 103 -188 -90 -770 689 283 -333 -99 -230 835 -134 208 -111 101
3949 101 526 -605 236 -61 263 213 -442 481 -465 86 -330 -358 -82 -117 32 -725 -229 308 -170 591 479
3970 479 212 243 224 331 423 -62 553 -244 228 493 165 574 -256 -145 -399 -168 92 -123 -258 199 162
3991 162 101 -789 451 -496 -304 197 -239 -373 426 415 237 -610 -101 96 -305 -57 -357 -174 778 536
4011 536 -162 298 330 56 -240 -399 -50 263 -97 -427 202 -160 -413 -270 240 -377 -290 -77 -77 -82 -94 686
4033 686 -281 7 -207 -208 483 -157 699 339 428 481 562 -204 140 -535 -135 -62 -261 -215 223 -957 884 -93
4055 -93 421 237 10 -539 165 439 151 -76 756 345 -495 -203 -739 362 -256 255 -6 -198 -488 -220
4075 -220 -441 -32 722 -143 322 8 -780 -433 329 -127 625 -255 -242 353 38 -118 221 27 -319 93
4095 93 723 55 468 -487 -879 216 280 45 162 -89 -238 484 27 272 -287 -486 -145 434 -232 -21
4115 -21 -108 107 174 393 634 312 356 239 91 -537 35 -15 145 318 -294 -112 369 -677 41 193 374
4136 374 -438 589 260 -451 -20 -152 -218 347 -324 430 -327 -265 33 679 751 153 454 -382 -255 129 324
4157 324 448 -94 46 -202 -705 -905 -703 -562 467 -305 85 -799 -142 -357 -292 440 613 181 -130 120
4177 120 -526 -121 23 4 -490 58 -6 629 -47 -115 -421 -92 354 10 163 -44 408 12 199 -496 -519
4198 -519 120 -12 -25 30 -201 -163 -8 12 -461 9 217 -249 -488 35 -587 679 -154 -147 301 -173 -169 281
4220 281 218 240 181 -138 -44 205 -10 -408 207 -225 -282 -199 -248 -204 493 146 157 352 -60 536 323 403 -21
4243 -21 119 606 -354 300 259 -530 122 20 64 190 -236 244 -47 556 37 92 799 442 284 -144 -533
4264 -533 112 369 231 341 -98 468 -502 286 536 -65 -26 181 413 97 -159 -520 -274 -407 -81 -376
4284 -376 -121 -250 -446 -71 105 242 -419 -185 -322 -413 35 -160 -279 710 -528 413 -23 53 -94 -563
4304 -563 -171 365 -226 313 416 -146 -399 75 -426 8 -379 -49 -260 121 715 178 178 6 224 67 218
4325 218 155 -176 205 -725 181 183 -290 53 282 289 164 -581 -394 317 -408 -84 -721 482 397 337 -99 180
4347 180 -135 -23 192 -149 -628 743 423 -357 -74 -129 462 554 519 369 393 -495 -27 -230 -205 -649 -689 -50
4369 -50 302 79 0 85 -608 778 550 932 -295 174 -385 -293 17 148 406 -106 424 175 354 769 -114
4390 -114 -155 793 218 -33 -358 117 -304 -27 -87 -377 439 -566 -379 -61 282 133 -318 -267 -280 510 898
4411 898 -327 -67 832 158 211 307 38 -554 472 -80 -330 102 48 -17 -76 -30 804 500 60 220 414
4432 414 295 -263 -247 130 -103 10 262 39 -152 172 29 87 -315 -196 -7 -235 353 47 247 -373 1
4453 1 -181 -527 -125 1 591 348 -456 394 34 482 -510 -57 -423 -173 360 303 391 -137 163 59 -103
4474 -103 -115 -375 157 295 240 -478 138 -299 -72 237 5 254 274 -270 -114 -163 -506 417 -238 -244 236 -293
4496 -293 -413 159 142 -481 -360 54 -43 94 81 -229 307 191 150 -44 3 148 389 -163 253 405 -230 -382
4518 -382 65 71 -6 -423 302 -30 234 357 -466 785 109 -134 410 260 70 -442 299 -295 364 -72 -99
4539 -99 420 108 -122 631 263 -407 -54 472 -685 251 -128 554 208 143 14 -366 -92 -54 398 -585 761
4560 761 98 626 -315 -261 -305 -338 -153 141 371 -593 -241 -236 -413 -31 99 -47 -171 752 4 103 599 457
4582 457 28 395 473 501 33 97 -307 464 187 424 651 753 353 74 154 400 -409 -555 458 100 -211
4603 -211 194 -432 -155 154 -112 -201 346 -411 29 -340 -44 164 -122 452 -149 -327 -214 -798 -283 -314 -273
4624 -273 371 -333 -536 127 -276 -30 -81 465 -228 412 -206 -45 -225 136 -606 609 706 -77 170 47
4644 47 312 28 -784 -64 299 -64 103 -338 -352 97 -169 -68 608 -777 -600 660 154 105 -36 -926
4664 -926 -66 -285 -412 118 545 661 184 89 -129 126 -276 -487 124 8 140 -167 1040 -128 336 -538
4684 -538 -195 -402 325 160 -114 -147 184 477 68 136 -466 -7 -588 -471 -251 -454 261 144 477 -223 -488
4705 -488 455 493 -230 -371 -33 -16 -536 678 117 208 -670 -176 96 -392 132 -904 -162 -313 -36 120
4725 120 228 12 -187 -507 -24 -270 144 -347 211 298 -449 -436 246 290 -163 1098 -275 -300 -150 -141 154
4746 154 -200 -378 446 132 -189 202 382 394 -18 232 123 550 145 63 -564 -504 979 29 -166 -1181
4766 -1181 160 240 145 -286 192 -135 -42 542 491 361 -345 -236 225 -371 -400 279 362 692 444 98 -228
4787 -228 -261 -318 -5 393 172 -22 -276 -46 -280 -199 -235 -197 -511 -90 120 -151 64 216 -156 493 215 515
4809 515 142 47 -89 160 590 429 0 -687 113 -47 865 -96 -99 -746 -72 -39 100 749 132 123 -441 153
4831 153 835 152 84 -27 241 -440 -246 26 533 85 19 269 36 -499 -210 -366 50 -17 297 665 766
4852 766 -120 381 -456 338 326 -328 -351 -174 -109 228 256 680 819 -38 -129 190 71 -188 162 35 -489 -54
4874 -54 -63 11 -417 -61 -501 88 418 155 46 200 -298 -595 183 278 319 -302 -329 -195 -564 -233 -155 -239 354
4897 354 -128 93 -181 328 -12 -255 -134 219 165 24 -599 -589 -105 164 -52 -141 237 -11 651 292 -441
4918 -441 -251 -348 303 -386 -230 -385 -779 273 -23 -202 253 -88 420 -113 -480 658 -275 231 360 8
4938 8 -477 -712 -336 737 -247 187 17 33 949 -291 -188 409 261 -670 -296 111 241 -347 -223 68
4958 68 -362 438 474 333 21 -567 544 -191 -464 -399 93 -120 -312 -103 158 234 -216 205 -301 46 417
4979 417 35 384 596 1501 -517 -176 2 276 -385 224 -193 -56 411 -350 22 158 -270 -140 324 -266
4999 -266 -229 503 255 431 137 65 309 -15 197 291 900 528 -217 -366 82 245 272 -419 69 -481 27
5020 27 337 -231 441 55 22 -133 56 266 334 69 -294 193 -2 -210 -478 -114 -177 -117 358 -292 -170 529
5042 529 -324 -21 -444 -491 0 -790 -333 -592 -90 -826 -728 339 220 -449 14 249 31 -544 -204 302
5062 302 -94 148 287 119 334 -364 1133 -75 -430 -480 -362 262 -435 -472 -482 277 8 -182 365 -45
5082 -45 -21 324 698 431 -40 276 308 177 -535 -627 16 -6 280 344 375 281 -455 -104 346 362 -484 -377 -140
5105 -140 -350 408 -254 -442 145 541 -111 -112 -103 -74 -677 -281 -437 -311 2 52 129 237 240 442 71 -678 233
5128 233 200 -88 -861 88 359 -189 -691 238 -176 440 168 -567 -310 563 371 592 -262 -284 -25 0 -265
5149 -265 -685 -14 127 -18 -214 414 -238 -676 319 -377 295 -114 -179 -334 10 340 -163 10 -333 235
5169 235 -816 -341 -120 157 -221 210 338 14 -71 -124 -362 -618 35 841 168 230 169 -303 425 -71 -138
5190 -138 -504 26 141 296 -627 291 496 -26 -241 -131 -164 582 15 400 252 -33 228 6 349 -122
5210 -122 216 118 -405 106 348 -34 410 194 322 214 69 -689 -371 648 -66 568 -430 541 67 -909
5230 -909 -138 192 614 151 -241 -165 -60 302 752 83 -82 -116 15 545 60 437 180 -72 339 55 806
5251 806 -406 -901 -175 -481 -21 -253 205 -170 -318 148 -307 -173 -1091 -481 -323 -46 285 -484 439 101
5271 101 13 -17 331 -224 521 47 115 -93 662 -258 -185 164 209 188 -17 -247 -64 -356 -259 137 -568 602
5293 602 -108 -172 243 380 499 -45 59 57 -336 557 264 -257 664 5 -344 68 -161 179 129 -501 -73
5314 -73 330 -276 523 -617 -486 231 38 256 -383 -226 131 376 501 -374 -202 -615 79 56 470 251
5334 251 -520 -750 -528 536 54 165 -270 232 -83 408 355 51 -331 -287 -189 -63 40 313 667 160 -530
5355 -530 -305 54 -799 -401 -47 -216 490 20 -213 19 -22 484 -178 -142 -360 155 -131 8 -161 472 41
5376 41 -144 -407 289 -126 280 -387 -562 -158 359 73 -803 10 337 60 -378 148 -64 42 -480 -524 450
5397 450 -231 480 106 -126 212 -301 49 -276 -360 100 153 -176 -382 -213 -43 86 -118 551 -400 -229 -170
5418 -170 -59 370 13 50 -133 158 -83 512 -15 49 511 599 118 -205 -136 327 74 264 -298 925 595
5439 595 151 269 -116 76 -1 400 -193 246 -17 11 -312 -61 511 40 -256 -543 -320 -148 103 494 373
5460 373 -26 -341 -785 324 -342 -135 -184 -61 222 636 -113 -110 337 -24 -21 603 12 -351 -175 627 568 -327
5482 -327 351 483 95 -131 358 -570 -43 698 -121 293 152 388 251 -373 583 -20 105 -138 -102 595
5502 595 -395 -103 -360 499 260 -253 547 531 631 449 348 -252 -683 347 -470 -580 -104 -484 -125 79
5522 79 -428 -210 702 -34 1 218 -304 11 -237 -621 78 -169 -231 -125 421 -59 21 -243 -264 -409 -51 486
5544 486 -718 -197 -69 433 300 -93 68 431 158 -223 150 -422 313 152 -282 -28 -291 225 338 -62
5564 -62 468 -67 -570 -438 -232 -143 -24 -204 -498 -199 -94 76 -47 283 -337 128 384 -918 -395 66
5584 66 -148 -333 -245 34 73 -305 -36 -212 26 243 57 565 -408 -243 -92 443 3 -192 -84 31 -345
5605 -345 -1210 -501 113 -699 114 -436 -185 350 -118 -598 47 -113 -151 -56 422 391 -634 352 108 194 -396
5626 -396 268 -298 69 -342 83 264 -27 864 -462 -604 160 -75 268 712 113 147 56 143 3 -379 -628
5647 -628 -380 373 446 -95 -75 170 231 -157 -31 -69 355 20 418 53 144 154 101 210 500 -125 -199 778 121
5670 121 64 17 789 408 -106 -67 -261 -984 27 -286 210 358 -48 243 -363 522 655 28 258 404 503
5691 503 24 2 255 -227 -536 89 75 -49 -585 -80 138 581 -332 194 153 70 109 198 173 186 -408 -220 148
5714 148 -335 103 474 -85 -360 181 344 79 -229 -337 -143 149 244 354 126 -457 -355 76 -285 -8
5734 -8 -293 -99 -603 48 -310 -101 -31 -469 345 606 73 350 473 -6 575 -49 90 -160 440 269 207
5755 207 38 -42 281 -102 -569 44 638 -442 -560 186 -603 318 -274 74 -11 58 -186 8 64 -1169 74
5776 74 -384 100 274 -652 210 -451 -36 -28 31 -425 8 259 512 -418 -179 515 146 62 -609 429 -637
5797 -637 -528 299 -33 540 -285 406 -152 440 -559 -141 -279 -74 174 -370 -100 -182 -132 -282 24 -32 -172
5818 -172 4 -356 -116 403 -115 -342 482 -379 -539 252 -467 188 115 244 254 -402 -543 -325 -417 294 69
5839 69 -219 -378 204 -441 206 185 -641 -162 -9 20 397 -491 -15 601 136 -34 -124 397 87 -93 1193
5860 1193 -47 26 6 393 -230 48 465 57 -264 49 114 232 -499 300 470 -9 48 142 -124 -475 82
5881 82 186 -390 -766 270 449 -400 286 147 460 -428 624 411 15 -289 75 107 -8 -452 234 -230
5901 -230 220 -196 -138 395 -447 -92 323 -48 262 73 52 -509 707 -177 -173 -438 -194 -132 -290 -91 -230
5922 -230 608 580 -215 697 -3 59 -433 83 -193 356 -209 155 -11 -262 471 377 -527 460 -366 -361 -260 430
5944 430 44 63 162 98 -99 -584 489 49 572 -457 -76 -531 246 -121 686 -492 12 -122 258 530
5964 530 -125 3 -66 -239 -347 131 -143 616 81 -478 122 -91 -176 28 188 -380 -269 189 15 482 457
5985 457 16 348 -103 -575 -207 -17 409 101 -628 -325 184 -265 -445 -562 -229 -607 -249 -218 -227 -21 -303
6006 -303 234 329 -198 -290 -325 -359 191 -406 39 -124 -186 -496 720 88 -241 -270 -171 -713 237 -703 195 -26
6028 -26 -399 73 -570 -149 -146 44 -335 -314 221 -542 -416 388 240 489 169 -444 1083 223 69 -186 -83
6049 -83 249 46 405 -38 322 -391 -226 -418 -382 -127 255 215 -47 -49 -280 237 -170 140 528 689 -187 -122
6071 -122 -219 -689 171 -415 -23 206 -59 -293 -233 -81 -181 -458 -376 805 11 -99 -53 -448 106 -106 -700
6092 -700 491 424 249 139 263 372 -243 -3 351 -140 -232 12 -51 447 -255 180 309 326 143 -440 -161
6113 -161 122 -100 467 -191 -397 448 161 189 -593 327 197 383 -253 279 -175 -430 -184 -278 -222 -267 -543
6134 -543 570 367 321 126 438 -980 -403 -156 -213 51 125 -581 -23 -124 -865 -662 136 -355 362 -489
6154 -489 -654 -331 148 107 184 -132 -191 405 106 18 691 433 -204 -88 315 285 -302 -237 -324 -131 -280 -15
6176 -15 167 -88 133 -293 -153 80 -398 115 476 -222 -587 714 -479 315 315 -144 -314 400 -19 247
6196 247 55 -650 49 1 -473 -205 -19 -303 -496 -138 4 -384 -82 0 -278 -374 159 -844 421 -403
6216 -403 60 132 158 -84 -513 -323 -176 -130 -13 -523 -32 -563 20 39 427 173 -56 -89 209 -134 -643 -59
6238 -59 -26 473 228 0 407 388 -295 14 135 -522 872 -335 -525 562 130 122 138 110 98 -24 -331 -152
6260 -152 -126 6 -159 -345 -347 524 -83 88 390 5 84 435 -387 75 -148 439 -72 -138 -426 -483 406 -2
6282 -2 -331 -218 716 -201 -56 -194 136 -33 -156 230 -596 145 791 130 435 -25 314 -215 -153 -332 65
6303 65 224 -152 -79 -70 219 339 1188 320 -168 543 -110 115 434 -586 168 -435 -176 -317 345 -61 -588
6324 -588 -353 -448 59 -308 -230 153 -208 -36 -31 173 614 -475 -11 -420 434 -34 418 161 -808 81 503
6345 503 275 -63 203 -404 382 54 -504 -172 -86 -560 321 293 -75 -269 216 429 -38 -152 55 571 -115
6366 -115 -620 304 452 325 259 181 -224 -138 115 -230 -271 -82 -4 -290 135 -127 -88 63 -460 217 97 485
6388 485 12 -208 -359 -181 -55 -504 -134 -457 -363 -72 295 -117 83 264 284 9 -451 1034 449 277
6408 277 528 -169 131 451 464 163 -291 -47 -188 248 -305 11 -457 -265 -97 -313 37 -338 101 71 -415
6429 -415 -215 -597 -221 -215 477 -308 69 220 116 601 -329 -900 164 -660 14 69 -171 400 148 -510 -53
6450 -53 388 -29 75 -7 -369 -558 -76 501 594 -62 -293 22 70 -54 -21 -415 -231 24 241 12 -613 -536
6472 -536 -29 393 -72 133 -192 -664 -181 -287 -567 -535 -115 796 -3 349 259 367 926 65 -151 -414 264
6493 264 797 87 -31 533 -1 -90 -31 -100 -191 -381 -239 -145 80 124 82 36 -422 -319 217 1046 336 232 277
6516 277 -254 -94 659 277 -64 -724 397 -550 -392 -15 -133 -490 -548 -265 273 401 -63 99 -338 369
6536 369 -46 108 81 -85 -448 -429 458 646 216 404 -156 -52 -536 495 374 192 364 251 -119 -309
6556 -309 327 823 502 -30 -4 -245 -54 158 -993 -250 207 -143 104 152 116 788 197 187 63 -421 398
6577 398 -101 -96 -260 164 -248 56 -254 -141 94 -88 158 -91 -757 -255 671 -43 397 -269 16 -246 52
6598 52 -738 -78 -209 149 381 -162 -70 259 374 322 -287 -435 -84 -277 -759 34 48 -333 57 -171 108
6619 108 -85 143 326 339 166 -449 -751 10 -85 -191 -1 62 -93 548 -459 -119 133 610 149 163 -449
6640 -449 -220 294 -147 727 183 -204 -655 27 73 -339 252 224 14 219 -309 786 -112 330 203 387
6660 387 15 401 488 80 152 -676 -296 852 31 128 501 -326 -378 302 592 83 235 210 -229 -258 -588 -598
6682 -598 640 -85 -108 449 -71 -525 -20 -401 -640 -383 187 517 -238 -102 -27 345 343 323 579 -224 -51
6703 -51 106 -69 316 -66 -87 138 21 -676 516 -30 -83 196 332 185 448 -503 -377 156 57 234 331
6724 331 36 647 -32 787 359 205 -224 -212 -249 33 -294 133 357 -8 -44 -74 -367 14 -100 -551 -478 -93
6746 -93 299 296 295 172 -293 -129 -494 -708 -45 38 1 103 -100 586 314 230 274 204 -157 -1021 -95 -926 218
6769 218 -185 -649 -498 150 76 -734 146 321 -26 -60 -96 211 310 -124 330 25 511 223 -43 -227 162
6790 162 -57 471 -239 -29 -46 52 -456 -42 -28 394 -105 -63 -168 -164 368 -256 -385 730 205 579 -506
6811 -506 311 -622 1 -278 -286 -470 -285 -526 -278 -371 257 394 90 41 -35 453 -485 -179 139 -17 239 612
6833 612 -410 -65 77 -152 -355 -115 -245 194 -320 -534 508 -54 350 -120 -65 231 277 196 110 198 429
6854 429 -505 -571 221 642 389 269 532 460 676 1080 -78 299 -46 -497 -98 307 -151 -108 -199 178 -422
6875 -422 61 419 523 205 -1 80 -457 379 -408 393 -159 -184 106 -706 182 -271 54 -306 -113 -266 -134
6896 -134 499 -518 130 26 -784 55 -41 -252 -46 -354 -414 102 435 -22 -290 19 118 10 -287 118 93
6917 93 -178 -691 29 -130 -45 -116 162 -29 101 414 697 560 442 63 611 325 705 976 187 838 373
6938 373 8 -77 454 476 104 -263 -595 68 -191 -146 543 208 400 303 249 -223 -336 -344 242 473 438 -66 -232
6961 -232 -243 -299 -159 -238 400 -166 108 -245 -277 227 238 -403 447 -269 -71 -137 -523 446 -116 471 590 18
6983 18 -238 -356 -120 15 427 -375 252 -420 92 186 100 -207 -203 -107 -486 -202 -335 -141 768 -497 -440 111
7005 111 -219 -132 45 -48 499 -135 296 -94 -17 53 -506 372 -8 278 122 -202 84 70 325 -198 71 88
7027 88 259 231 17 -151 228 134 363 529 -73 -407 292 83 -243 -466 300 -40 -232 246 511 -274 -438
7048 -438 -160 -487 46 -234 371 -63 -224 -143 -289 122 -239 159 68 -703 254 -93 -385 90 -133 -189 328
7069 328 -659 -487 -307 181 -163 -61 -289 26 356 -450 -223 462 220 76 261 -620 174 503 232 -379
7089 -379 744 -228 -293 -233 86 -249 -63 -96 -437 -177 52 39 488 122 460 -222 521 233 -524 221 -162
7110 -162 -409 283 51 -103 -210 -233 -492 -668 121 126 -235 -293 323 250 313 319 26 -266 -573 221 -406 606
7132 606 -162 263 -400 -431 106 659 -212 -49 -2 -4 -352 746 147 -561 -320 -479 307 390 531 -186 -534
7153 -534 -613 554 -258 84 265 -91 -295 71 -573 -611 -129 -722 -192 -383 87 -563 124 -356 -242 163
7173 163 -89 -10 -678 -586 75 97 254 -612 555 315 49 250 449 -351 -3 328 253 121 -526 -36 -415
7194 -415 366 -188 336 87 -21 -258 169 47 97 -485 277 -680 396 655 546 423 -67 -264 -4 -295
7214 -295 -677 46 -120 400 93 370 642 168 212 21 160 -455 -146 97 -504 69 -380 94 -279 -171
7234 -171 -285 208 224 -131 -314 59 635 -46 193 345 271 136 488 183 -719 -608 -82 782 -81 404 -206
7255 -206 206 -89 -600 -366 295 -685 467 335 -130 319 -766 -489 333 3 -153 223 -55 -99 -132 7
7275 7 -221 -374 -350 -41 41 713 -105 -355 -269 89 -34 -61 -58 141 287 474 -287 867 -144 189 -163 362
7297 362 386 6 1 -168 336 -493 -41 340 -32 90 353 351 -367 -332 -235 235 417 352 -56 60 -139 288 -283
7320 -283 387 -287 -14 -98 -388 22 473 303 361 21 52 -63 156 -679 -263 103 -467 269 -368 467 -47
7341 -47 129 -560 53 132 -8 -96 -248 310 -276 499 104 -428 337 -207 -138 119 304 -491 25 -232 196
7362 196 -567 -257 564 -214 325 98 399 -125 616 206 262 171 160 92 83 -98 -6 161 611 -73 209 216 -126
7385 -126 44 -617 40 -145 -223 272 -65 -8 -131 -86 287 -130 278 -372 -63 360 -65 58 -459 -461 -688 41
7407 41 -10 -111 378 -538 -283 19 -410 210 4 69 487 -220 -537 -358 -270 577 -263 175 340 273 493 -213
7429 -213 -549 -62 150 -72 -686 -161 -146 518 -716 41 -196 406 316 46 69 -314 237 134 130 -291 23
7450 23 98 -45 -195 -158 104 60 728 -479 325 172 -239 14 -144 -676 -132 -326 -92 94 -6 121 -711
7471 -711 -112 -421 -401 466 129 -101 213 -157 131 522 244 -352 464 155 215 -338 153 -753 -771 -420 -169
7492 -169 -535 -151 -247 -714 645 -84 17 340 -84 106 874 -235 233 131 -636 137 62 587 470 -174
7512 -174 63 242 -145 210 320 -50 34 612 -98 -386 -39 115 99 388 722 -208 258 -578 -123 391 218
7533 218 -355 -642 152 -487 392 -488 -31 -219 -797 -83 297 506 -300 356 350 -368 -243 26 871 -97 669
7554 669 119 -42 173 460 -35 -281 11 -708 -256 -130 260 258 635 -8 242 173 571 380 -538 555 -206
7575 -206 44 113 -43 -11 166 -310 -11 365 86 411 -104 -179 -386 353 -479 203 -80 211 -161 -144 -373
7596 -373 -702 257 593 395 -16 300 22 -315 -279 372 115 153 -80 50 -297 -123 -733 494 165 15
7616 15 -106 3 -561 -598 986 -658 397 -36 164 453 147 572 -636 -640 -210 78 501 262 449 -368
7636 -368 -123 124 577 227 430 550 -215 273 435 -228 -791 -544 753 300 -366 -169 -26 209 618 -256
7656 -256 241 450 -227 -860 -31 -93 -531 -340 -324 -163 309 179 380 213 -271 11 -126 -21 524 -537
7676 -537 -215 -69 73 72 174 51 606 149 -273 529 -818 -278 -71 -198 -100 109 -498 65 260 229 -459
7697 -459 -410 273 -268 266 -264 -290 -282 154 -89 -259 13 -728 -358 35 -240 59 173 148 170 188 156 -212 -611
7720 -611 643 -524 -92 177 -494 -52 256 -336 147 78 7 124 393 778 381 -41 40 -298 -42 456
7740 456 519 -444 61 -253 99 -33 243 -225 448 195 -558 363 664 -125 49 -488 -651 -14 297 347 -341
7761 -341 89 499 -447 336 514 -308 -474 538 40 -189 -96 105 -466 -8 311 -454 136 429 -256 98
7781 98 -299 101 596 -236 -445 -400 -691 -395 -279 -394 57 260 401 -216 239 -73 242 -162 -175 305 -302
7802 -302 -573 -325 34 773 46 -360 498 156 33 -138 425 151 428 81 -359 -79 -443 255 -239 -294
7822 -294 201 276 121 170 167 -350 -307 -343 215 -421 47 715 -347 335 70 541 59 -475 -115 295 615 -150
7844 -150 136 -443 576 -177 548 386 -406 -223 240 110 -836 661 -159 -251 -542 127 415 284 -105 -591
7864 -591 348 859 62 69 252 -676 303 -73 -253 -272 130 413 180 -373 130 -85 690 854 57 606 -63
7885 -63 -9 141 -109 -522 -323 -383 -27 -80 -701 -136 118 278 138 239 -856 413 -470 -297 413 354 -607
7906 -607 126 30 -376 312 -101 497 222 64 -306 -199 -74 -420 -248 248 -643 -98 182 -391 214 31
7926 31 708 167 175 50 -190 -29 34 -92 -517 -98 110 -461 77 262 518 -236 5 438 -273 235 8
7947 8 703 494 -389 238 -219 288 -184 -90 -182 158 -36 13 -67 152 -573 -587 33 -788 201 40 -174 -573
7969 -573 522 308 -274 -196 144 -289 -20 349 903 396 -50 54 -11 36 302 4 68 358 441 195 -398
7990 -398 377 363 303 83 -364 55 -582 -184 234 -680 30 -43 -484 -324 730 923 -201 -426 -365 442 -107
8011 -107 203 -296 -146 -399 -368 265 84 -533 364 94 70 250 -381 -25 -184 224 -235 -356 -236 57 67
8032 67 -288 442 9 379 788 379 -31 -266 -18 -433 -36 106 -82 -903 -250 -474 332 -195 44 -128
8052 -128 807 365 85 72 365 495 -323 -1262 -242 4 151 84 -432 -221 -676 206 77 732 -610 329
8072 329 25 16 54 -443 -8 -150 715 333 -156 637 -111 131 -3 139 -247 -203 -199 1039 -420 106 -522
8093 -522 197 1064 -211 -4 -237 540 998 -52 -16 666 626 160 -180 365 119 369 -201 409 665 -16
8113 -16 -85 433 161 -277 192 -158 -173 311 -21 -609 -188 -208 -424 243 220 -306 -154 35 -222 -46 150 53
8135 53 -714 -72 -249 546 -313 158 19 -75 371 50 531 185 822 19 215 210 551 -281 42 -459 -239
8156 -239 649 402 -363 -389 379 242 123 -78 -55 267 677 -42 649 93 80 -63 -205 -449 46 349 -160
8177 -160 -189 -59 759 -489 -270 78 22 -200 -457 164 -219 92 -323 323
8191C23
$$ Imaginary data points
##PAGE= N=2
##DATA TABLE= (X++(I..I)), XYDATA
0 0 0 0 0 0 0 0 0 0 -40 40 -40 40 -40 80 -80 80 -120 120 -160 186 -201 242 -280 326 -375 437 -494 559
28 559 -638 720 -806 911 -1013 1134 -1269 1411 -1573 1741 -1934 2143 -2371 2629 -2907 3221
44 3221 -3572 3957 -4407 4909 -5494 6175 -6976 7953 -9147 10676 -12696 15489 -19660
57 -19660 26533 -39933 76127 -394263 -1190085 -821338 -381925 -42941 228824 687586 876373
68 876373 576151 -100406 -639524 -817310 -633379 -360840 -49952 355906 789967 835305
78 835305 381291 -189926 -461619 -526942 -536723 -386211 51694 542673 760935 581085 173005
89 173005 -204062 -423407 -569147 -626943 -385674 180115 648315 653945 358407 112167 -99349
100 -99349 -429783 -713004 -616936 -147268 352135 573051 506824 350792 196379 -88944
110 -88944 -500996 -683851 -388458 93519 336748 366860 417822 410962 126685 -317862 -568625
121 -568625 -480947 -208423 55554 235008 363986 455399 369997 -3372 -427366 -524466 -316501
132 -316501 -141229 -52853 171429 489269 544832 220345 -181775 -361961 -340150 -288526 -238002
143 -238002 -52587 294735 541136 402957 12877 -228393 -233177 -267864 -370845 -253759
153 -253759 137566 449289 423798 191453 733 -98828 -213877 -357579 -364038 -103042 255331
164 255331 389461 255898 116894 80565 -45960 -311692 -437222 -247852 54433 213544
174 213544 219638 200609 187131 89310 -148485 -381341 -367198 -101556 124027 153245 166008
185 166008 281326 287809 21596 -291608 -342063 -174529 -33221 21676 107464 257165 327261
196 327261 176011 -120228 -290386 -217260 -94208 -84516 -47832 155191 335456 243681 -20526
207 -20526 -171861 -155427 -133670 -163358 -122889 61931 270425 304953 134249 -49908 -83261
218 -83261 -75123 -172676 -244752 -85633 188120 282797 166619 55477 40359 -4179 -146806
229 -146806 -259686 -186553 33681 194944 171502 75856 69945 84365 -52341 -248541 -241779
240 -241779 -27828 129367 117356 89114 137411 148900 17526 -171360 -236117 -119756 28503
251 28503 63113 44322 111005 205668 134057 -88322 -208942 -125686 -25757 -38940 -44439 70071
263 70071 197075 171283 7146 -128333 -120377 -49404 -54887 -94290 -9231 173427 226048 73604
275 73604 -78714 -74769 -31259 -86802 -150397 -66219 111856 194751 117414 -1574 -33807 -9770
287 -9770 -55498 -157234 -144618 24345 156763 111412 10701 9875 48172 -17280 -141703 -156880
299 -156880 -29582 94192 98535 41067 38886 83906 50926 -88082 -175242 -90270 44802
310 44802 60634 10637 41151 123361 100756 -40231 -142546 -104564 -12290 13158 -14987 10979
322 10979 100357 124921 12597 -113127 -106093 -17529 -1094 -46047 -11665 102231 144489 49646
334 49646 -61517 -74531 -27216 -25332 -69066 -53907 53089 137374 92390 -13963 -39999 5610
346 5610 -6575 -88123 -104486 -102 96102 75796 860 -15462 21488 13579 -66160 -111593
358 -111593 -36755 74092 84694 13758 -6820 41702 39453 -56415 -123197 -62787 44037 66834
370 66834 20824 13124 61364 69719 -14635 -105844 -89832 1641 35987 -6062 -13392 53046 91049
383 91049 20606 -74763 -77153 -8585 18488 -18548 -28775 35399 91552 52510 -39518 -66910
395 -66910 -13366 16945 -24729 -47600 19918 94617 71700 -13327 -45631 -8718 8585 -35357
407 -35357 -66325 -12509 68813 72024 2921 -34332 -4516 15955 -32396 -77667 -35754 49620
419 49620 69005 16262 -13029 16458 33600 -14039 -69915 -51499 24581 57726 22822 -4514
431 -4514 25790 54104 12747 -58038 -61239 1613 35424 3758 -21179 10967 47446 18312
443 18312 -49158 -66905 -15403 26168 4183 -23140 9355 58495 41266 -28968 -59286 -18670
455 -18670 18686 -1166 -27175 6419 65445 64624 4108 -35802 -11618 16277 -8940 -47336
467 -47336 -25394 36592 51169 2150 -34476 -13965 15270 -6209 -48751 -36820 23392 48866
479 48866 9727 -27115 -9952 18327 1203 -42908 -40353 16367 52180 27886 -6148 5821
491 5821 34055 17280 -34594 -50675 -6747 32031 14422 -15432 -781 34254 25981 -22864
503 -22864 -47165 -14513 20657 10920 -18011 -8607 30037 32839 -11294 -42902 -18889 18795 12013
516 12013 -16992 -6918 34086 42141 3014 -30740 -19541 7681 4528 -22535 -21505 18541 42379
529 42379 12010 -25274 -17775 12179 8675 -22438 -23807 15647 40107 18599 -12342 -10254 11030
542 11030 9504 -19334 -31332 -2364 32037 22279 -11112 -11883 13088 13662 -23152 -41385 -14534
555 -14534 16929 10762 -13414 -11487 13639 19452 -4675 -29683 -13365 20732 23719 -3663 -8032
568 -8032 20052 29355 -709 -29586 -17241 10824 12136 -8015 -11118 11686 25620 4611 -26809
581 -26809 -28423 -3461 3602 -19800 -28323 95 24787 6806 -19039 -14012 8248 11089 -5951
594 -5951 -13599 4940 26583 19870 -6336 -14092 3695 12229 -7293 -23660 -3724 23186 17123
607 17123 -8350 -11855 1543 2433 -15627 -28661 -19256 3573 9657 -5109 -13741 2862 15968
620 15968 1569 -19046 -11177 12415 16223 -2507 -8520 6052 13911 1748 -15428 -15169 1787
633 1787 13352 1936 -12213 -1340 15631 4959 -20031 -24144 -5408 2098 -10176 -16221 -1504
646 -1504 14606 11446 -3863 -11032 -1660 10052 2686 -11728 -4863 16414 16044 -6300 -14944 -707
660 -707 6630 -4093 -14767 -7002 8323 8907 -3892 -12890 -7122 2100 -2439 -15651 -15977 3797
674 3797 12941 -1508 -8999 2752 13027 4086 -6486 -4865 5984 10350 5574 -3143 -1747 6621
688 6621 5392 -10077 -16491 -3037 8552 435 -7664 155 9444 1735 -11068 -12464 -7610 -1583
702 -1583 25 -4765 -3342 8217 13245 2710 -7178 2195 13461 6527 -4795 -864 9126 6702
716 6702 -2542 -5615 -2203 3403 4336 -1786 -5963 3203 11916 2937 -9883 -6243 3607 -1547 -12786
731 -12786 -10321 2393 8455 3832 1869 2997 6411 5664 56 -6132 -1545 9169 7952 -4477
745 -4477 -3486 6577 5987 -5208 -5944 3246 7518 3879 -1315 -944 1100 2695 -1272 -7123 -5961 3298
761 3298 6203 -2929 -4970 6781 10122 209 -4101 1656 4113 990 -1558 -637 1849 5586 4346
776 4346 -2457 -5158 1215 4250 -1747 -4504 4780 10196 2050 -3251 -667 2291 -612 -1765 138
791 138 305 4463 7299 1920 -1899 3094 7569 1950 -4233 1485 6979 1700 -3250 -572 2595 96
807 96 -1773 -177 186 1214 5773 3317 -760 3035 6818 1490 -5171 -1603 4159 2601 -626 3264
823 3264 6964 5776 4256 3688 1837 1321 3922 2257 -2128 -919 3918 1517 -4350 -1887 2986 3034
839 3034 -528 2142 4188 2877 354 616 -1324 -2418 634 1976 -1843 -320 6525 6774 1450 1151
855 1151 6531 4201 -859 -1087 1158 -365 -269 1408 239 -1567 1003 2884 -1169 -2462 2257 4225
871 4225 -96 -2704 1430 1566 -3005 -3079 244 -352 121 3850 3115 597 2166 3953 760 -1519 -251
888 -251 2618 -1120 -2525 233 2233 -1060 -1894 964 -302 -1161 1101 1200 -2424 -216 2657 382
904 382 -3425 -726 1244 -1606 -2427 806 2329 410 588 2761 480 -2028 49 1756 -1771 -2110
920 -2110 551 886 -2882 -2547 46 -1330 -2831 -308 1767 -1182 -1352 1082 -842 -3386 -2097 -1056
936 -1056 -2692 -3958 -1227 1284 -1654 -1402 2262 1046 -1104 -508 1931 -1607 -3332 -704 -794 -2995
952 -2995 -2233 -840 -2017 -3311 -1645 330 -1915 -2005 -323 42 -3668 -4511 -3343 -3156 -4790 -1920 123
969 123 -1845 -185 2387 358 -1850 57 970 -1965 -3642 -1837 -1022 -2703 -3220 -173 -684 -1404 96
986 96 1006 -1661 -2977 -646 -1479 -4123 -2996 -1051 -2830 -3773 -1313 902 -112 617 2331 1240 -510
1003 -510 -403 1176 -1143 -2155 -112 769 -578 -1784 647 299 -1647 353 1134 -1062 -1707 350
1019 350 -1564 -2889 -2779 -220 -905 -1495 107 791 1153 421 1969 1709 393 1352 2337 -248 -1359
1036 -1359 429 816 -373 -1065 413 -260 -1584 -730 -651 -1707 -791 -269 -65 -1569 -2428 -836 -1064 -2866
1054 -2866 -1550 -57 -391 366 1735 896 -265 1106 1636 -176 -1317 -773 -885 -2016 -2531 -1152 -457
1071 -457 -1673 -1273 78 -407 -2200 -1046 -819 -3051 -2974 -1277 -2230 -2804 -737 -120 -1052 32 1339
1088 1339 1757 557 916 676 -46 -1275 -470 -108 -1239 -1076 -139 313 -1147 -411 998 -390 -489 144
1106 144 -399 -1090 -851 -915 -1281 -570 558 1815 1478 2250 3611 3553 2130 2274 3180 1754 542 891 1243
1125 1243 16 325 1017 1012 815 1517 1042 727 297 1018 841 -93 -155 1777 837 968 1511 3123 3488 2669
1145 2669 3070 3948 2908 3919 3613 1678 2302 1667 1099 275 82 776 955 193 -321 913 1615 -89
1163 -89 -241 175 514 620 679 446 -534 360 1152 397 1033 2370 3834 2178 1700 1656 1763 849 151 -1823
1183 -1823 -1131 -631 -640 -1607 -2000 -595 416 -1196 -1910 -926 487 -1356 -1652 -1562 -1182 -103 -467 -1404 115
1202 115 1511 1270 1621 734 1651 2057 1070 -1382 -1050 -538 -1062 -2017 -1961 -434 220 -341 -1174 -1096 660
1221 660 83 -1157 -1504 -1149 -469 84 -1530 -1127 618 2515 915 397 1225 2159 1193 -264 150 138
1239 138 1335 -755 -1837 -612 349 369 -816 -423 461 1504 945 -944 317 1188 826 -479 -105
1256 -105 885 1693 1471 -535 622 2227 2811 1521 366 168 1237 507 -2032 -2006 -554 -236 -1744
1273 -1744 -2155 -1046 180 543 -210 -818 1281 1606 413 77 133 1062 914 182 -1134 1159 2496 922
1291 922 -940 199 926 535 -813 -2010 -1205 22 -1538 -3344 -2823 -1892 -808 -1407 -2397 -1079 442
1308 442 452 -1153 -380 591 233 -767 -1312 -379 249 638 -576 -514 274 2132 815 -1083 -1173 328 -187
1327 -187 -2390 -3602 -1618 -866 -1550 -3328 -1902 -775 197 -517 -1860 -356 1103 229 -1755 -1559 272
1344 272 465 -1594 -1721 -180 1342 882 -220 -52 1132 610 -637 -1740 -1311 253 -313 -2686 -2093
1361 -2093 544 1273 -342 -931 -171 1220 1161 -500 -825 332 1197 -110 -292 -706 1420 1838 929 -1330
1379 -1330 1301 2223 866 -929 -1383 102 238 268 -1443 -1053 112 850 -1306 -948 838 2229 911
1396 911 -57 665 2131 669 -1722 -207 631 -92 157 -224 -188 1367 2120 -222 -609 -552 905 -128
1414 -128 -1641 -1447 474 794 -724 -890 746 829 391 -193 -428 1023 2223 938 -1316 60 1552
1431 1552 398 -654 -691 954 885 419 -129 755 2012 1568 103 -1240 -36 1312 749 -1677 -1543
1448 -1543 881 887 -923 -668 1190 2443 933 -129 98 1091 683 -345 -1065 -368 1050 1660 -363
1465 -363 -614 1817 2588 723 -252 938 1655 -294 -1377 -534 -808 1000 350 -1045 -517 1622 1775
1482 1775 -98 -501 1251 1713 889 -901 -138 1198 826 -710 272 135 722 1465 127 -504 1336
1499 1336 1125 -216 -1194 -115 1142 225 -1598 -1157 482 742 -590 -1184 320 1408 724 173 -299
1516 -299 31 1379 -554 -1083 35 1650 1205 -381 -42 942 1070 791 -248 497 95 481 -503 -1410
1534 -1410 -1150 652 526 -1507 -760 1083 808 -636 -167 725 406 109 -780 -677 972 658 -113 -680
1552 -680 -25 1782 1020 468 194 899 1700 -291 -1264 -72 -231 -283 -756 -1343 -397 7 158 -1060 -816
1571 -816 543 777 -640 -1580 -1053 400 -131 -1534 397 403 -545 858 -450 201 846 1170 2 -802
1589 -802 144 542 -547 -1451 -662 -191 -182 -460 -277 629 135 354 -921 -986 -480 674 -1251 -2129 -837
1608 -837 440 -922 -666 25 233 -134 -396 -364 -51 -317 -288 -513 -1690 -582 -102 -953 -1865 -442 717
1627 717 344 -749 -382 350 -126 -403 -651 -516 -604 -782 -1171 -1031 -723 -182 583 -85 26 804 -128 -1041
1647 -1041 -1266 -850 -1124 -1367 -1077 -1124 -1017 -768 -277 -1132 -525 872 944 -450 454 129 574 -497 -446 70
1667 70 523 -62 -21 676 -175 763 -159 -1100 -708 -136 -7 -1379 -1237 -774 -726 -1576 -1367 -574 -344 -380 73
1688 73 155 -412 155 1114 -89 101 765 506 905 -109 1414 904 822 189 699 441 177 -807 -601 127
1708 127 -939 -688 -334 -1353 -927 -738 -336 -746 -217 878 699 -10 195 821 -89 -47 509 341 799
1727 799 583 1421 888 1054 1064 726 -752 -219 -370 -642 -1002 -895 -810 -119 -680 -94 380 -63 548 375
1747 375 301 473 1012 270 1100 -108 36 928 562 417 716 463 296 548 27 -643 -1103 2 -505 152
1767 152 -57 -308 -193 -277 223 24 807 1110 1034 1554 847 1002 730 871 262 763 287 -46 718 287 -205
1788 -205 5 145 210 -528 -134 -572 -350 301 -14 -308 -552 -1407 978 862 545 757 1396 889 625 963
1808 963 1632 -30 651 604 395 -373 423 229 -534 -113 -473 -236 -603 -380 -160 -716 -1080 15 -312 -276
1828 -276 -89 285 378 404 1209 537 1242 775 171 763 74 345 581 525 298 974 506 255 394 -6 78
1849 78 -772 -789 -157 -565 -569 19 -687 -229 345 123 407 638 354 695 252 915 1114 204 732 -81 84
1870 84 -216 -493 -34 159 -5 108 -232 74 -279 160 -326 -555 -6 192 161 -128 432 816 571 398 521
1891 521 651 457 92 -190 20 185 -334 -105 -637 -67 -235 156 2 -23 -397 71 -158 -4 -388 -139
1911 -139 -412 -438 -370 -138 -64 -873 188 308 -133 309 -123 407 789 -411 -365 -575 -237 -627 -937 -179 -744
1932 -744 -587 -155 -772 -421 -129 223 -557 -629 -990 -83 -138 -321 -867 464 108 -641 928 198 24 128
1952 128 -676 -509 -23 -257 -354 -655 -394 -269 -269 -318 -531 430 -28 -426 -23 -147 -505 -532 -553 -982 -287 -55
1974 -55 -109 -190 347 417 314 -165 -515 297 72 -657 -246 -467 120 -115 -771 135 -458 251 -583 -111 -388
1995 -388 -137 530 -696 -63 -420 -532 -177 -1253 -176 591 -175 -867 -605 510 179 -223 -218 -295 425 -622
2015 -622 -421 -955 -954 354 -115 -682 -801 361 464 456 52 68 -158 -495 -44 -787 82 333 -70 -725 -349
2036 -349 868 -82 -954 -100 225 938 228 -1105 -529 -305 639 -3 -253 -172 458 -352 -1098 -294 467 847
2056 847 37 -557 -299 633 162 -1152 -320 526 936 -289 -471 1090 938 951 -422 -611 26 883 -486
2075 -486 -1126 -619 371 472 -261 -493 169 1063 237 -72 -2 590 361 -688 -1378 -236 443 351 -1053 -1071
2095 -1071 1158 1118 -250 -1392 -113 920 110 -536 -1310 358 908 -598 -294 347 1020 792 143 -271
2113 -271 570 1122 328 -1229 -791 703 505 -854 -908 187 856 387 -1210 659 1071 1015 -1031 -671
2131 -671 -212 1348 254 -870 16 933 1483 -493 -1174 369 303 779 -990 -1062 181 1443 -539 -888
2149 -888 175 1372 964 -461 -555 863 1623 -297 -1176 -128 629 681 -211 -1109 181 1371 297 -929
2167 -929 -123 777 1123 -376 -452 -397 1333 239 -1031 -338 1280 1213 249 -689 -23 1905 1657 -582 -568
2186 -568 1503 1654 389 -859 -87 1449 451 -1126 -1340 840 1384 -112 -903 -826 1055 798 -802
2203 -802 -1192 670 1295 -137 -907 -1557 1132 1135 -62 -1176 384 1862 349 -1029 -268 1028 1619
2220 1619 -901 -2223 -403 1497 1221 -1365 -1997 868 651 -496 -2228 -1275 808 300 -1777 -1337
2236 -1337 194 1467 -13 -1672 -434 1405 1824 -1414 -1417 553 1333 -196 -1487 -1553 66 1775 -866
2253 -866 -2046 188 1706 496 -2118 -1422 1013 1868 -882 -2343 -1061 1012 478 -1786 -975 1155
2269 1155 2327 45 -1631 371 2189 1147 -434 -1536 -162 1992 -285 -1698 -703 1358 1555
2284 1555 -1395 -1800 698 1944 558 -1484 -1605 1695 2357 -909 -2397 448 2321 1254 -1266 -1384
2300 -1384 1787 1959 -25 -2150 299 2118 916 -1503 -2053 891 2369 -288 -2357 -876 1818
2315 1818 1638 -1149 -1874 110 2451 -34 -2469 -804 1675 1319 -1076 -1716 645 2337 1055 -2132
2331 -2132 -1710 1962 1535 -762 -2071 -226 1824 828 -2343 -2099 951 1613 -1010 -3649 -896 1497
2347 1497 1449 -1810 -2153 1102 1919 -51 -1375 -324 2232 2060 -1209 -2090 642 2251 -233 -2860
2363 -2860 -1348 1619 1784 -1030 -2220 -398 2248 418 -2863 -1768 1585 1622 -1186 -2773 -385 2066
2379 2066 1026 -1777 -2516 1020 2492 -486 -2327 -661 1666 1446 -1048 -1888 1314 2589 -469 -2688
2395 -2688 -676 1915 2331 -1434 -2851 896 2576 900 -1793 -735 1891 2425 -693 -2553 928
2410 928 3144 1192 -2379 -1222 1259 3001 -165 -2547 -560 3578 1259 -2302 -2492 1503 3187
2425 3187 -477 -2917 -485 2003 1951 -2331 -3346 728 2510 555 -2297 -1146 2062 2698 -1970 -2750
2441 -2750 821 2654 353 -3303 -1323 2551 2383 -1533 -2727 24 2528 672 -3224 -1655 1466
2456 1466 2589 -496 -3112 -146 2532 1799 -2198 -1704 1067 3102 457 -3269 -1024 3223 1784
2471 1784 -1831 -2376 764 3612 427 -2853 -1272 2458 2459 -1594 -2698 449 2836 337 -3359 -2287
2487 -2287 2391 2400 -997 -2720 -101 3317 1517 -1898 -1557 1340 3026 -298 -2605 -277 2339 1416
2503 1416 -1605 -2553 647 3363 205 -2963 -666 2519 1254 -2843 -2331 1288 3059 617 -2655
2518 -2655 -1290 3456 2778 -1621 -2285 492 2857 723 -2322 -2816 2562 2712 -1377 -3115 -737 2297
2534 2297 871 -1828 -3000 1468 2960 -580 -3359 -442 3272 1862 -1875 -2939 1740 3122 -267
2549 -267 -2962 -866 2696 2624 -1665 -2944 222 2179 452 -3512 -1116 2703 2266 -1349 -2168 -378
2565 -378 3232 1002 -2460 -2070 2188 2485 -678 -3166 -445 2819 1263 -2280 -2029 1809 2933 -285
2581 -285 -2648 -360 1977 1555 -1913 -2182 445 2705 48 -2894 -1461 2562 2221 -1645 -2936 964
2597 964 3029 509 -3800 -1852 2117 2097 -1300 -3355 121 2737 820 -2975 -2222 1732 2619 -1036
2613 -1036 -2928 -806 2920 1671 -2462 -1787 1420 3009 -218 -3995 -1000 3020 2412 -1584 -2668
2628 -2668 617 3140 -300 -3139 -1099 2499 1958 -1345 -2461 688 2122 368 -2606 -1648 2259
2643 2259 2107 -1633 -3235 294 2891 874 -2229 -2555 1955 3032 -1101 -2847 -595 1904 1287 -2002
2659 -2002 -2643 1110 2602 -371 -3189 -751 2568 2126 -1528 -2306 694 3298 -278 -3164 -1176 2310
2675 2310 2151 -1803 -2987 616 3400 466 -2900 -1378 2360 2702 -1026 -2579 -272 2900 752
2690 752 -2569 -2378 2134 2243 -928 -2632 -473 3075 1620 -2690 -2149 1393 2662 -615 -2872 -1014
2706 -1014 2887 1362 -1900 -2752 475 2690 729 -2773 -1603 2573 1721 -1891 -3254 87 2685
2721 2685 1065 -2842 -1694 1836 2751 -1417 -2971 -208 3170 967 -2150 -1836 1331 3041 -460
2736 -460 -2465 73 2105 1664 -2084 -2679 1322 2517 -984 -2545 -999 2428 1733 -1559 -2670 679
2752 679 2527 -123 -2336 -741 2524 2409 -1200 -2769 356 2205 585 -3036 -1363 1841 2324 -786
2768 -786 -2268 557 2462 912 -2654 -2292 1014 2168 -378 -2830 -755 2177 1247 -1625 -1680 1012
2784 1012 2619 -149 -2573 -1291 2523 1447 -1393 -2104 253 2738 324 -1986 -1357 1410 2232 -1359
2800 -1359 -2531 557 2929 1480 -1822 -1303 1391 2434 -491 -2396 43 2368 1488 -1940 -1704 1552
2816 1552 2625 -191 -2190 -176 2117 1448 -1862 -1796 951 2784 150 -2585 -1194 2565 1177 -1651
2832 -1651 -2053 455 2366 778 -2168 -1823 1845 2074 -1258 -1978 70 2073 1780 -1743 -2061 1040
2848 1040 1618 -346 -2635 -388 1871 1646 -1961 -2188 917 2264 -341 -2578 -815 1541 937 -1368
2864 -1368 -2288 889 2397 -9 -2449 -938 2215 1127 -433 -1965 780 1885 1021 -1719 -1012 1606
2880 1606 2160 -642 -2085 155 2246 1483 -1718 -980 1221 1250 -568 -2107 -206 1617 1124 -1940
2896 -1940 -2089 678 1845 -787 -2094 -472 1793 2391 -1135 -1999 543 2121 876 -1955 -1242 975
2912 975 1116 -1376 -1981 370 2032 362 -2369 -909 1203 1429 -139 -2131 215 2135 272 -1695
2928 -1695 -1407 1228 1769 -702 -1399 -336 2280 1291 -1607 -1300 996 1675 -1043 -1527 -850 1600 1044
2945 1044 -1488 -1108 208 1779 123 -2113 -1096 1261 1258 -1186 -1774 813 1939 760 -1559 -1243
2961 -1243 1105 1304 -300 -2566 -365 1026 853 -1193 -1097 749 2208 513 -2190 -144 1643 574
2977 574 -1778 -1559 414 1700 -289 -1618 -608 1503 1842 -180 -1338 519 1695 201 -1529 -971
2993 -971 1313 1516 -638 -976 65 1681 337 -508 -1247 1154 1928 275 -2253 365 1249 224 -1158
3010 -1158 -975 528 1799 66 -1361 -426 1359 654 -1421 -1036 563 751 -335 -1327 -61 1248
3026 1248 1429 -435 -1625 191 1497 666 -1046 -329 1119 1143 -1307 -1448 -205 1052 569 -899 -727
3043 -727 867 1843 133 -1422 -90 1335 298 -1254 -1440 1003 804 24 -1656 -368 733 640 -999
3060 -999 -655 379 1065 -205 -1176 -809 343 937 -864 -1700 -311 1346 684 -1012 -603 1086 1260
3077 1260 -920 -947 795 413 744 -231 -1416 534 1111 32 -1300 -327 830 646 -1026 -930 431
3094 431 1246 -489 -971 -663 396 408 -291 -1088 -610 1512 507 -755 -345 1206 853 -498 -1160 -519
3112 -519 939 -210 -794 34 585 713 -411 -1371 432 860 567 -1126 -903 880 996 -269 -1065 -270
3130 -270 476 768 -1117 -1554 598 1219 15 -598 -127 1102 789 -555 -700 -229 603 30 -797 -377
3148 -377 550 635 -930 -421 146 1280 868 -1511 -676 284 -103 -341 -800 -378 1404 -158 -820 -569 609
3167 609 782 82 -1141 -520 270 736 -657 -1129 805 1155 -246 -620 -562 1039 620 -225 -895 213
3185 213 300 108 -823 -1129 1148 -353 50 -608 268 736 182 -391 374 -10 410 -826 -1008 -268 298
3204 298 583 -324 -219 643 104 -84 -442 -517 789 554 -1215 -299 22 308 -216 -517 -528 506 720 -835
3224 -835 -78 60 276 -61 -877 -278 228 819 -355 88 202 1139 -136 -402 -332 -210 1077 -111 -26
3243 -26 -193 624 506 50 -204 456 -139 -4 -267 -55 1004 195 -81 -779 6 275 -384 -419 -319 378
3263 378 187 -407 -170 193 509 469 -258 -82 906 629 -213 -718 56 -219 93 -894 -98 802 571 -279
3283 -279 -617 -911 415 -204 -219 379 31 109 -110 -504 -676 796 153 -454 175 188 885 94 -638 -561 507
3304 507 173 -812 56 -230 139 486 -905 67 410 372 -375 93 528 -98 464 -581 -290 338 -234 242
3324 242 -408 -233 550 348 -644 -712 195 377 -31 706 38 430 -73 -622 -712 654 558 -118 -1258 -685
3344 -685 860 900 384 -257 -160 830 -349 -303 117 475 467 -222 -72 210 134 -361 -41 9 -70 684 -24 86
3366 86 126 285 -22 -154 75 -225 699 -494 -416 486 288 543 -206 -50 -527 623 -178 -4 -5 -326 -347
3387 -347 -819 -307 -296 239 329 -394 -178 357 -488 -378 -146 314 392 221 180 -375 -102 -89 324 -99 111 129
3409 129 -26 -525 -79 481 406 -318 -389 -291 224 243 -24 64 -306 408 319 -356 257 449 138 -180 140 275
3431 275 336 253 -260 -225 91 54 27 -99 127 933 -191 -324 35 150 -192 227 187 -422 469 394 400 136 -282
3454 -282 -246 -188 -16 -432 -233 310 -281 135 578 83 289 319 348 -475 140 -122 -292 -279 360 -131 -131 380
3476 380 -225 -242 -190 -383 519 208 -215 -476 -524 -321 -405 -313 104 327 -275 288 -18 579 -118 746 -388
3497 -388 -692 -392 16 -89 -292 344 437 342 -153 237 491 183 -313 454 314 -551 -276 -37 -220 -109 67
3518 67 13 -222 -67 630 249 308 -611 -817 -187 -557 364 -138 290 615 25 621 -77 -11 104 286 -60
3539 -60 234 -775 -327 62 168 647 660 -76 171 482 289 268 79 -142 433 -119 538 549 -10 -107 216
3560 216 -126 -479 104 -172 -621 294 -87 335 309 -406 -207 307 -340 -91 -411 -185 -97 -803 -306 -113 228
3581 228 607 -157 -216 9 -49 973 364 247 206 167 292 89 -484 -324 -73 -388 -70 -120 518 -297 -157
3602 -157 -90 485 432 -452 275 -518 -197 719 -404 157 -246 77 -239 -296 -390 -69 -455 185 222 474 -825
3623 -825 -353 -195 -919 362 197 -200 317 65 -299 -291 -72 -501 465 49 -536 230 5 576 467 -360
3643 -360 329 5 370 -222 111 52 -466 292 -367 305 -160 -441 -268 121 283 -66 77 318 -51 -157
3663 -157 -99 -243 11 128 -257 -80 -295 181 -157 -417 -822 134 327 -60 -171 -1035 -257 392 103 -197
3683 -197 -259 141 -59 -118 344 -681 -593 132 -365 204 -410 180 4 -294 12 279 622 -283 -294 -40 -81
3704 -81 623 305 310 -750 -241 -261 29 222 197 -85 25 -168 -163 639 72 -50 -627 -284 -496 369 -311 455
3726 455 192 120 -475 267 526 149 72 -727 138 4 -359 -223 -303 -587 -257 -42 64 403 -486 -279 248
3747 248 -267 228 36 -708 -297 -159 -465 -235 -341 422 270 -717 -116 528 -431 554 146 130 -41 315
3767 315 -133 171 -286 207 27 -701 555 290 482 266 -35 -19 35 -365 607 -67 -549 77 8 141 398
3788 398 -178 290 686 -145 -29 141 -133 -216 7 476 220 -105 -298 77 52 -477 -43 311 -204 87 -197
3809 -197 -161 -458 578 10 -257 -268 -465 202 -788 -56 -177 186 -242 217 -89 155 202 252 -635 366 -473
3830 -473 446 -313 290 715 -324 -234 -439 -385 -320 -128 -968 90 -697 305 -576 -999 -397 -258 305 -298
3850 -298 403 1 478 -732 -345 16 348 182 -295 -262 164 265 255 21 -103 85 189 -118 -305 -68
3870 -68 279 -750 64 210 -353 -440 -292 -84 -95 -298 -389 16 -301 -131 161 627 -94 -812 195 170 -131
3891 -131 785 -182 309 -301 375 -203 -75 344 -229 -1049 566 597 -175 -22 -215 213 -642 -433 300 101
3911 101 153 -113 -11 -421 -366 -196 -365 -62 4 -1 -72 -473 159 0 -165 -203 153 26 79 62 -237 -222 379
3934 379 974 -37 16 292 285 -60 69 -440 -97 -16 -276 386 -123 -393 -83 54 -205 -407 14 -172 67
3955 67 -63 472 70 565 371 -216 -36 130 553 -354 296 6 -459 512 -75 322 34 -63 -112 -1 -36
3976 -36 263 -210 296 411 297 -520 -405 36 -127 -34 218 613 533 -263 123 -299 93 -311 -287 -488 739
3997 739 193 -212 -44 -542 -102 -506 -511 -445 364 110 179 -490 -68 172 -746 -280 7 240 95 5 725 -692
4019 -692 -155 -821 -22 -225 214 509 273 -30 -226 42 480 -292 686 96 162 -311 -236 58 205 92 -101
4040 -101 281 162 -24 -235 405 -34 -123 -370 254 -277 -93 -17 843 -452 -106 64 210 -31 251 462
4060 462 129 -220 118 568 -318 291 -274 -214 318 -61 -504 -57 318 712 -245 114 257 -338 -32 202
4080 202 15 -302 232 -234 564 605 -63 -956 301 -816 118 39 -144 -135 843 -305 329 -83 556 599 100
4101 100 226 -138 382 -99 -184 703 -59 -453 106 219 -170 -275 -103 189 -376 -1097 -390 523 394 -118
4121 -118 -909 -453 97 -503 574 -506 97 -94 234 253 -377 -173 208 -89 -1 559 -76 -382 81 205
4141 205 -279 -662 -220 219 18 -472 184 -391 602 -448 -296 -114 41 204 -81 -311 112 466 -717
4160 -717 -301 253 -332 -55 86 111 -165 -479 175 222 -251 429 403 -5 -541 147 212 -352 846 -147 135
4181 135 152 775 51 -121 405 -388 36 369 -168 11 352 -427 143 -30 327 -99 -302 -420 348 -362
4201 -362 -612 -425 438 -622 -189 670 -164 -367 -241 -302 -300 789 -323 62 -35 -661 182 -76 -322 364
4221 364 43 25 50 -293 -74 619 -268 -292 -270 -247 222 -47 371 -227 -329 374 241 -14 281 -324 120 85
4243 85 -627 -53 -144 346 128 231 69 192 -189 -359 597 -73 62 -3 -198 68 270 -71 213 359 -66
4264 -66 -180 -102 -197 -295 144 -163 278 197 16 -127 -536 288 561 152 308 169 368 129 -342 324 46 -186
4286 -186 -774 44 -28 243 31 -16 -418 -102 -24 28 463 -39 -384 459 156 94 -389 -457 619 -156 -420 -150
4308 -150 -295 -344 355 154 179 -304 -403 -163 -370 69 326 -588 57 191 0 -320 -331 -82 -409 -326 -357 -32
4330 -32 -100 -321 -308 468 -82 417 -77 173 193 -84 452 807 -470 280 -176 -103 -16 -530 -121 47 -409 209
4352 209 -272 -225 214 -153 185 -72 -492 284 220 129 -103 313 -258 36 315 133 -311 -91 -208 248 -541
4373 -541 194 -13 -99 245 -313 409 399 284 65 247 -261 -194 448 188 238 496 -146 -168 -431 -459 542 291
4395 291 -460 -536 -201 162 617 262 471 -474 262 199 159 185 521 582 338 45 -552 -380 305 173 -345 513
4417 513 -4 674 -177 -250 -103 474 -457 -225 242 519 -437 -618 344 190 64 -68 -385 37 293 360 412
4438 412 631 273 26 750 -350 -252 142 152 -787 -93 -40 2 -59 326 91 51 -294 290 292 -540 149 -35
4460 -35 52 -515 -95 -319 263 -405 -115 -811 -518 276 -147 -116 213 561 -137 -299 358 -229 240 -289 -17
4481 -17 261 -116 568 558 155 266 134 -580 163 412 -201 263 313 804 -388 25 528 -709 -368 133
4501 133 -37 255 339 37 54 288 -54 153 76 -42 216 470 96 108 -48 -158 -329 219 -292 81 -843
4522 -843 91 -41 343 -411 131 -528 -780 -233 -494 -165 -141 56 240 -225 -356 281 -331 -710 248 -437
4542 -437 134 -303 -380 -63 -316 295 -431 594 67 -243 -4 -396 -291 203 555 222 -621 -14 81 143 -11
4563 -11 -3 -346 43 -64 -529 55 313 544 -192 240 280 -143 -6 -116 203 -253 76 543 204 82 -22
4584 -22 100 9 474 -7 -606 556 16 -446 462 150 -333 -180 -226 -291 -411 -46 85 -363 -231 -213 -321
4605 -321 -223 -554 -78 530 272 -344 475 -152 656 548 -2 -336 9 -47 476 -292 345 184 -107 260 -13
4626 -13 902 83 -42 -364 -156 95 -186 17 -244 464 331 103 -463 644 -384 -764 406 263 216 -258
4646 -258 353 67 -432 -531 496 -399 73 380 -257 114 -34 -169 -417 39 -11 -485 -42 -639 -15 80 1
4667 1 230 -267 30 -732 -140 -75 -325 72 283 -53 -60 366 -74 37 457 -534 658 453 -121 -157 -285 -306
4689 -306 864 256 -654 170 326 -455 292 74 -103 -354 200 281 -211 173 60 -415 -518 133 393 311
4709 311 -3 -99 93 -429 478 171 -885 293 81 416 334 -61 -584 564 -40 -283 475 -252 -25 601
4729 601 604 343 -429 -455 246 -168 268 -116 -179 -436 -244 280 77 -401 -537 -311 -85 491 -130 -404 171
4750 171 372 -310 -65 200 -112 -39 214 2 -81 -546 -386 265 258 -302 80 -87 -274 -330 513 -84 -163 -487
4772 -487 121 663 -305 -157 421 -365 251 287 328 177 -287 -198 426 31 435 51 32 -93 115 188 -293 270
4794 270 116 278 -733 88 -245 -165 531 6 -104 -16 -199 173 18 -313 -483 461 -171 171 303 -246
4814 -246 178 676 440 -359 -101 84 82 -217 624 250 209 -27 -303 90 -76 -207 294 -52 -197 42 -3
4835 -3 -119 -206 71 -636 -251 325 243 -415 450 -152 -568 74 270 525 159 -121 -135 -343 430 -212 -364 24
4857 24 302 157 -112 -284 -537 35 328 -117 282 297 112 -655 303 581 -37 -201 -503 -337 -72 83 -247
4878 -247 -620 -323 77 135 356 -293 205 -22 202 59 469 273 -204 314 140 430 -178 480 484 100 286
4899 286 245 93 -385 -366 -77 333 -89 592 169 508 19 138 -521 -296 86 -122 103 263 227 67 -142
4920 -142 -304 938 406 -142 -117 -458 261 82 -345 -111 -260 529 -454 235 637 107 182 -118 -21 267 -86
4941 -86 -363 -206 246 496 -392 -76 -426 -48 103 343 325 15 198 180 374 -400 -1 -62 -331 -290 -157 -208
4963 -208 -322 300 448 478 146 314 -30 -136 -341 151 -21 67 256 364 -95 68 -265 102 -282 -59 362
4984 362 92 -11 -488 -326 -798 -264 -328 -441 -103 -92 -372 -314 220 -365 173 233 -1 216 -677 859 210
5005 210 708 -355 -568 -283 -133 -105 -280 332 314 -1098 -693 -257 121 33 379 712 64 -82 -307 180
5025 180 -190 59 335 -817 260 403 749 -127 68 -459 427 -88 404 130 -347 264 239 245 434 495 40
5046 40 121 -79 -20 -21 -110 106 268 224 93 -31 -221 353 -99 550 -398 141 140 -34 783 92 -390 -40 -125
5069 -125 -39 76 176 87 408 -247 299 151 -53 -423 291 353 -109 173 -480 65 521 392 146 -254 -208
5090 -208 59 592 -554 -366 358 125 -507 -498 810 402 104 -696 -382 114 -7 138 142 336 -70 -101 -548
5111 -548 346 -8 -368 -732 29 100 157 -270 117 -507 -256 -297 759 15 446 353 535 -314 424 445 -27
5132 -27 71 -153 803 116 -162 165 410 -334 -29 386 -664 -38 352 -290 37 321 498 -383 334 -354
5152 -354 21 -22 203 167 -625 -484 -67 426 -352 616 -752 -4 184 -25 32 176 134 312 181 80 148
5173 148 60 -201 -305 43 332 -459 -951 -663 -646 -225 -804 -784 323 -182 -617 -275 -381 -153 297 73 832
5194 832 77 81 700 -79 -810 -549 458 11 -314 -81 327 -233 68 347 -537 686 -42 -259 41 338
5214 338 415 11 -247 180 272 -274 -76 410 -193 191 112 23 -824 184 -275 -37 -292 68 478 -339 -438
5235 -438 -210 -32 -39 290 -315 1136 -16 -311 -323 281 121 87 -651 -231 191 -399 -341 84 -154 501 55
5256 55 -185 -210 414 -16 -208 -127 653 244 32 -377 -608 -38 298 358 274 -428 363 -495 -106 -527 3 -209
5278 -209 -324 137 -5 -328 385 -606 -581 769 -1 -250 100 -382 182 -112 -91 140 -515 -51 598 -141
5298 -141 778 -562 -250 -122 -434 -104 85 249 802 -737 358 -186 238 -287 303 -175 -126 66 -278
5317 -278 261 -491 -734 -20 162 -321 125 43 -771 314 93 -120 229 179 -782 -483 -153 -183 -54 633 129
5338 129 -144 -399 -156 -52 -256 -581 160 -77 -65 174 -255 313 110 -117 133 -371 527 985 465 254
5358 254 478 185 103 26 -377 -656 97 -132 -867 213 -275 -111 -259 -205 -588 187 -41 475 181 534 752
5379 752 757 83 -318 319 410 -499 -324 488 80 -155 236 35 -212 347 -539 40 -264 586 -428 -396 -585
5400 -585 -190 497 15 -30 498 -37 -606 270 864 -167 325 -139 -388 -330 286 202 -568 -180 824 -153
5420 -153 -304 -606 42 899 -298 166 468 226 -159 166 41 135 173 -703 -510 -4 -44 329 -215 -276 190
5441 190 -630 285 509 -488 -449 -318 -130 -322 -483 72 545 374 -167 -305 269 -541 -290 -23 11 149 132
5462 132 205 -64 4 -5 285 222 261 488 -566 -87 24 -387 -793 -321 267 241 428 130 116 72 55 -24 32 -326
5486 -326 407 1181 -302 -304 -267 -343 -158 -533 -681 202 -275 -183 394 14 -281 270 -623 -468 -467 -426 463 -556
5508 -556 310 -546 1154 204 170 162 218 94 -165 643 -238 41 -640 92 -291 75 -60 -243 -343 68 -1039
5529 -1039 -548 600 129 4 799 -763 205 -371 -653 -89 723 48 509 404 -435 889 -490 -156
5547 -156 87 -227 -217 33 -204 -144 210 624 -173 791 -50 -252 499 145 542 90 -330 -147 -9 -261 225
5568 225 83 -236 -522 -861 -479 235 341 114 -647 467 -79 68 407 -217 349 -376 -109 84 132 197
5588 197 -82 145 -193 -266 572 438 51 183 167 -52 -561 102 67 7 248 273 -100 -134 489 64 237 -128
5610 -128 351 313 203 -118 -123 -594 -163 532 -185 235 -236 -289 -51 -247 -90 -25 266 351 40 328 -473 79
5632 79 606 -344 -431 -373 108 481 267 -135 109 177 7 -180 -231 -463 236 -344 -19 560 8 -326 -191 -118
5654 -118 -382 321 355 -257 -990 -117 -60 -216 31 -702 -284 -736 -440 -321 -25 554 -231 -199 -268 437 -95
5675 -95 -430 -298 -107 -993 -292 280 -386 -373 199 -179 510 -70 413 87 90 513 518 118 777 52 190 -132
5697 -132 -228 91 -251 353 258 -805 1028 -45 -219 163 -644 -77 71 -329 99 -403 159 108 278 220
5717 220 -416 -212 151 -12 -498 -195 -206 45 -349 176 -338 63 -92 -123 -615 -372 -2 -109 94 -313 379
5738 379 176 492 207 154 -446 765 -380 283 130 246 158 26 756 -167 292 -150 -144 -241 29 248 41
5759 41 375 186 -16 -38 453 10 493 -17 -128 -859 -248 235 147 -191 -415 194 -60 244 -72 49 196
5780 196 679 -456 -44 -128 288 -238 -211 -192 -91 -379 300 10 515 270 -419 -542 -20 -243 229 -9 390
5801 390 -436 89 551 15 -79 92 -3 -349 516 111 -298 -123 -32 -383 -276 -112 105 -305 569 -841 -254
5822 -254 -13 -13 66 318 -153 -184 -124 -98 176 -84 -272 380 -536 201 -508 -610 196 163 55 318 565 214
5844 214 -8 -68 -446 661 5 94 -1 -225 -187 86 275 27 -213 -310 639 -423 270 260 -530 248 -73
5865 -73 -80 -358 -142 57 -146 -336 -28 -76 -505 166 699 -334 -154 54 -321 519 258 632 -235 -366 -60
5886 -60 -153 394 -40 275 267 -273 194 30 47 193 282 -1146 21 -34 111 -171 -83 -937 -206 470 -382 41
5908 41 -132 756 345 299 -169 -606 46 -400 -263 -331 63 354 -18 -162 -103 117 167 406 239 -452 -392 431
5930 431 -393 487 -832 584 41 84 -106 328 -153 -36 464 -240 -462 -449 -189 62 -344 256 457 -309
5950 -309 -114 45 527 171 239 -592 -391 189 -102 6 272 361 85 -228 -520 -679 -3 697 33 295 -423
5971 -423 -289 -294 -227 459 48 253 374 -210 -50 -165 97 254 -137 -251 -149 242 -46 -223 -149 -285 -216 -426
5993 -426 342 182 195 -72 -70 -494 391 -18 -34 344 436 -329 250 349 461 214 489 647 698 -495 345 -184
6015 -184 -215 390 -92 -242 -479 -255 -134 15 392 97 201 -809 -98 711 277 509 -30 -450 247 305
6035 305 -210 -11 -6 -586 -220 662 533 -346 -52 -282 -151 54 -494 198 245 -32 83 -170 25 -548 587
6056 587 -126 -142 20 -30 254 160 -74 -232 571 264 144 -841 532 211 902 -248 16 590 -301 -369 625
6077 625 -71 277 76 -83 333 -315 -736 -344 261 -251 -87 -494 61 244 70 70 261 -131 -29 -238 -806
6098 -806 51 361 -69 -267 -234 -176 320 129 -240 287 63 -208 -481 -506 575 236 334 -398 59 -89 13
6119 13 415 -197 -96 20 159 71 -132 -272 573 -5 721 410 5 43 161 542 250 -11 223 203 532
6140 532 206 39 -134 -261 115 360 -34 0 44 113 120 -620 55 412 250 -208 -175 -289 455 23 27 185 107
6163 107 168 330 121 396 40 363 -322 -54 -737 -312 229 577 267 -623 -322 365 -148 417 336 -115 119
6184 119 118 477 293 -15 302 266 14 552 -204 371 227 -136 -269 -166 676 -63 14 -39 606 187 283 -114
6206 -114 -243 -143 -1012 73 -385 47 -275 189 458 364 -165 113 320 299 -82 -140 218 154 302 -688 -58
6227 -58 347 128 -122 -732 -427 -503 112 -101 583 170 -606 146 -134 503 88 410 142 -247 128 -682 51
6248 51 94 -114 198 172 -660 197 415 -169 443 -589 69 -255 -122 -337 706 726 249 -251 -179 636 200
6269 200 -230 -331 -413 -169 -296 87 302 24 -498 763 -29 308 -312 -573 361 -621 102 187 -140 401
6289 401 283 421 -129 220 31 -640 -194 -182 579 -185 -379 131 209 165 276 -241 229 671 -119 -290 87
6310 87 72 272 -311 -23 70 347 127 288 -318 15 38 -56 -175 237 453 -440 790 -177 249 383 -296
6331 -296 -160 65 23 153 -136 199 240 -913 28 118 -176 -452 -140 -38 -196 691 -196 -875 -264 -619 -279
6352 -279 -524 215 275 -116 210 294 -106 -89 370 689 -202 -107 -519 -79 -335 57 353 444 -222 -105 301 -770
6374 -770 293 262 -237 245 786 185 -444 134 -362 337 -177 531 514 147 160 41 920 401 44 -301 -252
6395 -252 144 216 -525 -217 -209 -32 171 174 74 -141 18 297 520 393 -35 46 232 227 -710 -447 290 11 20
6418 20 -254 -482 -259 68 -51 -50 -40 26 -646 -667 3 -666 108 -106 -206 115 -381 -32 -284 669 102 -303
6440 -303 -517 397 0 -557 327 -106 216 187 -187 49 712 -608 942 -215 -103 351 216 117 256 272
6460 272 -607 786 -352 130 -267 -38 -144 130 221 258 -380 -491 423 508 -210 823 377 40 -153 -38
6480 -38 -63 216 -148 101 285 -91 290 -275 446 -360 368 -20 606 -94 208 -576 73 -646 -34 125 259
6501 259 68 77 -302 183 44 239 -163 142 104 -126 996 -825 -96 -439 96 80 -394 394 231 -139 48
6522 48 550 -108 -12 -271 -427 -274 199 83 -360 320 -183 -161 42 -329 298 188 -295 -66 -624 -281 -464
6543 -464 -186 -118 127 -280 5 432 -96 -93 -358 -62 192 373 431 -68 -469 -277 486 345 43 -51 231 -357
6565 -357 -24 -349 307 -432 532 73 457 197 50 -547 -58 420 163 248 -216 -241 198 291 8 118 46
6586 46 -88 -273 -186 291 -649 31 -85 56 -256 -246 -246 -268 -147 -650 -169 172 92 117 -204 156 193 30 847
6609 847 -604 234 341 -805 -22 339 -186 -812 102 450 351 50 -60 279 -369 -264 -859 -45 54 67
6629 67 337 732 281 456 209 595 91 -315 220 254 23 -355 474 -393 252 525 15 119 -18 -576 -310
6650 -310 -594 667 -420 -232 -63 -235 -66 -758 -367 -44 68 -149 358 -360 184 30 27 -356 196 -33
6670 -33 -717 624 68 104 269 225 -99 -178 285 -313 -262 -512 52 226 622 -147 702 275 239 190 -497 -372
6692 -372 -54 263 149 268 804 246 -139 -54 112 170 363 -23 -106 134 229 -260 -388 -49 45 278 -523 -539
6714 -539 295 116 -359 203 355 -39 67 -452 -736 149 -228 360 -283 464 240 774 -260 -193 212 85
6734 85 257 482 -41 -217 356 -640 218 -351 308 -318 425 -419 246 -313 -194 348 173 -176 360 7
6754 7 -241 -46 149 -183 -124 350 72 171 -375 884 -378 112 -158 837 -271 -122 173 -356 82 -79
6774 -79 0 -896 -184 -77 126 32 -245 -31 -27 216 112 -22 503 -425 -19 18 427 -115 -372 300 178 56
6796 56 107 304 -458 686 -153 -485 475 -180 -304 -79 -362 -260 -307 -250 170 532 55 -145 349 -771 56
6817 56 24 -470 132 94 277 -393 -319 -75 -71 182 114 -80 87 519 -32 531 48 -289 994 36 -243 11
6839 11 338 -3 -14 778 232 262 192 -714 -280 -216 427 7 365 -29 -171 1 -77 -670 -351 -242 532 64
6861 64 -13 -241 409 -100 -320 899 -206 -489 -240 -28 -619 445 737 264 169 -434 206 -513 -125 651
6881 651 1 50 -80 -519 -29 467 558 -201 -50 240 734 -582 -336 60 -216 226 -118 123 -435 100
6901 100 -336 -112 -155 -240 -336 349 398 -429 -482 -85 41 -316 401 -325 66 -286 -67 68 -81 -433 39 -284
6923 -284 -329 181 -1 419 -145 -247 590 203 104 200 -514 -304 140 373 638 -879 682 -274 224 -64
6943 -64 343 -293 -48 157 435 126 55 120 546 -454 -249 538 399 -153 446 354 -591 80 14 660 -138
6964 -138 584 -368 -40 301 -714 -74 47 -116 569 -69 -491 136 -270 70 290 783 -523 163 -58
6983 -58 -333 -435 297 332 131 674 560 108 -439 73 299 -2 198 28 733 -19 194 -113 67 31 7
7004 7 -94 431 39 -132 -110 63 11 96 -27 -621 563 377 -219 -216 -146 786 -342 173 -34 -366 -413 -242
7026 -242 149 -76 574 -408 612 97 216 -3 347 98 -366 -622 587 4 -123 -203 93 -3 -324 57
7046 57 -922 413 -866 -275 -136 172 556 264 478 89 620 277 779 -418 55 410 188 -116 422
7065 422 -325 -434 193 -231 -123 -518 -586 -52 -53 -111 -42 507 394 -410 138 216 571 -26 -160 -422 367 157
7087 157 -621 -46 450 330 -291 105 95 6 -132 -82 461 -48 259 -444 278 219 30 157 -352 -535 -461 -281
7109 -281 -531 -392 -583 -309 210 123 245 397 291 -210 135 -21 -113 -93 365 -92 213 285 -139 -331 164
7130 164 -201 126 112 674 5 -84 86 -203 -2 73 -114 -393 -142 112 -656 441 -414 -371 446 356 272 98
7152 98 -234 200 -240 -229 168 -260 -221 -135 -581 -88 648 -934 278 -119 427 -168 716 371 -86 -225 -205
7173 -205 565 35 -325 86 -827 -291 -394 493 199 6 236 -340 -662 471 743 713 -5 145 -96 246
7193 246 -574 -991 176 -45 -516 -42 -166 66 -388 -293 -539 323 199 -94 -554 -338 -340 -734 -52 33 -114
7214 -114 -832 244 248 -41 -287 -540 -103 117 -24 594 -624 -74 103 -334 117 -460 -81 150 586 383
7234 383 73 1150 418 78 300 -43 -197 -113 59 17 587 477 -782 -174 680 -139 -17 511 575 -140
7254 -140 -134 -16 587 -185 -19 -363 300 -269 371 46 39 552 756 -696 158 -319 -534 -133 -503 68 325
7275 325 -467 688 272 406 -227 -160 -152 -1279 -180 49 498 50 64 -42 -284 -59 127 -220 286 325 -106
7296 -106 310 -499 210 200 128 173 -450 81 -26 -225 -52 811 476 787 680 -31 -646 56 104 612 437
7317 437 -279 176 -94 31 275 -387 -411 536 164 -207 -277 342 -383 394 165 -390 456 286 -2 870 63
7338 63 -273 461 -707 15 390 793 504 -507 -147 -942 -144 -197 377 -171 39 198 389 -252 6 -360
7358 -360 59 316 -605 -439 475 -624 101 -9 -391 489 -8 476 -678 -244 -295 -588 595 -99 469
7377 469 635 92 -768 -180 -601 -559 525 346 -205 309 -230 -229 -339 -57 -232 -45 -123 -68 548 -17 422
7398 422 -134 821 -5 671 -196 -105 428 203 -240 48 -443 595 -344 133 167 -135 133 -795 -362 391
7418 391 18 -239 -76 140 605 -276 412 424 137 200 435 25 -96 121 315 178 -98 476 235 118 671
7439 671 -450 493 -207 108 -147 423 485 -345 108 -196 -120 193 -44 82 14 -310 334 -41 -75 -173 -158 442
7461 442 199 -417 -393 151 -7 198 -298 -512 344 -108 686 -513 -410 -629 -241 212 -19 -120 39 -150
7481 -150 294 270 -768 90 476 -153 390 -429 423 720 454 -77 -142 -322 -195 264 -802 -596 -312 -244
7501 -244 -609 -11 -200 -117 225 -649 -757 532 267 -5 -272 359 -20 9 26 -102 179 -425 651 244
7521 244 20 596 207 -428 -48 -496 -642 -284 56 125 153 245 -245 -36 17 -329 -118 -321 -125 71 479
7542 479 37 117 84 245 71 -69 80 -781 -230 144 -248 -10 -427 162 182 1 157 413 209 -466 -220
7563 -220 -49 188 605 -539 593 -52 364 -149 -289 -337 -172 -373 -337 -277 92 -713 -261 -420 604 -273
7583 -273 13 -319 -421 795 131 -59 -558 -410 -72 -506 -240 721 588 -9 -136 -143 -548 140 -49 -231
7603 -231 704 283 -51 -507 -380 338 85 601 -706 39 505 266 267 -93 50 548 -548 -356 -249 423
7623 423 -109 122 -354 119 265 203 104 -277 -90 -328 -91 94 -55 322 -462 -530 -308 414 -454 -81 358
7644 358 -34 -278 468 -4 -705 -373 141 421 -167 657 -113 -109 188 -335 54 -104 -641 45 644 -407
7664 -407 -444 -209 127 413 308 -227 107 79 -44 -134 -229 445 313 61 -535 736 -27 468 -83 294 422
7685 422 411 14 -547 -89 -288 -127 505 713 -95 -100 143 -278 117 -101 -370 117 -163 159 199 -224 -307 -402
7707 -402 -430 -482 -56 228 -422 87 439 366 151 600 -147 -7 421 56 -308 470 -105 213 -270 -284 114
7728 114 220 774 135 276 470 -311 -186 -336 -309 -612 -225 131 -133 -72 25 308 -12 -152 19 729 61
7749 61 -210 453 111 -981 209 -343 -505 333 -191 264 201 716 -250 447 -483 274 -314 118 413 -24
7769 -24 -539 -610 80 -640 56 -139 -478 760 268 -204 309 287 -358 -30 -170 -22 -22 -126 1 -248 -170 -151
7791 -151 522 72 -240 -403 -314 -427 -117 -734 92 283 -297 209 730 650 -377 -268 -254 213 -115 -472 -100
7812 -100 181 -407 105 492 330 348 -169 264 782 96 292 141 -197 257 -124 -480 -82 -116 -61 231 -366
7833 -366 614 -234 379 21 -490 -123 -182 403 -69 103 -303 -427 314 -92 32 110 -357 1195 -61 0
7853 0 -12 -821 345 -409 -186 -81 150 -87 -68 -282 -87 -271 -667 447 490 -57 -204 139 -63 255 46
7874 46 -133 -290 30 283 426 24 -114 -400 243 363 35 294 -436 -120 514 152 -16 278 217 564 126
7895 126 72 -82 -71 564 -102 414 -174 108 332 -50 -198 -467 76 -224 -163 -423 713 -230 -529 -369 41
7916 41 123 -260 -272 49 166 381 322 -55 -153 812 698 -487 -413 328 -240 -101 1069 -130 213 -168 -302
7937 -302 -106 21 237 -198 152 633 -22 -170 -264 -21 447 214 84 -134 -49 178 272 -49 -217 -203 -58
7958 -58 -350 -24 -185 178 -446 -39 -120 242 -113 113 -157 177 -375 -73 -469 -67 449 61 121 202 -546
7979 -546 -187 370 -458 70 87 5 69 -12 667 -259 -39 -74 -192 257 -440 159 -638 -140 -193 240 23 183
8001 183 -31 -519 -227 261 288 304 185 -97 -539 296 -198 -488 353 220 301 319 -258 457 -143 131 -740
8022 -740 -400 1061 128 -226 272 -165 -285 328 -408 9 190 581 -645 259 128 111 363 61 -236 -203
8042 -203 251 -219 -35 374 430 -262 -539 -442 756 306 -28 -429 204 -33 144 126 8 -321 -147 -408 -65
8063 -65 -637 -239 33 345 61 -53 37 -166 151 133 -69 -46 646 -101 -2 -457 -243 -292 -199 -353 61 -44
8085 -44 170 -76 470 455 -80 -196 -593 144 -130 -737 142 98 248 85 434 -42 268 -59 -636 171 45
8106 45 -34 662 -204 -75 11 -315 -30 432 65 264 425 322 -97 -79 -558 -52 266 -117 -36 574 -437
8127 -437 549 109 -307 -517 -267 -505 -381 338 -258 35 279 564 1 -286 173 -202 -426 -138 64 687
8147 687 -741 -468 -657 -130 92 489 -74 417 70 263 -297 198 435 309 -102 -172 1 -298 189 -231
8167 -231 543 82 -207 283 434 158 -63 -226 -4 202 -293 -85 -594 91 -67 -60 -215 472 302 -231 -517
8188 -517 502 167 -45
8191d5
##END NTUPLES=NMR FID
##END=
