##TITLE=1H_EC-3174
 CDCl3, 8 sc, 
 17.1.2019
##JCAMPDX= 6.0         $$ Bruker NMR JCAMP-DX V2.0
##DATA TYPE= NMR FID
##DATA CLASS= NTUPLES
##ORIGIN= UXNMR, Bruker Analytische Messtechnik GmbH
##OWNER= root
$$ XWIN-NMR		Version 3.5
$$ Thu Jan 17 13:53:07 2019 Russian Standard Time (UT+4h)  she@DPX200
##.OBSERVE FREQUENCY= 200.1313
##.OBSERVE NUCLEUS= ^1H
##.DELAY= (6, 6)
##.ACQUISITION MODE= SIMULTANEOUS
##.ACQUISITION SCHEME= undefined
##.AVERAGES= 8
##.DIGITISER RES= 18
##SPECTROMETER/DATA SYSTEM= spect
##.PULSE SEQUENCE= zg30
##.SOLVENT NAME= CDCl3
##.SHIFT REFERENCE= (INTERNAL, CDCl3, 0, 15.7039)
##AUDIT TRAIL= $$ (NUMBER, WHEN, WHO, WHERE, WHAT)
$$ ##TITLE= Audit trail, XWIN-NMR		Version 3.5
$$ ##JCAMPDX= 5.01
$$ ##ORIGIN= Bruker BioSpin GmbH
$$ ##OWNER= she
$$ F:/spectra/data/she/nmr/H-F/1/audita.txt
$$ ##AUDIT TRAIL=  $$ (NUMBER, WHEN, WHO, WHERE, WHAT)
(   1,<2019-01-17 13:52:11.60 +0400>,<she>,<DPX200>,
      <created by zg, POWCHK disabled, PULCHK disabled
       configuration hash MD5:
       00 E9 B6 7A A2 85 ED C7 34 08 36 98 17 FE 4E 26
       data hash MD5: 16K
       BB B3 B6 02 1E 10 46 AA 65 2D A5 A1 D6 DF E9 99>)
$$ ##END=
$$ 
$$ hash MD5
$$ 3A 08 BF 8A 21 B4 85 7B 17 3D DB 8B 2E 36 1D A6
##$RELAX= 
##$RELAX= 
##$RELAX= 
##$RELAX= 
##$RELAX= 
##$RELAX= 
$$ Bruker specific parameters
$$ --------------------------
##$DU= <F:/spectra>
##$EXPNO= 1
##$NAME= <H-F>
##$PROCNO= 1
##$TYPE= <nmr>
##$USER= <she>
##$AMP= (0..31)
100 100 100 100 100 100 100 100 100 100 100 100 100 100 100 100 100 100 
100 100 100 100 100 100 100 100 100 100 100 100 100 100 
##$AQSEQ= 0
##$AQ_mod= 1
##$AUNM= <au_zg>
##$AUTOPOS= <>
##$BF1= 200.13
##$BF2= 200.13
##$BF3= 200.13
##$BF4= 200.13
##$BF5= 200.13
##$BF6= 200.13
##$BF7= 200.13
##$BF8= 200.13
##$BYTORDA= 1
##$CFDGTYP= 0
##$CFRGTYP= 5
##$CHEMSTR= <none>
##$CNST= (0..31)
1 1 145 1 1 1 1 1 1 1 1 1 1 1 1 1 1 1 1 1 1 1 1 1 1 1 1 1 1 1 1 1 
##$CPDPRG= <>
##$CPDPRG1= <>
##$CPDPRG2= <>
##$CPDPRG3= <>
##$CPDPRG4= <mlev>
##$CPDPRG5= <mlev>
##$CPDPRG6= <mlev>
##$CPDPRG7= <mlev>
##$CPDPRG8= <mlev>
##$CPDPRGB= <>
##$CPDPRGT= <>
##$D= (0..31)
0 1.2 0 0 0 0 0 0 0 0 0 0.03 0 0 0 0 0 0 0 0 0 0 0 0 0 0 0 0 0 0 0 0 
##$DATE= 1547718731
##$DBL= (0..7)
120 120 120 120 120 120 120 120 
##$DBP= (0..7)
150 150 150 150 150 150 150 150 
##$DBP07= 0
##$DBPNAM0= <>
##$DBPNAM1= <>
##$DBPNAM2= <>
##$DBPNAM3= <>
##$DBPNAM4= <>
##$DBPNAM5= <>
##$DBPNAM6= <>
##$DBPNAM7= <>
##$DBPOAL= (0..7)
0.5 0.5 0.5 0.5 0.5 0.5 0.5 0.5 
##$DBPOFFS= (0..7)
0 0 0 0 0 0 0 0 
##$DE= 6
##$DECBNUC= <off>
##$DECIM= 32
##$DECNUC= <off>
##$DECSTAT= 4
##$DIGMOD= 1
##$DIGTYP= 9
##$DL= (0..7)
0 120 120 120 120 120 120 120 
##$DP= (0..7)
150 150 150 150 150 150 150 150 
##$DP07= 0
##$DPNAME0= <>
##$DPNAME1= <>
##$DPNAME2= <>
##$DPNAME3= <>
##$DPNAME4= <>
##$DPNAME5= <>
##$DPNAME6= <>
##$DPNAME7= <>
##$DPOAL= (0..7)
0.5 0.5 0.5 0.5 0.5 0.5 0.5 0.5 
##$DPOFFS= (0..7)
0 0 0 0 0 0 0 0 
##$DQDMODE= 0
##$DR= 18
##$DS= 0
##$DSLIST= <SSSSSSSSSSSSSSS>
##$DSPFIRM= 0
$$ [...]
##$SUBNAM2= <"">
##$SUBNAM3= <"">
##$SUBNAM4= <"">
##$SUBNAM5= <"">
##$SUBNAM6= <"">
##$SUBNAM7= <"">
##$SUBNAM8= <"">
##$SUBNAM9= <"">
##$SW= 20.0189088683792
##$SWIBOX= (0..15)
0 0 2 0 0 0 0 0 0 0 0 0 0 0 0 0 
##$SW_h= 4006.41025641026
##$TD= 16384
##$TD0= 1
##$TE= 0
##$TE2= 300
##$TE3= 300
##$TEG= 300
##$TL= (0..7)
0 120 120 120 120 120 120 120 
##$TP= (0..7)
150 150 150 150 150 150 150 150 
##$TP07= 0
##$TPNAME0= <>
##$TPNAME1= <>
##$TPNAME2= <>
##$TPNAME3= <>
##$TPNAME4= <>
##$TPNAME5= <>
##$TPNAME6= <>
##$TPNAME7= <>
##$TPOAL= (0..7)
0.5 0.5 0.5 0.5 0.5 0.5 0.5 0.5 
##$TPOFFS= (0..7)
0 0 0 0 0 0 0 0 
##$TUNHIN= 0
##$TUNHOUT= 0
##$TUNXOUT= 0
##$USERA1= <user>
##$USERA2= <user>
##$USERA3= <user>
##$USERA4= <user>
##$USERA5= <user>
##$V9= 5
##$VALIST= <valist>
##$VCLIST= <CCCCCCCCCCCCCCC>
##$VD= 0
##$VDLIST= <DDDDDDDDDDDDDDD>
##$VPLIST= <PPPPPPPPPPPPPPP>
##$VTLIST= <TTTTTTTTTTTTTTT>
##$WBST= 1024
##$WBSW= 4
##$XGAIN= (0..3)
0 0 0 0 
##$XL= 0
##$YL= 0
##$YMAX_a= 206016
##$YMIN_a= -417731
##$ZGOPTNS= <>
##$ZL1= 120
##$ZL2= 120
##$ZL3= 120
##$ZL4= 120
##$ABSF1= 10
##$ABSF2= 0
##$ABSG= 5
##$ABSL= 3
##$ALPHA= 0
##$AQORDER= 0
##$ASSFAC= 0
##$ASSFACI= 0
##$ASSFACX= 0
##$ASSWID= 0
##$AUNMP= <proc_1d>
##$AZFE= 0.1
##$AZFW= 0.1
##$BCFW= 1
##$BC_mod= 2
##$BYTORDP= 1
##$COROFFS= 0
##$CY= 11.3945322036743
##$DATMOD= 1
##$DC= 2
##$DFILT= <>
##$DTYPP= 0
##$F1P= 18.9103706918063
##$F2P= -1.10871071338519
##$FCOR= 0.5
##$FTSIZE= 0
##$FT_mod= 4
##$GAMMA= 1
##$GB= 0.15
##$INTBC= 1
##$INTSCL= 1
##$ISEN= 128
##$LB= 0.24
##$LEV0= 0
##$LPBIN= 0
##$MAXI= 10000
##$MC2= 0
##$MEAN= 0
##$ME_mod= 0
##$MI= 1.114404
##$NCOEF= 0
##$NC_proc= 0
##$NLEV= 6
##$NOISF1= 3.799351
##$NOISF2= 2.8
##$NSP= 1
##$NTH_PI= 0
##$NZP= 0
##$OFFSET= 15.70392
##$PC= 1
##$PHC0= -9047.957
##$PHC1= 12.00004
##$PH_mod= 1
##$PKNL= yes
##$PPARMOD= 0
##$PSCAL= 0
##$PSIGN= 0
##$REVERSE= no
##$SF= 200.130013532006
##$SI= 16384
##$SIGF1= 3
##$SIGF2= 2
##$SINO= 400
##$SIOLD= 16384
##$SREGLST= <1H.CDCl3>
##$SSB= 0
##$STSI= 0
##$STSR= 0
##$SW_p= 3612.71676300578
##$SYMM= 0
##$S_DEV= 0
##$TDeff= 0
##$TDoff= 0
##$TI= <>
##$TILT= no
##$TM1= 0
##$TM2= 0
##$TOPLEV= 0
##$USERP1= <user>
##$USERP2= <user>
##$USERP3= <user>
##$USERP4= <user>
##$USERP5= <user>
##$WDW= 1
##$XDIM= 8192
##$YMAX_p= 0
##$YMIN_p= 0
$$ End of Bruker specific parameters
$$ ---------------------------------
##NTUPLES= NMR FID
##VAR_NAME=  TIME,          FID/REAL,        FID/IMAG
##SYMBOL=    X,             R,               I
##VAR_TYPE=  INDEPENDENT,   DEPENDENT,       DEPENDENT
##VAR_FORM=  AFFN,          ASDF,            ASDF
##VAR_DIM=   8192,          8192,            8192
##UNITS=     SECONDS,       ARBITRARY UNITS, ARBITRARY UNITS
##FACTOR=    0.0002496,     1,               1
##FIRST=     0,             0,               0
##LAST=      2.0444736,     0,               0
##MIN=       0,             -417731,         0
##MAX=       2.0444736,     206016,          0
$$ Real data points
##PAGE= N=1
##DATA TABLE= (X++(R..R)), XYDATA
$$ [...]
1878a686J904K77q27Q08P25j284p62P75J082m29n01Q77M9j924O0J773p53q15J393
$$ -1686 218 495 -332 476 1201 -83 -845 -70 1012 583 82 959 1008 -916 -856 917 164 -651 742
1897G42J99k117j55J771n51r43J408O59j234p72J189L52q93M29J343p64j470N47
$$ 742 941 -1176 -1331 440 -111 -1054 354 1013 -221 -993 196 548 -345 84 1427 663 -807 -260
1915b60R40j166k56J715n96j578L44Q01q31N9J393L18j417J22R60k88p86R01J312
$$ -260 680 -486 -742 973 377 -1201 -857 -56 -887 -828 565 883 -534 -412 548 260 -526 375 1687
1934A687j253p27J030K0j693P22J507n76j434P85N9j015J27J265j93j103L92J036
$$ 1687 434 -293 737 757 -936 -214 1293 717 -717 68 127 -888 -761 504 311 -792 -400 636
1952F36j154p04J469N98o29k09J036p63j113Q58J203j023n88J406j030j123P04
$$ 636 -518 -1222 247 845 216 7 1043 280 -833 25 1228 205 -383 1023 -7 -1130 -426
1969d26R85p07l21N66m1q60l19J180K38o86O01O45j075o89J416L15j076Q03P66
$$ -426 559 -148 -469 97 56 -804 -1123 57 295 -391 210 855 -220 -909 507 822 -254 549 1315
1988A315j253o17N94M71q81K85N08l72j097J01J047m87k61J080L58j417J28J093
$$ 1315 62 -555 39 510 -371 -86 422 50 -1047 -946 101 -386 -647 433 791 -626 -498 595
2006E95l43q37J328N53j399j32O68m23n06N91P45n57j203N85P82r83m75J531k5
$$ 595 252 -585 743 1296 -103 -235 433 10 -496 95 840 283 -920 -335 447 -536 -1011 520 495
2025D95j238K16L91o04J37J054R3n86J45M59m15m26L82Q18o26o25N47or80P3J169
$$ 495 -743 -527 -136 -740 -603 451 544 -42 103 562 147 -279 103 921 295 -330 217 211 -769 -696 473
2046D73n02o62P44M2j147L02J126q4o50N77K81q16J24N34M80m60j08O85r22q89
$$ 473 -29 -691 53 95 -1052 -750 376 292 -358 219 500 -316 -192 342 822 362 254 939 17 -872
2066h72Q22O72r37j98J047k88j189N56M82l97j10R21j24r67p2J117q7j61K18P54
$$ -872 -50 622 -315 -513 534 246 -943 -387 95 -302 -412 509 385 -582 -654 463 376 215 433 1187
2086A187r64p82R26R1j009O86P25j018n67O28L10o41jJ029m35r44J66O82l14k22
$$ 1187 223 -559 367 458 -551 135 860 -158 -725 -97 213 -428 -429 600 165 -779 -613 69 -245 -467
2106d67O05P49o70m34Q14r5p95O74N19q75k24J02k4o96P80M55n40o39M77j1m83
$$ -467 138 887 217 -217 597 502 -293 381 900 25 -199 -97 -121 -817 -37 418 -122 -761 -284 -295 -778
2127g78J98Q93K55o08J69L60r71J19J030L8q67K51N02q00k47L70M63p09L8L57
$$ -778 -580 313 568 -40 129 489 -482 -363 667 705 -162 89 591 -209 -456 -86 377 -332 -294 63
2147F3k28o50L12P81l02l90N58J65j030L43Q11k27l28P98J12r36m67R66oj83k99
$$ 63 -165 -815 -503 278 -24 -414 144 309 -721 -378 433 206 -122 676 788 -148 -615 351 345 162 -137
2168a37N11m49m59L87L16m64p3O42k02q39L03N87l19NR19k43n53j16L38J4k88
$$ -137 374 -75 -534 -147 169 -295 -368 274 72 -767 -464 123 -196 -191 728 485 -68 -184 154 168 -120
2189a20M79K29n42o57P29j15m30J16P06m85p67P99L35n94K44N73j36o26O33j75
$$ -120 359 588 46 -611 118 3 -427 -311 395 -90 -857 -58 277 -317 -73 500 364 -262 371 196
2209A96l99R4O87J39n78j98L96k49q92R57J52n63j71M49j90n32P69J7j56l4K52
$$ 196 -203 -109 578 717 139 -59 337 88 -804 153 305 -258 -429 20 -170 -702 67 84 -72 -106 146
2230A46o8l76L10K97K4j38K19N7m93l28O27O9m67j2N73p10l84P36L1n13J91L57
$$ 146 78 -298 12 309 333 195 414 471 -22 -350 277 346 -121 -133 440 -270 -654 82 113 -400 -209 148
2252A48j23m55K91M52l52J0M49J12o93P9M37m1l8R0K19q41j93P26k21m55K93K31
$$ 148 25 -430 -139 313 -39 -29 420 532 -161 -82 355 314 276 366 585 -256 -449 277 56 -399 -106 125
2274A25l35j96K57L69m08J37K74J30m75J97K98k36o8O41l12o75K83J39l99J25
$$ 125 -210 -406 -149 220 -188 -51 223 353 -122 75 373 137 69 710 398 -277 6 145 -254 -129
2294a29L69j84l31L5P4k5k14L33N30l56k64L33L14p27O7Q60l15o77N17J40m59
$$ -129 240 56 -275 -240 -166 -191 -405 -72 458 102 -162 171 485 -242 -175 685 370 -307 210 350 -109
2315a09r3M24R3n15j5lj7j65L60K99l63M4L95j62n27M04K69j99j16M27k49n07
$$ -109 -202 222 315 -200 -215 -218 -235 -400 -40 259 -104 -60 335 173 -354 50 319 120 4 431 182 -325
2337c25L48J82k62L2L70k98q3k97M15L5n67L80J11k48j31L08J67k89J76M49k08
$$ -325 23 205 -57 -25 345 47 -36 -333 82 117 -450 -70 41 -207 -338 -30 137 -152 24 473 265
2358B65l45N03k51M1oK55k34n71Q1K34J58l17L02J56l64m39L37M11p61N98L06
$$ 265 -80 423 172 213 207 462 228 -343 -262 -28 130 -187 115 271 -93 -532 -195 216 -545 53 359
2379C59n75K48L10p3l22O3M66j15o15L0L13k95O4L31K08n86Q8O4k31rL44l1k22
$$ 359 -216 32 342 269 -53 10 476 361 -254 -224 89 -206 -142 189 397 -189 -101 -37 -268 -277 67 36 -186
2402a86K13P5k34m1L30L1j29p9L95p3m42J35K96R3n65K33l37Jk32N54n3j94J58
$$ -186 27 102 -132 -173 157 188 59 -20 375 302 -140 -5 291 384 -181 52 -285 -284 -516 38 -15 -209 -51
2425e1O4k39j7J3K84j43K16L14m42j04J87M27k76l35M00j07m64n5L95k77P1K35
$$ -51 13 -226 -243 -230 54 -89 127 441 -1 -105 82 509 233 -102 298 191 -273 -328 67 -210 -139 96
2447I6J68l14k94K14J38K0q3N40k22l43J93K97m53P5L47j19l15J78k0m65K13J75
$$ 96 264 -50 -344 -130 8 28 -55 485 263 -80 113 410 -43 32 379 260 -55 123 103 -362 -149 26
2469B6n6k90K98j4K7N8j16L54m39Q2Q2J70k30R1L01k53L6L41m22k36J74M55n17
$$ 26 -30 -320 -22 -36 -9 49 -67 287 -152 -70 12 182 -48 43 344 91 127 468 46 -190 -16 439 -78
2492g8J81l41J90k05J39J54j50j00l6K00M7j7j28N70k61j21qL1j82M08k04p9q
$$ -78 103 -238 -48 -253 -114 40 -110 -210 -246 -46 1 -16 -144 426 165 44 36 67 -115 293 89 10 2
2515BK79ll71j71L06Q2P7j56k20M5q6N36l50L3k2m4K19j79J07J82o9J43l74j11
$$ 2 281 278 -93 -264 42 124 201 45 -175 -130 -216 320 -30 3 -19 -63 156 -23 84 266 197 340 -34 -145
2539a45n8Q1J33O1O6k23M1l10Q9M18n8l77L94Q3k12j45L67j34j87J72o7N3l7R7
$$ -145 -203 -122 11 72 138 -85 -44 -354 -265 153 95 -282 112 195 -17 -162 205 71 -116 56 -11 42 5 102
2563A02Q3j47R6J16l64K14l90K13n6R3K94k31j11j17M0L79j88j35M91k07m04K84
$$ 102 185 38 134 250 -114 100 -290 -77 -133 -40 254 23 -88 -205 -165 214 26 -109 382 175 -229 55
2585E5k94L05O3Q5l42M8Rj22Q2K54j25o3K5nq6q8K20j23mJ59P6j42k40K01N8K83
$$ 55 -239 66 129 214 -128 -80 -71 -193 -111 143 18 -45 -20 -25 -111 -199 21 -102 -106 53 129 -13 -253 -52 6 289
2611B89m74K91j26J35k48M4L65j75o3k7q7j99K61l3J08N2Mm7k00j68M43l4n5p3
$$ 289 -185 106 -20 115 -133 -89 276 101 38 11 -76 -275 -14 -47 61 113 117 70 -130 -298 145 111 56 -17
2635a7K19k36j17R9k2K3J13k9l3J84j71no3Lp6J67j76n5J54j98J46J80l1k23J88
$$ -17 202 -34 -151 -52 -74 -51 62 33 0 184 13 8 -55 -52 -128 39 -137 -192 -38 -236 -90 90 59 -164 24
2660B4j12K89m58L42r8j13m6J38J22M0o8j04M7j72K35j82O2K82k22n6P7J42J6
$$ 24 -88 201 -257 85 -13 -126 -172 -34 88 128 60 -44 3 -169 66 -116 -54 228 6 -50 27 169 185
2683A85l26J48N8P9j47J07j71K6l9P3M8m7R7o2l4j22J48M6l75L02j73L6K97k93
$$ 185 -141 7 65 144 -3 104 -67 -41 -80 -7 41 -6 91 29 -5 -127 21 67 -308 -6 -179 -143 154 -139
2707a39K35k89L11j52m2l4K52k57K32K26m53J89o0J7J42j13n3qJ96k33K03K0m1
$$ -139 96 -193 118 -34 -76 -110 142 -115 117 343 -110 79 19 36 178 65 12 4 200 -33 170 190 149
2730A49l5j30J18k39l0P4M67l40o5K38j51j71j5l9J54J59j67Jo5LK65k50N4L00
$$ 149 114 -16 102 -137 -167 -93 374 34 -31 207 56 -115 -130 -169 -15 144 -23 -22 -87 -84 181 -69 -15 285
2754B85k98Q1k1k84J36J37j86K97k98n1J94o0p1K00J62l35J76%ml81K43J72R5
$$ 285 -13 68 47 -237 -101 36 -150 147 -151 -202 -8 -68 -139 61 223 -112 64 64 60 -321 -78 94 189
2777A89k64J13o8P7p9L35j30l23pL1m7q3L95j99J09J60q2r0j36j32L21j15k00
$$ 189 -75 38 -30 47 -32 303 173 -150 -157 -126 -173 -256 139 -60 49 209 127 37 -99 -231 90 -25 -225
2800b25K83J23m37K17r8K16J04p9k59K93l45N13j44k62L15J44n58L10p1P4J66
$$ -225 58 181 -256 -39 -137 79 183 104 -155 138 -207 306 162 -100 215 359 -199 111 40 114 280
2821B80mm33J01j28k23L07J06N7J54k90O3j18p7K44J22j53K7j9j5L90m92K20N9
$$ 280 276 -157 -56 -184 -407 -100 6 63 217 -73 -10 -128 -205 39 161 8 35 16 1 391 -101 119 178
2844A78J87k69j02j11pN6Q0L17m11J15j62q0K6N8K65m7l94Q7K83p7jL9q3J14J9
$$ 178 365 96 -6 -117 -124 -68 12 329 -82 33 -129 -209 -183 -125 140 93 -301 -214 69 -8 -9 30 -53 61 80
2869H0n1k89L12J81l33LK71l64l5L0M73l13n5K30k06N1L1k6K03k04J88l54J68
$$ 80 29 -260 52 233 -100 -97 174 -190 -225 -195 278 -35 -90 140 -66 -15 16 -10 193 -11 177 -177 -9
2892il88N37Q1k44N0K41l05p9K08j77kJ74j96m7K67o5j68L56k18K0J92Rk33l8
$$ -9 -397 140 221 -23 27 268 -37 -116 92 -85 -87 87 -109 -156 111 46 -122 234 16 36 228 237 4 -34
2916c4J96j91J0K72k34pj89L21J06jk67K8Q8j74j3J19L6MN6m0l04J31Q6M8Q4K89
$$ -34 162 -29 -19 253 19 12 -177 144 250 249 -18 10 98 -76 -89 30 66 70 126 86 -218 -87 -1 47 131 420
2942D20m04J50l55L98k42O7o5K83k45l76M11j06KN0j27J04k7k0n8J57J70l53K73
$$ 420 16 166 -189 209 -33 34 -31 252 7 -369 42 -64 -62 -12 -139 -35 -62 -82 -140 17 187 -166 107
2965A07j43KL3p8MJ6K77j0j64qj39j43L55M4l17j07M41l85j45M08r0J70N6j87
$$ 107 -36 -34 -1 -79 -75 -59 218 208 44 36 -103 -246 109 153 -164 -271 170 -215 -360 48 -42 128 184 -3
2989ck27N1KL48j08j02O0K54l20j10R7j67K30M3j29l27J94R9q0K2K82k54q0K16
$$ -3 -230 -179 -177 171 63 -39 21 275 -45 -155 -58 -225 5 48 -81 -408 -214 -115 -195 -173 109 -145 -225 -9
3013iJ67j4j73K56k16r6R5P7j07j89O0J96p4n4j7Q6k40K8M19l02N0p3J46j19j43
$$ -9 158 144 -29 227 11 -85 10 87 -20 -209 -149 47 -27 -81 -98 -12 -252 -224 195 -107 -57 -130 16 -103 -246
3038b46L13j48J08K12j75J1k24J98J07L8k72J63k53j77K99j53kL11j45k28R0n8
$$ -246 67 -81 27 239 64 75 -149 49 156 194 -78 85 -168 -345 -46 -199 -201 110 -35 -263 -173 -231
3060b31J36L26l67j1K08J00j84j1K52j7j04m3J0j55K9J48j48L15K13o08j29o7
$$ -231 -95 231 -136 -147 61 161 -23 -34 218 201 97 54 64 -91 -62 86 -62 253 466 -142 -271 -338
3082c38L77j9q5kK39k28j94L17M9j5k9m7M8l07M50m13J22J35p4lj82K18J5j87
$$ -338 39 20 -65 -67 172 -56 -250 67 116 101 72 25 73 -234 216 -197 -75 60 -14 -17 -199 19 34 -153
3106a53j3J28L55k67k85N7L6o9M35O0j45k0j19q5k4M41k04j38L6k39l1J49o6J81
$$ -153 -166 -38 317 50 -235 -178 -142 -211 224 284 139 119 0 -85 -109 332 128 -10 26 -213 -244 -95 -161 20
3130B0P9k55K10k7k33R5L42k48J61j4j3j28k0J08M5l2m5l8j97K28k22J95o9k14
$$ 20 99 -156 54 27 -206 -111 231 -17 144 130 117 -11 -31 77 122 90 45 7 -190 38 -184 11 -58 -272
3154b72J59K61l60k84N01m3n8Q1P7k35R6O6J47r3N2J03k9l48L49k12J61k44L40
$$ -272 -113 148 -212 -496 5 -38 -96 -15 62 -173 -77 -11 136 43 95 198 169 -179 170 -42 119 -125 215
3177B15j13l19o7J55j30L92j45%j40K36J75k51J88j13J84l36L03k02K36j82J94
$$ 215 102 -217 -284 -129 -259 133 -12 -12 -152 84 259 8 196 83 267 -69 234 32 268 86 280
3198B80k18j49N3q1M3k98q5M99M3kk67J65k73J61K49M6j42r1J70j76j58M50J95
$$ 280 62 -87 -34 -115 -72 -370 -455 44 87 85 -182 -17 -290 -129 120 166 24 -67 103 -73 -231 219 414
3221D14j28l05oj54KJ00M1p7K57j21k60p0K4M02j37j67M95j08k70j97N25J26l73
$$ 414 286 -19 -25 -179 -177 -77 -36 -113 144 23 -237 -307 -283 119 -18 -185 310 202 -68 -265 260 386 13
3244A3p2J68Ll41J83J7k9J46R6l11o8m4K76l07K17j7K50k87m2K88k7J5J33k96
$$ 13 -59 109 112 -229 -46 -29 -58 88 184 -127 -195 -239 37 -270 -53 -70 180 -107 -149 139 112 127 260 -36
3268c6K47k45J13K47k76qM1o0k38L32k76R7j73K62K03m39mJ59j47K17K49L2l99
$$ -36 211 -34 79 326 50 42 83 23 -215 117 -159 -62 -235 27 230 -209 -213 -54 -201 16 265 297 -102
3291a02K16o7j12N9K14n7r1j03J71m3j04q3J81k07l0J41O8m45M69K15r6L1Q4l69
$$ -102 114 47 -65 -6 208 151 60 -43 128 85 -19 -102 79 -128 -158 -17 51 -394 75 290 194 225 309 -60
3315f0J31j21K09K79k79M6j44O6k11M1LK2k75K50k63m2L05O7j75Q9L59m62lJ16
$$ -60 71 -50 159 438 159 205 61 127 -84 -43 -40 -18 -293 -43 -306 -348 -43 24 -151 -62 297 -165 -168 -52
3339e2J8J85j59L39o2l10P0J13Mj84J22k60j19m1K21k4j16L21R6j94j91J23M4
$$ -52 -34 151 -8 331 269 -41 29 142 146 -38 84 -176 -295 -336 -115 -139 -255 66 162 -32 -223 -100 -56
3362e6J17o3K78j04k49J38j78K24k18M98r4m22Q2J50k34K2oM4j5n5M4j64J22K0
$$ -56 61 -2 276 172 -77 61 -117 107 -111 387 293 -129 -47 103 -131 -109 -115 -71 -86 -141 -97 -261 -139 -119
3386a19L58l84j56L21j36K06j21L84O9l73J63j96k37L75j2O0k62J80k9j33j11
$$ -119 239 -145 -301 20 -116 90 -31 353 422 49 212 16 -221 154 142 202 -60 120 91 -42 -153
3407a53Q8J95j6r7J9m0k41L69l3J07O3j55J00m52J71J88o6J9j08P3K29m34k72
$$ -153 -65 130 114 17 36 -4 -245 124 91 198 261 106 206 -246 -75 113 47 66 -42 31 260 -174 -446
3430d46P02n12K14P7ol16L07K29l74M9M02l34Nl1nK70j22K4j36p8l3j6L6R0Q0
$$ -446 256 -256 -42 35 29 -287 20 249 -125 -76 326 -8 -3 -34 -39 231 109 133 -3 -81 -114 -130 -94 -4 76
3455G6r0k54L5Q6k8j02L58K63l71q6J72J48l18J29K10J73k67M9l15K35j34N1R8
$$ 76 -14 -268 -233 -147 -175 -277 81 344 -27 -113 59 207 -111 18 228 401 134 183 -132 103 -31 20 118
3478A18l58K00j02j3j37L11M21n71j79P21l61R2j17K33k32o6J17k4j19k46L92
$$ 118 -240 -40 -142 -155 -292 19 440 -131 -310 411 50 142 25 258 26 -40 77 53 -66 -312 80
3499H0K97m65j39N99m48l17L31J86k53L25k51k56K99R4rJ35j76M4M4k93J45J42
$$ 80 377 -88 -227 372 -76 -393 -62 124 -129 196 -55 -311 -12 82 73 208 32 76 120 -173 -28 114
3521A14P8j24p8K67q78M68J02K2J01L1J04k23l25K28J61q6R8K28j24m6L0j79J58
$$ 114 192 68 -10 257 -621 -153 -51 -29 72 103 207 -16 -341 -113 48 -38 60 288 164 118 148 -31 127
3544A27O5m4j51j71J88J23k77J47n2J79m38L23m8k71O3K43l8K96k55o1J9J96j83
$$ 127 192 148 -3 -174 14 137 -140 7 -45 134 -304 19 -29 -300 -237 6 -32 264 9 -52 -33 163 -20
3567b0N21k95k13J31Jl33l7M38l94M9N4j20O0R1J2lJ02j28l3J06k15M51J42l68
$$ -20 501 206 -7 124 125 -208 -245 193 -201 -152 -98 -218 -158 -67 -55 -58 44 -84 -117 -11 -226 225 367 -1
3591aK21J81l3n34K03K99n14J93J18m54K8J15Q9O9M7j96J96j37j60J63L45k55
$$ -1 220 401 368 -166 37 336 -178 15 133 -321 -293 -178 -89 -20 27 -169 27 -110 -270 -107 238 -17
3613a7O0L20k94O0m1k3p5P8K29j65l31P2k2n2K22O6J03k70k04J93j8n4J40M25
$$ -17 43 363 69 129 88 65 -10 68 297 132 -199 -127 -149 -201 21 87 190 -80 -284 -91 -109 -163 -23 402
3637D02k76m17M65o9J0k7N8j37j05k6J30o4j53K58K01m03k49L46j69L3J41L04
$$ 402 126 -291 174 105 115 88 146 9 -96 -122 8 -56 -209 49 250 -153 -402 -56 -225 -192 -51 253
3659B53m23K87m4j20k35M84N0O0k44r3J27j44MJ03r8o5j52L39l20m8K62n3k23
$$ 253 -170 117 73 -47 -282 202 252 312 68 -25 102 -42 -38 65 -33 -98 -250 89 -231 -279 -17 -70 -293
3682b93L38j83n5J39J66K1K15p8J31k10k26J91j3J93n34M21k44k24J79J33k4k62
$$ -293 45 -138 -193 -54 112 133 348 270 401 191 -35 156 143 336 -198 223 -21 -245 -66 67 43 -219
3704b19L05r5k76O6J53j15L62k2p3j3R0m8K46k19r1L01l92n6M12n76K5K29K06
$$ -219 86 -9 -285 -219 -66 -181 181 159 86 73 163 115 361 142 51 352 -40 -96 316 -260 -235 -6 200
3727B00l01l26K22r6J36J29j05L75j36k00L49k06oJ29J31j47l54L46q3k81L59
$$ 200 -101 -427 -205 -301 -165 -36 -141 234 98 -102 247 41 35 164 295 148 -206 140 57 -224 135
3748A35J72k42k73l7j61k1M60j60K28k52k5J54o3%M10p1j74l0K24k64j50L59m9
$$ 135 307 65 -208 -245 -406 -427 33 -127 101 -151 -176 -22 -85 -85 325 254 80 50 274 10 -140 219 170
3771A70j20J17k93po9j69L64K01m06K70P5l77l1K54l4J89K82k3n14J67K73j93
$$ 170 50 167 -126 -133 -202 -371 -7 194 -212 58 133 -244 -275 -21 -55 134 416 393 -121 46 319 126
3793A26L0K49m58pJ88j12j83K78j53L0N0k79Q6K95l99m7K97K2%O0j51O8J85J01
$$ 126 156 405 -53 -60 128 16 -167 111 -42 -12 38 -241 -155 140 -259 -306 -9 13 13 73 -78 -10 175 276
3817B76l01J4O2j88L5o2P7M11k38k13o8J44l55K81N14n58J43m7KMK09pR0j52K18
$$ 276 -25 -11 51 -137 -102 -164 -87 324 86 -127 -195 -51 -406 -125 389 -169 -26 -73 -71 -67 142 135 225 73 291
3842B91k03j58K4J11K09j46k42k41J98k19O4L28j39r6L19j38o2N7J42Q4r3J85
$$ 291 88 -70 -46 65 274 128 -114 -355 -157 -376 -312 16 -123 -219 100 -38 -100 -43 99 183 90 275
3864B75j80K59l52j02K73j18j69M01k36k27j6r4Q8K22j26J02p1R1k80L30k1R1
$$ 275 95 354 2 -100 173 55 -114 287 51 -176 -192 -286 -198 24 -102 0 -71 20 -260 70 49 140
3886A40k63K21m0p2r5J02J97J63n54K9p0J69o2Q9r3q3K02j00o4J66j19pJ98j03
$$ 140 -123 98 58 -14 -109 -7 190 353 -201 -172 -242 -73 -135 -46 -139 -222 -20 -120 -184 -18 -137 -144 54 -49
3910d9J42R2J4L0j29K74k51j58R0m8L3k8J35j43Jj61k89K44K27K10j53l90M24
$$ -49 93 185 199 229 100 374 123 -35 55 7 40 12 147 4 5 -156 -445 -201 26 236 83 -307 117
3933A17k15j24J03L42J25k92K04j74j96J26J50p6O8j18n2l6k87K20l1K24l51K26
$$ 117 -98 -222 -119 223 348 56 260 86 -110 16 166 90 158 40 -12 -48 -335 -115 -146 78 -273 -47
3955d7Kk06J5K59r2J04J16j34k86K89N2K05J74n7m63r6J7j44p0L8L88j9k90L5
$$ -47 -45 -251 -236 23 -69 35 151 17 -269 20 72 277 451 394 -69 -165 -148 -292 -362 -324 64 45 -245 -210
3979b10M2N9K6J69K3j25l1P1o1J0L90j40kj98K0O9o8q9p8K40n1k76K53k81j58
$$ -210 -168 -109 -83 86 109 -16 -47 24 -37 -27 363 223 221 23 43 112 44 -45 -123 117 66 -210 43 -238 -396
4004c96K73L92k07J17K8l22K67k84M72j94l1l7J25j28k80M42p9k40J33k29J13
$$ -396 -123 269 62 179 207 -115 152 -132 340 146 115 78 203 75 -205 237 158 -82 51 -178 -65
4025f5l39J54K59j82R1J51n1j69J76K71J08k31k77Q3J80q9L51n42L54m31M40l39
$$ -65 -404 -250 9 -173 -82 69 18 -151 25 296 404 173 -104 -21 159 70 421 -121 233 -198 242 -97
4047i7j92K20K3n1J66N2k63r9J53J51k19L25l9m4j4Q1%K0j99N14l20o0P3N9l08
$$ -97 -289 -69 -46 -97 69 121 -142 -241 -88 63 -156 169 130 86 72 153 153 173 -26 488 168 108 181 240 -68
4072f8R6m0n4p9P3j49j16Q1J58M21l00j03P1L37l56o8L36r0j01N4k20J02P9m1
$$ -68 28 -12 -66 -145 -72 -221 -337 -256 -98 323 23 -80 -9 328 -28 -96 240 150 49 103 -117 -15 64 23
4096B3K0l9j58j79P9J86m8K4K14k84J34j70L9J09L13k28J10J6J77m09J62J26r2
$$ 23 43 4 -154 -333 -254 -68 -116 -92 122 -162 -28 -198 -159 -50 263 35 145 161 338 -71 91 217 125
4119A25R5j41o7m49P5K17J89l7j63m4M1j41J78J87N2M0J52l38R6R5j36K36k68
$$ 125 220 79 12 -437 -362 -145 44 7 -156 -200 -159 -300 -122 65 117 157 309 -29 67 162 26 262 -6
4142fM3l2l34K26R7o3j24L2L3j13j65L30m0k20L41K2l02J94K9K44Jn1J82l0k63
$$ -6 37 5 -329 -103 -6 -69 -193 -161 -128 -241 -406 -76 -116 -336 5 27 -275 -81 -52 192 193 142 324 294 31
4167C1n1L53j99k15K68l2k57Qj77K17n2J86J6j31o5K19m61K40L36l7L37j40j68
$$ 31 -20 333 134 -81 187 155 -102 -94 -271 -54 -106 80 96 -35 -100 119 -342 -102 234 197 534 394 226
4190B26k68k77O8L97Ok59J49q6k6P1J55J9k66J4J6k05L73j2K31l20O5M2m8K8O
$$ 226 -42 -319 -251 146 152 -107 42 -44 -70 1 156 175 -91 -77 -61 -266 107 95 326 6 71 113 65 93 99
4215I9jm0P2k27P8p0K50k3n6k41J74l32j53K81J09M3K75O6m7k31p4R2R2J99j97
$$ 99 98 58 130 -97 -19 -89 161 138 82 -159 15 -317 -470 -189 -80 -37 238 304 257 26 -48 44 136 335 138
4240A38m8K48m73j2K53n7J3J31j10j30m26J85J1K65j3J63q8j78l7M04j63q7L51
$$ 138 90 338 -135 -147 106 49 62 193 83 -47 -473 -288 -277 -12 -25 138 50 -128 -165 239 76 -11 340
4263C40j72k63q4K83m6j9J18j38Q2k53j9j13p4K63P6P2j16J85J11l81K15J50j48
$$ 340 168 -95 -179 104 58 39 157 19 101 -152 -171 -284 -358 -95 -19 53 -63 122 233 -148 67 217 69
4286F9j43K73K3l10N05k74lj28J32j05R9j38q0N9J11l33J33j62l4K37Q0O9J54
$$ 69 -74 199 222 -88 417 143 140 12 144 39 138 0 -80 -21 90 -243 -110 -272 -306 -69 11 80 234
4309B34j70L2n0m2k5J68J04Q1k36j40J22k94L60l43J91J16j86l81K82j05J46J29
$$ 234 64 96 46 4 -21 147 251 332 96 -44 78 -216 144 -199 -8 108 -78 -459 -177 -282 -136 -7
4331gK84l32K87k00J30M0K12k28l56M0L04P8k10k64K76rk32j0L3k0l9L43k46J70
$$ -7 277 -55 232 32 162 202 414 186 -170 -130 174 252 42 -222 54 45 -187 -197 -164 -184 -223 120 -126 44
4355D4j05kLK70J7o3K2k4j03N1J02n2j14k8rk9j14m31L44j11K5K51N9j08j00J12
$$ 44 -61 -63 -60 210 227 164 186 162 59 110 212 160 46 18 9 -20 -134 -565 -221 -332 -307 -56 3 -105 -205 -93
4381i3J42K6R0O2k26jo1J64j57J02L4Q8m1j30Q1q5m12M08J07m00QK27M4j45J57
$$ -93 49 75 165 227 1 0 -61 103 -54 48 82 170 129 -1 80 -5 -417 -9 98 -302 -294 -67 -23 -168 -11
4406a1K04j9l03J59Q5J76k9k63L20k04k66L61k13j09L20l73j14K97j44K24l44
$$ -11 193 174 -129 30 115 291 262 -1 319 115 -151 210 -3 -112 208 -165 -279 18 -126 98 -246
4427b46M06j71q2K01nJ23j71J27m2K8j93P4L05j5k97J11L33k57j60j27k26J95
$$ -246 160 -11 -93 108 103 226 55 182 140 168 -25 49 354 339 42 153 486 229 69 -58 -284 -89
4449h9K62K9l57r3J08l4K54q7K27K1o5Q4j60k68K73r9R1J68j08k63j4p2J6J72
$$ -89 173 202 -155 -248 -140 -174 80 -7 220 241 176 260 100 -168 105 6 97 265 157 -106 -120 -192 -176 -4
4473dr7K27k70j16q9R1K73J75k05q2K93l00J15L56j20O0j00j92N8k10l3J16K89
$$ -4 -101 126 -144 -260 -349 -258 15 190 -15 -97 196 -104 11 367 247 307 207 15 73 -137 -170 -54 235
4496B35k24j93J41j08J9M5Nn4qJ51k16K59k3pM22l65K47j74J87l96P6j08m3K18
$$ 235 11 -182 -41 -149 -130 -85 -80 -134 -142 9 -207 52 29 22 444 79 326 152 339 -57 19 -89 -132 86
4520H6m6l34R6J44O9k01K57j42j70L57j52j62K04J98K0J53l29Q1K6J16k03O5n7
$$ 86 40 -294 -198 -54 15 -186 71 -71 -241 116 -36 -198 6 204 224 377 48 129 155 271 68 133 76
4543G6j87R1m8PJ20M4j03j42Q9Pk18K36K09k82K55j84J55j50K79N8j74P9j43m9
$$ 76 -111 -20 -68 -61 59 103 0 -142 -53 -46 -264 -28 181 -101 154 -30 125 -25 254 312 138 217 74 25
4567B5o6j63K69m6k18P9k3j21J88p5j13K02K01j24J13j31J73m2j91O1K35n8k29
$$ 25 -41 -204 65 19 -199 -120 -143 -264 -76 -151 -264 -62 139 15 128 -3 170 128 -63 -2 233 175 -54
4590e4J41K4J0k11L82k23j81j23J51j38J70J47j96KK7qR5j74J39M46j64k12k13
$$ -54 87 111 121 -90 292 69 -112 -235 -84 -222 -52 95 -101 -99 -72 -80 15 -159 -20 426 262 50 -163
4613a63L21O3j05O3j88P6j4j45L8j12K50k9o8j65j14L38m0K01j05k14K18n9j03
$$ -163 158 221 116 179 -9 67 53 -92 -54 -166 84 55 -13 -178 -292 46 6 207 102 -112 106 47 -56
4636e6o6P4Q6j3J0L06k14j48p8J6P4j78J77M0j85J37k46K14o0P0R0l1k86L31P3
$$ -56 -122 -48 38 25 35 341 127 -21 -99 -83 -9 -187 -10 30 -155 -18 -264 -50 -110 -40 50 19 -267 64 137
4661A37j88K52j17j00j02L21k49K6k3P5k12J86r7j56K26j43J52O0J63n3R2l86
$$ 137 -51 201 84 -16 -118 203 -46 -20 -43 32 -180 6 -91 -247 -21 -164 -12 48 211 158 250 -136
4683a36j9L45L2k51P7K13j59L6j40l2K2k33k9R4j38J08K29n0k60J80m2J3k21L33
$$ -136 -155 190 222 -29 48 261 102 138 -2 -34 -12 -245 -274 -180 -318 -210 19 -31 -291 -111 -153 -140 -361 -28
4707b8M3K21Q9p2k81K59k02j73M93l20j01j68K59k36M41q2j86M0Q3k84J28M8K32
$$ -28 15 236 325 253 -28 231 29 -144 349 29 -72 -240 19 -217 224 142 -44 -4 79 -205 -77 -29 203
4730B03j87l6K00k19Q2k72K74J89k21J2J78j96k01L01j11j63K49Q5l14P5O4k02
$$ 203 16 -20 180 -39 43 -229 45 234 13 25 203 7 -194 107 -4 -167 82 167 -147 -72 -8 -210
4752b10L8P9P3J86k24L4J21J23j02R4j15j73J64j28Ol6L5n3r8P7j47Q7j15J23
$$ -210 -172 -93 -20 166 -58 -24 97 220 118 212 97 -76 88 -40 -34 -70 -35 -88 -186 -109 -256 -169 -284 -161
4776a61J84p5N4j03J25J15j89P9j14l9J79l5R4k9K65k25j20n2k24K10j88O5q4
$$ -161 23 -52 2 -101 24 139 -50 29 -85 -124 55 20 114 85 350 125 5 -47 -271 -61 -249 -184 -268
4799b68J58N5j94K41j10J55L6K7k3J09j41k42K56J04j7R3k71O5j13J73k70J71
$$ -268 -110 -55 -249 -8 -118 37 73 100 77 186 45 -197 59 163 146 239 -32 33 -80 93 -177 -6
4821fn0pJk55l2L18K7q5K5L26k52J63j17M2N5M6J76k27j09q1n0K34J0k73r3K96
$$ -6 -56 -63 -62 -317 -349 -31 -4 -89 -64 262 10 173 56 98 153 199 375 148 39 -42 -92 142 152 -121 -214 82
4847H2l48J57j11J84o6n1N8K62j55M2Q6J7j25j08P5K11j51j37K03m7Ql34J3J30
$$ 82 -266 -109 -220 -36 -102 -153 -95 167 12 54 140 157 32 -76 -1 210 59 -78 125 78 86 -248 -235 -105
4871a05j90P0L24j55j57K82j90P4j8N4J63j79J93m3j78K4L51j29k55L28n21J71
$$ -105 -295 -225 99 -56 -213 69 -121 -47 -65 -11 152 -27 166 123 -55 -31 320 191 -64 264 -257 -86
4893h6q8O4K12j49j48K34o3m1LM1J94p1r2k0R0K01k41K5J94l40m1J76k66K33M2
$$ -86 -174 -110 102 -47 -195 39 -24 -65 -62 -21 173 102 10 -10 80 281 40 65 259 -81 -122 54 -212 21 63
4918F3k70J99O1o2l65K15pOJ62K0q5l5K65l16J79J77k69NR8k39J59K49k98J31
$$ 63 -207 -8 53 -9 -374 -159 -166 -160 2 22 -63 -98 167 -149 30 207 -62 -57 41 -198 -39 210 -88 43
4942D3r7Q3J16l62q1L53l66L26J8l69K50J05j23o6J31K88r8j18O6k85K03J54l14
$$ 43 -54 29 145 -217 -298 55 -311 15 33 -336 -86 19 -104 -170 -39 249 151 33 99 -186 17 171 -143
4965a43K52p4J03j43Jj83j40Q5J99K16k71L8j93K91J46k57J03O9j04K3K73j17
$$ -143 109 35 138 -5 -4 -187 -327 -242 -43 173 -98 -60 -253 38 184 -73 30 99 -5 18 291 174
4987A74k02J88l01j51L35k39Q5K70l56R8q3j63J40OM51k72JM8k11L66j8j34L13
$$ 174 -28 160 -141 -292 43 -196 -111 159 -197 -99 -182 -345 -205 -199 252 -20 -19 29 -182 184 166 32 345
5010C45k77j02j39J27M0J89j68O9k9j68j33N2L88k86J80J9k26J3p5N3K80%k87
$$ 345 68 -34 -173 -46 -6 183 15 84 55 -113 -246 -194 194 -92 88 107 -119 -106 -181 -128 152 152 -135
5033a35J58O1M7j88J82K23j94j15J4k28j24L49N3r0j0P2k05L58n41J84K89j43
$$ -135 23 84 131 -57 125 348 154 39 53 -175 -299 50 103 13 3 75 -130 228 -313 -129 160 17
5055A7J15J71l48J12N4j21oK37n0m35N68l47j19M5R5Jj57N7Q4j92J04l1J74j05
$$ 17 132 303 -45 67 121 0 -6 231 181 -254 314 -33 -152 -107 -12 -11 -168 -111 -27 -219 -115 -146 28 -77
5079g7K61o8j07qj04M76lm10K09j61j39J57l2r1J64r8J01o86N21K15j76K72n37
$$ -77 184 116 9 1 -103 373 370 -40 169 8 -131 26 -6 -97 67 -31 70 -616 -95 120 -56 216 -321
5102c21J76J2R8K95m5O2l8p0j25k71N20k93j31K51j70J03j59j11m8n3K24J11J03
$$ -321 -145 -133 -35 260 215 277 239 169 44 -227 293 0 -131 120 -50 53 -106 -217 -265 -318 -94 17 120
5125A20l45L28j39K13K7j76J1L7N1k53o9L08l50L02p0J6j22j32L5J81k52N9K10
$$ 120 -225 103 -36 177 204 28 39 76 127 -126 -195 113 -237 65 -5 11 -111 -243 -208 -27 -279 -220 -10
5148a0l34M24l47K6R1K23J07Mq4j92K34J29k77l7o1o4n2j15K76j66K97k8j30K89
$$ -10 -344 80 -267 -241 -150 73 180 184 100 -92 142 271 -6 -43 -104 -168 -220 -335 -59 -225 72 44 -86 203
5172B03k76r9K71k63r0L35J01m4k17Q9L08k36j39J14j20k69J60L1K4J00k5o5m4
$$ 203 -73 -172 99 -164 -254 81 182 138 -79 10 318 82 -57 57 -63 -332 -172 -141 -117 -17 -42 -107 -151
5195a51R6K55l65j83K55j00J94J55j91O9k4M07m48J48j2J6K19j20m8r7N4l36M6
$$ -151 -55 200 -165 -348 -93 -193 1 156 -35 34 10 417 -31 117 105 121 340 220 172 75 129 -207 -161
5218a61J85n5o3K4k35J5M21j77rN8Q3k5J94l51L5j54J23J9J05Q3l50J97PJ35L3
$$ -161 24 -31 -94 -70 -305 -290 131 -46 -55 3 86 61 255 -96 -61 -215 -92 -73 32 115 -235 -38 -31 104 137
5243A37l89L21k09J33j9n8p8K08KJ65j21k84kL54j21J62l4r1j87j10K78j2K7j34
$$ 137 -252 69 -140 -7 -26 -84 -162 46 48 213 92 -192 -194 160 39 201 167 76 -111 -221 57 45 72 -62
5267f2r4K84l17L76j5j54J80l22j39K03J01q6J58m4N6l5J66j73K6K9j15k12K51
$$ -62 -156 128 -189 187 172 18 198 -124 -263 -60 41 -45 113 69 125 90 256 83 109 138 23 -189 62
5290F2J68k11k18P6lr1L09k04R5K0J70j86R6k06%J02P3n8L54m06J06J14j60j81
$$ 62 230 19 -199 -123 -126 -217 92 -112 -17 3 173 -13 83 -123 -123 -21 52 -6 348 -58 48 162 2 -179
5314a79K95o0j60J4L3k48R6K10k72L02j49JQ9K56j88J00k99N1Q7K4K84j80o2l91
$$ -179 116 56 -104 -90 -57 -305 -209 1 -271 31 -118 -117 -28 228 40 140 -159 -108 -21 3 287 107 45 -346
5338c46K62K37k92K80j09p2j69K59j39l3K77j6o5r0J39r6K2l0K0K68l62m9K16
$$ -346 -84 153 -139 141 32 -40 -209 50 -89 -122 155 139 74 -16 123 27 49 19 39 307 -55 -104 112
5361A12l46N27k62J66l71K38J52l50J43j40l1J10J74m5k48J42M69m87K36k57p6
$$ 112 -234 293 31 197 -174 64 216 -134 9 -131 -162 -52 122 77 -171 -29 440 -47 189 -68 -144
5382a44M25k15R9j80j3L7j86J89k1K60q9j87j27Q0J11Q1q5o5j17L09j3k80Q6K60
$$ -144 281 66 165 -15 -28 9 -177 12 -9 251 162 -25 -152 -72 39 120 35 -30 -147 162 149 -131 -45 215
5406B15j95PK02m64L78j76j22K46J6j75J92j64J9J26k25Q0Q8l8KN0m0j19J42J74
$$ 215 20 27 229 -235 143 -33 -155 91 107 -68 124 -40 -21 105 -120 -40 48 10 12 62 22 -97 45 219
5430B19l05m7M23j72l3J26k43j96K91k2j51j43J05J06k49K83N8l00M66k92j1J53
$$ 219 -86 -133 290 118 85 211 -32 -228 63 41 -110 -253 -148 -42 -291 -8 50 -250 216 -76 -87 66
5452F6l16J58J70j13J39J69k49p1J43J3Ln6j6K2l84M12l6k20L13k13p7p3k1J57
$$ 66 -250 -92 78 -35 104 273 24 -47 96 109 112 56 40 62 -322 90 54 -166 147 -66 -143 -216 -237 -80
5476h0o3K83r7j7M1J13K26m51L39l91L9r7K05K1j57R9k76J35j12K93k71L16j33
$$ -80 -143 140 43 26 67 180 406 -45 294 -97 -58 -155 50 71 -86 13 -263 -128 -240 53 -218 98 -35
5499c5k4k4P6j47L45j74k3O1j05K14M9q9P0o8l06K44m3j45LL3J39k47R8J7K84
$$ -35 -59 -83 -7 -154 191 17 -6 55 -50 164 213 124 194 126 -180 64 21 -124 -121 -88 51 -196 -98 -81 203
5524B03j82J01j62K15o5p2PL54m45q6J18l5p3%K61k03l4N6M6k25J49p9K37j6l5
$$ 203 21 122 -40 175 110 38 45 399 -46 -132 -14 -49 -122 -122 139 -64 -98 -42 4 -221 -72 -151 86 70 35
5549C5k10L06K5k20k9K04K17j43j10J59n7j65r8K9K61L2k65J92m32J59Q0j15R6
$$ 35 -175 131 156 -64 -93 111 328 185 75 234 177 12 -86 -57 204 236 -29 163 -269 -110 -30 -145 -49
5572d9M2k0P8j21L5L9j7J19k16L75k99J91k5q1o4j30L3R3J4P5j24J95j09k46J49
$$ -49 -7 -27 51 -70 -35 4 -13 106 -110 265 -34 157 132 51 -13 -143 -110 -17 -3 72 -52 143 34 -212 -63
5597f3k5n5N9K86l28J10j69K95k73K91l5m0r8N5K6j54J78k18J33l6L95l23j46
$$ -63 -88 -143 -84 202 -126 -16 -185 110 -163 128 93 53 -45 10 36 -118 60 -158 -25 -61 334 11 -135
5620a35K0N4j60M14j79L5q3J08J18j30n2J43qj24L0q4K71j08q5j64p3n4L66k01
$$ -135 -115 -61 -221 193 14 49 -34 74 192 62 10 153 145 21 51 -33 238 130 45 -119 -192 -246 120 -81
5644h1N2J98j63M9k01L15L7q2k54J65K29k48K12k55N5j6k72L11J56j89l1j12K22
$$ -81 -29 169 6 55 -146 169 206 124 -130 35 264 16 228 -27 28 12 -260 51 207 18 -13 -125 97
5667I7l31J14j19J78k9K8K92j04M6j95J97m58L07j30J22j41L77j42j20qJ99j26
$$ 97 -234 -120 -239 -61 -90 -62 230 126 172 -23 174 -284 23 -107 15 -126 251 109 -11 -19 180 54
5689E4k71K40k22K93j83j10J71j12J20R8j70QL0Q7N5K4P4q9l9o3j90J33K32j10
$$ 54 -217 23 -199 94 -89 -199 -28 -140 -20 78 -92 -84 -54 33 88 112 186 97 58 -5 -195 -62 170 60
5713F0k01RN7l5J74p1j15lN7j05N3l1J26O8M5R5k93m8K80p6j46J03P3q1k25L17
$$ 60 -141 -132 -75 -110 64 -7 -122 -125 -68 -173 -120 -151 -25 43 88 183 -110 -158 122 46 -100 3 76 -5 -230 87
5739H7m2pK29k16o2j8j21K23k36K63j4j23MnK95l73J11j39J44n3p6K28l71K54
$$ 87 45 38 267 51 -11 -29 -150 73 -163 100 86 -37 -33 -38 257 -116 -5 -144 0 -53 -129 99 -272 -18
5763a8KJ0J09m1j44j1K65k07k0k74M28mR3j71O8n1kkQ1q3l2M1j18J30r2r3J40
$$ -18 -16 -6 103 62 -82 -93 172 -35 -55 -329 99 95 188 17 85 34 32 30 111 28 -4 37 -81 49 -43 -136 4
5790Dq2M2N2Q5j2j7on6r6L11L1l55J21J42n2r2q6K31k86P1J80r2k97J85J50j27
$$ 4 -78 -36 16 101 89 72 66 10 -86 225 256 -99 22 164 112 20 -66 165 -121 -50 130 38 -259 -74 76 -51
5816e1L09n48J18K07n8N7j32jK72j72J63Rk88O9R1j29J49j14j19L49k37J21M0
$$ -51 258 -290 -172 35 -23 34 -98 -99 173 1 164 173 -115 -46 45 -84 65 -49 -168 181 -56 65 105
5839A05k50M6lJ62j88P3J61j58J63j33K10j71J07R4j89J42j70l1J11j09J70O2
$$ 105 -145 -99 -102 60 -128 -55 106 -52 111 -22 188 17 124 218 29 171 1 -30 81 -28 142 204
5861B04q7k04o4L25l72K8P3J9l7K48l1k67K25j69J33l02J40J91J32Nk89P6Q6j34
$$ 204 117 -87 -151 174 -198 -170 -97 -78 -115 133 102 -165 60 -109 24 -278 -138 53 185 190 -99 -23 63 -71
5885g1N8J38j47K04m21R9J89j35NK58j68J13j96R8J6O8K7j29n0l1K44q0J00l92
$$ -71 -13 125 -22 182 -239 -140 49 -86 -81 177 9 122 -74 24 40 108 135 6 -44 -75 169 89 189 -203
5909b03L49j14j06J01j6pj92k3J48k19K52l5Q6J01n6J58k61J83l0j72j6R3r5J04
$$ -203 146 32 -74 27 11 4 -188 -211 -63 -282 -30 -65 21 122 66 224 -37 146 116 -56 -72 21 -74 30
5933C0r9J12l9j16M7J36j53J0j20J83j10l6J94o1O5j64L7M7O3j18L42k29L03m75
$$ 30 -69 43 4 -112 -65 71 -82 -72 -192 -9 -119 -155 39 -22 43 -121 -84 -37 26 -92 250 21 324 -151
5957a51O4J58L12j52k62K54k50k11L30j11J48n5l45L26j95J96j23J15j07Q0n6
$$ -151 -87 71 383 231 -31 223 -27 -238 92 -19 129 74 -271 55 -140 56 -67 48 -59 21 -35
5978c5j08l1J13j3K54l88J52K4o6oq2K8R1J2K52l52m9J34R0J10j32j38k77L95
$$ -35 -143 -174 -61 -74 180 -208 -56 -32 -98 -104 -186 -158 -67 -55 197 -155 -204 -70 20 130 -2 -140 -417 -22
6002b2OL7p3J93j93J47j51j13l5J07l10N66k56p6M02m07J0l6K52J06j38k65K64
$$ -22 -16 21 -52 141 -52 95 -56 -169 -204 -97 -407 159 -97 -173 229 -178 -168 -204 48 154 16 -249 15
6025A5LN9o4m7N5L9j36J14K47k05L6Q9l02k0J18l4J50j87N6K3j85K87O8k22k11
$$ 15 18 77 13 -34 21 60 -76 38 285 80 116 205 -97 -117 1 -33 117 -70 -14 9 -176 111 179 -43 -254
6050b54M29r1m2J6k64L24n2j61j4K4j59L84l20K36N8j41Q6k34O4J86q8J12j66
$$ -254 175 84 42 58 -206 118 66 -95 -109 -85 -244 140 -180 56 114 -27 59 -175 -111 75 -13 99 -67
6073f7J75k96J57J50J0q8j70K68l25L62l86L16j75J43M2r4o8O4m1j10J67J10k7
$$ -67 108 -188 -31 119 129 41 -129 139 -186 176 -210 106 -69 74 116 22 -46 18 -23 -133 34 144 117
6096A17O4k08J95j50N6j52J23j37K25O5r0j01k51K36J35J38m86J11J29k3J2J54
$$ 117 181 -27 168 18 74 -78 45 -92 133 198 108 7 -244 -8 127 265 -221 -110 19 -4 8 162
6118A62j32J88j8j52n3j59J04r5N6J95L6j52M5J25k5j07j11K40q1J14j53n00L43
$$ 162 30 218 200 48 -5 -164 -60 -155 -99 96 132 -20 25 150 125 18 -93 147 66 180 27 -473 -130
6141a30K17n5j10k01J92J98n1l24L23K38j07j32l5J74j13j35R5j28J2K21k54P8
$$ -130 87 32 -78 -279 -87 111 60 -264 59 297 190 58 23 197 84 -51 44 -84 -72 149 -105 -27
6163b7n6J45m5k63M00J00l29O8j59J07K87j27j5o9j8k6P4j46L6n6J19l29M50n8
$$ -27 -83 62 17 -246 154 254 -75 -7 -166 -59 228 101 86 17 -1 -27 47 -99 -63 -119 0 -329 121 63
6187F3p0l7o0J4j13M76j10j80j88K98j7k37J75o7K35k05O4k23P1K13J1l27J53
$$ 63 -7 -44 -104 -90 -203 273 163 -17 -205 93 76 -161 14 -53 182 -23 41 -182 -111 102 113 -214 -61
6210f1r5L10j31q6L23j84j86M8J37k83J65j17jK90%n7L4k04K95j64m7r5P7L1N
$$ -61 -156 154 23 -63 260 76 -110 -62 75 -208 -43 -160 -161 129 129 72 106 -98 197 33 -14 -109 -32 -1 4
6235DO2QNo2K28k42j37K34k0l28K46J32r8J20l18J75J38m8j1j45j4K73o8m83N11
$$ 4 66 74 79 17 245 3 -134 100 80 -248 -2 130 32 152 -166 9 147 99 88 -57 -71 202 134 -349 162
6260A62O8k33j58L2r2r4J73L0R4o3QJ84j03k4M9M2j13o3J38M7j0P4k41J28j89
$$ 162 230 -3 -161 -129 -221 -315 -142 -112 -18 -81 -73 111 8 -16 33 75 -38 -101 37 84 74 148 -93 35 -154
6285a54J5kL18j01k25J32K04j68j47N9k58L22r0K6J37k05O3j48L59R7l83J12L8
$$ -154 -139 -141 177 76 -149 -17 187 19 -128 -69 -327 -5 -95 -69 68 -137 -74 -222 137 234 -149 -37 1
6308Ak9j05K96j23Pm5J35n7j29J18k24k8L07j26K69l40K56m79L14k10L16j13o9
$$ 1 -28 -133 163 40 47 2 137 80 -49 69 -155 -183 124 -2 267 -73 183 -296 18 -192 124 11 -58
6331e8l8J32m6o3L4N9o4o9Q4J50j55q6J57p5j39K13qJ08J1m0p8j02j14L96j67
$$ -58 -96 36 -10 -73 -39 20 -44 -113 -29 121 -34 -120 37 -38 -177 36 28 136 147 107 29 -73 -187 209 42
6356D2q5M2o8J09N0j33q4J88Rj76K41j39J01P1n1j88Q5p7L2L2M1j35L05j43M5
$$ 42 -43 -1 -69 40 90 -43 -127 61 70 -106 135 -4 97 168 117 -71 14 -63 -31 1 42 -93 212 69 114
6381A14m6j10J15j27J70k67J82j77L54j69P9k14q4PNJ65Lj34j0J83J62k98l2J23
$$ 114 68 -42 73 -54 116 -151 31 -146 208 39 118 -96 -180 -173 -168 -3 0 -134 -144 39 201 -97 -129 -6
6405fn5L8J45m9j17K06k26M6j1P3j47J49j44J50K01j91k06J31p1J03J43j28n8
$$ -6 -61 -23 122 73 -44 162 -64 -18 -29 44 -103 46 -98 52 253 62 -144 -13 -84 19 162 34 -24
6428b4o9J08L9j9R1k7r9P5k56k9L48k01Q9j89J96j40J3K88k09J39L7J9l24q1J77
$$ -24 -93 15 54 35 126 99 0 75 -181 -210 138 -63 26 -163 33 -107 -94 194 -15 124 161 180 -144 -225 -48
6453d8K28p1p9K17l12L0R4j25J73P0k03n4K70j65P5J5q9Q5L9j04j64lJ41j76P8
$$ -48 180 109 30 247 -65 -35 59 -66 107 177 -26 -80 190 25 100 115 26 111 150 46 -118 -121 20 -156 -78
6478g8J82j36N2p1J19nj1oKo1o4J9k21J31K10q3J11L1j00r7o5K46j34Rp7K11k89
$$ -78 104 -32 20 -51 68 63 52 46 48 -13 -77 -58 -279 -148 62 -21 90 121 21 -76 -141 105 -29 -20 -97 114 -175
6505a75N3K59k57J73K1j54K07M4m0j32l0p0J70K10k00K6r8M1j29P0q0J8j8Q9O5
$$ -175 -122 137 -120 53 74 -80 127 171 131 -1 -31 -101 69 279 79 105 7 48 -81 -11 -91 -73 -91 -2 63
6530F3O5P2j51K13k41L4j08p4o9K63l44J50p1J5J85J47j85P5j41N0J18j33M4j87
$$ 63 128 200 49 262 21 55 -53 -127 -196 67 -277 -127 -198 -183 2 149 -36 39 -102 -52 66 -67 -23 -210
6554b10K68k89L81o2Q4k43N7p9N7K96J00k56r3J97m21K83l39J98J69k51n3K93
$$ -210 58 -231 150 88 172 -71 -14 -93 -36 260 360 104 11 208 -213 70 -269 -71 98 -153 -206 87
6576H7j72M6J7J09j10m0P9n6rJ37k40j1m1K88K2k97J84J4k15K71J29j59j16J57
$$ 87 -85 -39 -22 87 -23 -63 16 -40 -49 88 -152 -163 -204 84 106 -191 -7 7 -208 63 192 33 -83 74
6600G4k7M4R2q5q3J17K51j47l49J44lj96j60J67L32j01k75p4M14j42M9n7k2m7
$$ 74 47 91 183 98 15 132 383 236 -113 31 28 -168 -328 -161 171 70 -205 -279 135 -7 42 -15 -37 -84
6624h4K63j59O3l0N9j99J72L3k78K94j45J07j20R0K1JM8p9k38J51J87j38j67K95
$$ -84 179 20 83 53 112 -87 85 118 -160 134 -11 96 -24 66 87 88 136 57 -181 -30 157 19 -148 147
6648A47j03j57K03K11k58j10K60j04l58K00r4N0J79j74J21j60J23J26j73N4j72
$$ 147 44 -113 90 301 43 -67 193 89 -269 -69 -163 -113 66 -108 13 -147 -24 102 -71 -17 -189
6669a89K79j9k63M32j38K24r0j51k71J27k2J03l31J18q6K50j05J71j83L0J27k71
$$ -189 90 71 -192 240 102 326 236 85 -186 -59 -81 22 -309 -191 -277 -27 -132 39 -144 -114 13 -258
6691b58J89Oj82K65j02n4K23k0J4j35J22J16j13r1oK7J30k54K17QJ09j96J81J02
$$ -258 -69 -63 -245 20 -82 -136 87 67 81 -54 68 184 71 -20 -26 1 131 -123 94 102 211 15 196 298
6715B98l43O1K2k52L37k33J99j22j04R8L5J34l8j40k8M3p5R3r5j60J96p8P5J70
$$ 298 -45 16 38 -214 123 -110 89 -33 -137 -39 -4 130 92 -48 -76 -33 -108 -15 -110 -270 -74 -152 -77 93
6739I3o1%M9k9p2j9l2J66Q8l1j36J64m4o3O4Ko1j78J31o2K14j83J63Q2k14j53
$$ 93 32 32 81 52 -20 -39 -71 95 183 152 16 180 136 73 137 139 78 -100 31 -31 183 0 163 245 31 -122
6765a22K0j11J05J1J34J4RR4k97L65l53K38j67j6J01j29K18J39k03n7J38j98K01
$$ -122 -102 -213 -108 -97 37 51 60 154 -143 222 -131 107 -60 -76 25 -104 114 253 50 -7 131 -67 134
6788A34l87J23J07m6L5K17m1j85K60j77l73J69J72Q1k80K47n9mq7MM8n3J81j50
$$ 134 -253 -130 -23 -69 -34 183 142 -43 217 40 -333 -164 8 89 -191 56 -3 -7 -94 -90 -42 -95 86 -64
6812f4n7O4P5j1l8J29l6k11K03J06j75J54k14J11L9k32K06l90M34k77K23m9R4
$$ -64 -121 -57 18 7 -31 98 62 -149 54 160 -15 139 -75 36 75 -157 49 -341 93 -184 39 -10 84
6835H4j74%q7J29J84k11J10m1j47L15j77j27J56q7J42oq9j80M02j07qk35J49R0
$$ 84 -90 -90 -177 -48 136 -75 35 -6 -153 162 -15 -142 14 -73 69 63 -26 -206 196 89 81 -154 -5 85
6859H5j49j34K96j00O7j6p3J0O0N4L3k88l2J15J53P4k08k7k1k8m4J98Q3j89k12
$$ 85 -64 -198 98 -2 65 49 -24 -14 46 100 133 -155 -187 -72 81 155 -53 -80 -101 -129 -173 25 108 -81 -293
6884b93K38K05L9l33kJ39J97j24q5j4n2K0M9K6L0j57K76m5j26k32J25L4O4j55
$$ -293 -55 150 189 -144 -146 -7 190 66 -19 -33 -85 -65 -16 10 40 -117 159 114 -12 -244 -119 -85 -21 -176
6908a76J26J24J80l24K32k02n6L22l06J1P2k56m2L22J10j08P1j64n2L34k72K81
$$ -176 -50 74 254 -70 162 -40 -96 226 -80 -69 3 -253 -295 27 137 29 100 -64 -116 218 -54 227
6930B27k69M5M1k3K87j49j32o7J59Rj65j38L4L4k2J62J14j69J23M6j26j22L5L6
$$ 227 -42 3 44 21 308 159 27 -40 119 128 -37 -175 -141 -107 -129 33 147 -22 101 147 21 -101 -66 -30
6954c0K09m33K74%k54K43K7O1J96l20J62k09J78k0k9k77L62P9j14r6l10L71O4
$$ -30 179 -254 20 20 -234 9 36 97 293 -27 135 -74 104 84 55 -222 140 219 105 9 -301 70 134
6977A34O3j24k5k29J6R2j8J30K26l20nJ82J5J6j4l44K00K7l1R9j20K05j65q8J18
$$ 134 197 73 48 -181 -165 -73 -91 39 265 -55 -60 122 137 153 139 -205 -5 22 -9 90 -30 175 10 -78 40
7002D0k55M10l90L24l08J96j18K82j52R8k79N8K72q1j07K0m1O6j5j38J0K59P5
$$ 40 -215 195 -195 129 -179 17 -101 181 29 127 -152 -94 178 97 -10 10 -31 35 20 -118 -108 151 226
7025B26l73J77r4p0LK09j73K06j01o0M0P9j62L06k00O0j04N5r9K51l32L32k46
$$ 226 -147 30 -64 -134 -131 78 -95 111 10 -50 -10 69 -93 213 13 73 -31 24 -75 176 -156 176 -70
7048g0J62N6j97m4o2K28N8k66L33k90nJ03M4Q2J21j11j69n2J78j8k02J70N5j01
$$ -70 92 148 -49 -93 -155 73 131 -135 198 -92 -97 6 50 132 253 142 -27 -79 99 81 -121 49 104 3
7072CR6l08p9J99R7j26j68L10j51J18j85K63k56Q5K8J38o4j20J60k32J77k29L92
$$ 3 99 -209 -288 -89 8 -118 -286 24 -127 -9 -194 69 -187 -102 -74 64 0 -120 40 -192 -15 -244 148
7095A48j4l26K09K81l44l2K7Q0j24J34j0P4j40K08j85j47J70o9Qj51J42p0m7j3
$$ 148 134 -192 17 298 -46 -78 -51 29 -95 39 29 103 -37 171 -14 -161 9 -60 -52 -203 -61 -131 -178 -191
7119a91L62j43N6qJ3o0k79mM80j31j09r7j46J19mJ34J16O7k30j8J29M1k9k02J65
$$ -191 171 28 84 76 89 29 -250 -254 226 95 -14 -111 -257 -138 -142 -8 108 175 -55 -73 56 97 68 -134 31
7144C1k09J64J64p4j34R6L8J0J00k21L7L4J01j19k27J11j2N9j19K67lj71L40j64
$$ 31 -178 -14 150 76 -58 38 76 86 186 -35 2 36 137 18 -209 -98 -110 -51 -170 97 94 -77 263 99
7168I9kj05J06K7Pp0k9o0O0o4q4J49j4K2K31l85p5K37JJ12j95N9%R9k82J37J42
$$ 99 97 -8 98 125 132 62 33 -27 33 -31 -115 34 20 42 273 -112 -187 50 51 163 -32 27 27 126 -156 -19 123
7195A23j19k44%J92L37k60J94l29P3l10J99K14k52R7L32k69q2P8Q8j82Q4M2l02
$$ 123 4 -240 -240 -48 289 29 223 -106 -33 -343 -144 70 -182 -85 247 -22 -104 -26 62 -120 -36 6 -296
7218b96K23nn1q4J00J24j45P9O7j00J58kO5P4l36P6j5R7L2m16M75p7J32J39k76
$$ -296 -73 -78 -129 -213 -113 11 -134 -55 12 -88 70 68 133 207 -129 -53 -68 29 61 -355 120 43 175 314 38
7243C8P7k80rJ79l92N35j42o5J1n4p0L05k06Q7O6m6j60J08m3k4J54n3j51J27J04
$$ 38 115 -165 -174 5 -387 148 6 -59 -48 -102 -172 133 -73 14 80 34 -126 -18 -61 -85 69 16 -135 -8 96
7268I6Ol23MK61J51lp7j25J08l13M66k11r1j07j18K62l6o6J72L15k64pj69j24
$$ 96 102 -221 -217 44 195 192 115 -10 98 -215 251 40 -51 -158 -276 -14 -50 -116 56 371 107 100 -69 -193
7292a93K12K8Nk2j6q6j85K58K06j79N1k47P0L05l21%L9%n6K6J12m0J11k50M01
$$ -193 19 47 52 30 14 -72 -257 1 207 28 79 -168 -98 207 -114 -114 -75 -75 -131 -105 7 -33 78 -172 229
7317B29k55j64L14j50j46K4J43l1K43m80J83L02j80k26J6K44j90J46J02j16q6
$$ 229 -26 -190 124 -26 -172 -148 -5 -36 207 -273 -90 212 32 -194 -178 66 -124 22 124 8 -78
7338g8j44J27K56k30J05k0n2J09j60K8N1r5OJ03n2J54Nm5j63J5r5P9J10j18K14
$$ -78 -222 -95 161 -69 36 16 -36 73 -87 -59 -8 -103 -97 6 -46 108 113 68 -95 -80 -175 -96 14 -104 110
7363A10j89r4K25m7j37L14j8o0J52k52m5R1j21j13K3Q6J78J99j91j32M6K6pk53
$$ 110 -79 -173 52 5 -132 182 164 104 256 4 -41 50 -71 -184 -161 -75 103 302 111 -21 25 51 44 -209
7387b09L65j44k39L52n5j65K02J06l55L37k78j21L40O5l64K3L56j09l24J79K41
$$ -209 156 12 -227 125 70 -95 107 213 -142 195 -83 -204 136 201 -163 -140 216 107 -217 -38 203
7408B03m9j52j68K4K89j99K5k32M54r8j95K10K8j67L03j84j03J03k04J88J66n1
$$ 203 154 2 -166 -142 147 -52 -27 -259 195 97 -98 112 140 -27 276 92 -11 92 -112 76 242 191
7430A91k67P8J89k79P1ok57L03j35m4L87j27K5j58%K16j07j74J73m3j2j8M4q2
$$ 191 -76 2 191 -88 -17 -23 -280 23 -112 -156 231 104 129 -29 -29 187 80 -94 79 36 24 6 50 -32
7454c2K51P4j8j67n3Q3j58j21J99k02K27j95n2J71J07l46K26R9K5J54n21L87K3
$$ -32 219 293 275 108 55 138 -20 -141 58 -144 83 -112 -164 7 114 -232 -6 93 118 272 -249 138 161
7477A61j2k36o4K99m36L16m4J40J14k50J0K18k36m2q2J80l21L28K67k57K06j35
$$ 161 149 -87 -151 148 -288 28 -16 124 238 -12 -2 216 -20 -62 -144 36 -285 43 310 53 259 124
7499A24n08L14J48Q4j18j66o0L46k41j3j9K42r2j5j15L6J67l8j62r4J53Jk86M15
$$ 124 -384 -70 78 162 44 -122 -182 164 -77 -90 -109 133 41 26 -89 -53 114 76 -86 -180 -27 -26 -312 103
7523A03Pk84J28K2j2k1j72M57k45j23K02j57j27J29K48k92j61K44J16j62o6L52
$$ 103 110 -174 -46 -24 -36 -57 -229 228 -17 -140 62 -95 -222 -93 155 -137 -298 -54 62 -100 -166 186
7545A86k86M4j01R3O1JJ2J18j30j99L10lq0M5o1J06nk70J95Q6k37J45k07J74l6
$$ 186 -100 -56 -157 -64 -3 -2 10 128 -2 -201 109 106 26 71 10 116 111 -159 36 122 -115 30 -177 -3 -39
7570c9J56j19K92l02L8j08K66rN9k00k55L98k27J93l3K45l14o4J31j06k21J45
$$ -39 117 -2 290 -12 26 -82 184 175 234 34 -221 177 -50 143 110 355 41 -23 108 2 -219 -74
7592g4J53P1l08K94k00m1J67j79N3l9O6N8j05M3k60RM18l49J12K08L4J27l39J98
$$ -74 79 150 -158 136 -64 -105 62 -117 -64 -103 -37 21 -84 -41 -301 -292 126 -223 -111 97 131 258 -81 117
7616A17j02k15J31J00K8q8J30Mk09M15j05j65q5J30l0n7M8j06j08J55N3K00n5
$$ 117 15 -200 -69 31 59 -29 101 105 -104 311 206 41 -44 86 56 -1 47 -59 -167 -12 41 241 186
7639A86k66J7qR8J55Lj80m6oP6K0j36L8J72k6J1j56m6M0j14L9K05l7L4k37J67
$$ 186 -80 -63 -71 27 182 185 5 -41 -47 29 49 -87 -49 123 97 108 -48 -94 -54 -168 -129 76 39 73 -164 3
7665CK4J52j31j01j58L00O6j54P4j78L7P6k4K08j83o1P2j40M6J29j55N15l80l8
$$ 3 27 179 48 -53 -211 89 155 1 75 -103 -66 10 -14 194 11 -50 22 -118 -72 57 -98 417 37 -1
7689aO1j21K21l56R8k2J85k49J12J77j91K1N7R2r0r2j13K41RJ71r0k84P1J13K45
$$ -1 60 -61 160 -196 -98 -120 65 -184 -72 105 -86 -65 -8 84 -6 -98 -211 30 39 210 120 -164 -93 20 265
7714B65p8j64J13K2k85R8j32P1L62k83J70k65J4L8K48k44J53p1j4Q0j78p6J24
$$ 265 187 23 136 158 -127 -29 -161 -90 272 -11 159 -106 -92 -54 194 -50 103 32 18 98 -80 -156 -32
7737c2k62L94q9j30J84k32q3K39Rl1l0j41K67j60J01J43j93q7K73k24j2J39j59
$$ -32 -294 100 11 -119 65 -167 -250 -11 -2 -33 -63 -204 63 -97 4 147 -46 -133 140 -84 -96 43 -116
7760a16J4K39j47J15p6k23N0M19k75l27O05l49k26j7L74m3j97j2J92O8k85N9R7
$$ -116 -102 137 -10 105 29 -194 -144 275 0 -327 278 -71 -297 -314 60 17 -180 -192 0 68 -217 -158 -61
7783f1P3q1K45j60J89q8j43M6j09l3L70l83J62k21M1J94P0J15k83P6l3r0J3j31
$$ -61 12 -69 176 16 205 117 -26 20 -89 -122 248 -135 27 -194 -153 41 111 226 -57 19 -14 -104 -91 -222
7807b22K55j6J4k64L01k6j13J59k22K75p5j23K31k53J00J30j33n5n1L32j63k05
$$ -222 33 17 31 -233 68 42 -71 88 -134 141 66 -57 174 -79 21 151 18 -37 -88 244 81 -124
7829a24O2P3p2R3k2k18J55M3J16K1M1L9k05LJ1R1j06K8j43l4J44p9k42M43k45
$$ -124 -62 11 -61 32 10 -208 -53 -10 106 127 168 207 2 5 16 107 1 29 -114 -148 -4 -83 -325 118 -127
7854a27l7J34K18k60K82j15j82K12j50J33p1j17l6K01jl9j76K01j75R7k13N28
$$ -127 -164 -30 188 -72 210 95 -87 125 -25 108 37 -80 -116 85 84 45 -131 70 -105 -8 -221 307
7876C07k95q8K26k07K07l32J36j79J36J91N6m82J55j03J34ML29k23L61k24l01
$$ 307 12 -76 150 -57 150 -182 -46 -225 -89 102 158 -324 -169 -272 -138 -134 195 -28 333 109 -192
7897a92JL8J45L7k22OJ60M7q0J1K72k48M7m9m9l7O8L10l39L16k68j81J02K11j78
$$ -192 -191 -153 -8 29 -193 -187 -27 20 -60 -49 223 -25 22 -27 -76 -113 -45 265 -74 242 -26 -207 -105 106 -72
7922g2K77j17l82L71L2k68J37j43M1N86p51K88J50m1j30P7j53J51l9p8l7J75j91
$$ -72 205 88 -294 77 109 -159 -22 -165 -124 462 -289 -1 149 108 -22 55 -98 53 14 -64 -101 74 -117
7945a17R6j94K04j88k10N36j3m9N1j18m4J78j98J63j75K5L0P3r5O2R9j03n0k33
$$ -117 -21 -215 -11 -199 -409 127 114 65 116 -2 -46 132 -66 97 -78 -53 -23 50 -45 17 116 13 -37 -270
7969b70K33K25m8N4k07J99k24lN8m6j65J25J40l8l6j47N9L01L8j53l57K71L1j82
$$ -270 -37 188 140 194 -13 186 -38 -41 17 -29 -194 -69 71 33 -3 -150 -91 210 248 95 -262 9 40 -142
7993a42J09j2Q4j64O6N3L3On8J39J44k95K57j42rn2J05l11M6J54Q6M1l44J89K46
$$ -142 -33 -45 39 -125 -59 -6 27 33 -25 114 258 -37 220 78 69 17 122 -189 -143 11 97 138 -206 -17 229
8018B29j89L04n19K40j72J21n3J91m4j34nq4o9L47j68K02N6j45k15J88Pj50Q5
$$ 229 40 344 -175 65 -107 14 -39 152 108 -26 -31 -115 -184 163 -5 197 253 108 -107 81 88 -62 23
8041B3J7LK9j86K64p2j19j2J01l79K25J54j82K51Q3l4o7K4k40K87j90j03oL7M7
$$ 23 40 43 72 -114 150 78 -41 -53 48 -331 -106 48 -134 117 200 166 99 123 -117 170 -20 -123 -129 -92 -45
8066d5M1j11J44P3k52P8j29J87J96k78RR%J56P7n6p9m4O2j70J49P5j31J44j0l46
$$ -45 -4 -115 29 102 -150 -72 -201 -14 182 -96 -87 -78 -78 78 155 99 20 -24 38 -132 17 92 -39 105 95 -251
8092b51K73k7k2n2l9J93P4o3Q1L0j95Pl38K89J7j03L24m1j77K36l37J42j5j16
$$ -251 22 -5 -27 -79 -118 75 149 86 167 197 2 9 -329 -40 -23 -126 198 157 -20 216 -121 21 6 -110
8116a10K76j94J62k18LQ3l0J00j87J07j19L54k20j18P9N5J02l34K97J25k31N2
$$ -110 166 -28 134 -84 -81 2 -28 72 -115 -8 -127 227 7 -111 -32 23 125 -209 88 213 -18 34
8138C4j31O9j58M26j06j35j3j07N7j36J93n3j5J88l68L26p7N7J51j35K29k46K3
$$ 34 -97 -28 -186 240 134 -1 -14 -121 -64 -200 -7 -60 -75 113 -255 71 -6 51 202 67 296 50 73
8161G3n3J48j91Q6j15j31mK46j20K08j63j66J48j55K02K66j59k51J90L0K3k33
$$ 73 20 168 -23 63 -52 -183 -187 59 -61 147 -16 -182 -34 -189 13 279 120 -131 59 89 112 -121
8183a21J98r2j11k57L39R9j35j29
$$ -121 77 -15 -126 -383 -44 55 -80 -209
8191b09
$$ Imaginary data points
##PAGE= N=2
##DATA TABLE= (X++(I..I)), XYDATA
0@%%%%%%%%%%Qj6J6j6J6k4L2l5M3n6O4p2Q8j04J26j50J71j95K25k62L00l42L90
$$ 0 0 0 0 0 0 0 0 0 0 0 8 -8 8 -8 8 -16 16 -19 24 -32 32 -40 48 -56 70 -80 91 -104 121 -141 159 -183 207
33B07m39M95n59O28p03P87q79R78j087J207j337J476j630J802j988K189k410K656
$$ 207 -232 263 -296 332 -371 416 -463 515 -572 635 -702 774 -856 946 -1042 1147 -1263 1393
51A393k927L226l560L933m354M832n380O020o773P672q775J0161j1965J4424j7982
$$ 1393 -1534 1692 -1868 2065 -2289 2543 -2837 3183 -3590 4082 -4693 5468 -6497 7927 -10055
66a0055K3612l3886N8548k24516k31434M76207J06036k33899k9057J90934m7091
$$ -10055 13557 -20329 38219 -186297 -417731 58476 164512 -69387 -98444 92490 45399
77D5399m9109J34617L7287j70951K8868J79905o2117k18712J4190N9970j07637
$$ 45399 -3710 130907 168194 -2757 26111 206016 143899 -74813 -60623 -653 -108290
88a08290J1587K06167n6083k58273M7277K44227k7310j30423P9145R1611o2403
$$ -108290 -96703 109464 53381 -204892 -157615 86612 59302 -71121 8024 99635 37232
99C7232j8203K3312r0302l3640J70305O0044j91048n5543J73549k6329j95966
$$ 37232 19029 42341 -47961 -81601 88704 148748 -42300 -97843 75706 49377 -146589
110a46589R9648K26312j32057k12702J34227J31962j76055q5930J79799O6919
$$ -146589 -46941 179371 47314 -165388 -31161 100801 -75254 -161184 18615 85534
120H5534j07089N126M1108r8544j3990J75511K9385j75352j937J46695p8980j52640
$$ 85534 -21555 -16429 24679 -73865 -87855 87656 117041 -58311 -60248 86447 7467 -145173
132a45173J24276J34225j33468n0422J73233j6003k02879M2659J87786m6563j14751
$$ -145173 -20897 113328 -20140 -70562 102671 86668 -116211 -73552 114234 67671 -47080
143d7080P5203K9620j48520j7868J59783K329j18927P9584J26064j21635j11066
$$ -47080 28123 57743 -90777 -108645 51138 53467 -65460 14124 140188 18553 -92513
154i2513J45066Q1993j29843j3657J06949q1321j41808O0232O2564r1280J811
$$ -92513 52553 134546 4703 -8954 97995 16674 -125134 -64902 -2338 -93618 -91807
165i1807J34095k1027j32267M8658J25891m5713l9525J36057K5076j86964l0072
$$ -91807 42288 21261 -111006 -62348 63543 17830 -21695 114362 139438 -47526 -77598
176g7598J56659l8909j55969P8414J28651j05065r1191R7784K1360q9556P0195
$$ -77598 79061 40152 -115817 -37403 91248 -13817 -105008 -7224 14136 -75420 -5225
187e225J40913p0996j31328N7733O3577r3795j4062J25553k8232j40807O2214
$$ -5225 135688 64692 -66636 -8903 54674 -39121 -53183 72370 44138 -96669 -34455
198c4455J17508j16748r3640J63273R7044j28416l9571Q6423n1983q9810J04525
$$ -34455 83053 -33695 -127335 35938 132982 4566 -35005 51418 -565 -90375 14150
209A4150R9922j10000q3542R5838K9489j07656J2533J12932l4462p2941Q3213
$$ 14150 114072 4072 -79470 16368 45857 -61799 -49266 63666 29204 -43737 39476
220C9476K7707j47352k3067J51567J5318r6765L6628M8419j00084l2241J30708
$$ 39476 67183 -80169 -103236 48331 63649 -33116 3512 51931 -48153 -80394 50314
231E0314K5408j19018J0794J09832o2757j30119O3337R7849p2490k7821J20738
$$ 50314 75722 -43296 -32502 77330 14573 -115546 -52209 45640 -26850 -54671 66067
242F6067q640j40662L8502J38710l8711p2997Q1660K8478j23351l3695Q3761k3943
$$ 66067 57427 -83235 -44733 93977 55266 -17731 63929 92407 -30944 -64639 19122 -4821
254d821p6251O8723P2288j00896o9546J09146N0003q4240L5517J19186o5020j17967
$$ -4821 -81072 -12349 59939 -40957 -110503 -1357 48646 -35594 -77 119109 54089 -63878
266f3878P1418O1967j09348k9901J20483K20j20346N953P6472l7543k9354J03617
$$ -63878 7540 69507 -39841 -69742 50741 50961 -69385 -63432 13040 -24503 -53857 49760
278D9760M7329j01228k8870Q2964k3980q5047O2305P4792r0057n8833P9041n989
$$ 49760 97089 -4139 -33009 49955 25975 -59072 3233 78025 -12032 -70865 8176 2187
290B187r2039N3630J11073m8536o8733P0502K8543j02550j0259J20952N724j04962
$$ 2187 -89852 -36222 74851 26315 -42418 28084 56627 -45923 -56182 64770 70494 -34468
302c4468J6165O6727p8333o3706J11994O1006j01202k0471Q8380l0371q5444N2544
$$ -34468 -18303 48424 -29909 -93615 18379 79385 -21817 -42288 46092 15721 -69723 -17179
314a7179O3558n4762j3764P3887k5991j02045L3020J04335k8632o1953O2561K8748
$$ -17179 46379 -8383 -22147 51740 25749 -76296 -43276 61059 32427 -29526 33035 61783
326F1783j06625k5119J04924j075q3707M6654O6276q2895n3866Q7702L0434o8576
$$ 61783 -44842 -69961 34963 33888 -49819 -3165 63111 -19784 -73650 14052 44486 -24090
338b4090K5313Q0325n1910r4454L7285N3701n5448j9082P9013r617r8572K3132
$$ -24090 1223 81548 29638 -64816 -27531 26170 -29278 -48360 30653 21036 -77536 -54404
350e4404Q7623l5751l4800R5309L6394r4722j5623P1199l2943o7032O0025N5274
$$ -54404 33219 -2532 -37332 57977 94371 -351 -15974 55225 22282 -44750 15275 70549
362G0549q7903o4597O6073K3696p2760J9069J00512j6785p4700L9748M0465o8999
$$ 70549 -17354 -81951 -15878 7818 -64942 -45873 54639 37854 -36846 2902 43367 -25632
374b5632o412R5781q494r3419J5543N1641n6958l6277Q2447L7359o6429n227O2010
$$ -25632 -32044 63737 55243 -38176 -22633 29008 -27950 -64227 18220 55579 -10850 -16077 45933
387D5933l2496p0035N6431P3502o1719n2405N9239k335q9703K0367R1162k4806
$$ 45933 13437 -56598 -167 73335 11616 -40789 18450 16115 -73588 -53221 37941 13135
399A3135n2574N0339K3033p2573o926P9315L428n3996K6037L8155o3067m5924
$$ 13135 -39439 10900 33933 -38640 -45566 33749 37177 -16819 9218 47373 -15694 -61618
411f1618O8251L2797o0150J0054O6181m8495p7276N7604N7911n9358j5611P7086
$$ -61618 6633 39430 -20720 -10666 55515 7020 -70256 -12652 45259 -14099 -29710 47376
423D7376j0028q6486J7958P3476k3079l7368N9187L0404p9874l4126O3490J61
$$ 47376 37348 -49138 -31180 42296 19217 -18151 41036 71440 -8434 -42560 20930 21091
435B1091o1842K9391N1526o2567n3761N5355J9626m7529L3176P3592l3674n6161
$$ 21091 -40751 -11360 40166 -22401 -76162 -20807 -1181 -48710 -15534 58058 24384 -31777
447c1777M2741L3668n2377p155P0160n936q2145J701M9620m1156l9959P3520M1435
$$ -31777 10964 44632 -7745 -14900 55260 49324 -32821 -31120 18500 -22656 -62615 10905 52340
460E2340p0849j7924O0510j7547n2154M8149N1248n2432l6673M0949l432n6546
$$ 52340 -18509 -36433 24077 6530 -45624 2525 53773 1341 -35332 5617 2185 -54361
472e4361K1542O9710j4164m2998L7331K4910n7438n260P9064j206o8058J8729
$$ -54361 -32819 36891 22727 -20271 17060 41970 -15468 -20728 58336 57130 -10928 7801
484G801L7742o4890m5152O4767K8241n5544j163N1085k6168n3840M0228N7229
$$ 7801 45543 -19347 -64499 268 28509 -27035 -28198 22887 -3281 -57121 -16893 40336
496D0336l0085k3535M8197j731p0461P395O4716k0338m0564M4310J6941o9574
$$ 40336 10251 -13284 34913 33182 -37279 -29884 34832 14494 -26070 18240 35181 -34393
508c4393j3781N9596n510m2118L5202L7490n3668m0820N0294K8739l8535J2380
$$ -34393 -48174 11422 5912 -36206 -1004 36486 -17182 -58002 -7708 21031 -17504 -5124
520e124N8754k4935o0429L3993M3655m6261j7608O0653k786p0994p7L8022k5893
$$ -5124 53630 28695 -31734 2259 45914 -347 -17955 42698 39912 -31082 -31159 6863 -19030
533a9030j8317N2720J8365n4002r551M6809q150l8313L7008M5536m5883l9536
$$ -19030 -37347 15373 33738 -20264 -29815 16994 8844 -29469 7539 53075 7192 -32344
545c2344M2352M989n6855K1276P0801k2415n2958K9924K6575m3651o664N5610
$$ -32344 10008 14997 -41858 -20582 50219 27804 -25154 4770 31345 -12306 -18970 36640
557C6640Ln3881J306K7487l7956l6219M6722L4024m0943p225M5077j7080m2195
$$ 36640 36643 -17238 -15932 11555 -26401 -62620 -15898 18126 -22817 -30042 15035 -2045 -44240
570d4240M6818N4198l5424k4534L8646o752n4808J0342M4487k1426l3354L2150
$$ -44240 2578 56776 21352 -3182 35464 28712 -26096 -15754 28733 7307 -26047 6103
582F103J6419n4542j7190N8286J5101l9462J7239L6199m3158l6307M8010K4245
$$ 6103 22522 -32020 -49210 9076 24177 -15285 1954 38153 -5005 -41312 6698 30943
594C0943m0515M277M1279k4520m3376K5401K7885k7742m627M3730p520n9373L070
$$ 30943 -9572 -5295 35984 11464 -31912 -6511 21374 -6368 -10995 32735 25215 -34158 -31088
607c1088M5678j6929k8895M2561K3976n5034j6373M9562j988l6168L1217L8496
$$ -31088 14590 -2339 -31234 11327 35303 -19731 -36104 13458 11470 -24698 6519 45015
619D5015l8415l5217K8800J0785l2699J0737M4104j4398m3464J7343K6326l2228
$$ 45015 6600 -28617 183 10968 -21731 -10994 33110 18712 -24752 -7409 18917 -13311
631a3311r960N1017L539n2227K171K9862l0563k2436M7596K2095m0369m676L6234
$$ -13311 -23271 27746 31285 -20942 -18771 11091 -19472 -41908 5688 27783 -12586 -17262 18972
644A8972j0329l1283L0620M1596k5829k9074K4046j256m7504M543M6876j5394
$$ 18972 8643 -22640 7980 49576 23747 -5327 18719 17463 -30041 -25498 21378 5984
656E984l7906K3914J7066m0482l712N0922N537k9449J8291K3051l6608k7344L7620
$$ 5984 -31922 -8008 9058 -31424 -35136 15786 21323 -8126 10165 33216 -3392 -30736 6884
669F884K2325l4000o010L3286j8783m4737K6525M2672k6658j9310M1569M139n0768
$$ 6884 29209 -4791 -10801 22485 3702 -41035 -14510 28162 1504 -17806 23763 27902 -22866
682b2866j170L8646q949k1210K4829J2272l9626j5927L4768J0383k3116J3803
$$ -22866 -24036 14610 5661 -15549 9280 21552 -18074 -34001 767 11150 -11966 1837
694A837K8801k5303k8401K7591J2445l1653R116M1176j9584m2451J5999K0822
$$ 1837 30638 5335 -23066 4525 16970 -14683 -5567 35609 16025 -26426 -10427 10395
706A0395k3573l28L7407m713m1309L867K9632j7221k2845L3171K4690l3821j4116
$$ 10395 -13178 -13506 23901 19188 -22121 -18254 11378 -5843 -28688 4483 29173 -4648 -18764
719a8764L0627o787k9899L0313L8173l1013k9117K3557K044l2365R312L4548j4250
$$ -18764 11863 5076 -24823 5490 43663 12650 -16467 7090 9134 -23231 -13919 20629 6379
732F379l0080J8260J8649l0661j1706M3557J5718l2178R10K3724k6407k7426L5190
$$ 6379 -23701 -5441 13208 -17453 -29159 14398 30116 -2062 -1152 22572 -3835 -31261 3929
745C929K3165l3868j0348K6724j0638k8197J9880K9997j3524j1331K3842K034
$$ 3929 27094 -6774 -17122 9602 -1036 -29233 -9353 20644 7120 -4211 19631 21665
757B1665l6297k482L3273l883k4222J5186J0133l6635j0486L7669M691k4384J7931
$$ 21665 -14632 -17114 16159 12276 -11946 3240 13373 -23262 -33748 3921 8612 -15772 2159
770B159K5350k5776k2627K5114J3788k0779K889K4776j5013l5539J0877K4929
$$ 2159 27509 1733 -20894 4220 18008 -2771 118 24894 9881 -25658 -14781 10148
782A0148j6842q898L2070J335l7590L761L0164j5791j7839L2569J5974l6006j3602
$$ 10148 -6694 -15592 16478 17813 -19777 -16016 14148 -1643 -19482 13087 29061 -6945 -20547
795b0547K5759l19k0664J6503K7689j9775k7025J8075J2347k5889N10L4741p018
$$ -20547 5212 4893 -15771 732 28421 8646 -18379 -304 12043 -13846 -13336 21405 14387
808A4387l2483J0323J7165k3186o429L4257O364k6547M19J5361j4680j3553K3610
$$ 14387 -18096 -7773 9392 -13794 -20223 14034 20398 -6149 -5730 9631 -5049 -18602 5008
821E008J6098k1684r442J8750o979k4275J9118L0044j8952j7398K4248L38l4769
$$ 5008 21106 -578 -10020 8730 1751 -22524 -3406 26638 7686 -9712 14536 14874 -19895
834a9895K781L1697p605k1774J2465Q432k6041q051L0578J1659j8545O353K0607
$$ -19895 -17114 14583 6978 -14796 -2331 6101 -19940 -27991 2587 14246 -4299 2054 22661
847B2661j6470k1149K2434J6658k3563l229K3151j5522l2444J2045K1449j3878
$$ 22661 6191 -14958 7476 24134 571 -2658 20493 4971 -27473 -15428 6021 -7857
859g857o227K3398P72k7527J102K5834k273j5320J7102J4453k6632j5425K3616
$$ -7857 -14084 9314 10086 -17441 -16339 9495 7222 -8098 9004 23457 -3175 -18600 5016
872E016M022k1108J3379K4120j9961k2322J6765Q850j7530N134K1531j0428k4906
$$ 5016 9038 -12070 1309 25429 5468 -16854 -89 8761 -8769 -3635 17896 7468 -17438
885a7438O359J3554j4374o639K6212P659k5689q30K1189j0347j4582K6576J7063
$$ -17438 -11079 2475 -11899 -18538 7674 15333 -10356 -11186 10003 -344 -14926 11650 28713
898B8713k5464j0438J8493n210j9856J2971K0102j4183j5763J1369K386k2172
$$ 28713 3249 -7189 11304 6094 -13762 -791 19311 5128 -10635 734 3120 -19052
910a9052J338K6589k012k1728Q875J2200k0558o087L0569P616k0198P160J6564
$$ -19052 -17714 8875 6863 -14865 -5990 6210 -14348 -20435 10134 17750 -2448 4712 21276
923B1276j6917j5880J9269J2871j7308o461J3338r084k5051P138K2586q366j2244
$$ 21276 4359 -11521 7748 20619 3311 -3150 10188 1104 -23947 -16809 5777 -2589 -14833
936a4833J7906N163k4659J347K5869k580j3590J5207Q200k2745q792J8069K975
$$ -14833 3073 8236 -16423 -15076 10793 8213 -5377 9830 18030 -4715 -13507 4562 7537
949G537j2327Q001J4794j4939j8108J3954J2850j5739j496K1209p902k6878O895
$$ 7537 -4790 3211 18005 3066 -15042 -1088 11762 -3977 -5473 15736 7834 -19044 -12149
962a2149J5957j4235n128K3115L483k1853R04J7033m305p956J6707J2128j8234
$$ -12149 3808 -10427 -15555 7560 11043 -10810 -9906 7127 2822 -5134 11573 23701 5467
975E467j2034J3049q26j8139R030J9810j5043j9015J3542N422j8088M481K3290
$$ 5467 -6567 6482 5656 -12483 -3453 16357 1314 -17701 -4159 1263 -16825 -12344 10946
988A0946l861j6931P240Q894j3338m296K1105P316j6310k289J2604r665j3991
$$ 10946 7085 -9846 -2606 6288 -7050 -11346 9759 17075 765 -1524 11080 1415 -12576
1001a2576J6396J4121j7007p960J4158p061j9382J0535J7776r416p604J3159K61
$$ -12576 3820 17941 934 -7026 7132 71 -19311 -8776 9000 -416 -8020 5139 5400
1014E400j7602K437K0251o19j3436Q343R074j9037j1355K0021P129j6887M378
$$ 5400 -12202 -9765 10486 9867 -3569 4774 13848 -5189 -16544 3477 10606 -6281 -1903
1027a903J5648j3538j6142J4463J1069j1522j62J3195p096j7731M159J3101o283
$$ -1903 13745 207 -15935 -1472 9597 -1925 -2087 11108 4012 -13719 -9560 3541 -2742
1040b742n926J4726M027j8900j928J7839k057j0540J4462R958j9638r607J2914
$$ -2742 -8668 6058 10085 -8815 -10743 7096 5039 -5501 8961 18919 -719 -10326 2588
1053B588j003j2160P848J2811j1589j2454R334P031j0221K406J9108j014j7813
$$ 2588 1585 -10575 -2727 10084 -1505 -13959 -4625 2406 -7815 -5409 13699 12685 -5128
1066e128L945J0958j2088o115J8642L365j8829j258J0997r000q571J4513R479
$$ -5128 -1183 9775 -2313 -8428 10214 13579 -5250 -6508 4489 -4511 -13082 1431 10910
1079A0910j2400n553J0173k403j3502O996J7688o676j2706R479M827j6120R32
$$ 10910 -1490 -7043 3130 727 -12775 -5779 11909 5233 -7473 2006 6833 -9287 -8355
1092h355J9908k034j3189O857N632j4862n043J4719M130j0744Q18Q344r054j1457
$$ -8355 11553 9519 -3670 3187 8819 -6043 -11086 3633 7763 -2981 -2163 6181 -2873 -14330
1106a4330J1100J2296r755m010J3088l946j7404O287J4924p195n514J2492L25
$$ -14330 -3230 9066 -689 -4699 8389 4443 -12961 -6674 8250 1055 -4459 8033 8358
1119H358j5753M01J3406j294p225P997N608j3337r640J0357L684j0769L884J2547
$$ 8358 -7395 -6994 6412 5118 -2107 5890 11498 -1839 -11479 -1122 2562 -8207 -4323 8224
1133H224r664j3130J0840Q206r563L307J5484m478j4190M489P523p803l855J2231
$$ 8224 -1440 -14570 -3730 4476 -5087 -1780 13704 9226 -4964 -475 7048 -755 -4610 7621
1147G621K275j5046l929J0549k791r264J1612J0921j2343p720J0950j299j0803
$$ 7621 9896 -5150 -9079 1470 -1321 -10585 1027 11948 -395 -8115 2835 1536 -9267
1160i267P492J2456q866q843O961J827r695K396J3800J16j0490K724O438r648
$$ -9267 -1775 10681 1815 -7028 -67 1760 -7935 -5539 8261 8377 -2113 611 7049 -2599
1174b599n289J3652M786j3431j30Q506q626j0010J1422Q785q514k443P974l541
$$ -2599 -7888 5764 10550 -2881 -3011 5495 -3131 -13141 -1719 7066 -1448 -3891 4083 542
1188E42j0336N400J1277l316o344P002K438j2372j884J3309J96q661O548N170
$$ 542 -9794 -4394 6883 3567 -2777 4225 6663 -5709 -7593 5716 5912 -2749 3799 8969
1202H969j3523n315J1675J930q445L742P229q024q979P206P949n885n58J0623
$$ 8969 -4554 -9869 1806 3736 -4709 -967 6262 -1762 -10741 -3535 4414 -1471 -2029 8594
1216H594j720j3407K402J0191n872n030J1537J137j4077j241R875l261m985R117
$$ 8594 6874 -6533 -4131 6060 188 -4842 6695 7832 -6245 -7486 2389 -872 -5857 3260
1230C260N556r019n682O541J204p344L869J0041n559j0616N567M742q926J728
$$ 3260 8816 -203 -5885 656 1860 -5484 -1615 8426 2867 -7749 -2182 2560 -6366 -4638
1244d638J3841j812j0975M053N580p744k630R752K048r309k265M643m610o227
$$ -4638 9203 7391 -3584 469 6049 -1695 -4325 5427 7475 -1834 -4099 544 -4066 -10293
1258a0293P826P922o794m240Q006j203r549O287J1773n990o129P229J25j0312
$$ -10293 -2467 5455 -1339 -5579 2427 1224 -8325 -2038 9735 3745 -2384 4845 4970 -5342
1272e342O96J0298n17o722K667L538p562n274R048M313p732J41P565o532q899
$$ -5342 -4646 5652 5135 -1587 1080 4618 -2944 -8218 830 5143 -2589 -2448 5117 -1415 -10314
1287a0314P579P635o551k80Q633l555q862L467P348l110k696N877J067r613k681
$$ -10314 -2735 4900 -1651 -1931 6702 3147 -5715 -2248 5100 1990 -706 5171 6238 -3375 -6056
1302f056Q100j49o002N757N810r645o013Q214J673p055M300P701o773o541M829
$$ -6056 2044 1895 -4107 1650 7460 -2185 -8198 16 1689 -5366 -1066 6635 -138 -6679 -1850
1317a850L355m629J779P889q27q536J026N523m379l691Q674K185j0449j910O968
$$ -1850 1505 -3124 -1345 6544 5717 -2819 -1793 3730 -649 -4340 4334 6519 -3930 -5840 1128
1332A128m331n496Q737N875o627k673N996n58n425M234P914k871o757K968J885
$$ 1128 -3203 -8699 38 5913 -714 -3387 2609 2051 -3374 860 8774 5903 -854 2114 3999
1347C999p488j075Q837j4q151K610L925p525k866R065K280o001Q57M018m731m852
$$ 3999 -3489 -4564 4273 4259 -3892 -1282 2643 -4882 -7748 1317 3597 -2404 -1547 2471 -2260 -7112
1363g112N829N897l948j889N533o92q034K743P796k636m385N384K10r942j58O967
$$ -7112 -1283 4614 666 -1223 4310 3618 -4416 -1673 6123 3487 -898 4486 4696 -5246 -5404 1563
1379A563j543m436M582K450p033l138O355K908m281K118O231l681o930M473N291
$$ 1563 20 -4416 166 2616 -4417 -7555 -1200 1708 -2573 -455 5776 2095 -4835 -362 4929
1394D929m929N10P548k695q755K819M568m580j838N939N59p472j920M529o99l857
$$ 4929 0 510 8058 5363 -3392 -573 3995 -585 -2423 3516 4075 -3397 -5317 -788 -1487 -5344
1410e344M626N713n233m268N208J137m880L759O713m839n244L743O18n957J341
$$ -5344 -718 4995 -238 -4506 702 1839 -3041 718 7431 2592 -2652 1091 1709 -4248 -2907
1425b907O433j111o083J254K688l266j997O372L220n833r31M453l143m758O212
$$ -2907 3526 2415 -3668 -2414 274 -2992 -4989 1383 4603 -1230 -2161 2292 -851 -5609 603
1440F03M941n404j382M742k117n278L600N840k883l029K338K80n812j071N645
$$ 603 5544 140 -1242 3500 1383 -3895 -295 5545 2662 -367 1971 2251 -3561 -4632 1013
1455A013K40m433K402L265n848k686P285K042m040K290M068m243m629M193K961
$$ 1013 1253 -3180 -778 2487 -3361 -6047 1238 3280 -760 1530 5598 1355 -3274 919 3880
1470C880l049j153M296j493o458L32M938j995k288M439Q98o911n19N607j480k562
$$ 3880 831 -322 3974 2481 -3977 -3645 1293 -702 -2990 1449 2347 -4564 -5083 524 -956 -3518
1486c518M911K977n628j773M374L67k668K340M283l084n204K307K252l650n50
$$ -3518 1393 4370 -1258 -3031 1343 1710 -958 1382 5665 2581 -2623 -316 1936 -1714 -2264
1501b264N859j242n988J282L384l740r26O335J013n271M5L067k251k204L936L679
$$ -2264 3595 2353 -3635 -2353 1031 -2709 -3635 2700 3713 -1558 -1513 1554 -697 -2901 1035 4714
1517D714l748k424L014j94m487K263N515k607m175L171r4n296N56N533r21l587
$$ 4714 966 -1458 1556 1362 -3125 -862 4653 2046 -2129 1042 948 -4348 -3792 1741 820 -2767
1533b767J933J724l884o58M744K146k629r6L331k965l630L128L552l664j052L541
$$ -2767 -834 890 -2994 -3652 1092 3238 609 513 3844 879 -2751 377 3929 265 -787 2754
1549B754k467m964K547L899k258j445L508j25m686M10L570K43k229K233K279l977
$$ 2754 287 -4677 -2130 1769 -489 -1934 1574 1449 -3237 -2827 743 986 -1243 990 3269 -708
1565g08k710M026J526l112J666L893l946l536L068J408l144Q88L397j669m141
$$ -708 -3418 608 2134 -978 688 4581 635 -2901 167 1575 -1569 -681 2716 1047 -3094
1580c094P71K648j730p11L748J264m220q52L542r61k649L688K981m212k100L267
$$ -3094 -2323 325 -1405 -2116 1632 2896 -1324 -2176 1366 405 -2244 1444 4425 213 -1887 1380
1596A380j024k843K661L085j991k890J248O42l012K67M178k00l853J238K325k930
$$ 1380 356 -2487 174 3259 1268 -1622 -374 268 -2744 -2477 1701 1501 -2352 -1114 1211 -1719
1612a719j228M690J849l888O64K284k905j980L095J920k631r16J640j268l200
$$ -1719 -2947 1743 3592 -296 368 2652 -253 -2233 862 2782 151 -765 875 -393 -3593
1627c593J516L407q76k499L007O92m279K40M147n08k495K222J282l641r14L285
$$ -3593 -2077 1330 454 -2045 962 1654 -2625 -2385 1762 1254 -1241 981 2263 -1378 -2292 993
1643I93N53j619J236J812k279k844J810K158k057r79L106j471l619R18K944k024
$$ 993 1546 -73 1163 2975 696 -2148 -338 1820 -237 -1216 1890 419 -3200 -2282 662 -1362
1659a362p18L636J96l331R1K352m91j125K382J401k882j697K231K82k382J425
$$ -1362 -2080 1556 1752 -1579 -1488 864 373 -752 1630 3031 149 -1548 683 965 -1417 8
1675HK875k163l001J904Q38k662P10L508j193k587Q86J192j705Q9K878P06k012
$$ 8 2883 720 -2281 -377 461 -2201 -1491 2017 824 -1763 -877 315 -1390 -1301 1577 2283 271
1692B71o90J961j643j711K437K083k592j478K303j286k547K141K651j773j325
$$ 271 -419 1542 -101 -1812 625 2708 116 -1362 941 -345 -2892 -751 1900 127 -1198
1707a198J649Q8k431N97K649j58j684P96Q64k181j060L052R75k140N72J958k440
$$ -1198 451 539 -1892 -1295 1354 1196 -488 308 1172 -1009 -2069 983 1958 -182 390 2348 -92
1724i2k117K463J177j999j58J745j728k375J540J799n31n87J956N53k700k14K961
$$ -92 -2209 254 1431 -568 -726 1019 -709 -3084 -1544 255 -276 -863 1093 1646 -1054 -1268 1693
1741A693l33j541K128Q80k797j219K041l49j573J167J488k116j677J116O95j172
$$ 1693 1360 -181 1947 2827 30 -1189 852 503 -1070 97 1585 -531 -2208 -1092 -397 -1569
1757a569L23K027k88k520R73J558j476k04K847L35k480K56J885j378o95J686P77
$$ -1569 -1246 781 493 -2027 -1054 504 -972 -1176 1671 2006 -474 -218 1667 289 -406 1280 2057
1774B057j907j083J293o08j554R74J985j126j810J343O11k206N89L397r37j761
$$ 2057 150 -933 360 -248 -1802 -828 1157 31 -1779 -436 175 -2031 -1442 1955 1018 -743
1790g43R31J070j917R3K194K76j694J25Q66j250j355J432J452j491q70J382p70
$$ -743 188 1258 -659 -566 1628 1904 210 335 1201 -49 -1404 28 1480 -11 -881 501 -269
1807b69k467J673K014j308o93K121l32k055O76J833j71p75Q13L66k014o87J521
$$ -269 -2736 -1063 951 -357 -1050 1071 739 -1316 -640 1193 1022 247 1060 1426 -588 -1275 246
1824B46N14j625M01J780j923j836J721J219j230L37K016j326j729J001J268q13
$$ 246 760 -865 -464 1316 -607 -2443 -722 497 -733 -396 1620 294 -1435 -434 834 21
1840B1j59J726J17j933k08J571n20j124J630P28k180q05J184m93j108J288J216
$$ 21 -138 1588 1705 -228 -436 1135 615 -509 1121 1849 -331 -1136 48 -445 -1553 -265 951
1857I51j460j018J210rq64J013J541m54j425O94O06j071o02K018K00j762J08Q23
$$ 951 -509 -1527 -317 -326 -1190 -177 1364 910 -515 179 785 -286 -888 1130 1330 -432 -324 499
1875D99j263p07J571P51j485k39J037o04r49P64J518n58p41P33K68j476M76J728
$$ 499 -764 -1471 100 851 -634 -873 164 -440 -1389 -625 893 335 -406 327 595 -881 -405 1323
1893A323k58j279J230K85k093k78J681k50j226Q26O27j428p77J201R18o15o4J143
$$ 1323 1065 -214 1016 1301 -792 -1070 611 361 -865 -39 588 -840 -1617 -416 502 -113 -177 966
1911I66n14j693Q89J220q55j10J153q0k143P80J282r11m69R94K90j436m78J066
$$ 966 452 -1241 -352 868 13 -97 1056 976 -1167 -387 895 -16 -485 509 799 -637 -1115 -49
1929d9j6o92N44J181j308q95J388K93q24M54J712p85j336P31N41j283l8J392l64
$$ -49 -65 -757 -213 968 -340 -1235 153 446 -378 76 1788 1003 -333 398 939 -344 -382 1010 646
1948F46j127n0O12n61n54J149L53q66n01J311l54j206J474Q21p16o77P73J32j391
$$ 646 -481 -531 81 -480 -1034 115 468 -398 -899 412 58 -1148 326 1147 431 -246 527 659 -732
1967g32P34J303o90m37nK14j017j23J285m6j076o8J069j234n44J403N48r09J51
$$ -732 2 1305 615 178 173 387 -630 -753 532 486 -590 -658 411 -823 -1367 36 584 -325 -174
1986a74J073r89q09J004Q83o62lN80m58j313M23Q86n8o82M73M99j931m2J378L
$$ -174 899 -90 -899 105 988 326 323 903 445 -868 -445 441 383 -299 174 673 -1258 -1300 78 81
2006H1j037Q30P91j132l67N29P78n35N22P14p42q16M94N89o65j01R43k52j448
$$ 81 -956 -126 665 -467 -834 -305 473 -62 460 1174 432 -384 110 699 34 -67 876 624 -824
2025h24J27J031o27l38R61K42j167K2N86k65l24R03M99n29o96O77J07q33L85J337
$$ -824 -697 334 -293 -631 330 572 -595 -573 13 -252 -576 327 826 297 -399 278 385 -448 -63 1274
2045A274m69j216N89M28j359K65R69m0j057K24O96r43j06J020J59n66q6K66N3
$$ 1274 805 -411 178 606 -753 -488 481 441 -616 -392 304 -639 -745 275 434 -132 -218 48 101
2064A01o46N87J028r54m37P46K8j294R65O11n09n36K17J61r95J90J063j40m67
$$ 101 -545 42 1070 116 -321 425 453 -841 124 735 226 -310 -93 68 -927 -737 326 186 -281
2083b81L19L73n20o78R83M12o02J84N27k91j081P61L33o21J65M28k97r34L78L12
$$ -281 38 411 -109 -787 196 608 6 190 717 426 -655 106 439 -182 -17 411 114 -820 -442 -130
2103a30j93O0K64K34o17n64J209L7p73R15M92r95l32P76m7n17N71M99n33p98N06
$$ -130 -323 -263 1 235 -382 -946 263 300 -473 442 934 -61 -393 383 336 -181 390 889 356 -442 64
2124F4r6k23j74P44j83p72K44M97l36m18R69L05q66j9Q63m89l15Q28L18p32l69
$$ 64 -32 -255 -429 315 132 -640 -396 101 -235 -653 316 621 -245 -264 599 110 -205 623 941 209 -160
2145a60M79k65m14J99N94k57p13K28J35l77l81J085j28k67P7K81n62P8N23L37
$$ -160 319 54 -360 -161 433 176 -537 -309 -174 -551 -932 153 25 -242 -165 116 -446 -368 155 492
2165D92m25K41J09m30n44O37P29q88p7M25l21r12N53N97j12o78R08j84r24N56
$$ 492 67 308 417 -13 -557 80 809 -79 -156 269 -52 -964 -411 186 74 -604 304 120 -804 -248
2185b48L72K7k48M57K91m07n98O95k5m39K44P08n22p63L39L46o81J65Q35o47p14
$$ -248 124 151 -97 360 651 244 -354 341 316 -123 121 829 307 -456 -117 229 -452 -287 548 -99 -813
2206h13N26N20p19L80L14K51n57j02N88k93j95L72L55n95m52N55K6p08N51L53
$$ -813 -287 233 -486 -106 208 459 -98 -200 388 95 -100 272 627 32 -420 135 161 -547 4 357
2226C57n38l16L42k38l89M08N09M6k14J7M93m96m19O58M72n17l94Q11m93m87P49
$$ 357 -181 -497 -155 -393 -782 -374 135 181 -33 -16 477 -19 -438 220 692 175 -219 592 99 -388 361
2247C61j47k67j28K50j33m15J53L89k06j40O6L30n73N3Q70k12k53jP29q96k08
$$ 361 214 -53 -181 69 -64 -479 -326 63 -143 -283 -217 113 -460 -407 463 251 -2 -3 726 -170 -378
2268c78Q74j69n98J54M97n85m3J35K39j38m35M31M2n09M68K19k82j84L30L61p00
$$ -378 496 327 -271 -117 380 -205 -248 -113 126 -12 -447 -16 26 -483 -15 204 -78 -262 68 429 -271
2289b71J96M70j26n22N22K36o58M1J99R3o37L28O41q49k24O19l5m00K37P74m73
$$ -271 -75 395 269 -253 269 505 -153 -112 87 180 -457 -129 512 -337 -561 58 23 -377 -140 634 161
2310A61n82O69M0n38K12M85M4m35J5l7J49m41M39P9l08j22J45p6n35M81M69l70
$$ 161 -421 248 288 -250 -38 447 491 56 71 34 183 -258 181 260 -48 -170 -25 -101 -636 -155 314 -56
2332e6k52K64R6l53K06K12q7J26j27K97k56j88O03k81k99j27K72k92o4K87P5l76
$$ -56 -308 -44 52 -301 -95 117 30 156 29 326 70 -118 485 204 -95 -222 50 -242 -306 -19 56 -320
2354c20j2N36k56m29O24J2J28l34J27L53m94R7L10%m04M29O3o32k74O43l35k24
$$ -320 -332 204 -52 -481 143 155 283 -51 76 429 -65 32 342 342 -62 367 430 -202 -476 167 -168 -392
2376c92N51Pn57L31o2J13j86K52L70n64n6K95K00k11j80N44j26k55m2Q5r8k63
$$ -392 159 166 -391 -60 -122 -9 -195 57 427 -137 -193 102 302 91 -89 455 329 74 32 117 19 -244
2398b44L92p5k53n1J07R6k27J99J26k25J24j08L56k29j78L38K19n24L15N2k3k34
$$ -244 148 73 -180 -231 -124 -28 -255 -56 70 -155 -31 -139 217 -12 -190 148 367 -157 158 210 187 -47
2420d7K15J37m50K18k2l48K56q9P5r2q0K90k70j17K23L62l03q0K14J36n25J67
$$ -47 168 305 -145 73 51 -297 -41 -130 -55 -147 -227 63 -207 -324 -101 261 -42 -122 92 228 -297 -130
2442a30O02j27l07K03k70k38L34j24qJ1p1j7j4j76M25K35k12jJ4j17n6K40Q3j79
$$ -130 472 345 38 241 -29 -267 67 -57 -65 -54 -125 -142 -156 -332 93 328 116 115 129 12 -44 196 279 100
2466A00m3R3J85o04K25J34J45l30L6Q4j65k55L21N2j67J43J30K5k97J39J59j50
$$ 100 57 150 335 -269 -44 90 235 -95 -59 25 -140 -395 -74 -22 -189 -46 84 109 -188 -49 110 -40
2488d0R1O10n04k82M89l53K9j66L65P8m87lK30j34n6K54m6l41L6L21j57N1J20
$$ -40 51 661 157 -125 364 11 40 -126 239 317 -170 -173 57 -77 -133 121 75 -266 -230 91 -66 -15 105
2511A05J40Qk72m7J94k39J49K99l49p5L51p3j86k27K31J65l74R3R6M5l86L96J5
$$ 105 245 253 -19 -66 128 -111 38 337 -12 -87 264 191 5 -222 9 174 -200 -107 -11 34 -352 44 59
2534E9j35P1l0O4o8J30P3j67J09k8R4k57J08J03j09p2j07K81l42O6L00n4k9j4
$$ 59 -76 -5 -35 29 -39 91 164 -3 106 78 172 -85 23 126 17 -55 -162 119 -223 -157 143 89 60 46
2558D6o4J29k64Q8k11Q6J93J43j1j92J22M0l21J73L12l52l0m9J88L6j70p0K4M9
$$ 46 -18 111 -153 -65 -276 -190 3 146 135 -57 65 105 -216 -43 269 -83 -113 -162 26 62 -108 -178 -154 -105
2582a05J81l17K92k42L27p3r2N7K81k13n5j04K32j54L14l09j6PJ15J0k87L04l46
$$ -105 76 -241 51 -191 136 63 -29 28 309 96 41 -63 169 15 329 20 4 11 126 136 -151 153 -193
2605a93K97j15m0M5J84p8M9r6r6r7M30j64j96R5J99l67J53J04j38J19m7j15k6
$$ -193 104 -11 -51 -6 178 100 149 53 -43 -140 290 126 -70 25 224 -143 10 114 -24 95 48 -67 -93
2628i3M6M8Q3K7j18q5K74l02j37M96j74j89K30n5J5Pq4j26L99k25mJ65j72j75
$$ -93 -47 1 84 111 -7 -92 182 -120 -257 239 65 -124 106 51 66 73 -11 -137 262 37 33 198 26 -149
2652a49J07P0j62J47q5K2O6P5P2k76J30M3l47K25R3j05MqM71m10j18J67J03j94
$$ -149 -42 28 -134 13 -72 -50 16 91 163 -113 17 60 -287 -62 31 -74 -70 -78 393 -17 -135 32 135 -59
2676e9P4K08k24n2J15k38j01L7L13R3j67K6j01J6K68j57k5J09j11R3j72j32J75
$$ -59 15 223 -1 -53 62 -176 -277 -240 73 166 -1 25 -76 -60 208 51 26 135 24 117 -55 -187 -12
2699a2K56l98N5n7M6K4Q3L37l83J0k82L93j76K72M0k49j5K13p2M0r8n9J23n5j9
$$ -12 244 -154 -99 -156 -110 -86 -3 334 -49 -39 -321 72 -104 168 208 -41 -56 157 85 125 27 -32 91 36 17
2724A7j03j52L31J43j20k13P1k02N8K56K2j68J36k8k33L26l40J0O5J37Q4M1j83
$$ 17 -86 -238 93 236 116 -97 -26 -228 -170 86 108 -60 76 48 -185 141 -199 -189 -124 13 97 138 -45
2747d5j92j1k4J21K99P0p4l32O9Nj16J47j82K88M9j8k02K77k45P3J06j90N7j0
$$ -45 -237 -248 -272 -151 148 218 144 -188 -119 -114 -230 -83 -265 23 72 54 -148 129 -116 -43 63 -127 -70 -80
2771h0qN8J64L1l48J79j68L56l90J25K9L2J2j38OK55l8J67j63jj6oj46j10K22
$$ -80 -88 -30 134 165 -183 -4 -172 184 -206 -81 -52 -20 -8 -146 -140 115 77 244 81 80 64 58 -88 -198 24
2796B4j30K56j11n5j3J47l70L89J21m47J97j55J97k13M06j01j67J20k86J35p6
$$ 24 -106 150 39 -16 -29 118 -252 137 258 -189 8 -147 50 -163 243 142 -25 95 -191 -56 -132
2817a32Q9m8K54P7j75j29MOn4J58L6K02m79K11k31O43m70J18J34k31L8m3K09k5
$$ -132 -43 -91 163 240 65 -64 -60 -54 -108 50 86 288 -191 20 -211 432 -38 80 214 -17 21 -22 187 162
2841A62j55k9L10m32J13o6J0Q7K10o2m18K37k22J79M4qJ29K6r8j17R6j79j17J59
$$ 162 7 -22 288 -144 -31 -97 -87 0 210 148 -270 -33 -255 -76 -32 -40 89 115 17 -100 -4 -183 -300 -141
2865a41K07k67L54n0K8k03o8L49k61j9K4r7J10k5j28J73M0l7j44n5K98k45M62
$$ -141 66 -201 153 103 131 -72 -140 209 -52 -71 -47 -144 -34 -59 -187 -14 26 -11 -155 -210 88 -157 305
2888C05k01M8l50l3P1Q1K27k39L16k16M9j41K80j23K0l0P4l68j16K63K05j32J84
$$ 305 104 152 -198 -231 -160 -79 148 -91 225 9 58 -83 197 74 94 64 138 -230 -346 -83 122 -10 174
2911A74o7l94O9JJ60J93j86O5k2j03J67J28l83M25l4l3m69K13J93Q0k49P4L6J32
$$ 174 107 -287 -218 -217 -57 136 -50 15 -7 -110 57 185 -198 227 193 160 -309 -96 97 177 -72 2 38 170
2935A70n55L98N0m45M70P8j39l70N08k62R6r1L51k51j42J82j95j58L36RJ34j43
$$ 170 -385 13 63 -382 88 166 27 -343 165 -97 -1 -92 259 8 -134 48 -147 -305 31 40 174 31
2957C1j02M0j00J53j1K30j69q5p4J90l51K13K12k2N8j48j02j07N9J29J04j54L5
$$ 31 -71 -31 -131 22 11 241 72 -13 -87 103 -248 -35 177 155 213 65 -37 -144 -85 44 148 -6 29
2980B9j6j22K9J02k42j2J15J81j65k58J98K55n9q2l5K41n6k18K37R2l15M15J7
$$ 29 13 -109 -80 22 -220 -232 -117 64 -101 -359 -161 94 35 -47 -82 159 103 -115 122 214 -101 314 331
3003C31m90J35R6k37J61Q7j52j19m2K83P2k69K41n1J57k15k39K23K05j29j5L31
$$ 331 -159 -24 72 -165 -4 83 -69 -188 -230 53 125 -144 97 46 203 -12 -251 -28 177 48 33 364
3025C64l20j18l0J21R9jl6l36k4J64R8pP0Q4k45p6j2J59j08L31L9r8k07J52Q5
$$ 364 44 -74 -104 17 116 115 79 -257 -281 -117 -19 -26 44 128 -117 -193 -205 -46 -154 177 216 118 -89 63 148
3050A48j82L4K28k54O9nk34n8j10M18R4J9k63J61m5k83k8N13j24k09K18j71k11
$$ 148 -34 0 228 -26 43 38 -196 -254 -364 54 148 167 -96 65 20 -263 -291 222 98 -111 107 -64 -275
3073b75L16m0L49l28M32j84n94M16J00k11J14r1J9j23N9o4P0l62L59J50j5o4j2
$$ -275 41 1 350 22 454 270 -324 92 192 -19 95 4 23 -100 -41 -105 -35 -397 -38 112 97 33 21
3096B1K33k37J96P9m20R9J3J48j98O7p8L68k71p5K01j37j90K57O1k10l32L43K1
$$ 21 254 17 213 292 -128 -29 -16 132 -66 1 -77 291 20 -55 146 9 -181 76 137 -73 -405 -62 -41
3119d1M0J80q8O2k63L09j97j74J17P5K14l00k1J31n2j0P2J7o4P3K3k81O1L02k
$$ -41 -1 179 91 153 -110 199 2 -172 -55 20 234 -66 -87 44 -8 -18 54 71 7 80 103 -178 -117 185 183
3144A83k7k9j07j8n5J03J71r0k08k3N0j76J93J04k86L11R1l57r5p3L46R5r2j31
$$ 183 156 127 20 2 -53 50 221 131 -77 -100 -50 -226 -33 71 -215 96 187 -170 -265 -338 8 103 11 -120
3168a20K13m00J08L32m4J83j09K2j32Ok7LP4j42Q4m03J42j11l3J62K16J3j2o6
$$ -120 93 -307 -199 133 89 272 163 185 53 59 32 35 109 -33 51 -352 -210 -321 -354 -192 24 37 25 -41
3192d1l89L80K03j08R4O4j75j77K07l9J68k10L48m07j52J98j78J95k17L80J4l65
$$ -41 -430 -50 153 45 139 203 28 -149 58 19 187 -23 325 -82 -234 -36 -214 -19 -236 144 158 -207
3214b07k5J59n9J46P8J46j91j21Q6J50j24jK13m02J19J92n21L00J42k15Q2j10
$$ -207 -232 -73 -132 14 92 238 47 -74 12 162 38 37 250 -152 -33 159 -362 -62 80 -135 -53 -163
3236a63J06ln2K2M10m3j79K8Rj22J04oK18j44J09k92K1L7l1J15k22K12q3l8k43
$$ -163 -57 -60 -112 -90 320 277 98 126 135 13 117 111 329 185 294 2 23 60 29 144 -78 134 51 13 -230
3261b30Q6L12j98j38L77k49k37K00j64K80r9K73ok06j38J47L06m05J34L09l71
$$ -230 -144 168 -30 -168 209 -40 -277 -77 -241 39 -60 213 207 1 -137 10 316 -89 45 354 -17
3282a7r7m5J69n9M7J38k67j59J09J70j36J58N5q3P9o5n1K58l8k37L02l09K05j90
$$ -17 -114 -159 10 -49 -2 136 -131 -290 -181 -11 -147 11 66 -17 62 -3 -54 204 166 -71 231 -78 127 -63
3306f3R5l17M00q0j38j37J86J4l81M91L16k82k40J69O2j49J43N0J81r1k65L58
$$ -63 32 -285 115 35 -103 -240 -54 -40 -421 70 386 104 -136 33 95 -54 89 139 320 229 -36 322
3328C22l59j29R1k4J31N6j16r7qn3K16j53m5R9J0j27J5K42l6K47l84K39q5j01
$$ 322 -37 -166 -75 -99 32 88 -28 -125 -133 -186 30 -123 -168 -69 -59 -186 -171 71 35 282 -102 137 52 -49
3352d9n1P5J54P9lr0k69J1K42rj72P8o3k60O3K23l1K67oJ77l38q5K08k07J85m3
$$ -49 -100 -25 129 208 205 115 -154 -143 99 90 -82 -4 -67 -327 -264 -41 -72 195 189 366 28 -57 151 -56 129 86
3378H6R4q4l24J02r1PK46K60m30J2j90K24j93J91K17Mk25j42L64l8R1R4j6j26
$$ 86 180 96 -228 -126 -217 -210 36 296 -134 -122 -312 -88 -281 -90 127 131 -94 -236 128 90 181 275 259 133
3402A33j13k1j44J58o5J09K6k85lQ6j79J02M61k65p7n7K36j93K21L3L61l32q7
$$ 133 20 -1 -145 13 -52 57 83 -202 -205 -119 -298 -196 265 0 -77 -134 102 -91 130 163 524 192 105
3425A05J38j04p5k7J8L62o75J78n7j25P1J69j46r3K59k2l38L45J24k4j45J47O2
$$ 105 243 139 64 37 55 417 -258 -80 -137 -262 -191 -22 -168 -261 -2 -24 -362 -17 107 83 -62 85 147
3448A47l19N5L0K57K9q3j47J09l35O1J34j57J26K27k56k38K75q3n0K80J1J10l48
$$ 147 -172 -117 -87 170 199 116 -31 78 -257 -196 -62 -219 -93 134 -122 -360 -85 -168 -218 62 73 183 -165
3471a65J58n4L29k66J76j37r2j85J74K29j12j7J32j87l09L9J86k09K63nJ51j73
$$ -165 -7 -61 268 2 178 41 -51 -236 -62 167 55 38 170 -17 -326 -287 -101 -310 -47 -52 99 -74
3493g4j32K77j83j13N72O5n34k9K20m4p7K91k37n1nROP0j59J54O5l83J38L1K72
$$ -74 -206 71 -112 -225 347 412 -122 -151 69 25 -52 239 2 -49 -54 -45 -39 31 -128 26 91 -292 -154 -123 149
3518A49j68p6L86l33P8L95l29k22M50o5m19J65L8l09N9J96j08K13k14J41n9j47
$$ 149 -19 -95 291 -42 36 431 102 -120 330 265 -154 11 49 -260 -201 -5 -113 100 -114 27 -32 -179
3540a79K6K58N5q8K42l8l99Q3K54l19J06N4J03k97J21j18J19r8J01nM7j55o0K43
$$ -179 -153 105 160 72 314 276 -123 -40 214 -105 1 55 158 -139 -18 -136 -17 -115 -14 -19 28 -127 -187 56
3564E6l6k11L31k76L7L59p1k00O8M43l23j67M9Rj9J02k71J89m3l59J90j49Q0M68
$$ 56 20 -191 140 -136 -99 260 189 -11 57 500 177 10 59 68 49 151 -120 69 26 -333 -143 -292 -212 256
3588B56k87p2J8J04j73j90M02J25k37J49Lj9k06K50k19K08o8q5L10l08l3Ok9j
$$ 256 -31 -103 -85 19 -154 -344 58 183 -54 95 98 79 -127 123 -96 112 44 -41 269 -39 -72 -66 -95 -96
3612i6O9J25l34K50K4L4J76j95K34r7k02J93j07J25m03M60k60k05q6K46O1K0j6
$$ -96 -27 98 -236 14 38 72 248 53 287 190 -12 181 74 199 -204 256 -4 -209 -295 -49 12 32 16
3635A6N0k48K16n4qK9K70n0l06J04J00J34k5j71Q1l2l32K68j63j50J00K18K25
$$ 16 66 -182 34 -20 -28 1 271 221 -85 19 119 253 228 57 138 106 -226 42 -121 -271 -171 47 272
3658B72l47j34J51Q8k27K23R0l6pj55J91J39j09K48l72q2l1J57j74J69L50l88
$$ 272 -75 -209 -58 30 -197 26 116 80 73 -82 109 248 139 387 15 -67 -98 59 -115 54 404 16
3680A6p2n3P4m21K81K28k6j11J20p4R5k76J63N06j43j70K4o2r4N3M74m25N8k34
$$ 16 -56 -109 -35 -456 -175 53 27 -84 36 -38 57 -219 -56 450 307 137 161 99 5 58 532 107 165 -69
3704f9Q6k77K14p4Jr1N5n9K6q3Q0M17l9l57O27l03j80O8K56k14o9J78j86q7L8
$$ -69 17 -260 -46 -120 -119 -210 -155 -214 -188 -271 -191 226 187 -170 457 154 -26 42 298 84 15 193 7 -80 -42
3729d2n9K24j45j00K2J68m42L53P2j29Q0l4M3m04M21o6M7N3K68j69l04O9Q3J84
$$ -42 -101 123 -22 -122 -100 68 -374 -21 51 -78 2 -32 11 -393 28 -38 9 62 330 161 -143 -74 9 193
3753A93j18p5J52m23k12K56l7K69J09Q9k95O2K23l6k79L03m9p1J30j03p3j12J68
$$ 193 75 0 152 -271 -483 -227 -264 5 114 203 -92 -30 193 157 -122 181 132 61 191 88 15 -97 71
3776G1K53l03J5L3J3j68k69J62J73q4M2K38m04J03L32M3l53K63M1k78J41P8R5
$$ 71 324 21 36 69 82 -86 -355 -193 -20 -104 -62 176 -228 -125 207 250 -103 160 201 -77 64 142 237
3799B37j78l4k6j8k92K4M59r6l60L15j99j09L4J45J32j06L1J66l80K50k7n0K78
$$ 237 59 25 -1 -19 -311 -287 172 76 -284 31 -168 -277 -243 -98 34 -72 -41 125 -255 -5 -32 -82 196
3822A96J34N8k69k35K1K6L1p8K24r8j35j00J54k09J16K42p0j31J13L7j50R4M9
$$ 196 330 388 119 -116 -95 -69 -38 -116 108 10 -125 -225 -71 -280 -164 78 8 -123 -10 27 -123 -29 20
3845B0L40k00j5j07n2m0J75jJ3k40J53k59p7J31J57N8n7M3k16J19p3Q2K13kk59
$$ 20 360 160 145 38 -14 -54 121 120 133 -107 46 -213 -290 -159 -2 56 -1 42 -174 -55 -128 -46 167 165 -94
3870i4L69l41j54L06J39j61R0j01j88K5k89J07J58K20l7j28j1j30J78k2p1J50
$$ -94 275 -66 -220 86 225 64 154 53 -135 -110 -399 -292 -134 86 49 -79 -90 -220 -42 -64 -135 15
3892A5J09r1k39K98m1K5o5J51l15L54r4j45J22M3j32j42Q3Qj87O2L03k00L26l17
$$ 15 124 33 -206 92 51 76 11 162 -153 201 107 -38 84 127 -5 -147 -64 -56 -243 -181 122 -78 248 -69
3916f9K4P1J49j20n8L7m6L5J7k9j56P7K95l31N0k79L31k28k3L17J04o1l32L91
$$ -69 -45 26 175 55 -3 34 -12 23 40 11 -145 -68 227 -104 -54 -333 -2 -230 -253 64 168 107 -225 166
3940A66l19N3J30J49k7j34n0N3J92o8k56O7N4j38K66m02L51n8K2q5j46j04L01
$$ 166 -153 -100 30 179 152 18 -32 21 213 145 -111 -44 10 -128 138 -264 87 29 51 -34 -180 -284 17
3963A7k31L49p3%n0J28k17J53Q3N3M3k61jr2p3K05l2k77J76L65o45j28M62Ro4
$$ 17 -214 135 62 62 12 140 -77 76 159 212 255 -6 -7 -99 -172 33 1 -276 -100 265 -380 -508 -46 -37 -101
3988a01r0J50J17o5k10K41L95k74J25j77Q9l19K47J6l69P4J86j07k43K65k17J42
$$ -101 -191 -41 76 11 -199 42 437 163 288 111 200 -119 128 144 -225 -151 35 -72 -315 -50 -267 -125
4010a25O5K97j41k66R3n0Q8K8K8J67R6R5k40n5k56L15J45j76ok92j3k62M40K46
$$ -125 -60 237 96 -170 -77 -127 -39 -11 17 184 280 375 135 80 -176 139 284 108 102 -190 -203 -465 -25 221
4034B21k09k93O0M0J80k70O59j76l04J00K51k31l6L76n1k92l3K70l67P8k95K52
$$ 221 12 -281 -221 -181 -1 -271 388 212 -92 8 259 28 -8 368 317 25 -8 262 -105 -27 -322 -70
4056g0j30J46K0j1j38k43M96P7o0j09J56j45J00k7L35k33K60l46k48K4J31P0j21
$$ -70 -200 -54 -34 -45 -183 -426 70 147 87 -22 134 -11 89 62 397 164 424 78 -170 -146 -15 55 -66
4079f6n0J30j01j02p7j3K59M8K3p8r3K42Q3j84R6j1J02j28M7m0L7o7k2K04p3m89
$$ -66 -116 14 -87 -189 -266 -279 -20 28 51 -27 -120 122 205 21 117 106 208 80 127 87 124 57 35 239 166 -323
4105c23j15L14j40K73L7j87P8n2K52k91J56J23j50J38nQ9o0r3J56J19k8m09q4
$$ -323 -438 -124 -264 9 46 -141 -63 -115 137 -154 2 125 -25 113 108 197 137 44 200 319 291 -118 -202
4128b02J48k08J56J0j88O0k23M7L76M9k04J25Qn4l7K02P2r1J92L6l98K07j10o8
$$ -202 -54 -262 -106 -96 -284 -224 -447 -400 -24 25 -179 -54 -46 -100 -137 65 137 46 238 274 -124 83 -27 -95
4152i5j9K26l71J86K40n30RK98N9n1J81r0r0j8N2J45j82P5J58j48K37k8k3j19
$$ -95 -114 112 -259 -73 167 -363 -354 -56 3 -48 133 43 -47 -65 -13 132 -50 25 183 35 272 244 221 102
4176A02o6J50m0k85p5J38j32J17Q1J69k16J86k60J42j38L61l7L28m28J46j01j24
$$ 102 36 186 146 -139 -214 -76 -208 -91 -10 159 -57 129 -131 11 -127 234 197 525 97 243 142 18
4198A8NJ38Q5q9J0l73P3j11L46l23O4j03m4n3K91p4L59k21j6J77k16J2R6L14j30
$$ 18 23 161 246 157 167 -206 -133 -244 102 -221 -157 -260 -304 -357 -66 -140 219 -2 -18 159 -57 -45 51 365 235
4223B35l49J46J8j02k95J17Mp3L05j73k01J56R3K9p9oK39o8J28q4n3K08n4J25
$$ 235 -114 32 50 -52 -347 -230 -226 -299 6 -167 -368 -212 -119 -90 -169 -175 64 -4 124 40 -13 195 141 266
4247B66j83o0m4J8J28k08O5k51J31q2K53mj50K63J5k50k2K70J30m76K33L67p2
$$ 266 83 23 -21 -3 125 -83 -18 -269 -138 -220 33 29 -121 142 157 -93 -115 155 285 -191 42 409 337
4270C37k79l9r9R5Q3Q2j2m13J97m8p0M7K80j01j77J8q4K4J57Q9J42l9j44J54n5
$$ 337 58 19 -80 15 98 180 168 -245 -48 -96 -166 -119 161 60 -117 -99 -183 -159 -2 87 229 190 46 200 145
4295A45k06M32j92K44k69m49L01l2j00j16K48l74L75j06j92J19J56O5j34J06k2
$$ 145 -61 371 179 423 154 -295 6 -26 -126 -242 6 -368 7 -99 -291 -172 -16 49 -85 21 -1
4316aOn2K50j40P5K02o5j10j54l85L55l34L67L11k84k56P0J78j48m4O8J05j30
$$ -1 5 -47 203 63 138 340 275 165 11 -374 -19 -353 14 325 41 -215 -145 33 -115 -159 -91 14 -116
4339a16N7K10L9j3j00J65m6j72K40k77N5M8n4K05l87j88L31k51J54Q9N2q2j13
$$ -116 -59 151 190 177 77 242 196 24 264 -13 42 90 36 241 -146 -334 -3 -254 -100 -11 41 -41 -154
4362a54J33P3q6J81R7K34l10n1m9l05L00J02j2k63m4j09PO0K32j89K36j41j49
$$ -154 -21 52 -34 147 244 478 168 117 68 -237 63 165 153 -110 -154 -263 -256 -196 36 -153 83 -58 -207
4385b07K33L8o9J00j14n7K54pk90K00J79j20J83p2k70J6l9l9j38NJ71j80O5j37
$$ -207 26 64 -5 95 -19 -76 178 171 -119 81 260 140 323 251 -19 -3 -42 -81 -219 -214 -43 -223 -158 -295
4409b95K15N7o0k6J67J0l20L40J05l29M04j59j20q2J82n4N2k35K9k66K87j48J0
$$ -295 -80 -23 -83 -109 58 68 -252 88 193 -136 268 109 -11 -93 89 35 87 -148 -119 -385 -98 -246 -236
4432b36N0O4K36k5j91j82M02j02k22N88l91K1q1L3Q5L95m42J61k01j17J27j9O1
$$ -236 -186 -122 114 89 -102 -284 118 16 -206 382 -9 12 -69 -36 49 444 2 163 -38 -155 -28 -47 14
4455A4l00L2K42l37K31J91l05n1L02K50l40N07j84k35K79k28K00k40J2j22m9J65
$$ 14 -286 -254 -12 -349 -118 73 -232 -283 19 269 -71 436 252 17 296 68 268 28 40 -82 -131 34
4477C4j29J90j61k05J31K00j4m67L89J04N3j60o3R5j35K76oJ6m8j3JN3l79L57
$$ 34 -95 95 -66 -271 -140 60 46 -421 -32 72 125 -35 -98 -3 -138 138 132 148 100 87 88 141 -238 119
4501A19r6l3k3p5j62K84k10L9j49K86O7k34L66j79K46l72L89k00N9j09O2m8l1
$$ 119 23 -10 -33 -108 -270 14 -196 -157 -306 -20 47 -187 179 0 246 -126 263 63 122 13 75 27 -4
4524dO5J34jn42K93q3j08L19R6j79p9k4J5J77Q5N8p9K57k97jj04m1J45J45l57
$$ -4 61 195 194 -348 -55 -138 -246 73 169 -10 -89 -113 -98 79 164 222 143 400 103 102 -2 -43 102 247 -110
4549a10N2k3K43m67J39J83j82j31J43L5n2K2J77L21l95J45m8mj56N4L41k02j42
$$ -110 -58 -81 162 -305 -166 17 -165 -296 -153 -118 -170 -148 29 350 -45 100 52 48 -108 -54 287 85 -57
4572e7J33l20J8K22m9Q2j65K12jk04j42P4K16M0q7P3N8k11J29K96m99M17j97k3
$$ -57 76 -244 -226 -4 -53 29 -136 76 75 -129 -271 -197 19 59 -28 45 103 -108 21 317 -182 235 38 15
4596A5m0J59l23O1J39j97J19j3J94l5j51j26K42K38k33k53K66k20M70o6j32n7
$$ 15 -25 134 -189 -128 11 -186 -67 -80 114 79 -72 -198 44 282 49 -204 62 -158 312 246 114 57
4618E7PK50m18J09n3J60J7J5k73J76L9j25R2l64M8L82K04m68P0M41l75O7K7K31
$$ 57 64 314 -104 5 -48 112 129 144 -129 47 86 -39 53 -311 -263 119 323 -145 -75 366 -9 58 85 316
4642C16rl86M24l65K89j09k36K2J38k46K35k23k27K55j19J8N0J73L2J6K22j39
$$ 316 307 -79 345 -20 269 160 -76 -54 84 -162 73 -150 -377 -122 -241 -223 -173 0 32 48 270 131
4664A31k36J80n3j48K98K1rPj59J1RK1L5j05j74j62K93J00m04M74j98n4l1K62
$$ 131 -105 75 22 -126 172 193 184 191 32 43 52 73 108 3 -171 -333 -40 60 -344 130 -68 -122 -153 109
4688A09jK17k78K0r7M9N0m9l8o2L7o9L12m24P9p2L21l0r0L8k49J80Q3p8P7Q5J27
$$ 109 108 325 47 67 -30 19 69 20 -18 -80 -43 -112 200 -224 -145 -217 104 74 -16 22 -227 -47 36 -42 35 120 247
4715B47k71j32N8j36N8K48j42J22j52J1J60j33Q0q0j5lJ50j93L9j14NL91k03P7
$$ 247 -24 -156 -98 -234 -176 72 -70 52 -100 -89 71 -62 18 -62 -77 -80 70 -123 -84 -198 -193 198 -5 72
4739G2l07M00k69J28K38k71K19j24j20P3P5l23J34J09m9k84K51q2m3N15m12K14
$$ 72 -235 165 -104 24 262 -9 210 86 -34 39 114 -209 -75 34 -15 -299 -48 -130 -173 342 -70 144
4761A44j99R6kp8K12j21K68q1l21q4K29q9K04p3j73k0m4O0j74N6l4N2L4qK6K04
$$ 144 -55 41 39 -39 173 52 320 239 -82 -166 63 -26 178 105 -68 -88 -132 -72 -246 -190 -224 -172 -138 -146 -120 84
4787H4j19J93j20o5N3J62k50RP5M7R1k77jJ11R0j41j36J58j30k29L25K25j05J28
$$ 84 -35 158 38 -27 26 188 -62 -53 22 69 160 -117 -118 -7 83 -58 -194 -36 -166 -395 -70 155 50 178
4811A78m1r5j8O4j01p3M23r1k87K23k03Q4J53k86L2k0O8m56M55k4l37K54M2M9
$$ 178 137 42 24 88 -13 -86 337 246 -41 182 -21 63 216 -70 -38 -58 10 -446 9 -15 -352 -98 -56 -7
4835gm0L29j50m0J35j49J10o7j87Q0J7j42Q9l7J18O3k93pj23J73O2J7J97l0m37
$$ -7 -47 282 132 92 227 78 188 121 -66 14 31 -111 -22 -59 59 122 -171 -178 -301 -128 -66 -49 148 118 -319
4860c19J72K53O0j72J58o8L3k17MJ27J59n35M07m1K53l35R9O3j28J48p9k82K39
$$ -319 -147 106 166 -6 152 84 117 -100 -96 31 190 -345 62 21 274 -61 38 101 -27 121 42 -240 -1
4883aJ26l09P7O0pK43k32J57R8J68k34j00K17k78lp1m5J28k1n5M5m9Q9n3L6K1
$$ -1 125 -184 -107 -47 -54 189 -43 114 212 380 146 46 263 -15 -18 -89 -134 -6 -27 -82 -37 -86 3 -50 -14 7
4909GJ70n0o5j33L09k19n9J39J7k92Q5K09j70J58r6L3k72m3J22j5M4MK08j04L77
$$ 7 177 127 62 -71 238 19 -40 99 116 -176 -91 118 -52 106 10 43 -229 -272 -150 -165 -121 -117 91 -13 364
4934C64n34P9J55r9J72k5j38K39k79K52j67J66j69o9K95l15j8Q3k37K23n2q9J80
$$ 364 -170 -91 64 -35 137 112 -26 213 -66 186 19 185 16 -53 242 -73 -91 -8 -245 -22 -74 -163 17
4957A7k45K9M28j68l52M30J9j04J92o4k2j68J5Rj5mj89K02j33R4r2J38o5j26J08
$$ 17 -228 -199 229 61 -291 139 158 54 246 182 160 -8 7 16 1 -3 -192 10 -123 -29 -121 17 -48 -174 -66
4982f6O0r2j75L14p1R5J25k51J21P0Lm16K87kr8R3j34K10j0j37l44M99k17P2K06
$$ -66 -6 -98 -273 41 -30 65 190 -61 60 130 133 -283 4 2 -96 -3 -137 73 63 -74 -418 81 -136 -64 142
5007A42j4k28L15k2k07j20L27k49J03J51k67oK08j29J03O6l07K00q0m09J49K94
$$ 142 128 -100 215 193 -14 -134 193 -56 47 198 -69 -75 133 4 107 173 -134 66 -14 -423 -274 20
5029B0j69m8J31j09J53k9R8J31m1l2j2P8m01K57K92l34N5J07k15l6p3J63J53k34
$$ 20 -149 -197 -66 -175 -22 -51 47 178 137 105 93 171 -230 27 319 -15 40 147 -68 -104 -177 -14 139 -95
5053i5J87m4j84K19M4l58J05K49l72M28j84Q8n9M7o2N0m4k1j1r3J75l98K06K51
$$ -95 92 48 -136 83 127 -231 -126 123 -249 179 -5 83 24 71 9 59 15 -6 -17 -110 65 -333 -127 124
5077A24k05l9M9q9J22j09q3J72j32K97J24k16LK44k79J74k2l55J46Pj20J83j22
$$ 124 -81 -120 -71 -160 -38 -147 -230 -58 -190 107 231 15 18 262 -17 157 135 -220 -74 -67 -187 -4 -126
5100a26J7P3o9k0k0N7j63J69N4J33k22Q0P5p4K74j10j22L7K19l47k06K93M4N3
$$ -126 -109 -36 -105 -125 -145 -88 -251 -82 -28 105 -117 -37 38 -36 238 128 6 43 262 -85 -291 2 46 99
5124I9m08L05k05P5J5P8J45J0m6k73R8J80jK30l15K65l3l5j45j82J29J19L6l42
$$ 99 -309 -4 -209 -134 -119 -41 104 114 68 -205 -107 73 72 302 -13 252 219 184 39 -143 -14 105 141 -201
5148b01J57n0r2Q1j33J84k4J96q5k83L43K14k55L6n9O2k6J11R0j18p1k9M9j65
$$ -201 -44 -94 -186 -105 -238 -54 -78 118 33 -250 93 307 52 88 29 91 65 176 266 148 77 48 97 -68
5172f8r5K17j41O0J0J8j44j41L49j50K45l9j22J0n9N08l85r7j92Q6M60o16J94
$$ -68 -163 54 -87 -27 -17 1 -143 -284 65 -85 160 121 -1 9 -50 458 73 -24 -216 -130 330 -286 -92
5195i2P5K89m00R3K69l98K60l9j85o7J69j94qK04J69J3k88PK42K7j46Q8J5Lr3
$$ -92 -17 272 -128 -35 234 -164 96 57 -128 -195 -26 -220 -228 -24 145 158 -130 -123 119 146 0 88 103 106 13
5220A3pj40J02j49J64l6Q2j0R2q1J27j48j8J19k16k07N84l18R9P1j94L04j25L4
$$ 13 6 -134 -32 -181 -17 -53 29 19 111 30 157 9 -9 110 -106 -313 271 -47 52 123 -71 233 108 142
5244A42k19K85k50j17J60n4L43k86j05J0Q1j46l9L48l07L43j07j43J62m4m4N9
$$ 142 -77 208 -42 -159 1 -53 290 4 -101 -91 -10 -156 -195 153 -154 189 82 -61 101 57 13 72
5266G2j77K01l5j64J86k85J40p7p9P6J08j56J25j49L17k17J18j80J84j9j91L61
$$ 72 -105 96 61 -103 83 -202 -62 -139 -218 -142 -34 -190 -65 -214 103 -114 4 -176 8 -11 -202 159
5288A59Kk17L26k62Jl8J93J5k10J26k13p1J14q9R5J25l2j89K80n7r0QL9n5J27
$$ 159 161 -56 270 8 9 -29 164 179 -31 95 -118 -189 -75 -164 -69 56 24 -165 115 58 -32 -24 15 -40 87
5313H7j32Q5J03p0M7l81N96k79L4k70Q9k3L6o1J76q0j03M7N7K02q4J37l15K05
$$ 87 -45 40 143 73 120 -261 335 56 90 -180 -91 -114 -78 -139 37 -43 -146 -99 -42 160 76 213 -102 103
5337A03j03q8K97pmj58k45J09J51j38J25j04j28J86k11J6J65L2M8n8P8Q4n6j04
$$ 103 0 -88 209 202 198 40 -205 -96 55 -83 42 -62 -190 -4 -215 -199 -34 -2 46 -12 66 150 94 -10
5361a0Q0l2L63o81M36o7j47K96m2r3l6J65l92LJ64j55J60J38k18K35o4o4n4K88
$$ -10 70 38 401 -280 156 89 -58 238 196 103 67 232 -160 -157 7 -148 12 150 -68 167 103 39 -15 273
5385B73k54n6j49K50j82JM6J75J07Jk89o6L7J90j61J50p1j63NMN5K58j37j1L8
$$ 273 19 -37 -186 64 -118 -117 -71 104 211 212 -77 -143 -106 84 -77 73 2 -161 -156 -152 -97 161 24 13 51
5410E1P2k5K20k23q4j1L12l84J69Q9j77j52L1m9L99k59j9J09M33o09j15K92j45
$$ 51 123 98 318 95 11 0 312 -72 97 186 9 -143 -112 -161 238 -21 -40 69 502 -107 -222 70 -75
$$ [...]
8191h4
##END NTUPLES=NMR FID
##END=
