##TITLE=1H_EC-3173
 CDCl3, 8 sc, 
 15.1.2019
##JCAMPDX= 6.0         $$ Bruker NMR JCAMP-DX V2.0
##DATA TYPE= NMR FID
##DATA CLASS= NTUPLES
##ORIGIN= UXNMR, Bruker Analytische Messtechnik GmbH
##OWNER= root
$$ XWIN-NMR		Version 3.5
$$ Tue Jan 15 15:27:15 2019 Russian Standard Time (UT+4h)  she@DPX200
##.OBSERVE FREQUENCY= 200.1313
##.OBSERVE NUCLEUS= ^1H
##.DELAY= (6, 6)
##.ACQUISITION MODE= SIMULTANEOUS
##.ACQUISITION SCHEME= undefined
##.AVERAGES= 8
##.DIGITISER RES= 18
##SPECTROMETER/DATA SYSTEM= spect
##.PULSE SEQUENCE= zg30
##.SOLVENT NAME= CDCl3
##.SHIFT REFERENCE= (INTERNAL, CDCl3, 0, 15.7039)
##AUDIT TRAIL= $$ (NUMBER, WHEN, WHO, WHERE, WHAT)
$$ ##TITLE= Audit trail, XWIN-NMR		Version 3.5
$$ ##JCAMPDX= 5.01
$$ ##ORIGIN= Bruker BioSpin GmbH
$$ ##OWNER= she
$$ F:/spectra/data/she/nmr/H-F/1/audita.txt
$$ ##AUDIT TRAIL=  $$ (NUMBER, WHEN, WHO, WHERE, WHAT)
(   1,<2019-01-15 15:26:09.42 +0400>,<she>,<DPX200>,
      <created by zg, POWCHK disabled, PULCHK disabled
       configuration hash MD5:
       00 E9 B6 7A A2 85 ED C7 34 08 36 98 17 FE 4E 26
       data hash MD5: 16K
       9E 32 4B AD 31 4F 27 66 67 4E 1B F0 66 37 23 D9>)
$$ ##END=
$$ 
$$ hash MD5
$$ CE FF D7 F1 08 10 EA 5E 4E 16 3F FF 1B 4B F6 B0
##$RELAX= 
##$RELAX= 
##$RELAX= 
##$RELAX= 
##$RELAX= 
##$RELAX= 
$$ Bruker specific parameters
$$ --------------------------
##$DU= <F:/spectra>
##$EXPNO= 1
##$NAME= <H-F>
##$PROCNO= 1
##$TYPE= <nmr>
##$USER= <she>
##$AMP= (0..31)
100 100 100 100 100 100 100 100 100 100 100 100 100 100 100 100 100 100 
100 100 100 100 100 100 100 100 100 100 100 100 100 100 
##$AQSEQ= 0
##$AQ_mod= 1
##$AUNM= <au_zg>
##$AUTOPOS= <>
##$BF1= 200.13
##$BF2= 200.13
##$BF3= 200.13
##$BF4= 200.13
##$BF5= 200.13
##$BF6= 200.13
##$BF7= 200.13
##$BF8= 200.13
##$BYTORDA= 1
##$CFDGTYP= 0
##$CFRGTYP= 5
##$CHEMSTR= <none>
##$CNST= (0..31)
1 1 145 1 1 1 1 1 1 1 1 1 1 1 1 1 1 1 1 1 1 1 1 1 1 1 1 1 1 1 1 1 
##$CPDPRG= <>
##$CPDPRG1= <>
##$CPDPRG2= <>
##$CPDPRG3= <>
##$CPDPRG4= <mlev>
##$CPDPRG5= <mlev>
##$CPDPRG6= <mlev>
##$CPDPRG7= <mlev>
##$CPDPRG8= <mlev>
##$CPDPRGB= <>
##$CPDPRGT= <>
##$D= (0..31)
0 1.2 0 0 0 0 0 0 0 0 0 0.03 0 0 0 0 0 0 0 0 0 0 0 0 0 0 0 0 0 0 0 0 
##$DATE= 1547551568
##$DBL= (0..7)
120 120 120 120 120 120 120 120 
##$DBP= (0..7)
150 150 150 150 150 150 150 150 
##$DBP07= 0
##$DBPNAM0= <>
##$DBPNAM1= <>
##$DBPNAM2= <>
##$DBPNAM3= <>
##$DBPNAM4= <>
##$DBPNAM5= <>
##$DBPNAM6= <>
##$DBPNAM7= <>
##$DBPOAL= (0..7)
0.5 0.5 0.5 0.5 0.5 0.5 0.5 0.5 
##$DBPOFFS= (0..7)
0 0 0 0 0 0 0 0 
##$DE= 6
##$DECBNUC= <off>
##$DECIM= 24
##$DECNUC= <off>
##$DECSTAT= 4
##$DIGMOD= 1
##$DIGTYP= 9
##$DL= (0..7)
0 120 120 120 120 120 120 120 
##$DP= (0..7)
150 150 150 150 150 150 150 150 
##$DP07= 0
##$DPNAME0= <>
##$DPNAME1= <>
##$DPNAME2= <>
##$DPNAME3= <>
##$DPNAME4= <>
##$DPNAME5= <>
##$DPNAME6= <>
##$DPNAME7= <>
##$DPOAL= (0..7)
0.5 0.5 0.5 0.5 0.5 0.5 0.5 0.5 
##$DPOFFS= (0..7)
0 0 0 0 0 0 0 0 
##$DQDMODE= 0
##$DR= 18
##$DS= 0
##$DSLIST= <SSSSSSSSSSSSSSS>
##$DSPFIRM= 0
$$ [...]
##$SUBNAM2= <"">
##$SUBNAM3= <"">
##$SUBNAM4= <"">
##$SUBNAM5= <"">
##$SUBNAM6= <"">
##$SUBNAM7= <"">
##$SUBNAM8= <"">
##$SUBNAM9= <"">
##$SW= 24.933730806125
##$SWIBOX= (0..15)
0 0 2 0 0 0 0 0 0 0 0 0 0 0 0 0 
##$SW_h= 4990.01996007984
##$TD= 16384
##$TD0= 1
##$TE= 0
##$TE2= 300
##$TE3= 300
##$TEG= 300
##$TL= (0..7)
0 120 120 120 120 120 120 120 
##$TP= (0..7)
150 150 150 150 150 150 150 150 
##$TP07= 0
##$TPNAME0= <>
##$TPNAME1= <>
##$TPNAME2= <>
##$TPNAME3= <>
##$TPNAME4= <>
##$TPNAME5= <>
##$TPNAME6= <>
##$TPNAME7= <>
##$TPOAL= (0..7)
0.5 0.5 0.5 0.5 0.5 0.5 0.5 0.5 
##$TPOFFS= (0..7)
0 0 0 0 0 0 0 0 
##$TUNHIN= 0
##$TUNHOUT= 0
##$TUNXOUT= 0
##$USERA1= <user>
##$USERA2= <user>
##$USERA3= <user>
##$USERA4= <user>
##$USERA5= <user>
##$V9= 5
##$VALIST= <valist>
##$VCLIST= <CCCCCCCCCCCCCCC>
##$VD= 0
##$VDLIST= <DDDDDDDDDDDDDDD>
##$VPLIST= <PPPPPPPPPPPPPPP>
##$VTLIST= <TTTTTTTTTTTTTTT>
##$WBST= 1024
##$WBSW= 4
##$XGAIN= (0..3)
0 0 0 0 
##$XL= 0
##$YL= 0
##$YMAX_a= 83500
##$YMIN_a= -215372
##$ZGOPTNS= <>
##$ZL1= 120
##$ZL2= 120
##$ZL3= 120
##$ZL4= 120
##$ABSF1= 10
##$ABSF2= 0
##$ABSG= 5
##$ABSL= 3
##$ALPHA= 0
##$AQORDER= 0
##$ASSFAC= 0
##$ASSFACI= 0
##$ASSFACX= 0
##$ASSWID= 0
##$AUNMP= <proc_1d>
##$AZFE= 0.1
##$AZFW= 0.1
##$BCFW= 1
##$BC_mod= 2
##$BYTORDP= 1
##$COROFFS= 0
##$CY= 11.3945322036743
##$DATMOD= 1
##$DC= 2
##$DFILT= <>
##$DTYPP= 0
##$F1P= 18.9103706918063
##$F2P= -1.10871071338519
##$FCOR= 0.5
##$FTSIZE= 0
##$FT_mod= 4
##$GAMMA= 1
##$GB= 0.15
##$INTBC= 1
##$INTSCL= 1
##$ISEN= 128
##$LB= 0.24
##$LEV0= 0
##$LPBIN= 0
##$MAXI= 10000
##$MC2= 0
##$MEAN= 0
##$ME_mod= 0
##$MI= 1.114404
##$NCOEF= 0
##$NC_proc= 0
##$NLEV= 6
##$NOISF1= 3.799351
##$NOISF2= 2.8
##$NSP= 1
##$NTH_PI= 0
##$NZP= 0
##$OFFSET= 15.70392
##$PC= 1
##$PHC0= -8874.655
##$PHC1= 14.80006
##$PH_mod= 1
##$PKNL= yes
##$PPARMOD= 0
##$PSCAL= 0
##$PSIGN= 0
##$REVERSE= no
##$SF= 200.130013532006
##$SI= 16384
##$SIGF1= 3
##$SIGF2= 2
##$SINO= 400
##$SIOLD= 16384
##$SREGLST= <1H.CDCl3>
##$SSB= 0
##$STSI= 0
##$STSR= 0
##$SW_p= 3612.71676300578
##$SYMM= 0
##$S_DEV= 0
##$TDeff= 0
##$TDoff= 0
##$TI= <>
##$TILT= no
##$TM1= 0
##$TM2= 0
##$TOPLEV= 0
##$USERP1= <user>
##$USERP2= <user>
##$USERP3= <user>
##$USERP4= <user>
##$USERP5= <user>
##$WDW= 1
##$XDIM= 8192
##$YMAX_p= 0
##$YMIN_p= 0
$$ End of Bruker specific parameters
$$ ---------------------------------
##NTUPLES= NMR FID
##VAR_NAME=  TIME,          FID/REAL,        FID/IMAG
##SYMBOL=    X,             R,               I
##VAR_TYPE=  INDEPENDENT,   DEPENDENT,       DEPENDENT
##VAR_FORM=  AFFN,          ASDF,            ASDF
##VAR_DIM=   8192,          8192,            8192
##UNITS=     SECONDS,       ARBITRARY UNITS, ARBITRARY UNITS
##FACTOR=    0.0002004,     1,               1
##FIRST=     0,             0,               0
##LAST=      1.6414764,     0,               0
##MIN=       0,             -215372,         0
##MAX=       1.6414764,     83500,           0
$$ Real data points
##PAGE= N=1
##DATA TABLE= (X++(R..R)), XYDATA
0@%%%%%%%%Qj6J6j6K4l2L2m0M8n6P2q7R9j16J36j53J77k04K32k64K99l39L84m32
32b28M87n45O08o78P54q41R33j033J145j269J405j555J723j910K120k359K631
49A388k943L309l745M270m920N753o863Q421j0792J4883k3891P9353n8431j38778
63a32986J06590J09896r981j05622j1722O4780M1637m5542l9552K0759N5957p36
75E3478n6649n2373J1298L6489J2200j8079p724j250r112l891K8255K6366j1080
88G928j9443K4999L2862k5778n9694n016M7762J5964l8793k0483L2331L0303j2088
101A0854j4757K3764L1555j1101m6689l1514P556J9771M503r53J6654J6171k4480
114A334m7017P046P3306M1410n6623p5232J0339O3561J3688l7203m832L1550q385
$$ plain form
0 0 0 0 0 0 0 0 0 0 8 -8 8 -8 16 -16 16 -24 24 -32 40 -47 52 -64 72 -81 96 -108 124 -140 159 -180 204 -228
32 -228 259 -286 322 -356 398 -443 490 -543 602 -667 738 -817 906 -1004 1116 -1243 1388
49 1388 -1555 1754 -1991 2279 -2641 3112 -3751 4670 -6122 8761 -15130 64223 5792 -132986
63 -132986 -26396 83500 73519 -32103 -43825 20955 62592 17050 -22502 -1743 54214 53478
75 53478 -3171 -55544 -44246 -7757 4443 -13636 -21360 -22610 -31722 -35613 -7358 19008 7928
88 7928 -11515 13484 46346 20568 -39126 -44142 3620 19584 -19209 -39692 -7361 22942 10854
101 10854 -3903 19861 51416 40315 -6374 -37888 -30332 -10561 -6058 -7011 9643 25814 1334
114 1334 -45683 -38637 34669 76079 19456 -55776 -45437 18124 31812 -5391 -10223 21327 12942
127A2942n2618j2583N7847N0282j7210m2142k528K5071R28k9205j5778K1228K2391
140A8625j6482l4027N038M5216K1112l0808k7307J7158J6541k5774k4261K5832
152i137L3095j7279k8463K4342L8923k6703o3997J229P1909L6693m9922n7867
164d7177J5259N8403J5566m0899k9395K5080L0510k9717n8898N902P9800M8149
176G2583n1116p6604j406N6976K9163j7403j7578K70p09K288J7855J0379j8705
189E993j7609J5063J6578k2736l1677K0745N8309K1453m3168m8424M991L9941
201A9459R131m1479l6175K0327M4952Q65l8227o338L9900J6867l3894k1096L1130
214E422K1037l7787l6606L1947N3619q508n0681j1752L4871J6147k0722n893L4859
$$ plain form
127 12942 -39676 -52259 5588 55870 38660 -3482 -6010 19061 19989 -9216 -24994 -3766 18625
140 18625 2143 -31884 -26846 18370 39482 8674 -18633 -1475 15066 -10708 -34969 -9137
152 -9137 23958 6679 -21784 2558 41481 14778 -49219 -47990 23919 60612 10690 -47177
164 -47177 -31918 26485 42051 1152 -28243 -3163 27347 -2370 -61268 -55366 24434 72583
176 72583 21467 -55137 -56543 433 29596 12193 -5385 -5115 -5824 -3536 14319 24698 5993
189 5993 -11616 3447 20025 -2711 -34388 -13643 44666 66119 22951 -25473 -20482 19459
201 19459 28590 -12889 -49064 -28737 16215 17080 -21147 -27485 12415 29282 -4612 -25708 5422
214 5422 26459 -11328 -47934 -15987 37632 29124 -21557 -33309 1562 17709 -3013 -8906 25953
227B5953K5663k9743n4452q199M7700L3336l4670n8876k349N0283K7563j7782
239D427n595L0832J0136m1755l4722K1897L3252j1248k9656M145K3897J040j1773
252e123J1779K3969k632k6745j2720J3715J4408p084j8273n846Q279J010j4764
265b0027o978K0070K1353r411j6214K0943L6645j3739n8364k1190M3189L2046
277B8323k9400l8202J3370L8584Q546j3110O268J7382p556l1175j9378Q570J6755
290a023M775p005p580m497k815K745J9545K5788l253l8760k2122L5127M4549j6244
304B9230n3000n588M4523Q846m8737k1656N1710N1252k0784n2142l162M1042J5447
317C6981l4539l7884J524K4822R300j2930m873J5974J3136r398r874J4874J3816
$$ plain form
227 25953 51616 21873 -32579 -40778 6922 40258 5588 -53288 -55637 -5354 22209 4427
239 4427 -1168 29664 39800 -1955 -36677 -14780 18472 7224 -22432 -18287 5610 6650 -5123
252 -5123 6656 30625 27993 1248 -11472 2243 16651 9567 -8706 -14552 -6273 -5263 -20027
265 -20027 -27005 -6935 14418 5007 -11207 9736 46381 32642 -25722 -46912 -3723 28323
277 28323 -1077 -39279 -25909 12675 21221 8111 14379 31761 24205 -6970 -26348 -17778 -1023
290 -1023 3752 -3253 -10833 -15330 -18145 -15400 4145 29933 26680 -12080 -34202 925 45474 29230
304 29230 -23770 -29358 15165 24011 -24726 -46382 5328 56580 35796 -16346 -19508 21534 36981
317 36981 2442 -35442 -33918 -9096 204 -12726 -17599 -1625 11511 2113 -7761 7113 20929
330B0929k2139k9701J3308M0857N439l3967j3458K4625J1357k1789j0388K6448
342A1521K2775j6990l0533n34K2360J1150j0667j7478j2000l184M596J1875J4197
355G088Q016q343j6698l751J4921Q068j4099j0236J6145J3090j8907j7000K7398
368E692L7643j5331n0698r355M0967K1878k8417k4683J9352K8735q308k9274m605
381a6404K0393N886k3649j9375J7602L4465J845l4453j7560K8303K9728j3727
393A3054l0036L939K3091j942j7419J0005K6702n413l4598j0242K4241J5210j2128
406D464o387J5769R061j8818k0193Q435K4452P4l3700k9883J2257L8940J4825
419A9296k1998j5327J8879J8089j5695k3406Q900K3637n364k3905p50K1716Q894
$$ plain form
330 20929 -1210 -30911 -17603 23254 28693 -5274 -18732 5893 17250 -4539 -14927 11521
342 11521 34296 17306 -13227 -13761 8599 19749 9082 -8396 -20396 -23580 -18984 -7109 7088
355 7088 15104 6761 -9937 -13688 1233 9301 -4798 -15034 1111 14201 -4706 -21706 5692
368 5692 43335 28004 -22694 -32049 8918 30796 2379 -22304 -2952 25783 17475 -11799 -16404
381 -16404 3989 9875 -13774 -33149 -15547 18918 20763 -13690 -31250 -2947 26781 13054
393 13054 -16982 -13043 10048 8106 -9313 692 27394 21981 -12617 -22859 1382 16592 4464
406 4464 -1923 13846 22907 4089 -16104 -7669 16783 16857 -16843 -46726 -34469 4471 19296
419 19296 -2702 -18029 850 18939 3244 -20162 -11262 12375 7011 -16894 -17644 4072 12966
432A2966p546J24P830n602j0470J0154K1610k827k7296j4489J5813J8243j0874
445G636k9905j2359K0633K6456j373j6942K203K2466n1l1379j6758K2901K0004
458A3532k1201k8432J1468L1971P812j0415N849J4107j1361k5054J201K7163J0050
471B6690k4480k5105M912K1402N721j5648q596J4589J5178j0945j9914R376L0569
484B3749R16l8956k4083K1944K5275j2800k1548J2739K8865K822j4422N055J8031
497B7587m070k5396j2263J2074J2490n585j2945j293J1412Q955l247n717K246
510D248K513j0671j3739P508K0749n35k6206j2634J5974J3552r560m845J8339
523D693J3473j4588j4735J5728K3427n978k6927j2189R149P784r53J992Q243L870
$$ plain form
432 12966 5420 5544 13374 7772 -2698 7456 29066 26239 -1057 -15546 267 18510 7636
445 7636 -22269 -34628 -13995 12461 11088 -5854 -3651 18815 18764 -12615 -29373 -6472 13532
458 13532 -7669 -36101 -24633 7338 15150 4735 10584 24691 13330 -11724 -10523 16640 26690
471 26690 2210 -22895 -17983 3419 9140 -6508 -15104 -515 14663 3718 -16196 -6820 23749
484 23749 24665 -14291 -38374 -16430 8845 -3955 -25503 -12764 16101 18923 4501 9556 27587
497 27587 23517 -1879 -14142 -2068 10422 4837 -8108 -9401 2011 10966 7719 2002 4248
510 4248 6761 -3910 -17649 -10141 10608 10073 -16133 -28767 -12793 759 -8801 -13646 4693
523 4693 18166 3578 -11157 4571 27998 22020 -4907 -17096 -7947 -163 -1116 876 9119 12989
537A2989p727q647L821J2413j202k1235j5815J1989K0392n750j9779N143K5743
550A2335q91k9708p377L3782K1608k4893k9533J4088L4908K158k8114j6029J2336
563e330J4426l250r159L981J2585J756j4035r693J0010J3065r114k0357j693J6645
577a63N063q696L228J4700m824k5454o657K4688J6494j5307j8659P604J7548P5
591I640r598m69N175m417j3014l659J1397J2806p52j1399m904Q720Q088o957q855
606h198N659P376r383j1487J2602K2401n250k6994n069K3811J3319j4673j0720
619f606J3114J1512r537j1969O413J1402p296k0405p880J4702J7885K6j1947k992
633c578J1023M252j2566r374R945Q073j7174j9734J2811K9915K639k2986o667
$$ plain form
537 12989 5262 -3385 436 12849 11647 -9588 -25403 -13414 6978 1228 -18551 -13408 12335
550 12335 11444 -18264 -25641 8141 29749 4856 -24677 -10589 24319 26477 -1637 -17666 -5330
563 -5330 9096 5846 -3313 668 13253 15009 974 -8719 1291 14356 5242 -15115 -16808 -163
577 -163 4900 -3796 -568 14132 9308 -16146 -22803 1885 18379 3072 -15587 -7983 9565 9640
591 9640 42 -427 4748 331 -12683 -16342 -4945 7861 7109 -4290 -9194 -474 7614 657 -8198
606 -8198 -2539 4837 -4546 -16033 -3431 18970 13720 -13274 -18343 5468 18787 4114 -6606
619 -6606 6508 18020 8483 -3486 2927 14329 7033 -13372 -21252 -6550 11335 11361 -586 -3578
633 -3578 7445 11697 -869 -10243 -298 7775 -9399 -29133 -16322 13593 16232 -6754 -13421
646a3421J7996Q565j3706o361J3348Q273j5056j6531O287J7318J855j5913j0987
659a8333P991J6528M550p892j605R774K672j7112j4039J0547J4507r231j9157
672b0800M734K4000R691r033l085P242k974j3012j429J1459J329j4856q812Q355
686g191J2184K09o464j316M774J793n570k614Q116R921q267k1634o734J7645J4032
701H884j1753j3782J0600J8637j448j0256P425J4786r682k5459n597J7460R553
714I368j2307j0290Q342J3374J18p768p07P472P86j3631j2724P139J8497P90k0460
729a2001j0391J5774J5801p755j2003Q958J4522n794j2747O664J6740l470k0960
742f662q570J0889R743l010l152M876M516k635m626J771N271p72j3157j2600L856
$$ plain form
646 -13421 4575 13140 -566 -6927 6421 14694 -362 -16893 -10606 6712 8567 -7346 -18333
659 -18333 -10342 6186 10736 2844 1239 11013 13685 -3427 -17466 -6919 7588 -1643 -20800
672 -20800 -16066 7934 17625 8592 5507 12749 9775 -3237 -4666 6793 8122 -6734 -15546 -7191
686 -7191 4993 5202 -1262 -2578 2196 3989 -1581 -4195 3921 13842 5575 -16059 -22793 -5148 8884
701 8884 -2869 -16651 -6051 12586 11138 882 8307 23093 13411 -12048 -17645 -185 9368
714 9368 -2939 -13229 -4887 8487 8605 837 130 7602 8388 -5243 -17967 -10828 7669 8459 -12001
729 -12001 -22392 -6618 9183 1428 -10575 -1617 12905 7111 -5636 1028 17768 14298 -6662
742 -6662 -15232 -4343 5400 2390 -762 4114 8630 5995 1369 3140 8411 7639 -5518 -18118 -14262
757a4262J6100M607j0752n303R738N171j0015n056J3181R587j3006j4713R805
770d918J8415n36j4663m359P739J567o206P17R029M015p698p677K348Q262Q84
785F919j0652j0000L530J0222J66p632L298J1130k161j7609l225K0063J1666j5951
799b36j5350J0887J9552m65j3472n96Q923k605j2926k490J2310J0231n755j1960
813c952k786R917P914o458j2083j051N870l027q827M835J5919J471j8145p507
827a7910J5557J3818p226j1011N941J0595l938q185L744Q664l440j1807l759Q697
841b60R094O04m752k492L159K078n349o293L41N46p829p617Q316J6726J026j4011
857f713l376J2937O831r959n031Q845M063j1956q224J0835J4221k850j3486m010
$$ plain form
757 -14262 1838 6445 -4307 -9610 128 5299 -4716 -9772 3409 12996 -10 -14723 -4918
770 -4918 13497 12961 -1702 -6061 1678 3245 -2961 -2244 6785 10800 3102 -4575 -2227 6035 6919
785 6919 -3733 -13733 -10203 19 185 -7447 -4149 6981 4820 -12789 -16014 4049 15715 -236
799 -236 -15586 -4699 14853 14388 916 320 9243 6638 -6288 -8778 3532 13763 8008 -3952
813 -3952 -6738 3179 11093 4635 -7448 -8499 -2629 -5656 -14483 -9648 6271 7742 -10403 -17910
827 -17910 -2353 11465 4239 -6772 -831 9764 5826 -2359 1385 10049 6609 -5198 -8957 -260
841 -260 8834 9438 4686 2194 5353 7431 2082 -4211 -3870 -3324 -11153 -18770 -10454 6272 7298 -6713
857 -6713 -10089 2848 9679 -280 -5311 3534 7597 -4359 -12583 -1748 12473 9623 -3863 -7873
871g873R267Q270j55l272J99K111m744j0285l809Q557N353j0358j3159O869J8848
886E819L958j1042r10J0486m00j5486n745J2697P800j1035j0537Q169J5300K682
900A1756q025l508M296M294k320n338l13M553j313j0182o029Q138R347n483j1265
915a1392K352J3206L502o651R51O108n668j5310k260J4303P737r355p778O940
929c315J0731J756l329J082K388m708q265m149N259Q620k94r982o124P363Q097
944E130l146o461L981N894n800q735O381J2061m170j5786k811J3277N500q236
958b921l738R111P817l921o177K681N749k471r918o602N435J0660J417r114m927
973f919P451O494n335o617N044N037q925j0114P492J5873q5j3867m825P848L845
$$ plain form
871 -7873 1394 9664 9509 6237 6436 8547 3803 -6482 -10291 -1734 3619 -6739 -19898 -13029 5819
886 5819 9777 -1265 -2175 8311 7911 -7575 -13320 -623 7177 -3858 -14395 -6226 9074 11756
900 11756 3731 223 4519 8813 6493 1155 842 5395 4082 -6100 -12129 -3991 5356 -127 -11392
915 -11392 -9040 4166 7668 1017 1968 8076 2408 -12902 -15162 -859 6878 -2477 -10255 -3315
929 -3315 7416 9172 5843 6925 9313 4605 -3660 -7809 -2550 6070 5776 -4206 -10330 -2967 5130
944 5130 1984 -4477 -496 5398 -402 -9137 -2756 9305 5135 -10651 -13462 -185 5315 -2921
958 -2921 -6659 2452 10269 6348 171 2852 8601 6130 -3788 -10390 -4955 5705 7122 -1992 -6919
973 -6919 532 7026 1691 -4926 118 5155 -3770 -13884 -6392 9481 9396 -4471 -9296 -1448 2397
988B397n653j68Q345L176p514o683L982R233K442p670q660K78P372L201m325q46
1004a093N924R14r082n535Q385Q404o950j0390M419J1416j29q523o02N806j724
1019A240p814N62Q215K873o502l324M967P096J2o452n218P2K923j614k850M181
1035a633Q071j684j2339k685J3990R934r001j2087K954R411j911o147L476P955
1049H304l925j2055j698J0504P621k457m586j33K025o36l935k209J927O93o474
1064g034o589M854J3462L022r725m842Q901P166q456q713M440P351m152p181N029
1079b467R428l86q378p47P401M067k105l123r97l98k004k774oK574j18o847o381
1096a3261O118J3387L480q742m915N185J802q359l641Q083M839q893p715P794
$$ plain form
988 2397 -3256 -3424 4921 8097 583 -6100 -2118 7115 9557 1887 -6773 -6495 877 4078 -247 -1093
1004 -1093 4831 5745 -3337 -8872 -487 7917 967 -9423 -5004 6412 6283 -2240 -2842 2964 1240
1019 1240 -6574 -6012 2203 5076 -1426 -4750 217 7313 7325 873 -4345 -4273 -1350 -2964 -5814 -1633
1035 -1633 6438 4754 -7585 -10270 3720 13654 4653 -7434 -4480 4931 3020 -3127 349 8304
1049 8304 4379 -7676 -9374 1130 8751 6294 1708 1575 3600 2964 -971 -3180 -1253 -560 -7034
1064 -7034 -13623 -8769 4693 7715 -2010 -6852 2049 9215 759 -7954 -3514 3837 -315 -7496 -2467
1079 -2467 6961 6575 -1803 -2550 4851 8918 6813 3690 2693 2295 291 -2483 -2489 85 -33 -6880 -13261
1096 -13261 -7143 6244 9724 982 -3933 1252 3054 -5305 -8946 -863 3976 -4917 -12632 -4838
1110d838J2859K357o049j481K542j165m218j53L406J632m351o142j048N999N120
1125D470l816o467K361P852L43p368k61O592p77j1300l251R668O004p334o336
1140i620P937J0935l1o408k80L129k504n954j504M995M225k826o892j953P177
1155D26Q007k235q542j463M419n93m760K350Q173j728j1828l851R397P323m381
1170G14l786N051L640m135l048N022M989l695q246l804L940N698J032l672k461
1185b761L116L387l212m445J563L770l797n990L745Q898l45q947j141Q051L190
1200E082o335k329O776L198n777l480O201O997k609q181m568L009N379J121m126
1215C58k316J988R35l746k740N192N033o117r670K754J0202K139o872q71N243
$$ plain form
1110 -4838 8021 10378 4329 2848 5390 4225 7 -146 3260 4892 541 -5601 -6649 -650 4470
1125 4470 654 -5813 -3452 4400 4743 -2625 -2886 3706 2929 -8371 -11622 -1954 4050 -3284 -9620
1140 -9620 -1683 9252 9221 2813 2533 5662 3158 -2796 -4300 695 4920 2094 -4798 -6751 426
1155 426 8433 6198 -2344 -3807 612 19 -4741 -2391 5782 4054 -7774 -11625 -2228 5095 714
1170 714 -3072 1979 5619 1484 -1564 3458 8447 4752 -3494 -7298 -3358 2340 3372 -300 -2761
1185 -2761 355 3742 530 -3915 -2352 1418 -2379 -8369 -4624 4274 3929 -5018 -6159 1892 5082
1200 5082 -1253 -3582 3194 6392 615 -2865 3336 10333 7724 -457 -5025 -2016 3363 4484 358
1215 358 -1958 30 965 -2781 -5521 -329 4704 -1413 -11083 -8329 1873 4012 -2860 -3731 1512
1230A512r22o893L17R388M780n769n180M029O542P62m579l828r3J046o63k611
1246b162N53M614Q12n751l086N565N584n583r098J231P135l7n941R50N888j207
1262e33o361O08R083M470m738l691K530L557Q7j827q92n80j798k936j066M669
1278E82O890J35p157l409N330M632o099o725J527M437m460o195N259R600m1q334
1294d028k044O594L922k735k218R92P56k067r98J238K430m60k704k183L167O475
1310F137J585o170k968L937J845o035n724M640M685n542n890N438J0736O05o941
1325C38k700L569J411k905q84J784P1l219j456K303M643K246l037m438O2N440
1341C228J532m112k021L271l20o882l217P226N733n159o345L727Q491N13m455
$$ plain form
1230 1512 590 -6303 -5986 3402 8182 2413 -2767 1262 7804 8566 3987 159 66 1112 449 -2162
1246 -2162 -1609 3005 3817 -1934 -5020 545 6129 546 -8552 -7321 -186 -223 -6164 -5214 674 -533
1262 -533 -6894 -6286 2797 7267 2529 -1162 1368 4925 5012 3185 2293 1713 -85 -3021 -4087 582
1278 582 7472 7607 450 -2959 2371 7003 904 -5821 -4294 143 -4317 -10512 -5253 4347 4306 -4028
1294 -4028 -6072 522 4444 1709 -509 483 1239 -828 -1826 -588 1842 1382 -1322 -3505 -338 6137
1310 6137 7722 1552 -1416 2521 4366 -1669 -7393 -2753 1932 -3610 -9500 -4062 6674 7279 338
1325 338 -2362 1207 2618 -287 -1171 613 684 -2535 -3991 -1688 2955 5201 2164 -2274 -2212 3228
1341 3228 4760 648 -1373 1898 1578 -5304 -8521 -1295 4438 -721 -7066 -3339 5152 5665 1210
1356A210n47K019j876m527M1L989J552j814j946R15L787J985j616l656m12J844
1372I48j113l661J223N253m21p700k329P250N865m892n570L321N412j670l569
1387a653K560L829k834o227l42N081L934j459l308j125L044K914j132l186o52
1402e56J838k061m558J774O852J025o967l423N221L488l618l013L822K469l528
1417a235l233M751N387k198n368j477L070K359m42j468MJ222P72j640j506K432
1433A430K828l702n677Q80O522J691n316k240L301J121m133k25N661J862n287
1448a284l285M658O059j644m744k036J492Q04n56k87P04K185j00k476j176L032
1464A346L397l033o593m46N139P83l991N85M275Kn300k53O972L282m919l691K323
$$ plain form
1356 1210 663 2682 806 -3721 -3680 309 1861 47 -1899 -984 2803 4788 3172 -484 -896 948
1372 948 -165 -3826 -2603 2650 2229 -5471 -7800 -550 5315 423 -5147 -1826 3586 1916 -1653
1387 -1653 907 4736 1902 -4325 -4667 414 4348 2889 -419 -1544 1500 4414 3282 96 -556
1402 -556 1282 -779 -5337 -3563 3289 4314 -2653 -6076 -855 2633 -985 -3998 -176 2293 -1235
1417 -1235 -4468 283 5670 3472 -1896 -3373 -303 2056 1614 146 150 1372 2144 504 -1002 1430
1433 1430 4258 556 -5121 -4241 2281 3972 -1344 -3584 -283 838 -3295 -3520 2141 4003 -1284
1448 -1284 -4569 89 6148 4504 -240 -2276 -784 20 -536 -823 -119 2066 1966 -510 -1686 1346
1464 1346 4743 1710 -4883 -5329 -190 593 -3398 -2813 1462 1464 -3836 -4089 2883 6165 1246 -2445 -122
1481a22L898j273k805L44J058r59k154l97L302L522L82m032l176K705L515k668
1497A140n616q34L252j001k658K347O398j72n894l19N787K443m062l177J506K200
1513A340j388j366K412J414n57j791o68K405K983L39l158k969J266J656k889l327
1529d298J968K483k935l722L448P544L65n802k104L714J107l404j093K730N43
1544E44k761j239L319L828P72k455k376j30K573J237k429j880Q27N93l208j575
1560d360L635L356l555m356K673O580m6n005q89K841M3l484j37L492Q68k057j044
1577a445K155L319M83j393k501l39P35j51j921j67K623P2m593j862N095L856l246
1594G20n274J222M047l75k590J243L254j703m699L91M420K527j455j988N94J274
$$ plain form
1481 -122 3776 2503 -302 42 1100 141 -2013 -2410 892 4414 4796 764 -2412 293 3808 1140
1497 1140 -4476 -5310 -2058 -3059 -5717 -3370 3028 2856 -3038 -3357 2430 4873 811 -2366 -860 1340
1513 1340 -48 -1414 998 2412 1855 64 -604 1801 4784 5123 1965 -1004 262 1918 -971 -4298
1529 -4298 -2330 153 -2782 -6504 -3056 4488 4853 -949 -3053 661 1768 -1636 -2729 1 544
1544 544 -2217 -3456 -137 3691 4463 2008 -368 -498 2075 3312 883 -997 -170 423 -2785 -4360
1560 -4360 -725 2631 -924 -5280 -2607 3973 3927 -1078 -1967 874 917 -2567 -2704 788 1656 -401 -1445
1577 -1445 710 4029 4512 3119 618 279 1014 863 -1058 -1225 1398 1470 -3123 -4985 110 3966 720
1594 720 -4554 -3332 715 340 -2250 -1007 2247 544 -4155 -3764 656 3183 1728 -260 334 1608
1610A608J175k29p48p99L58j580j715R09L522M1m281k235L837K702l439l370K143
1627b101K836j698k966K637M066j565m207l25L803J598j642j065Q72J128M67k99
1643A539K69J534K52k773l230P34M799J247m305l119K237K060k447j456L339J836
1659B516l531l910L091M750p23l861r77J645J98o94N39J583Q14m18r55R8J648
1676A813J564k167l716p2L056O04k970o31L216Q10l178p62L614J740l377l434
1692c890K565L845j450k485L20J197o06o27J060K671J639j373k528q62K615J683
1708C774j158l981j495J956N48j293Q35L901l39m394j651L962K195l380k665P52
1724b433J569j077j336K163K825q13j942J2J813J937l70j738j709J657O98j284
$$ plain form
1610 1608 2783 2554 1806 1007 1365 -215 -1930 -1021 2501 2542 -1739 -3974 -137 2565 -874 -4244 -2101
1627 -2101 735 -963 -3929 -1292 2774 1209 -2998 -3323 480 2078 436 -629 243 1371 1838 1539
1643 1539 1808 3342 3594 821 -2409 -1675 3124 4371 66 -3053 -816 1244 -1203 -2659 680 2516
1659 2516 -1015 -4925 -1834 2916 2193 -1668 -2645 -1000 -802 -1496 -957 626 1440 1022 67 165 1813
1676 1813 3377 1210 -2506 -2578 478 1082 -1888 -2519 697 1507 -1671 -2433 1181 2921 -456 -3890
1692 -3890 -1325 2520 1070 -1415 -1095 102 -504 -1131 -71 2600 4239 2866 338 -524 2091 3774
1708 3774 2616 -1365 -2860 -904 -356 -1649 -814 3087 2748 -1646 -3297 665 2860 -520 -3185 -2433
1724 -2433 -864 -1941 -3277 -1114 1711 898 -1044 -1032 781 2718 2348 610 -1099 558 1256 -28
1740b8k135O94K435q13k224J053M199M19m073j927L254J464l293k077J977Q21
1756b54j773k20K799K706n35k551j132J322J672M45j728j759K27P37p11j33J611
1773G23J682k061l265J145M016O99l325j629K291j50k699n01L148J427k145j492
1789b136K021K212pj274q15M4J52k99q77L29J036L05j592q52K430J807j794l430
1807b740P33L036M58k842M9K124o83l065O95L337J175k465j667R03K398N22p18
1824A250J0n34n77k91k77R09J502J94k822j403K356K128j865k273K25K078j133
1841e23k132J667K920p72l170p27K638R56r80j249J581L95k39k72J060N06n24
1858A135q43j650Q88J928R3k101j534J773J759j270j485P38J933k174j861J676
$$ plain form
1740 -28 -2163 -1469 966 153 -2071 -1018 3181 3600 -473 -2400 854 2318 -975 -3052 -1075 -254
1756 -254 -2027 -2247 552 3258 2723 172 -960 362 2034 2479 751 -1008 -781 -44 -755 -888 723
1773 723 2405 344 -2921 -1776 2240 2939 -386 -2015 276 126 -2573 -3074 74 1501 -644 -2136
1789 -2136 -115 2097 2090 816 1 45 197 -102 -979 -650 386 691 -901 -1753 677 2484 690 -2740
1807 -2740 -2007 1029 1487 -1355 -1306 818 135 -2930 -2235 1102 2277 -188 -1855 -952 1446 1968 1250
1824 1250 1260 726 149 -142 -419 490 1992 2186 -636 -2039 317 2445 580 -1693 -1468 610 -523
1841 -523 -2655 -988 1932 1160 -2010 -2737 -99 857 -123 -1372 209 604 365 93 1153 1659 1135
1858 1135 292 -1358 -470 1458 1551 -550 -2084 -311 1448 178 -1307 -569 1364 -810 -2671 -995
1874i95L083q89l230r02K472P88o34J66P95K82p57j85J353R32J41j720j818M5
1892a073J529Q26j537l55J284P85j990j051K728J159k489k991R30K802n89j816
1908a848K50J912k36j327N97J523J078j082j000K12J053K16n87j727l01J281P54
1925G68j318L92J464M05k131j024K089J557k513k908J088J779j75j024J306J273
1941A028m98j688O96J800Q55j076j173m25N50P36l05n32k20J045m81j229Q88K198
1959B169J98k941j313J560J092j692j964J694J008j039o71J556K120m53k124J21
1975f79J046N85l25o74l75M19O55j04k28Q90O68j106j579P25K118kk461j467J665
1994b29N09j618n45J728O78j814j188J979J836k54j472m18M29Q4J22J61N2K50
$$ plain form
1874 -995 2088 1199 -2031 -2933 -461 327 -307 -141 654 936 179 -6 1347 2279 2420 700 -1118 -1073
1892 -1073 456 1282 -255 -610 674 1459 -531 -1582 1146 2305 -184 -3175 -2245 557 -32 -1848
1908 -1848 -1598 314 78 -1249 -652 871 1949 867 -133 79 1132 1348 761 -966 -1267 14 768
1925 768 -550 -158 1306 1711 -420 -1444 645 2202 -311 -3219 -2131 -352 -527 -1551 -245 1028
1941 1028 530 -1158 -462 1338 2193 1117 -56 -481 69 805 500 -32 -252 793 312 -917 -29 2169
1959 2169 2367 -574 -1887 -327 765 -927 -2891 -1197 -189 -1228 -1899 -343 1777 1324 -800 -679
1975 -679 367 952 627 -47 -422 -3 652 548 320 1210 1878 772 -807 -82 2036 2034 -427 -1894 -229
1994 -229 280 -1338 -1883 -155 523 -1291 -2479 -500 1336 1082 -390 -808 -379 -295 -173 -12 40 290
2012B90J02n79k4J031J324r82k032j03J809L63j825k26J342P1k187p2K101Q37
2030A240j760j299R99J826k62o46k36P7j65p1N9O56O40m0j295m68J289J440j023
2049I61j963J95J303o2j448O64J407m71k313l40K159P04j412j120R23Q35n7m40
2067d75P93O71m55j063RL45J029K63q85r37R81J040l40q37L11Q64j099j372O07
2086e50J664m62k133m74J614N73r76m42J155L42q56n7P69P73q21n58p48M43R98
2105B54K11j94q22R86P83q83l92R63M94j233k086R05J764j36j660Q3Q73M99p97
2124c88OJ194K28j406m80P15O65Q1o28o45O0M29N94O2l14Q57J34q97o48R49Q15
2145A383j316j889K70J755k87q34L42J067k34j145J71J271K39j201p05L99O35
$$ plain form
2012 290 392 -187 -211 820 2144 1162 -870 -973 836 1199 -626 -852 490 561 -1626 -1698 403 1240
2030 1240 -520 -1819 -820 1006 744 98 -138 -61 -226 -297 -238 418 1058 1018 -277 -745 544 1984 961
2049 961 -1002 -807 496 434 -1014 -350 1057 586 -1727 -2067 92 796 -616 -1736 -813 22 -35 -475
2067 -475 318 989 534 -529 -520 -175 854 1117 232 -705 276 1316 976 139 450 1314 215 -1157 -550
2086 -550 1114 652 -1481 -1955 -341 232 -744 -1186 -31 311 -545 -602 167 940 119 -439 -1187 -744 254
2105 254 465 271 -551 435 1218 335 -57 906 1400 167 -1919 -1014 750 614 -1046 -963 -90 409 -388
2124 -388 -382 812 1040 -366 -846 -131 534 615 -13 -658 -598 -169 425 487 173 1030 1164 267 -381 568 1383
2145 1383 67 -1822 -1552 203 -84 -918 -576 491 257 -888 -717 554 793 -408 -1113 -714 -79
2162g9r9N43m72p5L28L88l83L71N29J46j274o53P73P07p48j299M13J098n63n96
2182i45P36J546n11j629q9J007L56p48l35k1L51K70j66L11L35N43l93j153L05
2201b30J349J28j263n98M64P14n85m95Q39L20j002n95P80J401o16j070m57J024
2219A08m4n00J11J76R3n0k12O71L46K22o11r87R2R15M77j171n23Q44M02j173J45
2240f69R26Q97j566p21M09J368k33q35J40L66k16m50M28N61K13l83o9J29M69L52
2260A116j11j049k91J099l5j086K62R11m96j064j40R75L38p57p40N72P67l05p58
2279g92N31L63l18l67l56Q95K54jj23l85P71J56J16n67K57K06k14o80L39O13j82
2300E16j033l71J045J50k96m58M59L05p28l29R67O8l19o54l8M07N14J86r7m15
$$ plain form
2162 -79 -178 365 -107 -182 146 534 151 522 1051 1197 -77 -730 43 750 2 -1297 -884 214 -349 -945
2182 -945 -209 1337 826 -803 -892 115 471 -277 -612 -633 -282 -12 -178 133 468 1011 618 -535 -230
2201 -230 1119 1247 -16 -614 -150 564 -21 -516 323 643 -359 -954 -174 1227 611 -459 -916 108
2219 108 64 -436 -325 -149 -56 -106 -318 353 699 921 310 -677 -585 330 807 -364 -887 -43 359 -814 -669
2240 -669 257 1154 -412 -1133 -724 644 411 -424 -284 82 -134 -584 -156 405 618 235 166 295 764 1116
2260 1116 1005 -44 -335 764 729 -357 -95 816 320 -744 -884 91 429 -328 -1068 -496 271 -34 -792
2279 -792 -261 102 -216 -583 -939 -44 210 209 86 -299 472 628 744 177 434 640 426 -254 85 698 516
2300 516 -517 -888 157 307 11 -447 12 317 -411 -740 227 295 -24 -678 -716 -309 205 391 294 -121
2320a21M67M31j32k78r8Q00q28q52K49Q63K22j247j06O82L87o31j74O83K72o96
2340a07n56L56M49l54k20j31J57K66J96J01N57l99Q2j02n67N03P08j198q36M30
2360f65R53q2m19J71L71O3o22k59Q99L2r35l47N19K77n9J85j74Q9J95m7k7J58
2382B76L65k17n27j64N82M10p89k1l55N07P6k58K01K99j59q00M2M77K75p16m6
2403e42J20K88k07M00J86j88J69l15m4J44O13j09o08k90L60M59K31p18r0M69m15
2424h7r5J07Q82m35r00O3J70L94m22n28O18j0L2k78K72L10M11l53m44j74Q44q
2446C69l14j82J77L86j78k78L93L58p41m12M99N14n27l31j37M94j84n13K56N60
2466B09r4l50k96L40L11L44l87k07q6M81M8j64jk0K79n34mM64M93p87m30K55N25
$$ plain form
2320 -121 346 777 645 367 269 1069 241 -611 -362 501 723 -524 -630 52 439 -192 -366 317 589 -107
2340 -107 -663 -307 142 -212 -432 -563 -406 -140 56 157 714 315 397 295 -272 231 939 -259 -1095 -665
2360 -665 288 206 -213 -42 329 392 -230 -489 410 442 -493 -840 -321 -44 -103 82 -92 -3 192 145 118 276
2382 276 641 424 -103 -267 315 725 -64 -85 -440 67 143 -115 86 385 226 -574 -532 -55 220 -496 -542
2403 -542 -422 -134 -341 59 245 57 226 -89 -133 11 624 515 -93 -383 -23 436 667 -51 -141 328 -87
2424 -87 -182 -75 807 372 -528 -465 -295 99 -323 -851 -233 -243 -211 -489 -217 93 504 151 -293 -467 377 369
2446 369 55 -127 50 436 258 -20 373 731 -10 -422 77 591 64 -267 -404 90 -94 -607 -351 209
2466 209 115 -235 -531 -191 120 464 77 -130 -216 265 313 149 148 128 407 -127 -131 333 826 39 -391 -136 389
2489C89m54J05j34J77k45k07J16J38K57k42q5l9L21J43k0l51L55J4k90r6K32j06
2511b2M11o04m02P56L79l41l44J97J10k55j94O2M41k58n14J61J99J93k2K15j44
2532B4l2M01l98K35p0L57p00j45K92K73K33m14k73J71P12m59m44L17L21n15k48
2553c62k3N99k90l86J94M93p4o9J23j01j12J93o8k07J09J59p7n74R4R10q7k01
2575B43m18L42K00m09k48O42j36m48l88O41n4n4j4L2P3j10J78N4K1l4J6l78P1
2598a78o7M18M6m23K5M79k19j07K87J35m01l41J63o1O26p38n3K91Q1q5q6M69m9
2621B12l94j01L00K88j45k7Q2n06N87j44J49j89R8K48n71J33r4L63M8n56j17L70
2643C4J22k94j47K80J27j61p6J23P6m40P9J81l2o0K32J51l90J51j52L60m28M31
$$ plain form
2489 389 -65 40 -94 83 -162 -369 -253 -115 142 -100 -185 -224 97 240 220 -131 224 238 -52 -148 84 -22
2511 -22 389 -215 -617 139 518 177 -167 30 140 -115 -309 -247 194 -64 -578 -417 -218 -25 -47 168 24
2532 24 -8 393 -5 230 160 517 -183 -328 -36 237 470 56 -217 -46 666 207 -237 80 401 -114 -362
2553 -362 -385 214 -76 -462 -268 225 151 82 205 104 -8 185 117 -90 19 178 101 -473 -379 531 444 243
2575 243 -175 167 367 -42 -290 352 216 -232 -620 21 -33 -87 -101 -69 4 -106 72 126 147 113 129 -249 -178
2598 -178 -245 173 219 -204 -179 300 81 -26 261 396 -5 -346 -183 -244 382 -356 -409 -118 -37 -122 -208 261 212
2621 212 -182 -283 17 305 160 133 215 -291 296 152 301 112 210 458 -113 20 -74 289 337 -219 -336 34
2643 34 156 -138 -285 -5 122 -39 -115 8 84 -356 -277 -96 -128 -188 44 195 -195 -44 -196 164 -264 167
2665A67r6k31K89k98M98m24l42L75J09K6m6l70M28l16pP0Q6K26r1j65m26N49K45
2688B56k15J35j79j5K70L57j119O99L30l02k97K2J77nm14K50J24Q4l87O9J71j9
2710hj67o4J44P3j6j7oj42Q9J91n0j15L31J4lr6Pj17N1j59K20J75k22p4k34L78
2736A83k45j58m9M34l00m3j61R9K80MJ17J4k01L77l33j04m3n7K04K36m05K89j53
2759a5K11m9k66M56o89J38J21K56j57m55J48J16M24n05K76m9K35k17Q1o3K2k16
2781a97L13L2n07M57j37L15l46J84k53L40k83J31Q9O7l16j03K53n1j6j28J58j06
2803a04Q4j76m2L40k24r1j3R0Q4J64m69M10J43j15J98j43j88J99j07K53k45J24
2825A72j89j88j2L74k43R4P4j20M6j68J49J08j81J09p0j48K29J76l34q8M58q2
$$ plain form
2665 167 71 -160 129 -169 329 -95 -437 -62 47 73 27 -343 85 -231 -238 -168 -82 144 53 -112 -538 11 256
2688 256 41 176 -3 -18 252 609 -510 189 519 217 -80 -58 119 114 -300 -50 74 158 -229 -160 11 -8
2710 -8 -175 -239 -95 -22 -38 -55 -61 -203 -114 77 27 -88 243 257 254 158 165 48 99 -60 160 335 113 39 -195 183
2736 183 -62 -220 -269 165 -135 -178 -339 -240 40 44 161 175 -26 351 18 -86 -129 -186 18 254 -151 138 -15
2759 -15 196 147 -119 337 -352 -214 -93 163 6 -449 -301 -185 239 -266 10 -39 196 -21 60 -3 19 -197
2781 -197 116 148 -359 98 -39 276 -70 114 -139 201 -82 49 138 205 -111 -214 39 -12 -28 -156 2 -104
2803 -104 -20 -196 -238 102 -122 -213 -226 -136 -52 112 -357 53 196 81 279 136 -52 147 40 293 48 172
2825 172 -17 -205 -217 157 -86 8 82 -38 8 -160 -11 97 -84 25 -45 -193 36 212 -122 -210 248 166
2847A66j45j12K43K69k59K0Kl12K90k46K16k78j6L12n07L14N8J05k46O2j01J25
2869d0j12J23M6j95R0N9J34jp4n0L3j90J52K64j12O3k65K14l15K77j38K22j52
2892C3j2k9m5J86j40M7M9Q8j04j52K11k25O0J05m28N51J31k06k95K46j45%K04
2915A30j13j31K87k85j07M24k90K3o3Q7K22j19k07J98L0j10J01j36Q8m7j40K72
2937A14k55M5R0o9L34j34k24N1K05K5r9p2j0j18j70M72k52j8J64N5k35J07K0J88
2961B14k26J7j60J96Q8k22P1j8J91k9J3k80P5J32k82O7l6L04p5o4k01K71J04j38
2985A2j61J98j23r3M43l62Q0P2J75k20k79L81j55kQ4j45l8L6L76m87J81j63R4
3008i6j79M75j90q2Q1J03j43l7J24q6J11J9j99J52j49J01q1j44J71k73K26J00
$$ plain form
2847 166 21 -91 152 421 162 182 184 -128 162 -84 132 -146 -162 150 -357 -43 15 120 -126 -64 -165 -40
2869 -40 -152 -29 17 -178 -88 -29 105 104 30 -20 13 -177 -25 239 127 190 -75 139 -176 101 -37 185 33
2892 33 21 -8 -53 133 -7 40 89 177 73 -79 132 -93 -33 72 -356 195 326 120 -175 71 -74 -74 130
2915 130 17 -114 173 -112 -219 205 -85 -62 -125 -38 184 65 -142 56 86 -24 77 -59 29 -18 -158 114
2937 114 -141 -96 -6 -75 259 125 -99 -48 157 182 83 11 1 -117 -287 185 -67 -85 79 134 -101 6 26 214
2961 214 -12 5 -155 41 129 -93 -22 -40 151 122 135 -145 -70 62 -220 -153 -189 115 40 -24 -225 46 150 12
2985 12 -149 49 -74 -167 276 -86 -6 66 241 21 -258 123 -32 -34 50 -95 -133 -97 279 -208 -27 -190 -96
3008 -96 -275 200 10 -72 9 112 -31 -68 56 -30 81 100 -99 53 -96 5 -76 -220 -49 -322 -96 4
3030DJ3Q9q2K5j35l1j15L71k31j0J9j37L52k27j6p9J30l32L38J55j29q4pJ23L8
3055D2j56M34l45o1L55j36j54K62r4l0J6j15j45J25k6K6K9J62M6l85K42n0Lj49
3079a04O9p4K01l01L68l28j1M48j7k81R7j97J74j92L27j60q2J8K81k60l0nj97
3102b56J73j0J70k45J81k5J98j93o4k5p3K48j57m6R5P4Q3m29N18j26l4l1k12N26
3126C40j47j32j51K72k54J6j63K39P0j97j43J33K2L78r2m94L57j47Q2m8L7m5j3
3149h0R4k0J64j4k16K40l64K66L29m00K57k98K40k77m3j78J87No3K12L2J37j65
3172D5k8lJ52k10N1J02J8j36Pn1%J55N6k30L05j94j94Km0O3K23m73M2J08J09J16
3198eK12l98N12m71k64N95k13QNK16m08K57p5K28j72K38m49K65k91M77q9j72j42
$$ plain form
3030 4 17 106 24 49 -86 -117 -232 139 -92 -102 -83 -220 132 -95 -111 -190 -60 -392 -54 101 -28 -112 -119 4 42
3055 42 -114 320 -25 -86 269 133 -21 241 147 117 133 18 -127 -2 -28 -2 27 189 235 -150 92 42 45 -104
3079 -104 -35 -109 92 -209 159 -169 -180 268 251 -30 67 -130 44 -148 179 19 -63 -45 236 -24 -54 -59 -256
3102 -256 -83 -93 77 -168 13 -12 186 -7 -71 -96 -169 79 -78 -124 -29 45 128 -301 217 91 57 26 -186 340
3126 340 193 61 -90 182 -72 -56 -219 20 90 -107 -250 -117 -95 283 191 -303 54 -93 -11 -59 -22 -67 -80
3149 -80 14 -6 158 144 -72 168 -196 70 399 -1 256 -42 198 -79 -122 -300 -113 -108 -171 41 73 210 45
3172 45 17 14 166 -44 7 109 127 -9 -2 -53 -53 102 158 -72 233 39 -155 -153 -193 -130 93 -380 -338 -230 -121 -5
3198 -5 207 -191 321 -150 -414 181 -32 -24 -19 197 -211 46 -29 199 27 265 -184 81 -210 267 178 6 -136
3221a36m3MM09J18k80k8K30k70L7J3k9j45j16K32J90l82L31r2j71j4J91J69j33
3244H5MK76k99k0R9K10k41l68n9L13K23l62j2N7K39l27J36K06j1r8j08j12J70
3267AR9j82L46l12J64l66M52j83j78M35m47J33q1M3q6L61k30K57k83l2m2J86j15
3290f0J2J80l23K80j9n5r4p7j4J1L06J59l28J02j28J60j33M32m98k25M27J60m6
3313B29j75K3%k04m8J77L29k37K7j81j22jN3l0J47M62n01J18M7j51K54j27J00
3336A89l70L27n9l22k0L59k66K9P5m2j9K6r3K99rm92L64q0J62l15L6K65P0j77
3360f3O2J83j15j75R0J68K3k55K34J33j17l34M20k49j46k02O32l27J83r1OK25
3382B85l26p4k16M67m5j05k40K75O0n8p6J4j51M56L7l39o1J51k38K78l08K97J2
$$ plain form
3221 -136 -179 -175 234 352 72 44 274 4 41 54 25 -120 -236 -4 186 -196 135 43 -128 -142 49 218 85
3244 85 89 365 66 46 145 355 114 -254 -313 0 223 -139 -151 -94 145 -182 -46 160 149 51 -57 -169 1
3267 1 100 -82 264 -48 116 -250 202 19 -159 276 -171 -38 -119 -76 -162 199 -31 226 -57 -89 -131 55 -60
3290 -60 -48 132 -191 89 70 15 -79 -156 -170 -159 147 306 -22 80 -48 112 -21 411 -87 -312 115 275 229
3313 229 54 77 77 -127 -175 2 331 94 121 -60 -182 -183 -130 -160 -13 449 -52 66 113 -38 216 89 189
3336 189 -181 146 87 -235 -255 104 -162 -133 -58 -100 -119 -93 -186 113 104 -388 -24 -104 58 -257 -221 44 114 -63
3360 -63 -1 182 67 -108 -18 150 173 -82 152 285 168 -166 254 5 -141 -343 289 -38 145 54 60 285
3382 285 -41 -115 -331 136 91 -14 -254 21 81 23 -53 -39 -190 266 303 -36 -97 54 -184 94 -214 83 95
3405I5m04k7M75p0Lk46L62m05o2l3L2M56k84J5J01K77m59M02K1m8m2N6k32K6m2
3430c3J4J44o1q4j65L76l67J4K78q3l14K01J78O2k3l87J91M4Q7k45p0L47k22K10
3454I2R9k20J4M4L52r6j50p4J66j65n1k2l3j79J24Q4O2k26l6J06M3L4k38J91K97
3479B18k96RJ30J75l32l4J98pJ52J99k19j79PK70r8J7m61K42K00k79q4M6j7o0
3503b03p9J9N45l49l2k02K85Mn5qJ21p5m1J26j57N3kK04j8j8J09r9j34Q6J9l82
3529b83J3K42L98j67n1l82L85J88o45K48l4J71k47j66L34J44k10J53j67r0J49
3550a7M35j52l81j46K59k01J0J20J53J23n77L50R5K06m15j94L75n3N3j75L03l30
3572a59j09K09O0K51l93J43K7J26k20J04K20j20j80M8J4l58M37J16r2l45K07J10
$$ plain form
3405 95 -309 -336 139 69 72 -174 188 -217 -279 -312 -280 176 -108 -93 8 285 -174 228 249 201 159 215 -17 9 -33
3430 -33 -19 125 64 -20 -185 191 -176 -162 116 33 -281 -80 98 160 137 -250 -59 -15 72 -173 -243 104 -118 92
3454 92 191 -29 -15 29 381 285 135 61 227 62 11 -11 -44 -223 -99 -15 47 -179 -215 -109 -66 -32 -270 -79 218
3479 218 -78 -69 61 236 -96 -130 68 61 213 412 193 14 21 291 193 210 -251 -9 191 -88 -172 -126 -143 -203
3503 -203 -282 -263 282 -67 -99 -301 -16 -12 -67 -75 46 -29 -70 56 -101 -48 -50 154 136 118 227 128 -6 80 99 -283
3529 -283 -270 -28 370 203 152 -230 155 343 -302 -54 -88 83 -164 -330 4 148 -62 91 -76 -166 -17
3550 -17 418 266 -115 -261 -2 -203 -193 -73 80 203 -374 -24 71 277 -138 -332 43 -10 43 -132 171 -159
3572 -159 -268 -59 1 252 -141 2 29 155 -65 39 259 139 -41 7 21 -337 100 216 124 -221 -14 96
3594I6p9J82K27k01j68l85L38l53J74K72k95mJ56o3j22K08l9m4J75j24j89L88
3616A50J20j69k17R8J87J15l23J3M3o8k26N0K79j90m01N49j71K96k16N0j14J89
3638D4j00K13j39J05j40K30j54J09k1r6m4l03L01j93M23l39jJ44j9l17L18J97
3660B18k49k36K81N3p6n7J54K29l03j56K81j18o4K16j12j67j43L40p9O1J43k03
3682A3J93m13p4L86J07k11JM2r4P0q3m6k54L65J7P4Q7j03O7J2k16J58j92L56m52
3707a90k33O31k59K5n5J38L09p06l7M60L42m00j04k0m4J48j62P0K06l26q9R5J11
3730i0K08K13p9m07p7K14J97l12K58l7J18m36K28K46l4j27k73L81K2j60l98N03
3752A58j00k74K08p2P1J15l47K9K67J49k74M49n53K50k11L42l44J77P7K64l34
$$ plain form
3594 96 17 199 426 225 57 -328 10 -343 -169 103 -192 -196 -40 -103 -225 -17 -56 -100 75 -49 -238 150
3616 150 270 101 -116 -18 169 284 -39 -26 17 -51 -277 -227 52 -138 -539 10 -161 135 -81 -31 -145 44
3638 44 -56 157 18 123 -17 213 59 168 147 51 7 -296 5 -188 235 -104 -105 39 20 -297 21 218
3660 218 -31 -267 14 67 -9 -66 88 317 14 -142 139 21 -43 173 61 -106 -249 91 12 73 216 13
3682 13 206 -207 -281 105 212 1 2 44 -50 20 -63 -109 -363 2 19 93 180 77 144 156 -60 98 -94 262 -190
3707 -190 -423 208 -51 -26 -81 57 366 -340 -377 83 425 25 -79 -99 -143 5 -157 -87 119 -207 -296 -201 -90
3730 -90 118 331 252 -155 -232 -18 179 -133 125 88 206 -230 -2 244 210 83 -190 191 213 53 -345 158
3752 158 58 -216 -8 -80 -9 106 -241 -212 55 204 -70 379 -174 76 -135 207 -137 40 117 381 47
3773D7j44L68j49j53r6J65j42P0m5j34L60k06k60K29j01K20k75M31l11o6L26M
3795A38j32J83j40J39k20M7L77p8n66K38p7L56q6p6k06J17p3o8L9K37k54J2P6
3818a7l7O5J95K0k06j43J58Q4Q3k32J92N8l31L57q3J8j85o7l7R1mk97L58K9m49
3843c80OJ82O8M0M35j92n08K82J83j65j95K56O8j76m23M17M50k20l24J96L77r
3865C68l39J72p3j15l37J80M70l54nl9j36J44p5R3j59L0J85j98J70O9j24O0J21
3888A08l48K75J60R3o56L21M12Q4o03L79j68P7l70R4M67p46L15m3M25l60J35M5
3910I6k54K26l02K95l30K97O2j37j46l05M13L05o7P0m2L29o81K04J95j07q0k97
3932b56N28r8n1q3K04j56l97K78j59m2K58L1k16k9N7M19n5k18j30L38o3j59J43
$$ plain form
3773 47 -97 271 122 -31 -127 38 -104 -34 -79 -213 147 -59 -319 -90 -191 29 -246 185 -126 -192 134 138
3795 138 6 189 49 188 -32 15 392 314 -252 -14 -91 265 179 103 -103 14 -59 -127 -88 149 -105 -93 -17
3818 -17 -54 11 206 226 20 -123 35 119 202 -30 162 220 -111 246 163 181 -4 -71 -108 -17 -21 -318 40 69 -380
3843 -380 -374 -192 -124 -84 351 159 -349 -67 116 -49 -244 12 80 -96 -519 -102 348 128 -196 0 377 368
3865 368 29 201 128 13 -324 -144 326 -28 -33 -72 -208 -64 -139 -46 -205 -175 10 -188 -18 51 -73 -13 108
3888 108 -240 35 195 288 -368 -47 365 449 -154 225 57 134 -236 -142 325 -421 -106 -149 276 -84 51 96
3910 96 -158 68 -234 61 -269 28 90 -47 -193 -498 -85 220 153 223 181 510 -171 33 228 121 41 -256
3932 -256 272 174 123 40 244 88 -309 -31 -190 -232 26 57 -159 -188 -131 288 233 15 -115 223 160 1 144
3955A44K11L3n09j09N47J26j45m40J27M5m6k15L35q3m01K62n4K35j14q0K50q2
3977C7l43J59M00n16N2M48q3k32J62J08K34o17J68K29l4q9p8l4J67l85K45J51
3999A49R4m2k71J68l51J61k3j0j36Q6J24J17j00k22K86K16l02R3L37j38k12l6
4021a2K53j58m85L15J57Q6l51K8M64l64J8J40k06K10j85JLK51r1j80J52j59K78
4044A65K79l86j37O6J89n3k45J53Pl27j05L99j16K85m34J39pJ01K8o4MJ2j69k18
4068d34K70R3K01j66J33j82O0L1L40n41J12J5L35l06o8K54K14m35l55M79O4J5
4090A29m3j07j52j00R6j26M91l77J27j62R2J58N5K14k80r3J93J85k26j17J71q0
4112D8J84l28M36j63m70K19nJ93m37J08L50k21l14M2K79qJ53j17k72K07K26kr5
$$ plain form
3955 144 355 388 -121 -230 317 443 298 -142 -15 30 -16 -231 104 21 -380 -118 -172 63 -51 -131 119 37
3977 37 -306 -147 253 -263 -211 237 154 -78 84 192 426 -191 -23 206 172 83 5 -29 138 -247 -2 149
3999 149 243 201 -70 98 -253 -92 -115 -125 -261 -175 -51 66 -34 -256 30 246 -56 37 374 236 24 -12
4021 -12 241 83 -402 -87 70 156 -195 -167 297 -67 -49 91 -115 95 -90 -89 -86 165 74 -106 46 -113 165
4044 165 444 58 -79 -13 176 123 -122 31 38 -289 -394 5 -111 174 -260 -121 -128 -27 1 -63 -59 -47 -216 -434
4068 -434 -164 -71 130 -36 97 -85 -25 6 346 -195 -83 -68 267 -39 -107 147 361 -74 -429 50 114 129
4090 129 86 -21 -173 -273 -177 -303 188 -189 -62 -224 -132 26 81 295 15 -78 115 300 74 -43 128 48
4112 48 232 -96 340 177 -293 -74 -79 114 -323 -215 135 -86 -400 -358 -79 -87 66 -51 -323 -116 110 108 13
4135A3M2K48R1k28j87J15J24o5l40P4M43m33K18MK08k01m00O2L39k35k46K51P7
4158b6q6q3L01j99l38L86rJ50K9p9P0j7j14o4M25j45k70J51K1k47J0L61J22m09
4182f0J70k38R3Jj46r5L85l03J18J53J1k1L14m77J08K3J96K40n11j52M62J42l76
4205C7j92K39K53n95O4M21m2j84k12J16J11K8j40N3O0k42J84K32k04j03J53M26
4227D63l96k09K78m8j92j05L02J67m82Q8L30j36J38l48M5J06M3m26K14K19l68
4248c17PJ96l06J90J43K12k73K08O0k04J31J66J65J8l34j98K19L4k07k0N26j46
4270B70k22j50K27j21j48L28j45J00k72k70Q6K34O6k54J70k34N17j56p4r0J71
4291C3p8M6k17K95J79p5j24r6J07J74l20j7O0J66k35K56j90K41k24q0O2j23K07
$$ plain form
4135 13 55 303 394 166 -21 94 218 153 -187 -113 330 -103 115 119 327 126 -274 -212 127 -108 -354 -103 -26
4158 -26 -112 -195 106 -93 -431 -45 -54 96 125 46 116 99 -15 -79 346 201 -69 82 103 -144 -134 227 349 -60
4182 -60 110 -128 -35 -34 -180 -275 110 -193 -75 78 89 68 382 -95 13 36 232 472 -39 -191 271 413 37
4205 37 -155 84 337 -258 -194 227 185 1 -211 -95 16 44 -96 -43 17 -225 -41 191 -13 -116 37 463
4227 463 67 -142 136 88 -104 -209 93 260 -222 -134 196 60 198 -150 -105 1 44 -382 -168 51 -317
4248 -317 -310 -114 -420 -230 -87 125 -148 60 120 -84 47 213 378 396 62 -136 83 117 -90 -110 416 270
4270 270 48 -102 125 4 -144 184 39 139 -133 -403 -317 -83 -17 -271 -101 -335 182 26 -48 -138 33
4291 33 -45 1 -216 79 258 183 59 -37 70 244 -76 -93 -33 133 -102 154 -36 205 -19 -99 -37 -160 47
4314D7p1j08p1k81P19j41j04l13M68n9k70oK43N68n95K8n0K34k09L1k94M13m85
4337c06K73p3J91k50O5J81m16K00N34Nl69j26pK5j57M27N1K80m74M6J74k30r3
4360d9R8L60j66l70K0L02j53l72Q0M67j8Q1k49P8j63m4M6J40j61N0j48K62k18
4383a27O8J91K3k23l7K72J71k17L9J18l02J94j57J9m5qq3L29l91P6q2K72k74L5
4407a39L48k93K87k88N89r61L62R0K4J02k28P3qk9K65K1J19j84k39j69M14n67
4429d11M12r1J18P9l55K95j15M7j53j00J81o5M70k13q7j93L6N96m35j17P9K79
4451B57k71J13r9L22l74kL0l5J01k74K85L0j88k06J21J55l1k8J09j41l8L3J96
4474F5m03j02M77K30l98q7M08P0j7l65L63J83m17q8K27m9m06K83Q5L0o2j72M52
$$ plain form
4314 47 -24 -132 -203 -484 235 94 -10 -323 145 86 -184 -190 53 621 26 54 4 238 29 60 -234 179 -306
4337 -306 -33 -106 85 -165 -100 81 -335 -135 399 404 35 -91 -98 -73 -230 197 248 528 54 100 274 44 -49
4360 -49 49 409 243 -127 -107 195 42 -330 -250 217 199 280 31 109 -54 -98 -52 88 -73 -23 -171 91 -127
4383 -127 -59 132 155 -68 -105 167 338 121 160 278 -24 170 13 32 -13 -21 -104 225 -166 -90 -172 100 -174 -139
4407 -139 209 -84 203 -85 504 -457 -95 -5 19 121 -107 -34 -42 -71 194 215 334 150 -89 -258 156 -411
4429 -411 1 -90 28 107 -248 47 -68 -21 -174 -274 -93 -158 312 99 12 -181 -145 451 16 -101 -22 257
4451 257 -14 99 0 322 -52 -54 -24 -59 42 -232 53 83 -105 -311 -190 -35 -66 -94 15 -126 -164 -131 65
4474 65 -338 -440 37 267 -131 -218 190 260 243 -122 241 424 7 -81 146 97 -309 -26 59 89 27 -145 307
4497C07j55k76K74k51J32k22P9j05J9k10M15M3o6l1J98lj72j43K41n9l17J89J07
4520fP5l47M8J49q0m9L30l20k5Q3K48p7m4l22J37J11j05L19l6k2j26J11n1J72
4544A73k04j04J74J96J59m75J89J15l06J28j17j2k17L21r8N7l11J85J73m37L12
4565i9nJ27j37O0p5K28qk82M37m0l05K71j17J03r0k83J75J17jk88O0L08m07K01
4589e0L33l27k30L66j58j9j09L27l00j5P2L47k15K7Q7J69k71j29K4K33r4j87J10
4612ik0M4j34lJ53j34N0L69o53R6M11k35J93n7k78N02k57L1p4Q0L54o22J49j5
4636e9N98m61k90K20K67k15q6k08J98j94J32K46q1k89j06K35j47J19L03k06j52
4657a76q5O4K73j02J24j5J08k57J73M24l11n54J64L19o0l2K82q3l99J12p5l2J89
$$ plain form
4497 307 152 -124 150 -101 31 -191 -112 -217 -198 -408 7 50 -16 -47 151 148 -24 -167 74 15 -302 -113 -6
4520 -6 69 -278 -230 -81 -161 -210 120 -200 -225 -142 106 29 -15 -337 -200 -89 -194 125 89 67 -59 52 1 173
4544 173 -31 -135 39 235 394 -81 108 223 -83 45 -72 -84 -301 20 -78 -21 -332 -147 26 -411 -99
4565 -99 -104 23 -114 -54 -129 99 91 -191 246 206 -99 172 55 158 68 -215 -40 77 76 -212 -152 156 -251 -50
4589 -50 283 -44 -274 92 -66 -85 -194 133 -167 -182 -110 237 22 49 136 305 34 -95 -71 162 68 -119 -9
4612 -9 -29 15 -119 -122 31 -103 -53 316 -337 -241 170 -65 128 71 -207 295 38 69 -5 75 429 -193 -44 -59
4636 -59 539 78 -212 8 275 60 -26 -234 -36 -230 -98 148 67 -222 -328 -93 -240 -121 182 -24 -176
4657 -176 -261 -197 76 -26 98 83 191 -66 107 531 220 -334 -170 149 89 57 339 256 -143 -31 -106 -138 51
4680E1k94L47j37n87M11M34j46j93l8j3K05o4l6J37J90j9l9J7k42j56j82N91l20
4703h3r4K75N5j27O4l3l73K13K56q1j40m30L06K3K85k29j48M26r6l20L15L52l72
4726D4K5j84L24J04m12J36oL6K11l41N62o43K8J24j12J27j2J74k41j71J71j25
4748a81R3K15j00k1j24k22K27R1K8p0j62L70q1j1J07J96k24l37L76j16k37q8J49
4771a22L18n74K52J86r8l2J06J17l50L5M0J96n8j11Q5K76r0R0J3j20j49J3J46
4794A69K4l46M63k71L5kk68M33k22l21K06m7N2L04n63M37j03J04Q8R2k77j21O5
4817f9L90n03P4L35p5k29N6K20j27M1j64J74Pr0j93K64j65Qk39N7J61j3J76m4
4841E2k86K99l2J72k55j65M87J60l70qR0n3J91k51K53l19J20l80N83k13k21J79
$$ plain form
4680 51 -243 104 -33 -620 -209 225 79 -114 -152 -165 40 -24 -60 77 267 248 209 226 -16 -172 -354 237 -83
4703 -83 -177 98 153 26 90 57 -316 -103 153 72 -68 -498 -192 -169 116 -113 -261 165 69 -251 64 416 44
4726 44 69 -115 209 313 -99 37 31 67 278 -63 499 -144 -116 8 -104 23 11 185 -56 -227 -56 -181
4748 -181 -88 127 27 6 -118 -340 -113 -22 6 -64 -226 144 63 52 159 355 131 -206 170 54 -183 -271 -122
4771 -122 196 -378 -126 60 -38 -70 36 153 -197 -162 -122 74 16 -95 -10 266 176 266 279 159 10 23 169
4794 169 193 -153 310 39 74 72 -196 237 15 -306 -100 -147 -95 209 -354 83 -20 84 172 264 -13 -134 -69
4817 -69 321 -182 -108 227 152 -77 -21 199 72 113 -51 123 130 40 -153 111 -54 -46 -285 -228 -67 -80 96 52
4841 52 -234 65 33 205 -50 -215 272 432 62 54 144 91 282 31 284 -35 85 -295 288 75 -146 33
4863C3j80J98k17J75j0k64K51J25k66Kn8L15j57j08J40J91L7l47K34k01L02k65
4885g0J71m7jM3k40J48j06K35l06J00j40K5J44J59k94J41K76k03N5j1R8j58l02
4908b83M92p2p2o6j16N18m31m4J58k2K68m75k3M19l2l94K87l2l63K74q9J44j71
4931a25k01o6M48l51J4L94j79j00j57K97K26p1j91J66N4L0p0j4L0k15q2M09k55
4954io7P6Q5j41j19R6o1J32J31l41L85k21N1K37J15m94K4J82k05L88l06J88o2
4977F4k87K78OK8r4L33j44Lm60L56j9K4j04k85N6J2J54J72l0l20K26K11k53j0
5001h3J36Q0kk56K31K51m33r8J21j04J98l8J7K50m92K49K01o2k04q2J32j03K6
5024f5r6J65j94K67J12k66m6j38j88M70k98K01J87J72l81kJ72J64j81M6q0L8K3
$$ plain form
4863 33 -147 51 -166 9 -1 -265 -14 111 -155 -153 -211 104 -53 -161 -21 170 207 -140 94 -107 195 -70
4885 -70 101 54 53 96 -144 4 -102 133 -173 -73 -213 -188 -44 115 -179 -38 238 35 90 79 177 19 -283
4908 -283 209 137 65 -1 -117 401 -30 -74 84 62 330 -145 -168 251 219 -175 112 80 -283 -9 -98 46 -125
4931 -125 -326 -392 56 -295 -281 113 -66 -166 -323 -26 200 129 -62 104 158 188 118 104 134 -81 -163 246 -9
4954 -9 -76 0 85 -56 -175 -79 -140 -8 123 -218 167 -54 -3 234 349 -145 -121 61 -144 244 -62 126 64
4977 64 -223 55 61 89 -5 328 184 187 -273 83 64 88 -16 -301 -245 -233 -79 93 63 -257 -31 180 -73 -83
5001 -83 53 133 131 -125 106 357 -76 -174 -53 -157 41 3 20 270 -222 27 228 166 -38 -120 12 -91 -65
5024 -65 -161 4 -190 77 189 -77 -123 -261 -449 21 -277 -76 111 283 -98 -100 72 236 55 101 21 59 82
5047H2l38K43l6k5J03N4j09k7k2Q3j76J61M1m5q7J19k80L30k92L9N39j35l39J48
5071C1K07k10q9p7J29O9l03M35r7l18K81j31L0k07K51J1J5l4o7K40j10l52R2J72
5095c2R5p9k9L17r1K5k54K16L2j47J49l15LK08J02p7j38m8L0j74K61m52O05k90
5119h3j49J09K68kk30j8l7K15k06K00q0J26r1jk04K68j10j58K53J09j84kO2qo3
5144a6q6J53J1j70j28K28j87j55L53P1k84M3L41P9k58k1L02j98k54K8Q3K0K05
5167A60l57L92L1l30K67J56j07q9j34J5j64J38K45k59K03m51J46K13q0mL65k25
5189A31j96P3M2K21l65K31j21J23l05R7M8J7l32L47K9K12j39k43K37j50k34L90
5211A13k61O8r1K77o7j18J19j41J63p7R9n0j39l7J88J98k69J5K48l53M34q4k16
$$ plain form
5047 82 -256 -13 -49 -74 29 83 -26 -53 -75 8 -168 -7 34 -11 -98 21 -259 71 -221 -182 357 222 -117 31
5071 31 238 28 -61 -138 -9 60 -243 192 95 -223 58 -73 -43 -250 1 12 27 -7 -74 166 56 -296 -204 -32
5095 -32 63 -16 -45 272 181 206 -48 168 200 53 202 -113 -110 98 200 123 -15 -63 -33 -207 54 -398 207 -83
5119 -83 -232 -123 145 143 -87 -105 -142 73 -133 67 -13 113 22 21 -183 85 -25 -183 70 179 -5 -7 55 47 -16
5144 -16 -102 51 62 -108 -236 -8 -195 -350 3 74 -210 -167 174 253 -5 -26 276 78 -176 -148 -65 -45 160
5167 160 -197 195 226 -104 163 319 212 123 -11 4 -160 -22 223 -36 167 -284 -138 75 -5 -9 356 131
5189 131 -65 8 50 271 -94 137 16 139 -166 -69 -21 -4 -336 11 40 252 113 -130 107 -43 -277 113
5211 113 -148 -80 -171 106 39 -79 40 -101 62 -15 84 34 -105 -142 46 244 -25 -10 238 -115 319 235 19
5234A9K9j95J51p1n7R1K3r5P3k33J67J6j25J88O6j21J47kJ38l04K61k74n9K37
5258G0k00P6m5M78j63l87K27p9j51J45L76k81k24k1o1K39J8J04l1Q3k14J51j66
5281e6N1J6K6J69l63J90M46l90n8rl02O55n15p9L83r0P8l25K59o5j46m9J34j95
5305b35n0J27Q9P8l38O75m89N0K97j54M5j38J8P1j31K32k2j52j71J50J32j31J66
5328A19l51R4K18L3k53J58Q2j30N7M1q2j18j3M22k90R9qN5q6k41K45J56j26k9
5352E2p3j90N25n15L93m4k77j31J33n7M8m2J95k9K73k94k9J87k83J96r8j85J92
5375e3k10J5N94k41l11K65M5j2K4k26J62J20j73L8M0m4M1j36p1j2K16p6p3M5K9
5400dk22jM47j6J76l85O0R9k31o3nK62j45P4k08J40L83m60J27j50k17J05M12J2
$$ plain form
5234 19 48 -147 4 -67 -124 -33 -10 -105 -32 -265 -98 -82 -207 -19 47 -74 73 71 209 -95 166 -108 -167 70
5258 70 -130 -54 -99 379 216 -171 56 -23 -174 -29 347 66 -158 -179 -240 -1 17 121 90 173 -41 110 -56
5281 -56 -5 11 37 206 -157 33 479 89 31 22 -280 375 -140 -219 164 74 152 -173 86 21 -125 -174 -40 -235
5305 -235 -285 -158 -69 9 -329 346 -143 -93 204 50 95 -43 -25 46 -85 147 125 -27 -198 -48 84 -47 119
5328 119 -232 -138 80 113 -140 18 100 -30 27 68 -14 -132 -145 277 -13 86 78 133 47 -194 51 207 81 52
5352 52 -21 -211 314 -201 192 148 -129 -260 -127 -184 -136 -178 17 -12 261 -33 -62 125 -158 38 -60 -245 -53
5375 -53 -263 -248 346 105 -206 59 104 92 116 -110 52 172 -1 37 77 33 74 -62 -133 -145 71 -5 -78 -33 -4
5400 -4 -226 -227 220 204 380 -5 55 154 -77 -140 -145 117 -28 46 -162 -22 361 -99 28 -122 -339 -234 178 190
5424A90k12q7R0J76q9j11J4J40L9l25M13m3l19Q9J48k77K76j3k5J19r4j51K5J63
5448A36k1L3k82K33l23M61j97j73m6j3J29l7K19j2K1l0j16j62m9JP6J79j5O5K21
5473B98l81P15o30J90j14p7j64K59l02m8K64j2N5O9k01r8j23J14J3J39J06m7q5
5496f0J08m0R3Kl14J61L7j38L1J69j90K35r1QJ03o5M7l8nj1J80j9k47O7l33L58
5522D8Qj49J87j25q1K72p4j01K42k00J49l32J07m9M01j36N5k61n9Q7J45j55n9
5545h0J06K34l35j8K96l8l39K10K0Q5k0j70J52m4J18r5K6j4l5j91L56k55n5J68
5569H2j94J17J5k47J15L40l46k3J34j23K69p8j55K61m54K00rQ7j38M0J61j4Q7
5592A27j10M7l88J95L95k28Q8l58M03j17o0J23k29J57k87L56n7o4K8k6o2K3k42
$$ plain form
5424 190 -22 -109 -19 157 68 -43 -29 111 150 -175 238 195 -124 -35 113 -164 112 99 74 193 99 -52 -27 136
5448 136 115 148 -134 99 -224 237 40 -133 -179 -192 -63 -100 119 107 128 98 -18 -180 -229 -228 -152 27 12 77 298
5473 298 -83 632 2 192 78 1 -163 96 -206 -254 10 -2 53 122 -79 -177 -300 -186 -173 -34 72 25 -60
5496 -60 48 8 101 103 -211 -50 -13 -151 -120 49 -141 94 3 11 114 49 96 58 53 42 222 203 -44 23 -310 48
5522 48 56 -93 94 -31 -112 160 86 -15 227 27 176 -156 -49 -98 303 167 222 -39 -98 -11 134 -21 -80
5545 -80 26 260 -75 -93 203 165 -174 36 56 141 121 -49 103 59 177 82 108 94 59 -132 224 -31 -86 82
5569 82 -112 5 20 -227 -112 228 -118 -141 -7 -130 139 61 -94 167 -287 -87 -96 -9 -147 -107 54 40 127
5592 127 17 64 -324 -129 266 38 126 -232 171 54 -6 117 -112 45 -242 114 57 -7 21 -5 -67 -44 -286
5615b86J18P9j00J80M0j19O5O6J08j24j21J36N5j45PP6j77K93k07m9j87N34j82
5638F0n7R0j17m5P7J57l37j66K34K80j03j82pJ26J61k85M17l65Q5M2n2K19m63
5661b31K07j04L39l74j94K43K14j59J98j74J06l71L17R9m33K15J37J9l34K56K11
5682A87k12p7L20j71p0L23o07K91J23j92L20k85Q1J18o9j80K62j5J9l29K56l29
5704b36P3k2J84j58R9j55N0J53m2Q3Ok6J17j80j66K8J93P4M2J10L7m42N01k69
5728E4j55J55l23J46J09q0o6K44n0j10k8k8M7j70K23m1J77N7J39k97J52l04J14
5751c5K34k50k50K41K02j00j30r7L26k6k34J27k34M35k93n0J76J16M2qm6j61o2
5774g7K20L5j70J05j90J22j90L58k88K9J43k33L17n0o1N9j8n2J01l02K73k92r5
$$ plain form
5615 -286 -168 -89 -189 -9 31 -88 -23 43 151 27 -94 42 97 -48 -41 35 -142 151 -56 -105 -292 242 60
5638 60 3 93 -24 -69 8 165 -172 -338 -104 176 73 -109 -116 10 171 -114 303 -62 23 65 13 232 -231
5661 -231 -24 -128 211 -163 -357 -114 100 -59 139 -35 71 -300 17 116 -317 -102 35 54 -280 -24 187
5682 187 -25 -102 218 47 -23 300 -307 -16 107 -85 235 -50 31 149 80 -100 162 147 166 -163 93 -236
5704 -236 -163 -185 -1 -159 -60 -215 -165 -12 -54 29 35 9 126 -54 -220 -192 1 75 117 227 264 -178 323 54
5728 54 -101 54 -269 -123 -14 -94 -160 84 34 -76 -104 -132 -85 -255 -32 -73 104 161 300 3 155 -149 -35
5751 -35 199 -51 -301 -60 142 42 -88 -185 141 115 -119 8 -226 209 -84 -134 42 158 200 192 146 -15 -77
5774 -77 143 178 8 113 -77 45 -145 213 -75 -46 97 -136 181 131 70 129 111 59 160 -142 131 -161 -256
5797b56K25Qn6J78j04j14L4L9k34J46J5R4m0l6K62j2N8l15K88l21J6Q9l1J76j90
5822h1j67R3K15k9j62J83n1o0R6J47j32J2j98J29J20j41j30J28J21m50M03Q0j91
5845f5K04k12J16j01J46m2L0o0l0Ml26O25n79J90l3L46m86K89q1K16l47j9K78
5868F3j1p2J2j83J52K20j5k87J83j98K48n4j95j38M17j30j03P7O4j64o1J16P5
5891A6p3l6l5K57L0p0P9o0k71J48J54j27o8j20L53k36j00m3J23K50j61J44r9j08
5915e3j58J85j09K14M0Lm0l68L74k19K93j42N2K4L2m2k54L09q6J30l51R4r2j97
5939c61L41L8n8J94l8q7l7M5o3p6j9qJ16J11k40O5J72j41n1Q3K87j94k20P5J20
5964E4O0k30R7nj96J95p3N75n73J78rj06j39J04M8J19J0k03k68M97j00J59q9q1
$$ plain form
5797 -256 -31 -23 -79 99 -5 -119 -85 -46 -280 -134 -119 -25 -65 -101 161 149 207 -108 180 -141 -125 -36 -67 109 -81
5822 -81 -248 -155 60 31 -131 52 1 -59 37 184 52 64 -134 -5 115 -26 -156 -28 93 -357 46 126 -65
5845 -65 139 -73 43 -58 88 46 76 16 -14 -10 -336 289 -290 -100 -133 213 -273 16 -65 151 -196 -215 63
5868 63 52 -20 -8 -191 -39 181 166 -121 62 -136 112 58 -137 -275 142 12 -91 -14 50 -114 -175 -59 16
5891 16 -57 -93 -128 129 159 89 168 108 -163 -15 139 12 -56 -176 177 -59 -159 -202 -79 171 10 154 55 -53
5915 -53 -211 -26 -135 79 119 122 82 -286 88 -131 162 20 72 96 128 86 -168 141 55 185 -166 -72 -164 -361
5939 -361 -20 18 -40 154 116 29 -8 37 -26 -102 -121 -129 -13 98 -142 -77 95 -46 -97 -14 273 79 -141 -66 54
5964 54 114 -116 -19 -24 -220 -25 -98 477 -96 82 73 -33 -172 -68 -20 99 109 -94 -362 135 35 194 105 24
5988B4j16r4R9J7K13L1M3j41L5K1j34J08m7j29J10p9j79K52K18l40J79R3j69K77
6012B92l31J14J39l60m4J55P1M9n0j68L18k45o2L5J38j19J67K04l11mO3K07n53
6035b95N26k19J91j6k30K03n7k48L29j21j24l2J58M8k48M5Q1m6M2m0r6K28j05
6058b6r3K21p6M6Q7o8K1l6j18k05L81m9N6k50J51p3q6r3K4J11M1K40j94j44K43
6083A11k65L93q9k89N60m76j47K59P0J38l12j53J13K56m18K33J40k91L28k37O7
6104iK40n22M08J22O7l14J83l92J24K0k0M1J73j98J79j62JR3j09K79j7r2j92q
6128a05RJ23R4R3l83J94K14l65%J21O0j09K40q2ml5J63j07l37L31j70k0J58n3
6152C0k23M17k26l20M0J90K88j80J28q0j05K8J17j16L2k34k1M07j96J57J2k09
$$ plain form
5988 24 -92 -186 -87 -70 143 174 217 76 111 132 -2 106 59 -70 40 -39 -218 34 252 -88 91 184 15 292
6012 292 -39 75 214 -146 -190 -35 36 85 35 -133 185 -60 -122 -87 51 -68 99 303 -8 -12 51 258 -295
6035 -295 231 12 203 187 -43 160 103 -145 184 63 -61 -93 65 113 -135 -90 -9 -55 -13 -53 -149 79 -26
6058 -26 -119 102 26 72 159 91 112 76 -42 -247 134 85 141 -109 42 -31 -117 -210 -186 -75 -34 206 12 -132 111
6083 111 -154 239 150 -139 421 -55 -202 57 127 265 -47 -200 -87 169 -249 -16 124 -167 161 -76 -9
6104 -9 231 -291 117 239 306 -8 175 -217 -93 -73 -93 -52 121 -77 102 -60 -59 34 -75 204 187 95 -97 -105
6128 -105 -96 27 121 214 -169 25 239 -126 -126 -5 55 -54 186 104 100 65 228 121 -216 115 -55 -75 83 30
6152 30 -193 224 -2 -322 -282 -92 196 16 144 64 -41 -13 104 -12 20 -214 -235 172 -24 133 145 -64
6174f4L2j3P6J05K28m51K81l43Q4N1R1r4j39L19k56qJ26k12J98K4l0n7J32pk8
6199D5j44J40j43K20J38Mp8l85K25o1j02J78j10j9NK08j29L05k26k52K7J36o6
6222h4L50j04k66R2R5P6k18L63r5l21j07K88j38J22k23K67k76K82r7J79k09RJ15
6245A00k77J00J53k17K32J0j41L9L54m49O4NK02o4N2Mj32J17k30qk5K96m16N9
6269a72K38N8j89K10Kk60K29k24q9K13j77L77j69Q7j48J56Mj46J87k14J19n06
6291d14L96J99j46K83k21j22J54l00L48m6M4p9L7j00j39j47L42j36J36j40K20
6312A69q1k22J45k10N92m03k60L79l9k56K20j33J74k24K04k16J60j90L50j25k56
6333b22J72L95m14j33L43l05M26j97M7l29K37L0p2O8k09J66K66k20j1k8P7o4P8
$$ plain form
6174 -64 -32 -45 31 136 364 -87 194 -149 -65 -14 77 -17 -156 163 -93 -101 25 -187 11 35 5 -52 80 73 45
6199 45 -99 41 -102 118 256 260 182 -203 22 -39 -141 37 -73 -92 -87 121 -8 297 71 -181 -154 -18 -84
6222 -84 266 162 -104 -12 83 159 -59 304 209 -112 -219 69 -69 53 -170 97 -179 103 6 185 -24 -15 100
6245 100 -177 -77 76 -141 91 101 -40 -1 353 -96 -32 -27 175 111 163 167 35 152 -78 -86 -111 185 -231 -172
6269 -172 66 124 -65 145 147 -113 116 -108 -197 16 -161 216 47 134 -14 142 146 0 187 -27 92 -414
6291 -414 -18 181 35 318 97 -25 129 -171 177 131 175 96 133 33 -106 -253 89 -47 89 -51 169
6312 169 88 -134 11 -199 393 -10 -270 109 70 -186 34 -99 75 -149 55 -161 -1 -191 159 34 -222
6333 -222 -50 345 -69 -202 141 -164 262 65 112 -217 20 50 -22 46 -163 3 269 49 38 10 87 23 101
6356A01M6l19J64k6l4m8K11j50Q7j25J37j59L35j87R2l73K63K5m4n8P3J4J70r9
6380I6K38m31J03RO3n0r6J67m2l29N07N8o64M43m7m7o9J71j88j33O8K72o0K73
6404C12n05J82k08J05J07q2O5K29j68k6p8K39j22K5m9O3jr4J34k14J72J73l5m00
6428a76L20k84K7M7J06j52J45j82R7k3j56J77k5O9J50n4n2q2j2N7q4L7K55j09
6452I6j62NM2J06k4L2j4k28P9j24J69k16J53PL04P2n08N45l23k4j1K4o9K3j78
6477b24N8K23oN0j28j66J60K14k0j09J39j07k1o3P5K17j57k73L67k64J36k48l1
6500a78K65l0j28K36j17R6k11K37k17K65m89K27L8K74m07L38m8k01K56k26L59
6521C39l44m1j43J20O2J50j84J39J2j4nl33K78Kr6j25O2m0j10K82J5k9J1m5l6
$$ plain form
6356 101 147 -172 -8 -34 -68 -116 95 -55 32 -93 44 -115 220 33 125 -248 15 40 -4 -62 11 25 195 96
6380 96 334 -97 6 15 78 28 -68 99 57 -272 235 293 -371 72 25 -22 -91 80 -108 -241 -173 99 39 312
6404 312 -193 -11 -219 -114 -7 -89 -24 205 37 11 -67 172 50 75 26 89 88 -6 128 -86 86 259 224 -176
6428 -176 144 -140 -113 -66 40 -112 33 -149 -52 -75 -231 -54 -79 -10 140 86 34 -48 -60 -3 -87 -50 205 96
6452 96 -66 -61 -19 87 63 95 81 -147 -68 -192 -23 -239 -86 -79 225 297 -211 334 11 -13 -24 0 -69 -46 -224
6477 -224 -166 57 51 101 -27 -193 -33 181 161 52 191 84 63 0 75 292 135 -138 229 -35 101 -147 -178
6500 -178 87 57 -71 165 48 144 -67 170 -47 218 -271 -44 -6 268 -139 199 151 -50 206 -20 339
6521 339 -5 -46 -189 -69 -7 143 -41 98 110 96 91 -242 36 38 -58 -183 -121 -161 -271 11 26 -3 8 -37 -73
6546g3J61k5K6L0n6J16j70L7M9m15K56J17k54N54l60j38J57K06j14jk53L65n36
6569c21M24L0o9J88k95M1j32J92m97L03J73K3j93K40J55l71k1K82q2k49K83l9
6591F5j67J81K2mm8o3J55P6k10r1M7K06j21m9J47k83P1J09Pj4j31J34o9J03k83
6616b10j55J54J77n1Q6j07J0J42J14Q6l86R4K12k31Q8o7j62L66j15j3o9J55j90
6639g2R4j07m1L42m27j6K94J14n9k2p9o6K6p1J94k65J52Q9k70l2L01J11j60K2
6663E2M8p7k95L86k4j02N2O7Q1l24j31K11o1K97j37J34j25o7l61oL78l36K51J18
6687B9K34l47J36p8J63k87O3J44M6j11l8J33l4k9m9J83k18j09J57M06n67K09o6
6710c0l2J45k67J83J90j99J79k79m7r0L24o6P7j38P0l57L71R7q2j32J51k0L3j84
$$ plain form
6546 -73 88 63 89 119 63 179 9 46 95 -320 -64 53 -201 353 -7 -145 12 218 104 103 -150 215 -321
6569 -321 103 133 64 252 -43 -2 -134 58 -439 -136 37 60 -133 107 262 -109 -130 152 70 -179 104 65
6591 65 -102 79 101 97 49 -14 141 217 7 -84 -37 169 48 -1 146 -137 -66 43 50 36 -95 39 -30 73 -210
6616 -210 -365 -211 -34 -85 1 -106 -96 46 160 246 -140 -46 166 -65 23 -44 -206 160 45 32 -37 118 -72
6639 -72 22 -85 -126 216 -211 -227 67 181 122 100 21 -45 -19 -90 104 -161 -9 80 -190 -222 79 190 30 52
6663 52 100 23 -272 114 90 -12 40 107 188 -136 -267 -56 -117 180 43 177 52 -15 -376 -382 -4 -340 -89 29
6687 29 263 -84 52 -26 137 -150 -87 57 103 -8 -46 87 53 24 -25 158 -60 -169 -12 394 -173 36 -30
6710 -30 -62 83 -184 -1 189 -10 169 -110 -157 -247 77 11 88 -50 20 -337 34 131 49 -83 68 48 81 -103
6734a03m7M47k33j61K5Q1j41Q1k7m2R8J69j89J2j08jj19J56J56J63q8k62L0K68
6758A65k26N9K8j39J17k1J84o9M4r1j81p3K09J35k23k7M37k69j59J07j05J21R1
6781A14j69R5j6J95J09j32j53k18J45M6K79l89O2lR3Q3j86k38M65j07R1k23J28
6804G1r8j83JK12q2J38N1l54J73p8J21j67K50K34k06p4K94j71j59l1K39j14k29
6827a62J2L02k57K74l27K67Qm4k50K25L38m73J30j23J61K40J8l85K6K0J02L4m8
6850H8m9K35j01r7j6j30q9K99J26m71N42k41k50L16l1l56K25q9K27L4j18j07M8
6873en3P6k61N2%J60j14K21k9J18l15L00k73L1M21k77L30n95J7m8L41j79P5K11
6897B04k93L9J39j54J18N9k66J75l4R2J79n03K56K61k21k81L78m9j14O1j42p0
$$ plain form
6734 -103 -150 297 64 -97 -72 9 -132 -51 -78 -120 -22 147 -42 -30 -138 -139 -258 -102 54 217 129 -133 -103 165
6758 165 -61 -2 26 -113 4 -17 167 98 142 51 -130 -203 6 141 -82 -109 328 59 -100 7 -98 23 114
6781 114 -55 40 24 219 328 196 43 -175 -30 16 295 -94 -32 -35 58 141 -45 -283 182 75 166 -57 71
6804 71 -27 -210 -209 3 -79 59 110 -244 -71 -149 -28 -195 55 289 83 9 303 132 -27 -58 181 67 -162
6827 -162 -150 152 -105 169 -158 109 117 73 -177 48 386 -87 43 -80 81 321 339 -46 -20 0 102 136 88
6850 88 39 274 173 76 60 -70 -159 140 266 -205 337 96 -154 162 131 -225 0 -89 138 172 54 -53 -5
6873 -5 -58 18 -243 -191 -191 -31 -145 76 47 165 -150 150 -123 -92 329 52 382 -213 -196 -244 97 -82 -7 204
6897 204 -89 -50 89 -65 53 112 -154 21 -13 79 258 -245 11 272 51 -230 148 99 -15 46 -96 -166
6919a66N0J0L96l20O9l3r9j0J3Q4k66J78l4J44j38J83O2j4j70J5J9j2o8K16j17
6944hJ63j69j45L07O7n74L15K04J16n10P5M95l98J67p1J50j30j39j13J50Q5Jj4
6967B4k40O2J29j17M37j77Kk04K31j24k0j67J47J18l4k07L23j85n05M47R3j8j02
6990h7O5q8K43o3q5J89O7j6N5m19J45O3M4l12rL69l3p4j44L42l17j10l1L87j44
7015C7k8J4l31M4M22k70k9J68j87J50M0J30k74Q8j15J3J25r4K8K33P5l92J90p8
7039d1J71l8l8l8M1J0k4l2o9J86P4j35q1l25K41L0j11K16K53m11J61J83j30rm4
7064D0L6l4j71K23M5j32L7M6k62J76k4j7L4k3L3J27L0j9k52K35j34m2J44qp8j
7090Ij66L31j20o9Q6o7P3k16j9J54J66l54L00J01l06K14m0m1k78K85P1R8n7l97
$$ plain form
6919 -166 -116 -106 290 -30 39 6 -93 -103 -90 -6 -272 -94 -128 16 -122 61 123 109 -61 -46 -27 -39 -107 109 -8
6944 -8 155 -14 -159 148 215 -359 -44 160 276 -234 -159 336 -62 105 34 184 54 -85 -198 -48 37 38 24
6967 24 -216 -154 -25 -142 295 118 120 -84 147 23 3 -164 -17 101 67 -140 183 -2 -507 -60 33 15 -87
6990 -87 -22 -110 133 70 -15 174 241 225 280 -139 6 69 113 -199 -208 161 128 54 -90 252 -65 -175 -206 181 37
7015 37 9 23 -308 -264 158 -112 -141 27 -160 -10 30 160 -114 -26 -141 -128 -3 -97 -69 164 239 -153 37 -41
7039 -41 130 92 54 16 57 67 43 11 -58 128 202 67 -14 -339 -98 -68 -179 37 290 -121 40 223 93 84 40
7064 40 76 42 -129 94 139 7 44 90 -172 4 -20 -37 -3 -26 7 134 164 145 -107 128 -6 -48 96 88 10 9
7090 9 -157 174 54 -15 71 4 77 -139 -158 -4 162 -192 108 209 -97 117 77 36 -242 43 114 212 155 -242
7114b42J21L22l12J58J66j63k75K69R8o8J89m70J8K06J86j49j81K00j26k50L79
7135G6J17j36L0Pj04j5r8k07J80M04K4l33J36J52j80r2J36j0j81Q5MO1j60P5J54
7160A25j72O3L14k55l0O7j23J26o3l90K96j58L42j55pJ20j38j34J70K2j45J83
7182E8l01q6L92p0M3KN6j8r5n0Q9j72K24j39jj16J91N7o8J06m01M08j20l27L30
7207hQ1r7m5P1p9jj41J60J9J37K68j61k23J7K1j67J99rk82N42l01k08Q2R6J42
7232A13p2K08l87q6J15L08k71k4k07J82J4j12J84n2J16j22nJ22J31j93O4Q5J55
7255B66l79K96n8L20m39P9p6K28m19K36j4o9J17j9j93j13J01k38L67k69J74J78
7277G6j00J50k28J42m9J11j13M55k30j23l20J11J39j3L1K3j22J05n0M1p7J26o3
$$ plain form
7114 -242 -121 201 -111 47 213 50 -225 44 142 74 263 -207 -189 17 203 54 -127 73 -53 -303 76
7135 76 193 57 87 94 -10 -25 -123 -330 -150 254 278 -55 81 233 53 -39 97 87 -94 -9 -5 56 -104 -29 125
7160 125 -47 16 330 75 45 112 -11 115 52 -338 -42 -200 142 -13 -20 100 -38 -172 -2 20 -125 58
7182 58 -243 -329 63 -7 36 38 94 76 -19 -69 20 -152 72 -67 -68 -184 7 64 -4 102 -299 109 -11 -338 -8
7207 -8 73 -24 -69 2 -77 -78 -219 -59 -40 97 365 204 -19 -2 19 -148 51 42 -240 302 1 -207 -125 -29 113
7232 113 41 249 -138 -224 -109 199 -72 -96 -303 -121 -107 -219 -35 -87 29 -93 -98 24 155 -38 26 111 266
7255 266 -113 183 125 445 6 85 9 237 -182 54 40 -29 88 69 -124 -237 -136 -374 -7 -276 -102 76
7277 76 -24 126 -102 40 -9 102 -11 444 214 91 -229 -118 21 8 39 62 -60 45 -5 36 -41 85 22
7300B2j53K17J85k41j25K11k33K54k19J66J23k39n1N4l1L3R3J09j44J23k62J69
7322F1k27J48K5P2j62K74j17J57l59O3O8P8LJ1J9k18J33j34R2K38k90k30N59m25
7346a61Q3N4J3k74M24n6k4J6j06K60J7n42M75j50k7o4j08K43j88K67k33J99n78
7369d60L92L35l11N5K86k84J47j71J07J50Jl06L6L15k97J85J13k45Q1k6k02J26
7391B7q6j32P2j31J80K07j33J15r2k94N90m74J11J76K3j12n4j34J4P4J97k03L24
7414B65l91K02j17J53l52M11K26k76l85K19o1J2M8P8j2o6o4K7J0n0J00m7P5m2
7438c7j18J88L3o1J80k67J15N9l1k90J42q3K20j51j56L56j24O6j37K74l47J79
7460A0k12K4K64K56m45L3K64k45O0J46m8L3K8n6%k99P1J70n3J57k42K00l76J64
$$ plain form
7300 22 -131 86 271 30 -95 116 -117 137 -82 84 207 -32 -83 -29 -60 -27 66 175 31 154 -108 61
7322 61 -166 -18 7 79 -83 191 74 231 -128 -65 3 81 84 95 114 -104 29 -105 -13 225 -65 -295 264 -161
7346 -161 -78 -24 -11 -285 139 83 59 75 -31 229 246 -296 179 29 2 -62 -170 73 -115 152 -81 118 -460
7369 -460 -68 267 -44 11 297 13 160 -11 96 246 247 -59 -23 292 -5 180 293 48 129 103 -99 27
7391 27 -59 -191 -119 -250 -70 137 4 119 27 -267 323 -151 -40 136 159 47 -7 -141 -127 -53 144 -59 265
7414 265 -126 76 -41 112 -240 171 397 121 -264 -45 -106 -94 -46 32 20 -46 -110 -83 -73 -123 -23 -70 5 -37
7438 -37 -155 33 66 5 185 -82 33 92 61 -229 -87 -170 50 -101 -257 99 -25 41 -96 178 -169 10
7460 10 -202 -178 86 342 -103 -70 194 -51 9 155 107 140 168 112 112 -187 -116 54 1 158 -84 116 -260 -96
7484i6J24j63J31P9j48K73k85J21lK6K8j44R5p5j11K08J8R0j4l34M1K70M7k99
7508a21J13P1j87J41n0J91l68J12J09pN7K48j86j95qk6O8p3K07Q3k13j49Q6K16
7532A19m32L95J51k15L42l39P2j93K2L8l3K93J09m88J33J50J53l21J56j86n2M
7554a22Q1J41j94J7J43o8q4L4K17j56J3Mk87J59M4j37L33o3l39L49r5%L3P3k80
7579a84K29k94K30j66k6N3J27J12l76L11l8J81j9j88R6j07J34r4Kj49p0K90k7
7602B7J55N6k50l4L3N9J94n5j36kj03m5J06J0l7R3P4k68J74R5j83j9J6P1P6k5
7628H2j21K2O4n7J83m9J21r8k38J85k54K45k88L34m46L35J6k67J89O5j14J4R1
7651A4M5K14j99rM4rj14J49qk53J83N9j58J37j62J32qL6j58k6J71j15j76O9J12
$$ plain form
7484 -96 28 -135 -4 75 -73 200 -85 36 33 59 87 -57 38 -37 -148 60 78 168 154 -180 -139 131 178 -121
7508 -121 -8 63 -124 17 -33 158 -210 -98 11 4 61 309 123 -72 -80 -106 -38 -111 96 179 -34 -183 -97 119
7532 119 -313 82 233 18 360 21 93 -100 -78 -40 -73 220 329 -159 -26 124 277 -44 112 -74 -126 -122
7554 -122 -41 100 -94 -77 66 -2 -86 -52 165 9 22 26 -261 -102 -58 -195 138 75 -264 85 -10 -10 23 96 -184
7579 -184 45 -249 -19 -185 -211 -158 -31 81 -295 16 -22 159 140 -48 48 -59 75 -19 -17 -166 -236 54 27
7602 27 182 238 -12 -46 -13 46 240 185 49 47 -56 -101 5 15 -22 71 145 -123 51 146 -37 -56 -40 31 107 82
7628 82 -39 -17 47 -10 173 124 245 147 -91 94 -160 85 -203 131 -315 20 36 -231 -42 23 -91 -77 14
7651 14 59 273 74 65 109 100 -14 135 127 -126 57 116 -42 95 -67 65 57 93 -65 -91 80 -35 -211 -142 -30
7676c0J95j88J22J8j60j48n0L25L7Ll3Ln8j16qJ70Q6j58N8O0k78J08K7J52j97
7701f0O2k3j45J58r9j45L42J30l72P1J25P9l5l69L31j03K27l04J24N5r3j21J57
7724hK41r7Lj67j17J99l1j57m3K87n6k28K40K20k88n9K9p8K90l77L02kp0j67J2
7749a22L14P9k51mK78k36p7P9j9j87K51k03J21k3J96k62J04k08J82L7O0j62K70
7772B17m7l77J04J71j02J2P2j75L19m30J35p2P0Q4J33L6j35j56J05m3J19j37O4
7795c3n5k59L26K13m49K44N2M7k85M7K81Ml02K20k52J66K43k60K17j26O2k28M49
7818C22l78K5j7p0J94l42K97o1km68M66M8M8l10K3J73K07P2n9k55K63K0n60L56
7842hq7j55K95l11L01p0J06q0K02J17l29J99j22j85K09o4p1j44J72J2N1K89k42
$$ plain form
7676 -30 165 -23 99 117 -43 -191 -241 84 121 124 91 94 36 -80 -88 82 168 10 68 128 -150 -42 -15 137 -60
7701 -60 2 -21 -166 -8 -107 -252 90 220 -152 -81 44 123 88 -281 50 -53 174 -130 -6 49 -44 -165 -8
7724 -8 233 136 139 -28 -145 54 23 -134 -177 110 54 -174 66 286 -2 -61 -32 -110 180 -197 105 103 33 -134 -122
7749 -122 192 271 20 16 294 58 -19 60 41 -146 105 -98 23 0 196 -66 38 -170 12 49 109 -53 217
7772 217 170 -207 -103 68 -34 -22 50 -125 194 -236 -101 -173 -103 -19 114 150 15 -141 -36 -79 40 -97 -33
7795 -33 -88 -347 -21 192 -257 -13 39 86 -199 -152 129 133 -169 51 -201 -35 208 -52 165 39 101 -127 322
7818 322 -56 -31 -48 -118 76 -266 31 -30 -32 -500 -34 14 62 -248 -225 -52 155 227 168 -87 176 196 -364 -8
7842 -8 -95 -250 45 -266 35 -35 71 -9 193 310 -19 180 58 -127 82 18 -53 -197 -25 -13 38 327 85
7865H5o5j56K91j47M29m43P4j22L4r9QK51k05m1M1M10m87j11K42M3o5J31j48m2
7889i2r1K92O0j97J18l92M44j30j95M1o9L69k65J88L0O4k93L00k90n1K07J05k96
7912a43K16n6n7p8J41K26j62M6j27J22j64j43K06N4J04k5l96M01j04k9J90j02
7934A20k39J5P6l2l2j33M21N0j48k3J39l21J91j31K6q9J4M1j1q1J94q5J37M6m3
7959A02j02J36k8j28j13J02J6o2K62l1L8j94Q0j13J24j23J53l3m4r0j95J44J05
7982FN4q9J94j68k43J74L4K33l64J29oJ3K23j9J32q0l05J86l05K96L2j95K05p7
8006F0M2m4k31K07p8R6J21l53K81j29J13k30K26pl29L82j99j24P0P3k5K47j74
8029ej44K22l44L96j33J08p2K58m77j81L77Q0q8J00k63R5J13k5p0Ml17J70R0M
$$ plain form
7865 85 20 -136 155 8 437 -6 68 -54 -20 -119 -111 140 -65 -106 -65 345 -142 -253 -11 32 -33 98 -50 -92
7889 -92 -183 109 169 -28 90 -302 142 12 -183 -142 -211 158 -107 81 111 175 -118 182 -108 -159 48 153 -143
7912 -143 73 17 -40 -118 23 249 87 133 6 128 -36 -179 27 81 185 160 -236 165 61 32 222 120
7934 120 -119 -104 -28 -60 -92 -225 196 246 98 75 214 -107 84 -47 -21 -110 -96 -55 -66 -147 47 -38 99 145 102
7959 102 0 136 108 -20 -133 -31 -15 -77 185 154 192 -2 78 -35 89 -34 119 86 42 -48 -243 -99 6
7982 6 60 -29 165 -3 -246 -72 -38 195 -169 -40 -46 -33 190 171 303 223 -82 104 -201 95 127 -68 137 60
8006 60 102 58 -173 34 -44 52 173 -180 101 -28 85 -145 81 74 -255 127 -72 -196 -126 -53 -78 169 -5
8029 -5 -149 73 -271 125 -8 100 28 286 -191 -372 5 85 -3 97 -166 -71 42 17 -53 -49 -366 -196 -106 -102
8053a02K15l46J21J85J4K16n02j02J60k04O16j04j88q3J39L4j05J1J31P8j40m
8075D0K6j03J73KL0j22o1M1J13k01P5j15O4K46j72j44J0L12p6o5J51m39J94K1
8099@j54K30l34L45ok0k34K39Rj1m03K29r5J47k15K26P9P0M5J29j3j11l85K78
8123D5Q8k88L1P6o0rN3l6o4K20R1j04k05N1L39l62J3L0L5L01K4j37k00J05J3K08
8149B58k56kJ30k52M8J13j94L37k38Kp5j89O07k35K2O4j43o1J09q5K69r6k26K29
8173A36k9j0n20N30M56l77l30K80k6o1q3r9K74o4k52J63j24J99
$$ plain form
8053 -102 113 -233 -112 73 87 303 -199 -301 -141 -345 271 167 -21 -104 35 69 -36 -25 106 184 44 40
8075 40 66 -37 136 138 168 46 -15 26 139 -62 13 -102 -38 208 36 -108 -98 214 138 73 224 -215 -21 0
8099 0 -154 76 -258 87 81 61 -173 66 75 64 -339 -110 -205 -58 -273 -47 32 102 147 276 263 152 -233 45
8123 45 133 -155 -124 -48 -108 -117 -64 -100 -164 56 147 43 -162 -111 228 -134 -121 -91 -56 245 269 132 -68 37 50 258
8149 258 2 0 130 -122 -74 39 -155 182 -56 -54 -129 -318 289 54 76 140 -3 -64 45 -40 229 133 -93 136
8173 136 107 97 -423 107 563 186 -144 136 110 49 -34 -133 141 77 -175 -12 -136 63
8191F3
$$ Imaginary data points
##PAGE= N=2
##DATA TABLE= (X++(I..I)), XYDATA
0@%%%%%%%Mj2J6j6J6j7K5l2M0m8N6p1P9q8J04j22J46j68J92k21K50k84L21l61
31a91M05m55N10n69O34p05P84q69R64j070J184j309J450j607J781j979K204k460
49a298K756l108L529m040M682n516O646q276J0849j5541K6841j04908j27988J72744
63d2628J21457k9910j10094J2490Q6157M1181n3380l4109L1238M9367j7679o0847
75f757l2617L6186M6248L955l0903j3847J967j560j911J9444J1963k3364k9010
88b0206J1719J7846l1734n0043J1461N8195J6830l8418j2446M1939L1831j8025
100A8949j9774J7871J9485k3919m4918j2041L0105L2165N019p670L815L649k5513
113b777l2476J7426O0706J2739p2694o5423L2266P3535O073m8614j1611L1872
$$ plain form
0 0 0 0 0 0 0 0 0 4 -8 8 -8 8 -9 16 -16 24 -24 32 -39 40 -48 56 -66 80 -88 104 -117 133 -151 170 -191
31 -191 214 -241 269 -300 334 -371 413 -456 508 -562 622 -687 763 -844 937 -1042 1162 -1298
49 -1298 1458 -1650 1879 -2161 2521 -2995 3651 -4625 6224 -9317 17524 -87384 -215372 -42628
63 -42628 78829 48919 -61175 -48685 37472 78653 25273 -8836 22402 71769 54090 -6757
75 -6757 -39374 -3188 43060 47015 16112 2265 4232 2672 761 20205 32168 8804 -20206
88 -20206 -8487 9359 -22375 -72418 -60957 -2762 14068 -24350 -36796 5143 36974 18949
100 18949 -825 17046 36531 12612 -32306 -44347 -14242 17923 22942 15272 19087 22736 -2777
113 -2777 -35253 -17827 42879 55618 -17076 -82499 -50233 23302 29375 -19239 -30850 1022
125A022j706l8243N715O4652L6493l8005n0424K908L1224J557k6551p061K6214
138G795J9534j8301k8010J2302M0511O230m2803k9915J9473K0095k0853j9113
150c3055K8571L1246k0155l0334K0009L2263k6851m9726J9323P3460J9990o2566
162B175m9755L3733O0681J263n2239k6703K9076K6624k8762m3117K2046P2313
174D7335J8887p2995p0097K3097P0737K0354l6639k6013N934R001L769J1803L963
187I136j8515j3697J7690J9184j6018j8355K7898M8148j751n6782m0655K1551
199b2166M4743K239m1321k1745L3184M3832q018m2369m897L6992R655l8949k1461
212c0281L0089J9193l4628k6516L7774M7171k0195n3692k171M5311J7623k4397
$$ plain form
125 1022 -684 -38927 -33212 31440 67933 29928 -20496 -17588 13636 15193 -11358 -18419 7795
138 7795 27329 9028 -18982 -6680 33831 40061 -2742 -32657 -13184 6911 -13942 -33055
150 -33055 -4484 26762 6607 -23727 -3718 28545 1694 -48032 -28709 44751 64741 2175
162 2175 -47580 -13847 46834 48097 -4142 -30845 -1769 24855 -3907 -47024 -24978 47335
174 47335 66222 -6773 -76870 -53773 16964 37318 679 -25334 -19400 -10399 -6630 5173 9136
187 9136 -9379 -23076 -5386 13798 -2220 -20575 7323 55471 53720 -3062 -43717 -22166
199 -22166 22577 24816 -16505 -38250 -5066 38766 30748 -11621 -16518 20474 30129 -8820 -30281
212 -30281 -192 19001 -15627 -42143 -4369 42802 22607 -31085 -33256 12055 29678 5281
224E281r235K5892J0696l8245m3822J1423N3297K1354m2115m7151J8613O0283
236B6271K1497l1951j9312J8581Q40m1423k4818L3135L7175j4324k9226R856K9370
249A5671J997j5117N932J6609j0375k8784p036K0135J3595j0720j7756k17J3533
262b533M727q696j067J9957J6041j4130j9585J2438K2043k3233n2134m017N3504
275C315L0471l3663l3419K4758M2783P10k5614m572R367j2699k8676p110K1213
288a3136K1587P32j1309o925J611M117O927J3805R600j5465l5873j0313L8401
301C759L3749k7446n1359M767N0029R650m3035r857N4810L8401l8188n5974N700
314b4994M5407P347m0572k8678J8761L5283Q119j6501o683J3746Q151j4305j3927
$$ plain form
224 5281 -3954 21938 32634 -5611 -49433 -38010 15287 36641 -5474 -52625 -34012 26271
236 26271 47768 15817 -3495 15086 15926 -25497 -50315 -17180 19995 5671 -23555 -13699 15671
249 15671 17668 2551 8483 25092 14717 -14067 -21103 -968 12627 1907 -15849 -16066 -2533
262 -2533 2194 -6502 -7569 12388 28429 14299 -5286 7152 29195 5962 -46172 -50189 3315
275 3315 33786 123 -33296 -8538 34245 34955 9341 4769 14136 1437 -27239 -34349 -13136
288 -13136 8451 9183 -2126 -9051 -7440 -3323 3604 17409 27009 11544 -24329 -34642 3759
301 3759 37508 10062 -41297 -36530 13499 23149 -19886 -29743 25067 63468 25280 -30694 -24994
314 -24994 20413 27760 -12812 -41490 -22729 12554 20673 4172 -2511 11235 19386 5081 -8846
327h846Q617Q011k0610k1684J9332L7338l667l8241j0160K9513J4852k0328q429
340a4302K6052J7121k3616k7243Q939K7527O936j7499j6985j592R285J2009J1361
353A7993N625m141j5647j6504n48J5176M815j5338r562J4524J1247j6239j2794
366b1393K4434K6546k3377m5505L598M9454J9226l2141k2491K4536K7688j4245
378A6330l0184O29K4007M897k1387j1690K1846K7042r725l7720j1576L0525K3197
391B6191k2908l2274O821K6680j182j8890O893K1571r130l0487l41L3235J7498
404B3677j4868r414J4315O516j8114j4754J4041K1811o430l1304j4832K6402L7743
417C4789K378l2741j9713J5851J3239k0715k3617J0720K2945p636k3175L461K5419
$$ plain form
327 -8846 -229 7782 -12828 -34512 -15180 22158 18491 -19750 -29910 -397 14455 -5873 -14302
340 -14302 11750 28871 5255 -21988 -13049 14478 21414 3915 -13070 -14662 -5377 6632 17993
353 17993 23618 19477 3830 -12674 -13222 1954 6769 -8569 -18131 -3607 7640 -8599 -21393
366 -21393 3041 29587 6210 -39295 -35697 13757 32983 842 -21649 2887 30575 16330
378 16330 -13854 -13225 10782 15679 -5708 -17398 4448 31490 21765 -15955 -27531 2994 26191
391 26191 3283 -28991 -22170 4510 3328 -15562 -8669 12902 3772 -26715 -27056 6179 23677
404 23677 8809 -605 13710 20226 2112 -12642 1399 23210 16780 -14524 -29356 -2954 34789
417 34789 37167 4426 -15287 564 13803 -6912 -30529 -19809 3136 -4500 -27675 -24214 1205
430A205Q083j2905l575Q133j420o320J0465J6617p367k4959n546K2783J7295j3088
444I401k3769J104K8782K1883j0824k4027k326J4540o427l0853j1031K6301J8351
457A1105k1401k3050J9558L4255J457k0637l138R613j0486j9622Q007K8246M957
470A8864k6545j7219J6537K6642K483j7197o445J4309J0754j4142j9136P908K1840
483A8653q729l8995j4793L1113K7659j4714k1398J4625K6973l586k1912r91J3311
496G216o471k2786l465K1641J5819n788j0442M971J4206O576p012q630K5J352
510G212p879q933Q930J5762o096k5971p451K1382J5164j1520q140J3595Q397j7789
524c337j4648J4913J7804j2483k7148k847K0692J4401n20L22N816O04r174o956
$$ plain form
430 1205 9288 -3617 -7192 941 -479 -6799 3666 20283 12916 -12043 -17589 5194 22489 9401
444 9401 -14368 -13264 15518 37401 26577 2550 224 14764 8337 -22516 -33547 -7246 11105
457 11105 -10296 -33346 -13788 20467 21924 1287 -1851 7762 -2724 -22346 -14339 13907 18864
470 18864 -7681 -24900 -8363 18279 20762 3565 -2880 11429 22183 8041 -11095 -3187 18653
483 18653 9924 -29071 -43864 -12751 14908 194 -21204 -6579 20394 16808 -5104 -6095 7216
496 7216 745 -22041 -25506 -3865 11954 6166 -4276 695 14901 21477 14465 5835 5860 7212
510 7212 -667 -9600 -670 15092 8996 -16975 -24426 -3044 12120 600 -7540 6055 14452 -3337
524 -3337 -17985 -3072 14732 2249 -24899 -27746 -7054 7347 6827 7149 12965 13569 4395 -2561
538b561M898R037m342j8095q065J7758J9184q552k0438M583K1394m345k8348l490
552b1382L2049J4121l0770k6466J9673L2806n797l2767r829K1306J7961m726r882
565c703M461J0859j350j3988o345J2749J1190j0227j7095M458J9819N147j2145
578C830j853R313o377k1296n47K6211J2593k0492j7917J1153J8674l519j3923
591d150j847O224k929q431K301J4545R456n837j3270l360R489N983q547r430N074
606d729P287p027r024J1721J6894j0495k5849K87K6705J0875j8150j1642J3126
619b1J1293j1256j1984Q014J1324p174j4912K124K1179J5215o057j5337l337R648
633H719K138j3424q160R725P825j3687j2568J7043K6539m656k7751o435J9653
$$ plain form
538 -2561 2337 11374 7032 -11063 -19128 -1370 17814 9262 -11176 -6593 14801 10456 -17892 -21382
552 -21382 10667 24788 -5982 -32448 -12775 20031 14234 -18533 -28362 -7056 10905 6179 -3703
565 -3703 758 11617 10267 -3721 -10066 2683 13873 3646 -13449 -8991 10828 15975 3830
578 3830 1977 11290 4913 -16383 -16930 9281 21874 1382 -16535 -5382 13292 9773 -4150
591 -4150 -5997 227 -2702 -11133 -8832 5713 15169 9332 -3938 -7298 2191 8174 -373 -9803 -4729
606 -4729 2558 -4469 -13493 -1772 15122 4627 -21222 -20935 5770 16645 -1505 -13147 -21
619 -21 11272 16 -11968 -3954 7370 196 -14716 -12592 8587 23802 17745 2408 -929 8719
633 8719 10857 -2567 -10727 -1002 6823 -6864 -19432 -2389 24150 19494 -8257 -14692 4961
646D961P579j5851q229J3056O486j5434j2058J1813J8525j481j6352n527J3508
659I96J5516o04j3413n165O532q28j6031q691J4316J4895q859j5074R203K4046
673A6839M028j7180q571N085j200j0252Q00J2893J908j2314l553J3985J2642k881
687A2229r219r33M776L09n745k851N852L700j0489j7525Q20K0918J2108j3589
701C61j3339J1679J7192n730j5476L043R690j0544k0957K715K4449J0058j2841
714C00p800J2262J3031l058j1212j997N920j549j1889p160J0690J5292l749k0714
728a1633o326J8710J3828j1682j4672P700J2477p810j3987N757J4158o101j9509
741a9090j292J8568J2363m329m508M513M112l747m905J069M028l022j0520n601
$$ plain form
646 4961 12540 -3311 -11540 1516 8002 -7432 -19490 -7677 10848 9367 -6985 -12512 996
659 996 16512 15908 2495 -2670 3862 3034 -12997 -21688 -7372 7523 -1336 -16410 -7207 16839
673 16839 20867 3687 -4884 201 -999 -11251 -10451 2442 4350 -7964 -11517 2468 15110 12229
687 12229 3010 2077 6853 7162 1417 -1434 4418 8118 -2371 -19896 -19076 1842 13950 361
701 361 -12978 -1299 15893 10163 -5313 -2270 7420 -3124 -24081 -21366 3083 13141 300
714 300 -7500 4762 17793 14735 3523 1526 7446 5897 -5992 -13152 -2462 12830 9081 -11633
728 -11633 -17959 751 14579 2897 -11775 -4075 8402 592 -13395 -7638 6520 419 -19090
741 -19090 -20382 -1814 10549 6220 1712 6225 10337 6590 1685 2754 6782 3760 -6760 -12361
755a2361R546J5522P92j3808o229Q740M481j0863n163J0714O212j3839j2092J2439
769e909J7279m722j6874j966J1720M483m828J337Q787J199q565n779N064P424
783H650j410j0428o143P298J1052j925q808K38P292m417j5779o4J8807P044j8367
798f960j3060J4306J8665n274j7122k90J0805m40r245K283J4998P557q685j1125
812c587J643J1385M823r281j1316J424Q499q62p231L970J1698l138j8586n174
826a5733J6834J0900j2247j3334O127J0257m309r130L799R012l095q895J875J2474
840D535Q889k304o976k135K818J323m846n267J590L479l607l093R512J2737m448
855A2207j7514l992J2590L787j2775o891P840M372j0199n314J3487J2763n945
$$ plain form
755 -12361 -2815 12707 13499 -309 -6538 2202 6683 -4180 -9343 1371 7583 -6256 -18348 -5909
769 -5909 11370 6648 -10226 -12192 -472 4011 -817 520 9307 10506 1941 -3838 1226 8650
783 8650 7240 -3188 -9331 -2033 9019 7094 -1714 -1476 5816 1399 -14380 -14444 4363 11407 -6960
798 -6960 -20020 -5714 12951 7677 -9445 -9735 1070 630 -8615 -6332 8666 16223 7538 -3587
812 -3587 -1944 9441 14264 4983 -6333 -4909 3590 2728 -4503 -533 11165 8027 -10559 -15733
826 -15733 1101 12001 -246 -13580 -7453 2804 -1505 -10635 -6836 2176 -919 -9814 -7939 4535
840 4535 13424 11120 4144 2009 4827 6150 1304 -3963 -2373 1106 -2501 -5594 3918 16655 12207
855 12207 -5307 -9299 3291 7078 -5697 -12588 -4748 -376 -10575 -15889 -2402 10361 4416
868D416j4093Q01J2886Q307l568o152j058J461l339n922Q55R716N288r316q719
883h437R975J6659j670j6555n341P805j681j4765k852J4160P383j1195q141J1097
897c558J4962j782j1731l482O152M350l533m546J231M790r95o722j216R816Q606
912A2342o382j0375L992J2467j31j1008l923L837n417j2059K771J6215N945j1168
926b894p088Q991J0470k115p045j385R95l267n685J397R025P405k250r319k401
941e166R125P576n450p700K521N231n671q006N605R635o472j4832Q77J4951N040
956G264r677m175Q860O143o652p710K997N237k873p782n62R348J0133r82r961
971c92l827Q357N595o834o837L812N155p555p716R087J3313m627j6022l411J0658
$$ plain form
868 4416 -9677 -8876 4010 12317 8749 2597 1539 3000 -339 -6261 -5406 4310 9598 282 -8437
883 -8437 1538 18197 16527 -28 -5369 2436 755 -14010 -16862 -2702 4681 -6514 -14655 -3558
897 -3558 11404 9622 -2109 -5591 561 4911 1378 -3168 -1937 2853 1858 -4864 -6080 3736 12342
912 12342 5960 -4415 -423 12044 11913 905 -3018 819 -4598 -16657 -13886 2329 8274 -2894
926 -2894 -9982 -991 9479 7364 319 -1066 -71 -3338 -9023 -7626 1399 8804 6554 -2765 -5166
941 -5166 3959 11535 6085 -1615 906 6137 466 -7540 -1935 7700 1228 -13604 -12727 2224 7264
956 7264 -2413 -6588 2272 8415 1763 -5947 -2950 2287 -586 -8368 -8930 418 10551 9569 -392
971 -392 -4219 4138 9733 2899 -3938 -126 5029 -2526 -10242 -1155 12158 7531 -8491 -11902 -1244
986a244M859o042r83O902J266q263m924O535Q231o00q904n789M111R461K690n147
1002B159k638M522L97q231l482R128P101p617r824N569J1121k184j0550j086O730
1017A115q30n954J877Q520J448p082k556N980N170l223q072l282L226M149j32
1032C54j684K995M862l457j0697m11J3259O429j2444j2486N809J1207j660p659
1046e583L023P307m414r566K850J2987O236o207o926K13K718q77k934j098K681
1061D10R93l958k421O365J0639j140j2642n619Q126M768r784q837N948Q559l653
1076b246o303N162R454k362q513O28Q561L236m851l927j81J506k45p08J402K376
1092B989J41m368k048P424J0645j978j3217o839N457K055p194l022Q351M080q289
$$ plain form
986 -1244 3615 -2427 -3410 3492 4758 -3505 -8429 -1894 6337 5737 -3167 -8956 -4845 4616 7306 2159
1002 2159 -479 4043 4440 -3791 -7273 1855 8956 1339 -8485 -2916 8205 6021 -4529 -5615 1115
1017 1115 285 -5669 -3792 4728 6176 -906 -3462 2518 7688 4465 -3607 -6889 -3663 486 354
1032 354 -1330 1665 6527 3070 -7627 -8038 5221 11650 -794 -13280 -7471 3736 2076 -5583
1046 -5583 -2560 4747 333 -9233 -6383 6604 12840 6633 -293 -80 2638 1761 -1173 -2271 410
1061 410 1403 -2555 -4976 1389 12028 10888 -1754 -7373 753 5521 -4263 -13100 -7152 1407 -2246
1076 -2246 -8549 -3387 6067 3705 -4808 -4180 4381 7617 2766 -1161 -1342 164 -81 -789 613 2989
1092 2989 3130 -1238 -3286 4138 14783 12805 -412 -7251 -1794 261 -6933 -9955 -1604 2476 -5813
1107e813n229R597J2151k312r838l041L138l4k489R96M479R60l947l124L127P021
1123E642L572m715n929K813O801j913q503j618N754j684r211j478J1056N167p916
1138b162n396Q354R045m665r145j267L756q45m049J181O574L553l063n078J507
1153a700P912N294n184r548o37N740N36m447J175N528k833j0554j472J1334O787
1168G931o692n529M238L403m050l397M133L918m495o947Q50P243O087o59m221
1183A813k117L379K725l678m908J606L890l284m545L481P474k911r618j243Q736
1198H00K209p224k477O474K877n424k968O390O072m496p944p18O840N997R8m355
1214B151j923K592K112l044k333M285L077o488p830L997R616l76r553k524M544
$$ plain form
1107 -5813 -11042 -1445 10706 8394 -1444 -4485 -1347 -1381 -3870 -2874 1605 2565 -1382 -4506 -1379 5642
1123 5642 9214 4499 -1430 1383 8184 6271 -2232 -3850 1904 220 -8991 -10469 587 5754 -2162
1138 -2162 -7558 796 9841 5176 -3969 -5236 -1480 -2325 -6374 -5193 1381 4934 1871 -3207 -1700
1153 -1700 6212 11506 6322 -3226 -3863 1877 2413 -2034 -859 4669 1836 -8718 -10190 1144 7931
1168 7931 1239 -4290 -52 3351 -699 -4096 37 3955 -540 -7487 -6637 606 6693 6034 1813
1183 1813 -304 3075 5800 2122 -2786 -1180 2710 -574 -5119 -1638 5836 2925 -6693 -7936 800
1198 800 3009 -4215 -6692 -218 2659 -2765 -5733 657 6729 2233 -5711 -6429 411 6408 6506 2151
1214 2151 228 2820 4932 1888 -445 3840 6917 429 -7401 -3404 6212 5836 -3717 -6241 -1697
1229a697j69n775J287Q842K306p374m839M810O711j269n712k089K461L431P47
1244A671l01J657L768J94m942k409N231L898o700q352K782P732j085o664p6N006
1260A410j532o336J256P955J946p403m431L185L988j259k030n68P12N26L12J978
1276b91N451M831k478p389k443N658M085o306o513L435N337k962m679N137P883
1291H756l143r601j707O424L224n059l720J402J127j275m00K327K303j93j897
1306a432q3L966M814r10p139l183M448K231n333l730N596N132m319m870O557Q067
1322I812k733r744k928M528J671l325p21J672Q46j994M18L644L736p4m169l416
1338b777J919M896L88m879k522L319M81n154j077P823M772o152o495M966P351
$$ plain form
1229 -1697 -1866 -7641 -6354 2488 4794 -2580 -7419 -2609 4102 2833 -2879 -4968 -2507 924 1671
1244 1671 1370 3027 6795 6989 2047 -362 4869 8767 2067 -6285 -3503 4229 3144 -3520 -3596 1410
1260 1410 -122 -6458 -5202 2753 4699 -2704 -7135 -3950 38 -1221 -3251 -3819 -3107 -2581 -2269 -291
1276 -291 5160 9991 7513 124 -2319 3339 7424 1118 -5395 -1960 3377 415 -4264 873 8756
1291 8756 5613 -3988 -5695 729 3953 -1106 -4826 -3424 -2297 -3572 -3972 -1645 658 465 -1432
1306 -1432 -1515 2451 7265 6355 -784 -3967 481 2712 -2621 -6351 -755 4377 58 -4812 1745 9812
1322 9812 7079 -2665 -5593 -1065 606 -2719 -3440 -1768 -922 -2916 -2498 1146 4882 4808 639 -2777
1338 -2777 -858 4038 4426 -453 -2975 344 825 -4329 -5406 2417 7189 1037 -5458 -492 6859
1353F859j857p399j742K847j048l177J527N000J459k530j074K073L092N30k820
1368A740l433n7K858q3k905J366M120r17o742q21P996L659o343n701L510N235
1384C482k599m382J520L372k838n459J934O803L194l081l615M0L580J921j830
1399B042l609N4K435p04k500K655N513p75p207k992O138L349m587l667L518K900
1415B563m119k702M195L992l421o162N14M928K134j059j739M37J739R06j808r95
1431e97K183J696l044m268K121O624K93o205k498L762J884l593p07M649J094n479
1447b085k695M842M821l270o076l49L199K145k63k82J344J814m98k341q17K809
1463B298J834l986n419J305O143O77m420j86L683m65m868L12O085J487o339m233
$$ plain form
1353 6859 5002 -2397 -4139 -1292 -2340 -5517 -3990 1010 2469 -61 -1135 938 4030 4560 1740
1368 1740 -1693 -1750 1108 1025 -1880 -514 3606 2689 -4053 -4874 3122 6781 438 -5263 -1753 3482
1384 3482 883 -3499 -1979 1393 -1445 -6904 -4970 1833 5027 1946 -1669 -1629 1951 3872 2042
1399 2042 -1567 -1513 922 218 -2282 373 5886 5111 -2096 -5088 1050 4399 -188 -3855 -337 2563
1415 2563 -1556 -4258 -63 3929 508 -5654 -5140 -212 1922 863 -876 -439 1300 2206 398 -597
1431 -597 1586 3282 238 -4030 -1909 4715 5008 -1197 -3695 67 1951 -1642 -2349 2300 3394 -2085
1447 -2085 -4780 62 4883 1613 -4463 -4812 -1613 532 269 -13 1331 3145 2647 306 -511 2298
1463 2298 4132 146 -5273 -3968 2175 2852 -1568 -1754 1929 1464 -3404 -3092 2993 4480 -1859 -6092
1479f092L783L772j492k686N47K069q5j205K009L238K417j546m507k147L181K987
1495D243l139n007R72M098L88k496J424M799k286o454q24N518J296n580l393K633
1511c808K807r83p60K057J677p39j203Q19K719J849r49l729j862K004K460j841
1527E18k737K532K948k011l060L775N629k361p583k635M036J365l531j024K829
1542a310J020k476k6L600K974q90l632j735J588K662M50k165j880J605J271j729
1558f73j032L732K753m181l910L166N362k151o149j597L952j3k977k36M039R44
1574A029j802r03K645K139p83k434j665M78J824P73j128O35J775J72l480q18M794
1591C251K925m899m958J752M512j104l795Q27K202j949l906J280M615J603l017
$$ plain form
1479 -6092 -2309 1463 -29 -2715 -2168 -99 -184 -1389 620 3858 6275 4729 222 -1925 1256 4243
1495 4243 1104 -3903 -2931 1167 1555 -941 483 5282 2996 -3458 -4282 1236 2532 -3048 -6441 -3808
1511 -3808 -1001 -1984 -2744 -687 990 251 -952 -133 2586 4435 3486 -243 -2105 -101 2359 518
1527 518 -2219 313 3261 1250 -1810 1965 7594 5233 -2350 -4985 -949 416 -3115 -4139 -1310
1542 -1310 -290 -2766 -2792 808 3782 2892 -740 -2475 -887 1775 2225 60 -1820 -215 1056 -673
1558 -673 -1705 2027 4780 599 -3311 -145 5217 3066 -3083 -4680 -728 -741 -3718 -3954 85 1029
1574 1029 -773 -1676 969 3108 2325 -109 -1774 -1296 528 1301 173 808 2583 2755 -725 -1543 3251
1591 3251 6176 1277 -3681 -1929 2583 1479 -2316 -1489 713 -1236 -5142 -3862 753 2356 -661
1606f61k325J446J735N28o36o42j41P60L0m81J525K820l75l760j533L961K143
1623D394l837l430K720L035k461l042K092K881k398m372K02M184Q66k469j228
1638b863J155J729J32p06L53Q53j69j318k022K373M653K97m486k137L198K432
1654C474j864j829K688Q63m038k563L441L493j886m678p35K748P20j190R86J365
1670I95L20r67j223J58J650M64j891k674R33L809O90k723n10L259O19l098j350
1687a539K943J280m119k976L030L087j676l307M07K317j86j063J322K448J02k009
1703F1k206L53K491J494j659l392M81L400J719r90P1K535r90m232j113M015J623
1720C661m176k870J704K384j062j347J922J888j534k384L25K163N84j227j858
$$ plain form
1606 -661 -2986 -1540 195 723 87 -555 -696 64 94 -387 1138 3958 3583 -177 -1710 2251 4394
1623 4394 557 -2873 -153 2882 421 -2621 -529 2352 -46 -4418 -4216 -32 834 -1635 -2863
1638 -2863 -1708 21 153 -553 -200 653 484 -834 -2856 -483 4170 4467 -19 -2156 1042 3474
1654 3474 1610 -219 2469 3332 -706 -3269 172 3665 1779 -2899 -3634 -886 -166 -1356 -370 995
1670 995 1315 348 -875 -717 933 1397 -494 -3168 -2235 1574 2264 -459 -969 2290 2909 -189 -1539
1687 -1539 1404 2684 -1435 -4411 -1381 1706 30 -3277 -2870 -553 -739 -1802 -480 1968 2070 61
1703 61 -2145 -1792 699 2193 534 -2858 -2377 1023 2742 1752 1823 4358 3368 -864 -1977 2038 3661
1720 3661 -515 -3385 -1681 703 -359 -1706 216 2104 570 -1814 -1489 674 1258 31 -1827
1735a827p31J658J307r57j671J436K650n86j665R90L388j064m552j137L132J427
1751A798l208j719K310J517j318m38K606J462k010l234r3K089J118k25j657j172
1767b174J203J285K02k49J662J144k278k829K031L623m44m358j200K102N28k101
1783a853J8L257Q09k559j630K390K023j312k316k03Q8P22J78l79P18J095L98j461
1801a7r21K518J390k501k756J067L412o15k938p8K194p51k413O63L193M53l211
1818a311j713K160K241k81j764m95j82K66N95M48P99J240o86j733r80K763J981
1835C348k040k333N88K205n96k217Q92K692j402l344j28K690R71j637j118J126
1851c03J014j142k97O51L79l49j114j4R45J742N0k094o22J914J494j051k084J301
$$ plain form
1735 -1827 -2558 -900 407 -550 -2221 -785 1865 1279 -386 604 3992 2928 -1624 -2761 371 1798
1751 1798 -1410 -3129 -819 698 -620 -1058 1548 3010 1000 -2234 -2327 -238 880 655 -1002 -2174
1767 -2174 -971 314 516 267 1929 3073 795 -2034 -3 3620 3176 -1182 -2382 -280 248 -1853
1783 -1853 -1835 1422 2231 -328 -1958 432 2455 1143 -1173 -1376 -1288 -566 -388 -767 -49 1046 1444 -17
1801 -17 -938 1580 2970 469 -2287 -1220 2192 1577 -1361 -1439 755 4 -2409 -1746 1447 1900 -1311
1818 -1311 -3024 -864 1377 1096 -668 -1163 -1345 -1079 -484 -36 763 2003 1317 -416 -1396 1367 3348
1835 3348 1308 -1025 -437 1768 1172 -1045 -153 2539 1137 -2207 -2335 355 1326 -311 -1429 -303
1851 -303 711 -431 -728 -77 302 -47 -1161 -1175 -230 1512 1562 -532 -1154 760 2254 1203 -881 420
1869D20J237j711j930K026K020j472l441j37K797J088j181n17P95J40j077k39
1885a182J444M14l87j618j092J234K225J141j218p39J173Q89j808j003K113P57
1901B343k471k818J946K735o82k586R6K032l10j403M79J492j9j551r74O71Q38
1918a82K93q71j180Q10J951R32o42k47J026p8k108n02K180N38k454k315J444K719
1936A314n83j564Q68J074j162j793Q24J709K56j791j419K10J230R97J82n82K47
1953A7J088n05l06P54J501m92k893r38K002J479j727j597J450J419j166r09J178
1970C55J579j686j975k90J451L58p31p52O2R12P68J72m19P60O34m90j156N40K295
1989B387m32k499j073K078J072j141p72J352P64k165o78J651J416j361k181k10
$$ plain form
1869 420 1657 -54 -1984 42 2062 590 -2851 -2988 -191 897 -284 -801 -6 134 -943 -1182
1885 -1182 262 676 289 -1329 -2421 -1187 1038 2179 961 222 1395 2284 476 -527 1586 2343
1901 2343 -128 -2946 -1000 1735 1053 -1533 -1437 595 285 -1118 -639 853 834 -717 -1691 -1020 -182
1918 -182 111 -760 -1940 -1130 821 1753 1111 864 1890 1812 -296 -798 1382 1920 -534 -2849 -1405 1314
1936 1314 731 -833 35 1109 -53 -1846 -1022 687 943 -848 -2267 -2057 -827 170 352 -230 17
1953 17 1105 600 294 1048 2549 2057 -836 -1774 228 1707 -20 -1617 -167 1252 86 -823 355
1970 355 1934 248 -1727 -2017 -566 -208 -939 -1691 -1629 -717 51 223 -196 564 1198 708 -448 92 2387
1989 2387 1955 -544 -1617 461 1533 392 -380 972 1736 -429 -1107 544 1960 599 -1582 -1792
2005a792Q00K05p7J46O09L7k21j90P2J004J064j301j756L94K193K97j880j80J784
2024A208k06j716j08K069N05k150j124J370J066m99j064m73O84m6m70N22K24N77
2042C69j31q40j05J349R38j220j354N07J817m08r01K71J336m93k303K29J969O61
2060A691j940j156J144P54p18j71L24k50l83p92K25J064R60l71j021l43J020J347
2078A384p10r86N58R71q81j153R00J615o22j923m0J642P63j315m96Q76p7p12m86
2097f92O33M96p94j175j84J115P82J77l88k91L55R59p59n11O61M45j289j036Q87
2116f09K040k69j676L8Q57O14q45q7N89j20j452n71J035M80j87n43l11L66Q61
2135B10O36m88k62O91L4q26n80J040O17j055j334P02J928k57j175K22J182k89
$$ plain form
2005 -1792 -992 -787 -864 -718 -109 -72 -293 -483 -411 593 1657 356 -1400 -1006 1187 1484 -396 -576 1208
2024 1208 1002 -714 -822 1247 1752 -398 -1522 -152 914 415 -649 -1122 -438 -484 -954 -432 -208 369
2042 369 238 -602 -707 642 1580 360 -994 -487 1330 922 21 292 1628 1135 -1168 -939 1030 1691
2060 1691 -249 -1405 -261 493 -225 -396 -72 -322 -705 -1497 -1272 -208 752 381 -640 -983 37 1384
2078 1384 674 -312 246 1217 336 -817 83 1698 1076 -847 -887 755 1518 203 -293 583 506 -206 -692
2097 -692 -59 437 -357 -1532 -1716 -601 181 358 -30 -321 34 993 234 -277 384 829 -460 -1496 -609
2116 -609 1431 1162 -514 -476 381 995 150 63 652 532 -920 -1491 -456 24 -163 -706 -1017 -651 210
2135 210 846 358 96 787 821 -5 -585 455 1072 17 -1317 -615 1313 1056 -119 103 1285 996
2153I96j547N2J090j24j396n49M59Q30K76n4N3k71L06J8k14L51L83k51j224l40
2173a156J298R26j010j011J030Q07jr52P75N15o77j634J5J383m03n59k63O4R41
2192H8l75j4N74k2r9k78n29K27J204k20j304m14J204R91n53q24P82M75r47n73
2212f07R46J030r64j233l59J169J11n08q3M04K36j96J47J3L29o3p14m93M31J203
2232G99mj064m43R85M55p73j90Q09L72j207j145P64J617r13r41k4P29m08M4J09
2252d29L70Pl14j6j00P14N32n51p67K72P76L97n90k54R80k59p62k68J394J31j105
2273A58o92O79O85n38n33q4N52n11o33K43P62k31M7m93j21Q02L01m87j51j65M59
2294D9on64L77Q74o1q57k35J090N71o59p34L28M05o21l72M45K78p68m85j2J015
$$ plain form
2153 996 -551 -499 591 467 -929 -1478 -1019 -189 87 33 86 -185 121 139 -75 276 659 408 -816 -1156
2173 -1156 142 1068 58 -953 77 884 883 -69 706 1221 544 -1090 -1075 308 -95 -654 -917 -853 88
2192 88 -287 -301 273 251 152 -126 -655 -428 776 556 -748 -1162 42 1033 480 -344 438 913 -34 -607
2212 -607 339 1369 405 -828 -1187 -18 93 -415 -498 -94 142 -54 93 106 435 372 -342 -835 -404 799
2232 799 795 -269 -712 273 728 -45 -235 574 946 -261 -1406 -642 975 62 -879 -903 -174 -582 -538 -429
2252 -429 -59 -52 -366 -382 -482 232 764 213 -554 -282 494 891 301 47 1027 768 6 -262 1132 1263 158
2273 158 -534 145 830 292 -241 -325 227 -284 -917 -674 88 -143 -96 -589 -710 92 393 -94 -245 -410 49
2294 49 43 -521 -144 730 669 -188 -423 667 1238 579 -155 173 578 -43 -415 30 308 -460 -945 -957 58
2315E8o2p7n61K57J57M60l98j85K49K73k54n58N52Q09L19j014k22Q02L01n41n41
2336a76O81o9p64k95O36N70m04r74L84N00J85j87K47k86K4R9o66j69O60K78l73
2357i9n51M26R09o4m38k00P73l03p44J14L92Jq98k19M42P01j19m28K59j58J48
2378e6j47N3J58M8n8q05K74L80Q64m28o49N63N49j57n27K26L54j47j096K58O39
2399B96k23l31l03N14L24k68j14J47k41j29r6m7K31K82N9l49l54O32M82l16j66
2420C0J76M12m02l58M72O54p09o55K38M49J10o52LL88l56j84K53L87j13l38l35
2441e30KJ44J22K67l64r9N96K10m22L4O14j40k02p24O17Q35m81o28k94O89o4l00
2463a18J41O60n05k87O8n7K13Q1p67K94j32O06P8j76j88L11j68l25p3O87J79l56
$$ plain form
2315 58 -4 -81 -642 -385 -228 232 -166 -351 -102 171 -83 -641 -89 720 1039 25 -197 605 906 365 -176
2336 -176 505 436 -328 -623 13 583 179 -795 -411 89 274 87 334 48 72 171 -495 -664 -4 274 -99
2357 -99 -650 -224 685 621 183 -17 756 453 -291 -177 215 216 -682 -901 -459 242 123 -305 -46 -204 -56
2378 -56 -203 -150 8 56 -2 -807 -533 -153 711 283 -366 197 746 589 62 288 642 495 -601 -343 296
2399 296 73 -258 -561 -47 277 9 -105 42 -199 -328 -424 -471 -240 42 101 -248 -602 30 512 196 30
2420 30 206 618 216 -142 330 984 275 -380 -142 307 417 -235 -232 156 -200 -384 -131 256 143 -195 -530
2441 -530 -528 -384 -262 5 -359 -458 138 348 -74 -40 574 434 232 -492 125 960 479 -149 -443 246 182 -118
2463 -118 23 683 178 -109 -41 -98 115 196 -571 -277 -409 197 275 99 -89 222 54 -271 -344 343 522 166
2485A66n98N32P07n06l73k3L14l59l37N71L6M5k90m8p7M22L3m28P2q3K20J88k37
2508e3k69P37j02m64RN91L55m68n79K41O1p7j08L52Mk34n32L96L86O7l12k09P6
2531a32j77K59Q5k71K2J92j99l11M13M66J12m53k01L79M44j79n55L40q9m20k02
2552d77O14K61n38k85L27L91k18q4j38K41j58J24k18j4J46m19K89l56L62M71K04
2573E25n82j26N50k20k57N7L91k6n42k8L15L11J42m70q1K76j21l9l45K21j30l33
2595e12J64L6J18J86R4l42J74K92j7r4j49L91j05q10K35M25j41J04l04K10K43
2616A98o3j53q9J49k50q0J80l17L01J45k55j60K15N22o1n04K69P4l1l73L86J68
$$ plain form
2485 166 -432 100 807 301 -72 -95 219 -140 -477 94 130 175 -115 -163 -240 182 215 -213 -141 -224 -4 184 -53
2508 -53 -322 415 313 -151 -142 449 804 336 -243 -2 59 -18 -126 226 230 -4 -536 -140 246 313 1 -208 -132
2531 -132 -309 -50 35 -236 -214 -22 -221 -532 -119 347 459 6 -195 184 628 449 -106 234 145 -275 -477
2552 -477 137 398 -140 -425 -98 293 75 -9 -147 94 -64 60 -158 -172 -26 -445 -156 -512 -150 321 525
2573 525 -57 -183 367 147 -110 -53 338 312 -230 -258 57 368 510 40 -41 235 114 75 -270 -49 -179 -512
2595 -512 -348 -312 -194 -8 86 -256 -82 210 193 99 -50 341 236 -574 -339 86 -55 49 -255 -45 198
2616 198 135 -18 -107 42 -208 -288 -108 -425 -124 21 -234 -394 -179 343 282 -222 47 121 90 -283 103 271
$$ [...]
8191a10
##END NTUPLES=NMR FID
##END=
