##TITLE=1H_EC-3172
 CDCl3, 8 sc, 
 11.1.2019
##JCAMPDX= 6.0         $$ Bruker NMR JCAMP-DX V2.0
##DATA TYPE= NMR FID
##DATA CLASS= NTUPLES
##ORIGIN= UXNMR, Bruker Analytische Messtechnik GmbH
##OWNER= root
$$ XWIN-NMR		Version 3.5
$$ Fri Jan 11 14:17:59 2019 Russian Standard Time (UT+4h)  she@DPX200
##.OBSERVE FREQUENCY= 200.1313
##.OBSERVE NUCLEUS= ^1H
##.DELAY= (6, 6)
##.ACQUISITION MODE= SIMULTANEOUS
##.ACQUISITION SCHEME= undefined
##.AVERAGES= 8
##.DIGITISER RES= 18
##SPECTROMETER/DATA SYSTEM= spect
##.PULSE SEQUENCE= zg30
##.SOLVENT NAME= CDCl3
##.SHIFT REFERENCE= (INTERNAL, CDCl3, 0, 15.7039)
##AUDIT TRAIL= $$ (NUMBER, WHEN, WHO, WHERE, WHAT)
$$ ##TITLE= Audit trail, XWIN-NMR		Version 3.5
$$ ##JCAMPDX= 5.01
$$ ##ORIGIN= Bruker BioSpin GmbH
$$ ##OWNER= she
$$ F:/spectra/data/she/nmr/H-F/1/audita.txt
$$ ##AUDIT TRAIL=  $$ (NUMBER, WHEN, WHO, WHERE, WHAT)
(   1,<2019-01-11 14:16:42.71 +0400>,<she>,<DPX200>,
      <created by zg, POWCHK disabled, PULCHK disabled
       configuration hash MD5:
       00 E9 B6 7A A2 85 ED C7 34 08 36 98 17 FE 4E 26
       data hash MD5: 16K
       2D A5 EA 3F 75 95 8A C3 78 11 2E E0 F2 88 47 88>)
$$ ##END=
$$ 
$$ hash MD5
$$ AC 43 4D 99 A3 86 C0 B9 84 F2 FB 12 A9 3E AC 45
##$RELAX= 
##$RELAX= 
##$RELAX= 
##$RELAX= 
##$RELAX= 
##$RELAX= 
$$ Bruker specific parameters
$$ --------------------------
##$DU= <F:/spectra>
##$EXPNO= 1
##$NAME= <H-F>
##$PROCNO= 1
##$TYPE= <nmr>
##$USER= <she>
##$AMP= (0..31)
100 100 100 100 100 100 100 100 100 100 100 100 100 100 100 100 100 100 
100 100 100 100 100 100 100 100 100 100 100 100 100 100 
##$AQSEQ= 0
##$AQ_mod= 1
##$AUNM= <au_zg>
##$AUTOPOS= <>
##$BF1= 200.13
##$BF2= 200.13
##$BF3= 200.13
##$BF4= 200.13
##$BF5= 200.13
##$BF6= 200.13
##$BF7= 200.13
##$BF8= 200.13
##$BYTORDA= 1
##$CFDGTYP= 0
##$CFRGTYP= 5
##$CHEMSTR= <none>
##$CNST= (0..31)
1 1 145 1 1 1 1 1 1 1 1 1 1 1 1 1 1 1 1 1 1 1 1 1 1 1 1 1 1 1 1 1 
##$CPDPRG= <>
##$CPDPRG1= <>
##$CPDPRG2= <>
##$CPDPRG3= <>
##$CPDPRG4= <mlev>
##$CPDPRG5= <mlev>
##$CPDPRG6= <mlev>
##$CPDPRG7= <mlev>
##$CPDPRG8= <mlev>
##$CPDPRGB= <>
##$CPDPRGT= <>
##$D= (0..31)
0 1.2 0 0 0 0 0 0 0 0 0 0.03 0 0 0 0 0 0 0 0 0 0 0 0 0 0 0 0 0 0 0 0 
##$DATE= 1547201802
##$DBL= (0..7)
120 120 120 120 120 120 120 120 
##$DBP= (0..7)
150 150 150 150 150 150 150 150 
##$DBP07= 0
##$DBPNAM0= <>
##$DBPNAM1= <>
##$DBPNAM2= <>
##$DBPNAM3= <>
##$DBPNAM4= <>
##$DBPNAM5= <>
##$DBPNAM6= <>
##$DBPNAM7= <>
##$DBPOAL= (0..7)
0.5 0.5 0.5 0.5 0.5 0.5 0.5 0.5 
##$DBPOFFS= (0..7)
0 0 0 0 0 0 0 0 
##$DE= 6
##$DECBNUC= <off>
##$DECIM= 24
##$DECNUC= <off>
##$DECSTAT= 4
##$DIGMOD= 1
##$DIGTYP= 9
##$DL= (0..7)
0 120 120 120 120 120 120 120 
##$DP= (0..7)
150 150 150 150 150 150 150 150 
##$DP07= 0
##$DPNAME0= <>
##$DPNAME1= <>
##$DPNAME2= <>
##$DPNAME3= <>
##$DPNAME4= <>
##$DPNAME5= <>
##$DPNAME6= <>
##$DPNAME7= <>
##$DPOAL= (0..7)
0.5 0.5 0.5 0.5 0.5 0.5 0.5 0.5 
##$DPOFFS= (0..7)
0 0 0 0 0 0 0 0 
##$DQDMODE= 0
##$DR= 18
##$DS= 0
##$DSLIST= <SSSSSSSSSSSSSSS>
##$DSPFIRM= 0
$$ [...]
##$SUBNAM2= <"">
##$SUBNAM3= <"">
##$SUBNAM4= <"">
##$SUBNAM5= <"">
##$SUBNAM6= <"">
##$SUBNAM7= <"">
##$SUBNAM8= <"">
##$SUBNAM9= <"">
##$SW= 24.933730806125
##$SWIBOX= (0..15)
0 0 2 0 0 0 0 0 0 0 0 0 0 0 0 0 
##$SW_h= 4990.01996007984
##$TD= 16384
##$TD0= 1
##$TE= 0
##$TE2= 300
##$TE3= 300
##$TEG= 300
##$TL= (0..7)
0 120 120 120 120 120 120 120 
##$TP= (0..7)
150 150 150 150 150 150 150 150 
##$TP07= 0
##$TPNAME0= <>
##$TPNAME1= <>
##$TPNAME2= <>
##$TPNAME3= <>
##$TPNAME4= <>
##$TPNAME5= <>
##$TPNAME6= <>
##$TPNAME7= <>
##$TPOAL= (0..7)
0.5 0.5 0.5 0.5 0.5 0.5 0.5 0.5 
##$TPOFFS= (0..7)
0 0 0 0 0 0 0 0 
##$TUNHIN= 0
##$TUNHOUT= 0
##$TUNXOUT= 0
##$USERA1= <user>
##$USERA2= <user>
##$USERA3= <user>
##$USERA4= <user>
##$USERA5= <user>
##$V9= 5
##$VALIST= <valist>
##$VCLIST= <CCCCCCCCCCCCCCC>
##$VD= 0
##$VDLIST= <DDDDDDDDDDDDDDD>
##$VPLIST= <PPPPPPPPPPPPPPP>
##$VTLIST= <TTTTTTTTTTTTTTT>
##$WBST= 1024
##$WBSW= 4
##$XGAIN= (0..3)
0 0 0 0 
##$XL= 0
##$YL= 0
##$YMAX_a= 115815
##$YMIN_a= -216503
##$ZGOPTNS= <>
##$ZL1= 120
##$ZL2= 120
##$ZL3= 120
##$ZL4= 120
##$ABSF1= 10
##$ABSF2= 0
##$ABSG= 5
##$ABSL= 3
##$ALPHA= 0
##$AQORDER= 0
##$ASSFAC= 0
##$ASSFACI= 0
##$ASSFACX= 0
##$ASSWID= 0
##$AUNMP= <proc_1d>
##$AZFE= 0.1
##$AZFW= 0.1
##$BCFW= 1
##$BC_mod= 2
##$BYTORDP= 1
##$COROFFS= 0
##$CY= 11.3945322036743
##$DATMOD= 1
##$DC= 2
##$DFILT= <>
##$DTYPP= 0
##$F1P= 18.9103706918063
##$F2P= -1.10871071338519
##$FCOR= 0.5
##$FTSIZE= 0
##$FT_mod= 4
##$GAMMA= 1
##$GB= 0.15
##$INTBC= 1
##$INTSCL= 1
##$ISEN= 128
##$LB= 0.24
##$LEV0= 0
##$LPBIN= 0
##$MAXI= 10000
##$MC2= 0
##$MEAN= 0
##$ME_mod= 0
##$MI= 1.114404
##$NCOEF= 0
##$NC_proc= 0
##$NLEV= 6
##$NOISF1= 3.799351
##$NOISF2= 2.8
##$NSP= 1
##$NTH_PI= 0
##$NZP= 0
##$OFFSET= 15.70392
##$PC= 1
##$PHC0= -8853.493
##$PHC1= 15.80006
##$PH_mod= 1
##$PKNL= yes
##$PPARMOD= 0
##$PSCAL= 0
##$PSIGN= 0
##$REVERSE= no
##$SF= 200.130013532006
##$SI= 16384
##$SIGF1= 3
##$SIGF2= 2
##$SINO= 400
##$SIOLD= 16384
##$SREGLST= <1H.CDCl3>
##$SSB= 0
##$STSI= 0
##$STSR= 0
##$SW_p= 3612.71676300578
##$SYMM= 0
##$S_DEV= 0
##$TDeff= 0
##$TDoff= 0
##$TI= <>
##$TILT= no
##$TM1= 0
##$TM2= 0
##$TOPLEV= 0
##$USERP1= <user>
##$USERP2= <user>
##$USERP3= <user>
##$USERP4= <user>
##$USERP5= <user>
##$WDW= 1
##$XDIM= 8192
##$YMAX_p= 0
##$YMIN_p= 0
$$ End of Bruker specific parameters
$$ ---------------------------------
##NTUPLES= NMR FID
##VAR_NAME=  TIME,          FID/REAL,        FID/IMAG
##SYMBOL=    X,             R,               I
##VAR_TYPE=  INDEPENDENT,   DEPENDENT,       DEPENDENT
##VAR_FORM=  AFFN,          ASDF,            ASDF
##VAR_DIM=   8192,          8192,            8192
##UNITS=     SECONDS,       ARBITRARY UNITS, ARBITRARY UNITS
##FACTOR=    0.0002004,     1,               1
##FIRST=     0,             0,               0
##LAST=      1.6414764,     0,               0
##MIN=       0,             -216503,         0
##MAX=       1.6414764,     115815,          0
$$ Real data points
##PAGE= N=1
##DATA TABLE= (X++(R..R)), XYDATA
$$ [...]
$$ plain form
1932 381 1919 1116 -703 -607 -552 -873 -268 1020 1153 -1462 -1731 -594 752 700 985 1092 139 -652 759
1951 759 1647 1085 -378 -935 -747 -1132 -1847 -83 960 -221 -894 -582 168 -39 -12 517 142 -1743 -1595
1970 -1595 837 1728 150 -356 345 632 596 1206 1645 449 -635 338 1404 1021 127 35 -52 -994 -1516
1989 -1516 -398 359 -539 -1058 -750 -582 -1195 -510 817 488 -1395 -1856 -501 657 713 933 472 -491
2007 -491 -788 585 1829 1362 299 458 1086 640 295 991 860 -811 -1765 -1090 -173 -176 -287 549 77
2026 77 -1063 -383 636 555 -431 -818 -617 -507 -876 408 800 204 -774 -41 1207 852 872 762 607 -428
2046 -428 -680 630 831 -583 -1670 -1258 -486 -878 58 878 667 -657 -555 222 225 -535 -660 -581 -1004 -1057
2066 -1057 76 1589 1653 714 874 1166 438 793 1496 1248 -494 -1500 -633 -83 -389 -223 -716 -928 -1280
$$ packed form
1932C81J538q03j819R6N5l21O05J288J33k615k69J137J346n2K85J07r53p91J411
1951G59Q88n62j463n57J88l85p15J764J043j181o73L12P50k07K7N29l75j885J48
1970a595K432Q91j578n06P01K87l6O10M39j196j084R73J066l83q94r2q7r42n22
1989a516J118P57q98n19L08J68o13O85J327l29j883m61J355J158N6K20m61r63
2007d91k97J373J244m67j063J59O28m46l45O96j31j671r54O75R17lj11Q36m72
2026G7j140O80J019q1r86l87K01J10l69J284L92n96r78P33J248l55K0j10j55j035
2046d28k52J310K01j414j087M12P72l92R36Q20k11j324J02P77Lp60j25P9m23n3
2066a057J133J513O4r39J60K92p28L55P03k48j742j006Q67N50l06J66m93k12l52
$$ plain form
2085 -1280 -311 1366 539 -694 -803 -234 -801 -1144 -668 -86 -944 -863 -24 1319 1132 1301 1499 1268 -60
2104 -60 -197 1519 1165 -325 -903 -352 -44 -227 460 904 69 -1431 -576 458 317 -544 -900 -1140 -1350
2123 -1350 -1909 -944 285 -747 -811 71 673 690 1084 1583 1043 -474 -309 -176 686 144 262 475 219
2142 219 -267 625 1427 801 -575 -382 356 -188 -285 -264 19 -937 -1478 -359 597 201 -168 501 147 -498
2162 -498 -122 1242 1186 -335 -592 -383 -173 -2 251 583 -171 -783 -223 766 341 -593 -434 -848 -919 -1279
2182 -1279 -77 387 -218 -1002 -469 -137 -238 236 1220 551 0 -22 1123 1411 451 526 302 -399 -592 314
2202 314 520 411 -385 68 240 272 -43 323 207 -881 -942 -427 68 -377 -295 -351 -212 -686 -64 579 487
2223 487 23 -618 762 499 484 421 266 -175 -1014 -134 466 94 -90 140 339 -452 -108 501 224 -668
$$ packed form
2085a280R69J677q27j233j09N69n67l43M76N82q58Q1Q39J343j87J69J98k31j328
2104f0j37J716l54j490n78N51L08j83O87M44q35j500Q55J034j41q61l56k40k10
2123a350n59R65J229j032o4Q82O02J7L94M99n40j517J65J33Q62n42J18K13k56
2142B19m86Q92Q02o26j376J93P38n44r7K1K83r56n41J119R56l96l69O69l54o45
2162d98L76J364n6j521k57K09K10J71K53L32p54o12N60R89m25r34J59m14p1l60
2182a279J202M64o05p84N33L32j01M74R84o69n51k2J145K88r60P5k24p01j93R06
2202C14K06j09p96M53J72L2l15L66j16j088o1N15M95m45Q2n6J39m74O22O43r2
2223D87m64o41J380k63j5o3j55m41q39Q80O00l72j84K30J99p91L44O09k77q92
$$ plain form
2243 -668 -1098 -901 -563 -367 -417 301 15 -860 -20 695 877 388 658 703 136 -22 408 962 180 -590 -428
2264 -428 27 118 542 781 615 -221 -448 191 272 -589 -842 -598 -884 -594 -272 746 49 -380 -50 536
2284 536 369 -83 112 109 -420 -554 -211 672 532 -258 267 390 -24 265 909 504 -593 -850 -284 -368 -823
2305 -823 -656 -624 -835 -814 -389 842 485 27 -119 -160 -131 -269 436 648 -305 -780 115 614 413 274 903
2326 903 364 -136 14 907 404 -435 -442 -297 -255 -773 243 481 37 -251 -138 314 304 276 347 12 -450 -539
2348 -539 -107 480 -135 -67 -41 104 172 200 779 445 -402 -355 -33 39 -636 -563 -91 -660 -752 -548 111 -33 -20
2371 -20 56 126 254 427 585 674 -293 -388 134 309 495 338 270 36 -237 102 618 431 -10 -75 -191 -172 -385
2394 -385 -171 -8 69 -633 -642 -63 -313 -320 -69 31 -295 -415 617 765 117 13 -2 274 -67 288 836 444
$$ packed form
2243f68m30J97L38J96n0P18k86q75Q40P15J82m89K70M5n67j58M30N54p82p70J62
2264d28M55R1M24K39j66q36k27O39Q1q61k53K44k86K90L22J018o97m29L30N86
2284E36j67m52J95ln29j34L43Q83j40p90N25J23m14K89O44m05j097k57N66q4m55
2305h23J67L2k11K1M25J231l57m58j46m1K9j38P05K12r53m75Q95M99k01j39O29
2326I03n39n00J50Q93n03q39pJ45M2n18J016K38m44k88J13M52j0k8P1l35m62q9
2348e39M32N87o15O8K6J45O8K8N79l34q47M7L22P2o75P3M72n69r2K04O59j44J3
2371b0P6P0J28J73J58Q9r67r5N22J75J86j57o8k34k73L39N16j87m41o5j16J9k13
2394c85K14J63P7p02rN79k50pK51J00l26j20J032J48o48j04j5K76l41L55N48l92
$$ plain form
2416 444 -219 181 455 280 116 98 187 -463 -579 -104 79 -346 -440 -346 45 -398 -253 580 217 -18 -377
2437 -377 124 332 153 -57 136 191 -433 242 448 501 140 121 180 169 212 484 141 -155 -1001 -494 52 -307
2459 -307 -215 -415 -179 -771 -358 382 311 -67 -283 -152 111 7 122 247 213 -287 -6 521 404 457 448 402
2481 402 35 -198 239 300 -287 -532 -461 -494 -362 -89 350 203 -621 -306 319 280 112 -143 -81 -387 -414 53
2503 53 340 238 204 -51 360 201 57 413 546 11 -288 -126 528 -5 -205 -12 -173 -519 -94 385 375
2524 375 -164 -45 -165 -485 -288 105 62 -152 -82 -71 444 303 378 318 186 50 29 279 470 -98 -347 -374
2546 -374 -236 -352 -66 425 -284 -250 -363 119 -79 -3 138 -339 -220 -371 141 350 -146 -339 324 320 305 644
2568 644 416 502 -100 -310 384 223 166 -62 -95 -269 -341 -83 343 30 -141 -102 -342 -235 -14 -274 33 -329
$$ packed form
2416D44o63M00K74j75j64j8Q9o50j16M75J83m25r4R4L91m43J45Q33l63k35l59
2437c77N01K08j79k10J93N5o24O75K06N3l61j9N9j1M3K72l43k96q46N07N46l59
2459c07R2k00K36n92M13P40p1l78k16J31K63j04J15J25l4n00K81N27j17N3rm6
2481D02l67k33M37O1n87k45P1l3J32K73M39j47q24L15O25l9j68k55O2l06k7M67
2503E3K87j02l4k55M11j59j44L56J33n35k99J62O54n33k00J93j61l46M25M79j0
2524C75n39J19j20l20J97L93m3k14P0J1N15j41P5o0j32j36k1K50J91n68k49k7
2546c74J38j16K86M91p09L4j13M82j98P6J41m77J19j51N12K09m96j93O63mj5L39
2568F44k28Q6o02k10O94j61n7k28l3j74p2K58M26l13j71L9k40J07K21k60L07l62
$$ plain form
2590 -329 -723 -47 75 -123 -69 167 68 39 -81 190 122 -248 -67 202 114 29 -11 227 -219 -266 112 -27 0
2613 0 -168 -211 -229 -391 -631 4 238 -297 -377 -387 -52 -168 -9 318 122 -135 171 276 224 -135 44 52 -46
2636 -46 -35 267 327 -309 -276 147 -92 303 -73 1 93 -432 -336 -87 22 -277 -304 -110 -84 -288 -3 141 58
2659 58 41 79 356 190 29 319 131 -33 -347 -93 454 -270 -70 203 152 93 266 115 -163 -254 -277 -57
2681 -57 -14 -424 -282 30 -102 -284 -74 339 376 194 252 217 -43 -302 373 365 130 -289 -8 120 -172 -108 -42
2704 -42 78 116 -70 -26 307 -136 -133 -83 -366 -389 60 151 -94 -256 -46 66 80 -51 38 250 -114 -94 -117 161
2728 161 -57 -190 58 19 -13 214 126 306 -145 -430 38 -46 -218 -21 90 -525 -37 111 261 127 -211
2749 -211 -191 110 208 34 40 188 -163 -93 -93 -56 135 329 -99 130 -436 -82 160 46 -187 -222 -97 94 -294
$$ packed form
2590c29l94O76J22j98N4K36r9k9j20K71o8l70J81K69q8q5m0K38m46m7L78j39K7
2613@j68m3j8j62k40O35K34n35q0j0L35j16J59L27j96k57L06J05n2l59J79Qr8
2636d6J1L02O0o36L3M23k39L95l76P4R2n25R6K49J09k99k7J94K6k04K85J44q3
2659E8j7L8K77j66j61K90j88j64l14K54N47p24K00K73n1n9J73j51k78r1k3K20
2681e7M3m10J42L12j32j82K10M13L7j82N8l5k60k59O75qk35m19K81J28k92O4O6
2704d2J20L8j86M4L33m43LN0k83k3M49R1k45j62K10J12J4j31Q9K12l64K0k3K78
2728A61k18j33K48l9l2K27q8J80m51k85M68q4j72J97J11o15M88J48J50j34l38
2749b11K0L01R8j74OJ48l51P0%L7J91J94m28K29n66L54K42j14k33l5J25J91l88
$$ plain form
2772 -294 -77 182 -267 -354 -182 373 101 -41 -115 -79 -10 350 291 44 185 70 14 54 321 -13 256 -89
2794 -89 -46 -387 193 35 -220 -78 81 18 -244 72 169 -63 -310 -188 102 322 146 36 269 -100 -171 -97
2816 -97 114 238 -60 41 -68 -147 178 1 59 16 -228 -383 -203 -23 36 -11 -121 -255 -349 200 68 -273
2838 -273 40 -190 2 -101 -82 68 210 -151 22 197 67 -30 76 -5 -233 53 349 -15 -50 15 6 94 -18
2861 -18 -44 -75 -13 -66 11 -202 -28 4 544 194 -32 -156 144 161 -153 -82 -149 -33 121 208 490 85 -58 -119
2885 -119 494 49 -193 109 -12 -69 -286 -127 -180 73 -102 133 -42 -55 -139 237 273 -111 -80 -165 69 -25 -126
2908 -126 -132 129 -12 -274 260 -119 130 326 231 -409 20 -28 36 24 -33 -46 59 -66 -101 -151 -59 79 -151 310
2932 310 152 -116 79 193 -234 -301 -83 287 -129 77 171 318 123 -92 37 13 -237 -58 108 459 -235
$$ packed form
2772b94K17K59m49q7J72N55k72j42p4L6O9L60n9k47J41j15n6M0K67l34K69l45
2794h9M3l41N80j58k55J42J59o3k62L16R7k32k47J22K90K20j76j10K33l69p1P4
2816i7K11J24k98J01j09p9L25j77N8m3k44j55J80J80N9m7j10j34r4N49j32l41
2838b73L13k30J92j03J9J50J42l61J73J75j30r7J06q1k28K86K96l64l5O5rQ8j12
2861a8k6l1O2n3P7k13J74L2N40l50k26j24L00J7l14P1o7J16J54Q7K82m05j43o1
2885a19O13m45k42L02j21n7k17J59n3K53j75K35j75j3q4L76L6l84L1q5K34r4j01
2908a26oK61j41k62N34l79K49J96r5o40M29m8O4j2n7j3J05j25l5n0R2J38k30M61
2932C10j58k68J95J14m27o7K18L70m16K06R4J47j95k15J29k4k50J79J66L51o94
$$ plain form
2953 -235 58 425 289 98 -145 -173 -18 -233 111 79 6 -109 -299 -92 -13 40 -355 276 234 -67 98 -49
2975 -49 -121 114 208 -58 162 -61 191 -296 69 1 -50 -100 -216 263 -250 -202 188 122 117 91 -229 -13 -88 -178
2999 -178 -214 -131 -148 -58 102 154 31 -108 99 239 83 154 71 278 47 286 11 172 0 -148 22 -52 -171
3022 -171 31 150 234 -173 -31 -103 -150 -35 -56 -85 -93 -107 206 82 167 48 87 71 -14 178 164 -5 -215 -2
3046 -2 144 26 -23 117 80 -158 -50 59 -213 -146 3 -201 35 323 83 209 -30 -230 68 275 574 11
3068 11 -285 262 65 105 -321 115 -106 75 46 -55 -11 90 -214 -168 30 -90 84 -135 98 -29 -27 -25 69
3091 69 -141 57 -6 -33 -131 146 145 107 -134 -24 -70 -114 22 102 184 -23 0 -95 96 -96 -13 -104 -251 -244 133 -302
3117 -302 265 -293 -230 28 -247 -148 72 136 271 -160 159 195 -161 -27 143 235 -150 -322 209 135 108 169 7
$$ packed form
2953b35K93L67j36j91k43k8J55k15L44l2p3j15j90K07P9N3l95O31m2l01J65j47
2975d9p2K35R4k66K20k23K52m87L65o8n1n0j16M79n13M8L90o6nk6l20K16p5r0
2999a78l6Q3j7R0J60N2j23j39K07J40j56P1q3K07k31K39k75J61j72j48J70p4j19
3022a71K02J19Q4m07J42p2m7J15k1k9qj4L13j24Q5j19L9j6q5J92j4j69k10K13
3046bJ46j18m9J40l7k38J08J09k72O7J49k04K36K88k40J26k39k00K98K07K99n63
3068A1k96N47j97M0m26M36k21J81k9j01M4J01l04M6J98j20J74k19K33j27KKR4
3091F9k10J98o3k7r8K77jl8k41J10m6m4J36Q0Q2k07K3r5J91j92Q3r1j47PL77m35
3117c02N67n58O3K58k75R9K20O4J35m31L19L6l56J34J70R2l85j72N31p4k7O1j62
$$ plain form
3140 7 -1 -267 29 -43 314 101 -76 -16 -28 -152 -135 133 175 -206 98 -35 -218 261 92 -46 73 -134 166
3163 166 166 -42 129 179 97 121 341 187 -145 -92 199 -253 -17 -229 -149 -13 118 39 159 170 -12 137 111
3186 111 -153 20 -87 306 -246 -198 93 457 130 -27 -102 85 -91 -94 346 233 -440 -85 -271 94 41 -69
3208 -69 266 164 -44 -20 -92 -4 -1 246 -37 0 -186 -99 -13 131 -24 214 -86 64 11 24 95 -337 -129 61
3232 61 136 -123 -74 119 98 -287 -166 -217 99 -220 -25 -201 -413 -244 -14 243 15 -125 290 168 176 -236
3254 -236 -104 257 94 95 134 234 41 -71 58 199 -183 -93 99 -50 -208 -230 136 -114 -159 21 -22 119
3276 119 -58 -311 402 79 -127 -81 -176 -113 15 103 -211 95 12 163 288 -81 -68 38 -69 90 375 114
3298 114 -31 -62 -88 -390 73 31 -58 147 1 -95 111 165 20 162 -2 8 -227 -26 212 -4 143 110 194
$$ packed form
3140Gqk66K96p2L57k13j77O0j2j24J7K68M2l81L04j33j83M79j69j38J19k07L00
3163A66%k08J71N0q2K4K20j54l32N3K91m52K36k12Q0J36J31p9J20J1j82J49k6
3186A11k64J73j07L93n52M8K91L64l27j57p5J87j76lM40j13o73L55j86L65n3j10
3208f9L35j02k08K4p2Q8LK47k83L7j86Q7Q6J44j55K38l00J50n3J3P1m32K08J90
3232F1P5k59M9J93k1l85J21n1L16l19J95j76k12J69K30K57k28j40M15j22Qm12
3254b36J32L61j63JL9J00j93j12J29J41l82R0J92j49j58k2L66k50m5J80m3J41
3276A19j77k53P13l23k06M6r5O3J28Q8l14L06q3J51J25l69J3J06j07J59K85k61
3298A14j45l1k6l02M63m2q9K05j46r6K06N4j45J42j64J0k35K01K38k16J47l3Q4
$$ plain form
3321 194 180 -174 -22 3 13 -111 56 84 -68 113 44 -125 -196 208 68 179 -249 -307 -117 -143 81 90 -26
3344 -26 45 11 -308 176 244 -73 56 -167 -198 -71 -86 50 139 136 -316 -226 53 -231 73 221 -214 200 -104
3367 -104 -298 0 -275 -421 -29 -66 58 119 -201 -105 310 49 442 -17 85 256 139 191 191 43 103 -223
3389 -223 184 42 -153 128 42 142 -78 -58 -177 57 -256 -49 3 279 -116 136 -190 -129 -188 87 106 119
3411 119 26 540 104 -39 -216 67 183 35 -176 -364 -218 -72 -230 223 -118 38 -134 -185 158 -141 92
3432 92 27 27 -67 6 219 149 44 371 -44 138 133 166 269 322 -288 152 211 -78 48 309 326 -349 -447 -8 191
3457 191 -105 -247 215 -49 11 208 3 -131 176 174 -209 -121 -224 231 64 -15 95 -18 130 -103 23 -66
3479 -66 181 271 181 126 -32 -35 -83 143 -211 50 14 84 -130 58 100 46 -88 -315 81 -155 118 9 -41 71
$$ packed form
3321A94j4l54J52K5J0j24J67K8j52J81o9j69p1M04j40J11m28n8J90k6K24Rj16
3344b6P1l4l19M84O8l17J29k23l1J27j5J36Q9lm52R0K79k84L04J48m35M14l04
3367a04j94K98k75j46L92l7J24O1l20R6M15k61L93m59J02J71j17N2%j48O0l26
3389b23M07j42j95K81q6J00k20K0j19K34l13K07N2K76l95K52l26O1n9K75J9J3
3411A19r3N14m36j43j77K83J16j48k11j88J46J46j58M53l41J56j72n1L43k99K33
3432I2o5%r4P3K13p0j05L27m15J82nL3J03N3o10M40N9k89J26K61J7o75r8M39J99
3457A91k96j42M62k64O0J97k05j34L07kl83Q8j03M55j67p9J10j13J48k33J26q9
3479f6K47R0r0n5j58lm8K26l54K61l6P0k14J88M2n4j34k27L96k36K73j09n0J12
$$ plain form
3503 71 -39 -407 102 78 -68 -192 29 -142 187 105 51 -174 -264 124 133 45 -25 42 -25 -104 -324 12 -115 -98
3527 -98 149 12 -190 -39 66 -24 137 -45 -63 -97 -55 66 297 30 -33 -71 -242 160 -227 -114 192 -219
3549 -219 -189 -179 138 -28 -103 -80 118 -137 -254 119 -14 2 -237 -183 164 26 70 -60 -193 32 248 260 80
3572 80 -87 2 -252 -13 155 -110 256 41 117 -130 3 -64 48 -33 -239 -72 -29 -205 393 320 148 130 -30
3595 -30 6 126 124 -24 109 54 254 69 -116 -65 -117 -7 -297 -37 57 182 -68 -280 -32 31 -147 278 120
3618 120 -127 -313 -132 125 -157 175 -278 339 -178 -283 -48 1 261 -128 43 339 -128 -112 55 48 23 30
3640 30 -74 -390 -181 -5 -109 95 -28 -66 -14 43 188 137 73 -14 -124 -193 -67 -115 -308 -174 59 -89 258
3663 258 203 184 -186 114 184 5 -54 37 -179 -233 -47 62 123 -108 -265 -273 -80 -87 -103 -241 -270 106 -22 -192
$$ packed form
3503G1j10l68N09k4j46j24K21j71L29q2n4k25r0L88Rq8p0O7o7p9k20L36j27J7
3527i8K47j37k02J51J05r0J61j82j8l4M2J21K31k67o3l8j71M02l87J13L06m11
3549b19L0J0L17j66p5K3J98k55j17L73j33J6k39N4L47j38M4j30j33K25K16J2j80
3572H0j67Q9k54K39J68k65L66k15P6k47J33o7J12q1k06J67M3j76N98p3j72j8j60
3595c0L6J20kj48J33n5K00j85j85N1n2J10k90K60R4J25k50k12K48O3j78M25j58
3618A20k47j86J81K57k82L32m53O17n17j05K35M9K60l89J71K96m67J6J67pk5P
3640C0j04l16K09J76j04K04j23l8N2N7J45n1o4q7j10o9J26m8j93J34K33j48L47
3663B58n5j9l70L00P0j79n9R1k16n4J86J09O1k31j57qJ93pj6j38k9L76j28j70
$$ plain form
3687 -192 136 49 130 507 -383 -165 270 492 295 -85 142 249 342 115 101 -63 -160 -157 -41 -183 3 -38 99
3710 99 97 -204 -264 -67 -276 87 244 43 177 -271 -20 27 -1 -130 -212 222 165 37 -63 -50 -504 -228 10
3733 10 -204 -21 -266 6 126 -530 47 -159 -122 109 178 -37 205 -94 -67 160 7 76 64 -162 19 -149
3755 -149 -241 247 33 -53 -77 -60 -18 -300 -69 262 -232 -234 -153 65 -153 -107 145 -95 -66 28 -137 -108 170 -97
3779 -97 21 -113 -288 212 280 102 167 473 -27 -101 143 -86 -210 -70 -221 226 -165 -150 -192 -54 -234 -104
3801 -104 83 212 -7 -297 -148 43 196 -55 -105 282 -92 -173 127 164 -61 54 199 -12 31 -62 240 409
3823 409 216 155 140 283 -98 -238 -91 111 -50 41 -55 -31 -228 51 1 -32 -52 50 92 -240 141 -127 167
3846 167 -138 -63 190 91 -101 -70 78 -41 -59 63 71 -159 -95 -301 256 64 -435 110 -34 -129 20 -197 452
$$ packed form
3687a92L28q7Q1L77q90K18M35K22j97l80K27J07R3k27j4j64r7LJ16j42J86m1J37
3710I9kl01o0J97k09L63J57k01J34m48K51M7k8j29q2M34n7j28j00J3m54K76K38
3733A0k14J83k45K72J20o56N77k06L7K31O9k15K42k99K7K27j53O9j2k26J81j68
3755a49r2M88k14q6k4J7M2k82K31L31m94kQ1K18k18M6K52k40K9R4j65K9K78k67
3779i7J18j34j75N00O8j78O5L06n00p4K44k29j24J40j51M47l91J5m2J38j80J30
3801a04J87J29k19k90J49J91J53k51n0L87l74q1L00L7k25J15J45k11M3r3L02J69
3823D09j93o1j5J43l81j40J47K02j61R1r6K4j97K79n0l3k0J02M2l32L81k68K94
3846A67l05P5K53r9j92L1J48j19j8J22Qk30O4k06N57j92m99N45j44r5J49k17O49
$$ plain form
3869 452 -82 121 -355 -32 108 -81 224 143 -373 117 -101 195 171 -128 -166 10 104 -10 97 -257 -157
3890 -157 145 -61 137 494 -303 -286 -49 -123 45 -147 -208 -83 16 -42 -44 -60 98 126 -51 70 117 230 38
3913 38 29 -205 55 58 213 145 25 -12 27 -98 -162 -134 -353 -186 -48 100 -14 38 -100 -49 -161 -114 118 56 123
3938 123 -61 -150 -145 -55 -98 -159 -161 -58 -110 45 10 169 -219 118 225 -157 170 195 -236 453 253 30 -8 -52
3962 -52 33 -139 -147 206 -115 -17 45 -26 126 194 -77 282 -99 -75 73 -38 117 -17 34 -11 52 70 381 -83
3986 -83 9 31 -13 -224 133 267 211 -70 155 76 -232 259 -18 -110 -140 82 26 451 -324 4 283 18 218
4009 218 -88 -340 54 -136 -111 242 80 -1 -27 -230 -56 -136 -81 -267 -55 -22 126 26 -81 -371 63 51
4031 51 -237 26 73 128 -100 -40 -108 -9 -75 -142 -70 -52 321 79 25 215 -90 136 -57 47 -11 -65 36 64 -24
$$ packed form
3869D52n34K03m76L23J40j89L05q1n16M90k18K96k4k99l8J76R4j14J07l54J00
3890a57L02k06J98L57p97J7K37p4J68j92o1J25R9n8kj6J58K8j77J21M7J13j92
3913C8rk34K60LJ55o8j20l7L9j25o4K8k19J67J38J48j14N2j38N1j12M7K32o2O7
3938A23j84q9NR0m3o1kJ03n2J55l5J59l88L37J07l82L27K5m31O89k00k23l8m4
3962e2Q5j72qL53l21R8O2p1J52O8k71L59l81K4J48j11J55j34N1m5O3J8L11m64
3986h3R2K2m4k11L57J34n6k81K25p9l08M91k77r2l0K22n6M25p75L28K79k65K00
4009B18l06k52L94j90K5L53j62q1k6k03J74q0N5j86K12L3J48j00j07k90M34j2
4031E1k88K63M7N5k28O0o8R9o6o7P2J8L73k42n4J90l05K26j93J04n8n4J01K8q8
$$ plain form
4056 -24 -159 69 98 -133 19 480 -24 -57 -60 224 -314 -195 17 76 40 -202 53 56 319 153 103 128 -9 -202
4080 -202 32 -51 9 44 -89 -247 -183 -34 -81 -144 -160 228 -178 -56 -268 71 -4 -93 44 107 44 -11 102 89
4104 89 -117 -241 151 23 2 -259 -214 -22 87 -2 -90 -55 -39 197 184 115 2 224 299 -211 -56 154 -98
4127 -98 136 134 -121 44 213 -5 70 87 -30 -31 170 227 49 -337 -91 -76 -131 -139 -76 -64 -186 16 -43 -50 -61 -23
4153 -23 6 90 -17 102 332 72 -26 -54 106 1 -181 -15 359 271 -37 -140 148 36 -145 70 -112 -71
4175 -71 105 94 149 16 0 -163 -65 -387 97 137 -43 -11 -131 26 -73 -4 44 144 118 94 159 251 271 -85 373
4200 373 1 115 142 -374 -27 -91 -4 221 50 -11 76 202 112 -134 112 57 -59 -426 -29 -54 3 174 48
4223 48 107 140 235 131 236 72 82 -76 32 -193 112 -208 65 -43 -254 -118 -141 -10 106 10 -70 -110 142
$$ packed form
4056b4j35K28K9k31J52M61n04l3lK84n38J19K12N9l6k42K55LK63j66n0K5j37j93
4080b02K34q3O0L5j33j58O4J49m7o3j6L88m06J22k12L39p5q9J37O3o3n5J13j3
4104H9k06j24L92j28k1k61M5J92J09q9q8L5J6K36j3o9j13K22P5n10J55K10k52
4127i8K34kk55J65J69k18P5J7j17jK01N7j78l86K46J5n5qO3J2j22K02n9pj1L8
4153b3K9Q4j07J19K30k60r8k8J60j05j82J66L74q8l08j03K88j12j81K15j82M1
4175g1J76j1N5j33j6j63R8l22M84M0j80L2j20J57r9O9M8J00k6k4O5R2K0l56M58
4200C73l72J14K7n16L47o4Q7K25j71o1Q7J26r0k46K46n5j16l67L97k5N7J71j26
4223D8N9L3R5j04J05j64J0j58J08k25L05l20K73j08k11J36k3J31J16r6q0m0K52
$$ plain form
4246 142 184 -197 -63 -183 209 -51 -113 153 157 36 48 18 -164 -203 99 135 8 34 147 107 190 165 -523 30
4270 30 170 63 44 54 -10 22 64 114 123 106 -1 194 -110 -99 198 -80 148 180 -142 -88 172 34 308 349 -71
4295 -71 214 135 157 23 72 263 307 -154 164 -22 347 -99 -72 -103 -36 519 172 56 75 136 167 170 203 -141 164
4320 164 -24 -32 -32 1 -171 107 395 -242 7 -39 243 290 41 161 -65 -115 236 -332 -68 14 299 153 -119
4343 -119 49 -201 54 292 -49 -86 -80 -172 22 50 -201 -218 -108 297 98 183 148 -93 59 190 -230 -63 -107
4366 -107 41 37 26 -56 -55 38 289 30 39 -138 54 271 -167 214 -116 -41 -266 -61 -50 -72 -96 64 63 -10 235
4391 235 73 159 -37 252 -44 -196 -258 -142 214 316 212 -232 -18 143 54 80 -12 -110 -51 -398 128 88 102
4414 102 203 -79 -144 -376 31 100 -112 239 -144 296 -2 19 -169 -2 24 -322 -80 -150 -172 256 -102 -4
$$ packed form
4246A42M2l81J34j20L92k60o2K66Mj21J2l0j82l9L02L6j27K6J13m0Q3k5o88N53
4270C0J40j07j9J0o4L2M2N0Rj7j07J95l04J1K97k78K28L2l22N4K60j38K74M1m20
4295g1K85p9K2j34M9J91M4m61L18j86L69m46K7l1O7N55l47j16J9O1L1LL3l44L05
4320A64j88q%L3j72K78K88o37K49m6K82M7k49J20k26n0L51n68K64Q2K85j46k72
4343a19J68k50K55K38l41l7Or2J94K8k51j7J10M05j99Q5l5k41J52J31m20J67m4
4366a07J48mj1q2JR3K51k59Rj77J92K17m38L81l30P5k25K05J1k2k4J60jp3K45
4391B35j62Q6j96K89k96j52o2J16L56J02j04m44K14J61q9K6r2r8N9l47N26m0J4
4414A02J01k82o5k32M07O9k12L51l83M40k98K1j88J67K6l46K42p0k2M28l58R8
$$ plain form
4436 -4 132 112 193 -224 330 165 -72 146 101 186 -19 -129 -44 168 91 -30 -544 -106 -30 30 194 -65 -6 215
4460 215 195 197 241 43 212 -132 -6 89 88 -278 -48 230 -30 31 -40 127 5 105 -161 -57 -232 -45 135
4483 135 117 163 -66 -42 -144 -184 -122 -76 -139 78 -45 -17 238 -106 -111 198 -342 49 153 316 188 -129 -208 24
4507 24 84 -357 64 330 -284 104 36 -170 -122 11 9 -177 7 101 173 -186 183 154 -139 283 2 67 -35
4530 -35 10 251 -130 56 -40 161 -85 -119 345 25 123 -305 -189 210 -82 -244 -50 -92 -68 -357 -173 172
4552 172 -127 -113 -85 61 -62 97 37 242 -89 -186 345 -282 -210 91 -160 -287 162 -473 -34 115 -78 -56
4574 -56 126 -215 -55 -103 61 -104 -296 26 19 -44 -108 153 95 -245 -74 20 158 -17 76 -99 -231 -193 -104 160
4598 160 -185 11 108 47 -167 39 -31 146 277 48 95 -241 43 -371 -304 216 -60 284 262 -112 -70 294
$$ packed form
4436dJ36k0Q1m17N54j65k37K18m5Q5k05j10Q5K12p7j21n14M38P6O0J64k59N9K21
4460B15k0KM4j98J69l44J26R5jl66K30K78k60O1p1J67j22J00k66J04j75J87J80
4483A35j8M6k29K4j02m0O2M6o3K17j23K8K55l44nL09n40L91J04J63j28l17p9K32
4507B4O0m41M21K66o14L88o8k06M8J33kj86J84R4P2l59L69k9k93M22k81O5j02
4530c5M5K41l81J86r6K01k46l4M64l20R8m28J16L99k92j62J94m2K4k89J84L45
4552A72k99J4K8J46j23J59o0K05l31r7N31o27P2L01k51j27M49o35M39J49j93K2
4574e6J82l41J60m8J64j65j92L22po3o4K61n8l40J71R4J38j75R3j75j32L8Q9K64
4598A60l45J96R7o1k14K06p0J77J31k29M7l36K84m14O7N20k76L44k2l74M2L64
$$ plain form
4620 294 171 125 26 525 115 -213 -90 -297 130 195 -19 -65 -75 -8 -151 -131 84 -16 79 31 -30 -143 -116 -221
4644 -221 116 -162 -195 -136 280 225 313 3 -38 -99 -103 285 -22 -81 151 -79 170 25 -144 -155 -187 -303 108 4
4668 4 223 -138 -51 -194 176 161 129 23 -189 -66 -148 -329 36 -143 68 -49 -126 167 -21 260 -229 -67
4690 -67 276 -130 -177 -242 -236 -2 105 59 -39 272 21 42 -98 -41 -203 30 -14 -94 52 1 172 -30 -10 17 237
4715 237 51 -269 -16 -75 -285 87 -16 368 214 -134 -133 23 29 -119 20 -218 -342 -87 16 -188 183 45
4737 45 -255 67 -251 97 200 209 159 -293 55 86 82 -110 -142 -99 -122 252 209 67 236 498 -155 -200 -23 40
4761 40 97 -252 52 1 222 97 -145 122 103 40 165 -212 270 -45 -127 233 100 229 170 -34 308 5
4783 5 -149 -50 -97 -17 217 27 179 178 248 -178 211 168 -110 -39 139 -11 -91 -287 58 -139 -53 -19 119 -132
$$ packed form
4620B94j23m6r9M99m10l28J23k07M27O5k14m6j0O7j43K0K15j00R5m8o1j13K7j05
4644b21L37k78l3N9M16n5Q8l10m1o1mL88l07n9K32k30K49j45j69j1l2j16M11j04
4668DK19l61Q7j43L70j5l2j06k12J23q2j81L65j79K11j17p7K93j88K81m89J62
4690f7L43m06m7o5OK34J07m6r8L11k51K1j40N7j62K33m4q0J46n1J71k02K0K7K20
4715B37j86l20K53n9k10L72j03L84j54l48JJ56Oj48J39k38j24K55J03k04L71j38
4737D5l00L22l18L48J03Rn0m52L48L1mj92l2M3k3L74m3j42J69K62o53m5J77O3
4761D0N7l49L04n1K21j25k42K67j9o3J25l77M82l15q2L60j33J29n9k04L42l03
4783Ej54R9m7Q0K34j90J52jP0m26L89m3k78P1J78j50q0j96L45j97Q6L4J38k51
$$ plain form
4807 -132 -33 129 -293 67 -193 145 50 152 -33 -336 17 -91 130 7 132 -187 120 138 -286 -135 -50
4828 -50 -121 82 109 -89 -22 -123 -244 -89 149 132 33 97 -1 -64 -289 -22 99 236 121 -94 76 -304 -12
4851 -12 107 17 213 -162 -171 77 -173 25 -20 -142 221 -291 -35 -29 -168 -128 136 33 -217 -55 172 94 189
4874 189 83 451 -69 -113 -161 5 68 -74 27 125 -67 182 113 -42 -95 47 -203 -65 -36 -254 109 0
4896 0 -6 -64 -21 65 3 147 -167 -266 -29 -92 -178 -139 67 109 270 36 217 81 69 -27 -196 -128 5 -55 -16 7
4922 7 -190 19 69 -26 -71 5 97 -230 -156 -24 217 -209 178 -80 70 -167 209 -144 -2 -53 -61 156 3 227
4946 227 -62 14 -116 16 121 146 462 29 -113 143 -113 69 33 -202 -107 -41 -234 130 354 120 91 -40
4968 -40 44 -111 122 142 156 221 -253 88 155 -140 -3 223 -72 64 20 -3 -357 196 -87 26 -137 -135 37
$$ packed form
4807a32R9J62m22L60k60L38r5J02j85l03L53j08K21j23J25l19L07J8m24J51Q5
4828e0p1K03K7j98O7j01j21J55K38j7r9O4r8o3k25K67J21J37j15k15J70l80K92
4851a2J19r0J96l75rK48k50J98m5j22L63n12K56Oj39M0K64j03k50J62K27p8R5
4874A89j06L68n20m4m8J66O3j42J01R8j92K49o9j55n3J42k50J38K9k18L63j09
4896@on8M3Q6o2J44l14r9K37o3q6L9K06M2J61k34J81j36j2r6j69O8J33o0L9K3
4922Gj97K09N0r5m5P6R2l27P4J32K41m26L87k58J50k37L76l53J42n1qK17j53K24
4946B27k89P6j30J32J05K5L16m33j42K56k56J82l6k35R5O6j93L64K24k34k9j31
4968d0Q4j55K33K0J4O5m74L41O7k95J37K26k95J36m4k3l54N53k83J13j63KJ72
$$ plain form
4991 37 348 88 78 -132 -163 62 -291 51 -135 18 -153 -16 -112 162 -45 -138 -294 -175 183 58 -23 -223
5013 -223 -85 -52 -208 41 58 71 174 14 308 -9 106 -11 67 -206 -37 -171 168 106 42 29 -34 7 159
5036 159 -92 -55 177 264 227 283 -148 68 -277 96 92 -17 0 83 -238 -61 -243 -190 -33 -173 -108 497 386
5059 386 -195 152 293 -2 -115 23 11 -59 -183 -84 54 -191 -118 183 161 32 19 -179 23 -323 270 70
5081 70 289 320 209 -117 -54 -38 97 108 -20 41 73 3 75 -75 12 66 -163 -317 266 -37 -272 31 -152 51
5105 51 21 23 174 -31 25 32 -22 -135 116 -219 -77 -75 47 64 -43 11 213 -27 103 83 118 25 81 -183 133
5130 133 47 12 80 -110 -115 -124 323 -39 282 -76 101 65 -84 -184 180 133 -62 -108 176 -105 -184 47 124 -63
5154 -63 21 -36 0 -96 -292 183 217 109 113 151 142 -15 -50 -106 -358 -159 84 -248 -2 53 98 374 274 203 -8
$$ packed form
4991C7L11k60j0k10l1K25l53L42j86J53j71J37r6K74k07r3j56J19L58j25q1k00
5013b23J38L3j56K49J7J3J03j60K94l17J15j17P8k73J69j34L39o2o4j3o3M1J52
5036A59k51L7K32Q7l7N6m31K16l45L73mj09J7Q3l21J77j82N3J57j40O5O05j11
5059C86n81L47J41k95j13J38j2p0j24R9J38k45P3L01k2j29j3j98K02l46N93k00
5081G0K19L1j11l26O3J6J35J1j28O1L2p0P2j50Q7N4k29j54N83l03k35L03j83K03
5105E1l0KJ51k05N6Pn4j13K51l35J42KJ22J7j07N4K02k40J30k0L5r3N6k64L16
5130A33q6l5O8j90nrM47l62L21l58J77l6j49j00L64m7j95m6K84k81p9K31P7j87
5154f3Q4n7L6r6j96M75L4j08ML8rj57l5n6k52J99K43l32K46N5M5K76j00p1k11
$$ plain form
5179 -8 201 -290 -217 33 -372 142 287 -196 250 172 109 40 119 85 -3 -15 98 220 246 41 11 335 -165 57
5203 57 34 -108 -87 -4 -5 52 -105 -354 163 205 -207 -44 -2 87 -263 -70 107 44 22 63 -186 82 -121 20
5227 20 108 107 -118 -21 -8 -5 221 -147 -69 -31 -153 93 65 -116 120 -155 120 133 -235 -91 50 -19 -239 -201 -183
5252 -183 -44 -303 -12 -18 265 69 257 -168 -93 88 73 -184 -56 36 -213 36 8 87 -59 -7 -50 279 203
5275 203 205 -60 191 57 121 -93 70 -386 -205 18 -122 -136 -182 -62 -44 -146 5 -335 88 -289 -179 -2
5297 -2 79 137 -111 10 125 267 192 162 255 -34 41 -132 -180 -84 -99 -354 -167 104 9 -217 -284 -70 30 141
5321 141 -282 -88 -81 -99 86 247 285 -60 -240 -93 365 97 187 188 336 108 86 22 -27 166 238 -75 10 -283
5345 -283 158 -8 8 -135 8 -187 -95 -226 -106 84 271 36 -7 -165 -145 -180 98 -109 83 154 -11 112
$$ packed form
5179hK09m91P3K50m05N14J45m83M46p8o3o9P9l4q8j2J13J22K6k05l0L24n00K22
5203E7k3j42K1Q3jN7j57k49N17M2m12J63M2Q9l50J93J77o3k2M1k49K68k03J41
5227B0Q8jk25R7J3LK26l68P8L8j22K46k8j81K36k75K75J3l68J44J41o9k20L8J8
5252a83J39k59K91oK83j96J88m25P5J81j5k57J28R2k49K49k8P9j46N2m3L29p6
5275B03Kk65K51j34O4k14J63m56J81K23j40j4m6J20J8j02J51l40M23l77J10J77
5297bQ1N8k48J21J15J42p5l0R3k89P5j73m8R6j5k55J87K71r5k26o7K14J00J11
5321A41m23J94Pj8J85J61L8l45j80J47M58k68R0JJ48k28k2o4m9J93P2l13Q5k93
5345b83M41j66J6j43J43j95R2j31J20J90J87k35m3j58K0l5K78k07J92P1j65J23
$$ plain form
5367 112 -22 2 4 -131 -72 -163 -5 5 -59 -109 245 109 209 -61 105 335 50 62 135 -7 -139 -305 -246 123
5391 123 -103 -152 4 46 70 30 81 -57 -156 203 -220 -165 -22 108 104 -102 -96 143 -201 39 -28 44 -10 178 60
5416 60 85 -290 30 -118 -21 3 280 124 57 130 16 137 70 222 -162 140 286 75 -94 85 83 62 -157
5439 -157 39 -7 -43 -138 91 261 189 149 314 -161 52 -34 -87 148 62 18 -12 -303 351 220 -205 76 21 -457
5463 -457 -77 101 7 319 -68 -64 183 -153 -59 184 200 81 102 -75 -238 -82 -99 267 -11 -77 -63 73 44
5486 44 23 -7 -165 -31 263 159 -57 -153 209 -104 -236 -250 -153 148 108 373 -26 -77 20 90 95 -47 -158 158
5510 158 -19 -33 -185 -80 102 -64 103 20 209 50 321 2 -54 0 108 -109 -153 20 -35 -14 -104 165 -139
5533 -139 119 72 214 133 -39 -85 228 108 -16 191 -46 79 7 -42 174 -211 -177 -217 -184 -381 -346 18 38
$$ packed form
5367A12j34K4Kj35N9r1J58J0o4n0L54j36J00k70J66K30k85J2P3j42j32j66N9L69
5391A23k26m9J56M2K4m0N1j38r9L59m23N5J43J30mk06OK39l44K40o7P2n4J88j18
5416F0K5l75L20j48R7K4K77j56o7P3j14J21o7J52l84L02J46k11j69J79kk1k19
5439a57J96m6l6r5K29J70p2m0J65m75K13q6n3K35q6m4l0k91O54j31m25K81n5m78
5463d57L80J78r4L12l87MK47l36R4K43J6j19K1j77j63J56j7L66k78o6J4J36k9
5486D4k1l0j58J34K94j04k16r6L62l13j32j4R7L01m0K65l99n1R7P0Nj42j11L16
5510A58j77j4j52J05J82j66J67q3J89j59K71l19n6N4J08k17m4J73n5K1r0K69l04
5533a39K58m7J42q1j72m6L13j20j24K07k37J25p2m9K16l85L4m0L3j97L5L64K0
$$ plain form
5556 38 117 -3 24 -13 78 -51 134 129 207 -113 102 52 17 287 -117 319 -219 39 -148 30 105 -71 -7 27
5580 27 73 -45 275 35 -239 45 188 1 350 -150 -178 131 -104 -10 -50 -51 -130 -246 -103 207 4 40 -17
5603 -17 65 -232 306 -79 -87 216 -59 -31 316 106 -74 -60 150 -39 -129 46 54 -81 -100 -110 -119 -21 129 161 -160
5628 -160 -115 214 -106 -110 218 2 -7 -263 -108 110 -395 121 -55 202 -28 11 -12 66 -7 -51 -47 9 -112 -34 -23
5653 -23 10 -218 -83 75 -165 -111 42 61 -134 -148 -46 43 -81 41 -114 64 -64 -162 -132 -32 34 -163 -131
5676 -131 89 -64 101 209 76 31 -164 13 318 -110 -142 -256 -232 14 40 197 -3 3 -96 160 3 -83 359
5699 359 128 -221 -160 -97 239 -22 69 -133 4 -26 -168 86 109 -94 -61 217 93 -25 -168 -190 -305 -53
5721 -53 59 -149 -291 -37 220 74 -81 -161 207 35 -20 265 163 102 -273 25 -3 93 115 258 88 -2 -274
$$ packed form
5556C8P9j20K7l7R1j29J85nP8l20K15n0l5K70m04M36n38K58j87J78P5j76O4L4
5580B7M6j18L20k40k74K84J43j87L49n00k8L09k35R4m0jp9j16J43L10k03L6n7
5603a7Q2k97N38l85qL03k75K8L47k10j80J4K10j89r0J75Qj35j9j0rR8J50L2l21
5628a60M5L29l20mL28k16rk56J55K18n05N16j76K57k30L9k3P8p3m4MN6j21P8J1
5653b3L3k28J35J58k40N4J53J9j95j4J02Q9j24J22j55J78j28r8L0J00O6j97L2
5676a31K20j53J65J08j33m5j95J77L05m28l2j14K4K46K6J57k00Or9K56j57q6M42
5699C59k31l49O1O3L36k61R1k02J37l0j42K54K3k03L3K78j24j18j43k2j15K52
5721e3J12k08j42K54K57j46j55q0L68j72n5K85j02o1l75K98k8R6K2J43j70r0k72
$$ plain form
5744 -274 62 174 -327 -183 36 -7 -144 -190 -3 245 -251 -17 -128 -15 19 148 151 -103 0 -19 240 61
5766 61 -173 -133 163 19 -102 -317 -104 -2 0 293 -19 217 -208 62 82 -9 6 -158 264 13 47 -161 -140
5789 -140 -178 -55 123 45 -54 -166 -112 66 71 -7 -40 -89 28 129 81 52 -127 -87 -232 -237 -166 224 64 141 368
5814 368 208 182 -54 -126 -80 -3 308 439 30 361 3 126 78 -170 -420 13 -217 216 10 -400 -258 -204
5836 -204 -99 233 180 -99 8 150 -32 26 42 -12 16 98 65 114 -51 269 153 68 53 86 -297 8 -290 -161
5860 -161 -3 340 -116 -52 55 7 119 -114 0 221 -85 127 30 -40 -378 -46 -62 201 -4 46 463 138
5882 138 189 199 -137 -182 -180 224 168 -141 -151 100 91 -100 -178 166 -42 -245 67 -82 -4 -76 -135 -32 -39 -24 31 224
5908 224 472 -100 41 -51 -20 -289 116 205 -51 -315 -198 -4 -34 97 -145 -116 93 -2 15 145 -216 58
$$ packed form
5744b74L36J12n01J44K19m3j37m6J87K48m96K34j11J13L4J29Lk54J03j9K59j79
5766F1k34M0K96j44j21k15K13J02KK93l12K36m25K70K0r1J5j64M22k51L4k08K1
5789a40l8J23J78p8r9j12N4J78Np8l3m9J17J01m8k9j79M0j45nP1L90j60P7K27
5814C68j60k6k36p2M6P7L11J31m09L31l58J23m8k48k50M33k30M33k06m10J42N4
5836b04J05L32n3k79J07J42j82N8J6n4K8Q2l3M9j65L20j16q5j5L3l83L05k98J29
5860a61J58L43m56O4J07m8J12k33J14K21l06K12r7p0l38L32j6K63k05N0M17l25
5882A38N1J0l36m5KM04n6l09j0K51rj91p8L44k08k03L12j49P8p2n9J03pJ5N5J93
5908B24K48n72J41r2L1k69M05Q9k56k64J17J94l0J31k42K9K09r5J7J30l61K74
$$ plain form
5930 58 122 21 239 -266 -80 22 -73 45 -26 112 -156 157 -50 -70 105 280 71 2 208 105 50 32 72
5953 72 -44 30 -311 216 3 43 -93 154 18 -326 -89 -396 11 -21 88 -127 -3 128 52 207 97 211
5975 211 -76 95 110 -61 -35 188 -108 -52 -102 153 29 -226 109 -347 -191 -249 197 -14 131 167 -109 -47
5997 -47 330 211 117 324 -8 -58 -136 -10 -39 0 12 3 73 210 166 222 -175 2 -33 73 3 41 -35 -162 -136 62
6023 62 99 -231 -65 -54 -18 -159 -95 38 -61 -258 -101 -90 110 275 161 69 -245 -66 -7 -73 -177 27 403
6046 403 75 117 12 40 14 -5 -86 210 -254 25 -154 -37 193 6 114 26 7 56 -200 -250 281 -15 202
6069 202 249 101 61 83 371 132 -63 117 -130 -42 266 -26 -185 -56 30 -195 81 48 -10 212 -307 194
6091 194 -28 119 -56 368 311 213 174 -66 79 -111 139 -156 12 80 60 50 -126 64 -85 -120 -188 -11 62
$$ packed form
5930E8O4j01K18n05J86J02r5J18p1J38k68L13k07k0J75J75k09o9K06j03n5j8M0
5953G2j16P4l41N27k13M0j36K47j36l44K37l07M07l2J09k15J24J31p6J55j10J14
5975B11k87J71J5j71K6K23k96N6n0K55j24k55L35m56J56n8M46k11J45L6k76O2
5997d7L77j19r4K07l32n0p8J26k9L9J2rP0J37m4N6l97J77l5J06p0L8p6j27K6J98
6023F2L7l30J66J1L6j41O4J33r9j97J57J1K00J65j14r2l14J79N9o6j04K04L76
6046D03l28M2j05K8k6j9q1K96m64K79j79J17K30j87J08q8j9M9k56n0N31k96K17
6069B02M7j48m0K2K88k39j95J80k47Q8L08k92j59J29Q6k25K76l3n8K22n19N01
6091A94k22J47j75M24n7r8l9k40J45j90K50k95J68O8k0j0j76J90j49l5o8J77P3
$$ plain form
6114 62 20 22 -164 -49 127 -7 93 -301 -476 99 230 22 117 199 -89 -54 -113 -41 98 308 -148 -86 -164 -222
6138 -222 -7 161 71 -231 -13 -34 150 -58 -171 -63 -137 -19 -159 -28 -408 -148 -96 -169 -128 59 4 -50 -63
6161 -63 122 117 81 -67 348 163 54 128 2 -40 144 -89 89 43 -104 -188 -151 -154 -133 38 -36 -98 217 167 -58
6186 -58 -16 -167 -335 9 199 76 374 52 -44 -318 -69 163 -330 -222 114 12 -52 -133 79 -313 -188 59
6208 59 -11 -79 -469 -9 72 -244 -293 231 101 -107 127 80 51 51 50 146 -31 -76 288 -145 7 113 -115 97
6232 97 -181 -357 70 -46 -77 32 147 -159 -27 -172 34 188 -208 -193 -368 125 -154 124 181 50 162
6253 162 255 -104 248 -139 -150 258 32 -228 117 281 -127 -171 212 -1 -331 -104 126 55 -130 -11 90
6274 90 174 -93 126 -62 179 -15 -55 119 18 246 268 -84 -2 6 153 -284 -292 239 279 6 18 -65 -79 159
$$ packed form
6114F2m2Kj86J15J76j34J00l94j75N75J31k08R5Q2k88L5n9P2J39K10m56O2p8n8
6138b22K15J68r0l02K18k1J84k08j13J08p4J18j40J31l80K60N2p3M1J87n5n4j3
6161f3J85nl6j48M15j85j09P4j26m2J84k33J78m6j47q4L7lK1J71p4o2L15n0k25
6186e8M2j51j68L44J90j23K98l22r6k74K49K32m93J08L36j02o4q1K12l92J25K47
6208E9p0o8l90M60Q1l16m9N24j30k08K34m7k9%jR6j77m5L64m33J52J06k28K12
6232I7k78j76M27j16l1J09J15l06J32j45K06J54l96J5j75M93k79K78N7j31J12
6253A62R3l59L52l87j1M08k26k60L45J64m08m4L83k13l30K27K30p1j85J19J01
6274I0Q4k67K19j88K41j94m0J74j01K28K2l52Q2QJ47m37qN31M0k73J2q3j4K38
$$ plain form
6298 159 -366 -75 -136 -200 -170 -139 -70 0 -130 10 43 -429 -139 -70 23 98 16 -72 -32 -108 99 288 -74 -214 13
6323 13 136 -24 159 -116 -67 208 24 -164 182 72 -17 -54 12 184 -113 -137 199 257 -180 -42 132 -67
6345 -67 43 -18 -194 9 -148 257 212 -121 -21 207 -14 -185 162 155 -100 -321 174 255 161 -352 234 9
6367 9 341 -34 311 -69 162 164 -99 332 -35 49 94 11 -319 -350 -115 -71 -13 33 -189 85 91 134 63 90 113 -255
6393 -255 -171 9 18 127 -95 -22 113 -145 45 92 78 239 -71 200 192 189 106 58 -79 -26 -86 -20 103 125 -77
6418 -77 129 -22 87 161 -114 -48 -97 -514 -125 -80 27 163 -157 94 11 -15 133 131 9 -15 46 82 350 -311
6442 -311 -249 208 -140 -368 32 171 77 67 -248 87 100 -203 -31 102 -175 16 75 226 -321 -183 -10 -92
6464 -92 -192 -21 6 135 -68 49 1 11 -285 -8 409 69 -216 222 222 -197 264 -15 -24 31 -82 133 -53
$$ packed form
6298A59n25K91o1o4L0L1O9P0j30J40L3m72K90O9R3P5q2q8M0p6K07J89l62j40K27
6323A3J23j60J83k75M9K75j84j88L46j10q9l7O6J72k97k4L36N8m37J38J74j99
6345f7J10o1j76K03j57M05m5l33J00K28k21j71L47pk55k21M95Q1r4n13N86k25
6367IL32l75L45l80K31Kk63M31l67Q4M5q3l30l1K35M4N8M6k22K74OM3p1K7K3l68
6393b55Q4J80RJ09k22P3J35k58J90M7j4J61l10K71qlq3m8j37N3o0O6J23K2k02
6418g7K06j51J09P4k75O6m9m17L89M5J07J36l20K51q3k6J48kj22k4O1L6K68o61
6442c11O2M57l48k28M00J39r4j0l15L35J3l03J72J33k77J91N9J51n47J38J73q2
6464i2j00J71K7J29k03J17m8J0k96K77M17l40k85M38%m19M61k79rN5j13K15j86
$$ plain form
6487 -53 -87 -55 -82 148 -170 -54 137 23 -22 -59 -54 -40 -56 281 68 -56 -64 129 -49 -44 177 -93 108 77 -2
6512 -2 217 -25 -140 -54 67 -101 -45 -174 -87 60 -15 -89 -376 -20 19 157 60 -145 116 -144 257 227 -52
6535 -52 126 265 -155 -8 67 -17 228 8 -177 -127 -12 4 168 -172 -23 61 6 -245 -169 -247 314 -250 -48
6558 -48 153 149 -83 229 130 -250 -15 131 382 -51 -61 -91 -164 168 101 -185 105 150 -171 -140 -66 10 150 -177
6582 -177 -44 83 -26 -20 46 88 -66 10 -149 -52 94 245 363 170 15 23 175 97 -288 -57 60 -390 -168
6605 -168 -209 -12 -188 -9 -99 205 51 -338 65 130 -86 36 139 52 -46 -62 417 -188 -6 -125 -79 196
6627 196 68 108 26 -183 127 -275 373 -119 -3 -325 -61 26 129 124 65 -261 -177 39 -105 -216 2 655
6649 655 -136 305 232 -48 -161 128 267 188 -85 -49 34 -68 3 77 48 358 -157 -55 89 -191 -11 199
$$ packed form
6487e3l4L2k7K30l18J16J91j14m5l7NJ4j6L37k13j24qJ93j78NK21k70K01l1p9
6512bK19k42j15Q6J21j68N6j29Q7J47p5p4k87L56L9J38r7k05K61k60M01l0k79
6535e2J78J39m20J47P5q4K45k20j85N0J15J6J64l40J49Q4n5k51P6p8N61n64K02
6558d8K01mk32L12r9l80K35J46K51m33j0l0p3L32o7k86K90M5l21L1P4P6J40l27
6582a77J33J27j09OO6M2j54P6j59R7J46J51J18j93j55QJ52p8l85K31J17m50K22
6605a68m1J97j76J79r0L04j54l89M03O5k16J22J03q7r8j6M79o05J82j19M6K75
6627A96j28M0q2k09L10m02O48m92J16l22K64Q7J03nn9l26Q4K16j44j11K18O53
6649F55p91M41p3k80j13K89J39p9k73L6Q3j02P1P4k9L10n15J02J44k80J80K10
$$ plain form
6671 199 -126 129 142 -305 104 -344 -190 299 86 15 86 4 33 -123 -172 156 137 68 407 -57 184 38 -130
6694 -130 183 -21 -164 97 156 105 257 -265 -42 -16 -102 -53 251 -402 17 -45 -143 -66 -112 -26 181 48 -176
6717 -176 -158 165 -265 297 174 151 -181 241 3 165 -136 -62 105 -29 16 53 146 -43 -90 70 -107 -93 -269
6740 -269 -235 -117 -121 -106 -32 14 3 13 132 280 -68 471 -66 -104 -18 -56 371 -39 69 162 -190 40 -10 108
6764 108 74 32 -177 193 -116 -44 192 152 -17 -462 -76 -13 -29 -198 260 111 -20 -104 123 12 21 79 265
6787 265 197 -170 -32 175 260 -4 177 -146 -27 -50 -222 279 -234 112 224 -128 19 -240 -109 -54 2 -368
6809 -368 226 1 106 -175 76 191 -60 -64 146 138 -16 -208 -192 -28 -15 -135 131 -156 -547 -108 -104 2 -4
6832 -4 -186 -112 -98 -392 -181 294 46 -324 -14 300 -157 -187 -54 156 62 102 265 -8 70 54 -101 118 -47
$$ packed form
6671A99l25K55J3m47M09m48J54M89k13p1P1q2K9j56m9L28j9o9L39m64K41j46j68
6694a30L13k04j43K61N9n1J52n22K23K6q6M9L04o53M19o2r8P7m6Q6K07j33k24
6717a76J8L23m30N62j23k3l32M22k38J62l01P4J67j34M5L7R3j89m7J60j77J4j76
6740b69L4J18mJ5P4M6j1J0J19J48l48N39n37l8Q6l8M27m10J08R3l52K30n0J18
6764A08l4m2k09L70l09P2K36m0j69m45L86O3j6j69M58j49j31q4K27j11RN8J86
6787B65o8l67J38K07Q5k64J81l23J19k3j72N01n13L46J12l52J47k59J31N5N6l70
6809c68N94k25J05k81K51J15k51mK10qj54j92J6J64J3j20K66k87l91M39MJ06o
6832dj82P4J4k94K11M75k48l70L10L14m57l0J33K10r4M0J63k73P8j6j55K19j65
$$ plain form
6855 -47 -373 -182 -266 -128 32 163 -49 -4 226 37 -167 -300 79 290 149 -319 -203 223 45 -73 187
6876 187 341 1 116 116 53 -174 251 116 351 -12 124 167 108 -284 -116 61 45 -295 60 -157 183 -15
6898 -15 74 98 127 -311 51 243 -72 152 -55 211 -60 45 -122 27 -188 -17 -84 -168 -74 3 62 104 -26
6921 -26 -23 24 189 -157 106 365 -202 39 27 -177 -189 -169 -192 83 -141 -20 191 46 114 88 313 284 -138 34
6945 34 -21 40 -171 -104 -212 -188 -59 -110 -5 -111 -101 -141 109 -10 -40 87 141 115 190 337 265 88 106 -153 16
6970 16 198 87 -160 39 -214 71 -70 -275 -158 216 56 -141 -18 -204 92 -163 67 95 37 93 58 27
6992 27 45 -98 93 99 104 -5 -104 86 -127 -79 -198 526 142 30 -105 9 10 24 82 7 32 -20 67 166 -97 -325
7018 -325 -196 -171 -43 -73 -173 48 -116 77 144 -305 -158 172 69 166 79 121 450 58 -288 213 132 -270
$$ packed form
6855d7l26J91q4J38J60J31k12M5K30j89k04j33L79K11j41m68J16M26j78j18K60
6876A87J54l40J15%o3k27M25j35K35l63J36M3n9l92J68J77j6l40L55k17L40j98
6898a5Q9K4K9m38L62J92l15K24k07K66k71J05j67J49k15J71o7q4R4P7N9M2j30
6921b6LM7J65l46K63K59n67K41j2k04j2K0k3K75k24J21K11j45O8k6K25k9m22J72
6945C4n5O1k11O7j08K4J29n1J05j06J0m0K50j19l0J27N4k6P5J47p2j77J8k59J69
6970A6J82j11k47J99k53K85j41k05J17L74j60j97J23j86K96k55K30K8n8N6l5l1
6992B7J8j43J91ONj09r9J90k13M8j19P24l84j12j35J14JJ4N8p5K5n2Q7R9k63k28
7018c25J29K5J28l0j00K21j64J93O7m49J47L30j03R7q7M2L29l92l46N01q1m02
$$ plain form
7040 -270 -313 -52 105 19 -338 -52 191 74 -15 -34 228 356 62 218 3 241 249 -95 -212 -294 -189 254
7062 254 167 -62 18 105 178 86 141 161 23 -159 -84 -306 -260 158 127 81 154 -262 -59 -155 -65 -224 318 -133 -199
7087 -199 97 141 48 20 190 108 -152 -48 252 -18 27 167 158 42 -110 -53 251 -30 38 -84 -30 37 -85 -146
7111 -146 -333 -291 -277 116 -157 -169 146 96 -48 94 -7 86 120 -6 -137 -171 -174 -49 244 76 140 -231 -79
7134 -79 -382 -21 -7 -307 -58 -41 -36 185 -37 -130 -179 272 72 17 -146 -8 45 43 -110 144 -282 -246 32 5
7158 5 264 -47 -165 105 118 -16 -54 -9 -6 -111 -219 90 -281 -253 7 -6 -205 -205 -145 206 -74 81 127 157 -77
7183 -77 -28 -59 252 217 -46 421 -413 -53 -88 -117 282 76 21 93 -326 175 88 -18 -86 -138 245 205 -325 -152
7207 -152 -52 91 17 35 198 -113 103 124 -31 295 -36 96 44 255 -167 276 155 -132 -46 146 93 -256
$$ packed form
7040b70m3K61J57q6l57K86K43j17q9j9K62J28k94J56k15K38Ql44j17q2J05M43
7062B54q7k29Q0Q7P3r2N5K0j38j82P5k22M6M18l1m6P3m16K03r6R0j59N42m51o6
7087a99K96M4r3k8J70q2k60J04L00k70M5J40rj16j52N7L04k81O8j22N4O7j22o1
7111a46j87M2J4L93k73j2L15n0j44J42j01R3L4j26j31l4lJ25K93j68O4l71J52
7134g9l03L61J4l00K49J7NK21k22r3m9M51k00n5j63J38N3kj53K54m26L6K78k7
7158EK59l11j18K70J3j34l8M5Lj05j08L09l71K8K60j3j99%O0L51k80J55M6L0k34
7183g7M9l1L11l5k63M67q34L60l5k9L99k06n5P2m19N01q7j06o8n2L83m0n30J73
7207a52J00J43p4J8J63l11K16K1j55L26l31J32n2K11m22M43j21k87Q6J92n3l49
$$ plain form
7229 -256 206 -19 37 -454 -21 12 219 260 -301 102 -185 61 42 296 -101 -129 123 -246 92 -207 -232 103
7251 103 -119 257 55 362 -44 87 -111 41 -120 -293 -79 19 4 -163 123 -45 -19 -130 234 121 310
7272 310 -219 159 378 14 190 200 -165 -319 -171 -178 -24 -20 98 -232 104 -64 -42 -225 -92 23 65 44 112
7295 112 78 -135 -51 -14 -118 -16 58 -57 156 -51 118 -101 342 -51 244 114 411 41 57 -52 121 -88
7317 -88 104 -14 -121 314 11 -143 68 -134 -77 23 -214 -191 124 121 -114 36 -90 113 -51 -218 -258 186
7339 186 236 22 202 35 -89 -116 -27 -370 -152 -41 259 112 -388 -255 -363 160 -336 -20 177 267 -280
7360 -280 -344 -32 -159 -95 -13 149 421 154 -263 58 69 -48 -106 -4 174 -246 -206 -201 44 -33 78 152 -200
7383 -200 -131 -299 37 13 -145 -67 -43 -13 -267 113 34 -202 -15 -160 125 -2 164 404 285 192 -72 36
$$ packed form
7229b56M62k25N6m91M33L3K07M1n61M03k87K46j9K54l97k8K52l69L38k99k5L35
7251A03k22L76k02L07m06J31j98J52j61j73K14R8j5j67K86j68K6j11L64j13J89
7272C10n29L78K19l64J76J0l65j54J48pJ54MJ18l30L36j68K2j83J33J15M2k1O8
7295A12l4k13Q4L7j04J02P4j15K13k07J69k19M43l93K95j30K97l70J6j09J73k09
7317h8J92j18j07M35l03j54K11k02N7J00k37K3L15lk35J50j26K03j64j67m0M44
7339A86N0k14J80j67j24k7Q9l43K18J11L00j47n00J33j08N23m96L16J97R0n47
7360b80o4L12j27O4Q2J62K72k67m17L21J1j17n8J02J78m20M0NK45p7J11P4l52
7383b00O9j68L36k4j58P8K4L0k54L80p9k36J87j45K85j27J66K40j19r3k64J08
$$ plain form
7405 36 -12 -171 17 230 -57 -5 -129 222 82 -215 157 65 -137 -171 193 -148 115 -96 -37 37 -40 -66 189
7428 189 313 235 -200 309 28 -161 254 -200 323 -97 -60 -124 197 68 214 116 -154 -55 147 -5 -267 -115
7450 -115 23 16 -326 -111 -187 205 -81 69 6 -59 11 -57 220 234 -57 270 6 -149 -152 -135 78 48 -213 -76
7474 -76 -115 -32 -8 -24 217 -22 -179 -38 -39 -36 -215 -238 318 -29 377 -172 -248 10 -72 25 140 -365 71 349
7498 349 -190 323 -14 142 14 50 224 253 80 -228 90 101 21 134 149 -79 -425 205 80 120 -378 9
7520 9 211 206 78 245 -138 -161 -49 -268 -28 -205 -50 147 159 106 -106 218 -2 -150 -151 209 40 89 328
7543 328 -51 10 39 -99 -67 -143 -134 -92 33 11 -198 -83 -191 118 -258 204 111 -293 -248 -12 133 -228 -220 1
7567 1 503 -217 273 137 12 -214 -77 13 26 -99 -1 -133 73 -203 106 283 11 -22 -103 91 -371 139
$$ packed form
7405C6m8j59J88K13k87N2j24L51j40k97L72r2k02l4L64l41K63k11N9P4p7k6K55
7428A89J24p8m35N09k81j89M15m54N23m20L7o4L21j29J46r8k70R9K02j52k62J52
7450a15J38pl42K15p6L92k86J50o3o5P0o8K77J4k91L27k64j55lJ7K13l0k61J37
7474g6l9Q3K4j6K41k39j57J41jLj79k3N56l47M06n49p6K58q2R7J15n05M36K78
7498C49n39N13l37J56j28L6J74K9j73l08L18J1q0J13J5k28l46O30j25M0m98L87
7520IK02nj28J67l83k3J12k19K40j77J55J97J2n3k12L24k20j48jL60j69M9K39
7543C28l79O1K9j38L2p6RM2J25k2k09J15j08L09l76M62r3m04M5K36J45l61QK21
7567AN02p20M90j36j25k26J37R0J3j25R8j32K06k76L09J77k72l3q1J94m62N10
$$ plain form
7589 139 -123 61 68 -196 22 57 -291 -120 5 -156 70 -375 266 85 -6 17 39 -268 -284 82 227 -424
7611 -424 58 114 -78 -294 5 387 -44 -164 172 140 -145 69 -262 -40 26 277 114 -78 41 -118 -144
7632 -144 119 -2 -51 243 244 -4 -307 101 -230 -13 -375 -65 -45 12 48 147 -10 -55 61 149 -4 -88 223
7655 223 75 75 -48 93 49 -127 -254 -221 -18 -8 -13 -66 62 -233 -216 -176 19 -174 -107 -21 -25 20 20 223 103 -140
7681 -140 97 -295 36 72 93 219 -147 -311 59 37 -74 -36 29 -280 65 262 -74 81 -155 -144 -169 -88 -43
7704 -43 24 -61 -11 -106 -52 52 282 -158 -163 -170 280 -258 -15 -51 -74 -137 296 165 -175 59 -650 91 -50 -44 356
7729 356 23 -36 241 111 -93 -249 41 -24 12 -121 -34 -42 168 8 -111 339 235 45 -9 238 -58 159
7751 159 -32 0 -55 -219 221 267 -325 -276 -98 -219 -192 3 79 -32 -41 -46 -97 13 156 -178 -16 94 -251 157
$$ packed form
7589A39k62J84Pk64K18L5l48J71J25j61K26m45O41j81r1K3K2l07j6L66J45o51
7611d24M82N6j92k16K99L82m31j20L36l2k85K14l31K22O6K51j63j92J19j59k6
7632a44K63j21m9K94Jk48l03M08l31K17l62L10K0N7L6R9j57m5J16Q8j53q4L11
7655B23j48%j23J41m4j76j27L3K03J0nn3J28k95J7M0J95j93O7Q6mM5%K03j20k43
7681a40K37l92L31L6K1J26l66j64L70k2j11L8O5l09L45J97l36J55k36J1k5Q1M5
7704d3O7q5N0r5N4J04K30m40npM50n38K43l6k3o3M33j31l40K34p09P41j41OM00
7729C56l33n9K77j30k04j56K90o5L6j33Q7qK10j60j19M50j04j90n4K47k96K17
7751A59j91L2n5j64M40M6n92M9J78j21K7J95P6j11rnn1J10J43l34J62J10l45M08
$$ plain form
7775 157 53 105 74 100 155 -30 200 45 -39 231 -30 205 -106 249 -23 124 -72 217 -263 -6 25 -224
7797 -224 186 174 61 -43 123 -111 302 -44 72 135 -356 -44 298 -54 17 -160 57 272 -27 8 46 81
7819 81 18 -87 187 104 -209 -206 -73 32 76 189 242 -164 35 -58 112 -60 -57 394 92 -134 -46 145 72 46
7843 46 6 159 -104 216 -146 -13 -94 -262 -84 119 46 -311 -212 -39 -143 -180 7 85 -26 188 52 148 14
7866 14 -54 -40 74 25 -74 61 -224 158 29 80 417 317 -92 296 168 -76 -82 -180 -279 -347 112 102 -375 -264
7890 -264 289 57 333 195 32 210 38 -93 152 -258 -8 -50 -205 108 7 197 25 -411 59 130 196
7911 196 126 -190 -130 199 -25 131 9 -169 61 80 50 5 275 -55 91 356 308 45 141 36 -325 -135
7933 -135 -218 95 177 18 111 -145 9 318 -16 -189 -92 385 -31 -116 -37 -32 -11 0 -237 425 54 359 174
$$ packed form
7775A57j04N2l1K6N5j85K30j55q4K70k61K35l11L55k72J47j96K89m80K57L1k49
7797b24M10j2j13j04J66k34M13l46J16O3m91L12L42l52P1j77K17K15k99L5L8L5
7819H1o3j05K74q3l13LJ33J05M4J13N3m06J99r3J70j72LM51l02k26Q8J91p3k6
7843D6m0J53k63L20l62J33q1j68J78K03p3l57R9J73j04l7J87P8j11K14j36R6j34
7866A4o8J4J14m9r9J35k85L82j29N1L37j00m09L88j28k44or8r9o8M59j0m77J11
7890b64N53k32K76j38j63J78j72j31K45m10K50m2j55L13j01J90j72m36M70P1O6
7911A96p0l16O0L29k24J56j22j78K30J9l0m5K70l30J46K65m8k63R6j05l61J90
7933a35q3L13Q2j59R3k56J54L09l34j73R7M77m16q5P9NK1J1k37O62l71L05j85
$$ plain form
7956 174 449 281 88 443 -32 -70 81 79 175 401 -121 -144 204 -61 -195 -66 -252 51 19 87 196 -177
7978 -177 21 76 -42 17 72 -214 158 466 -12 284 -23 213 67 204 287 -1 -143 26 377 -193 -4
7999 -4 196 -58 -268 -31 -243 -50 46 110 227 -183 145 251 -218 360 48 173 164 -367 -32 100 -20 -79
8021 -79 65 -147 -164 59 180 26 60 -243 -45 -49 -151 190 56 -5 -93 -262 99 -148 11 326 170 212 -161
8044 -161 -182 71 -43 182 -313 -11 438 -43 -41 -89 -100 -133 348 201 79 4 9 -144 -5 137 78 -280 -266 14
8068 14 172 225 -327 -187 -2 -155 126 190 300 -71 70 -98 114 57 22 -48 242 110 -78 54 102 106 34
8091 34 108 -262 202 299 139 99 -138 -83 -255 -76 -341 35 215 321 -178 65 119 60 -156 -128 274 -183 -137
8114 -137 168 364 40 151 111 125 141 -237 -272 -66 -142 -52 -101 54 46 101 -258 -74 138 41 105 -228 30 -198
$$ packed form
7956A74K75j68j93L55m75l8J51kR6K26n22k3L48k65j34J29j86L03l2O8J09l73
7978a77J98N5j18N9N5k86L72L08m78K96l07K36j46J37Q3k88j42J69L51n70J89
7999dK00k54k10K37k12J93R6O4J17m10L28J06m69N78l12J25rn31L35J32j20n9
8021g9J44k12j7K23J21j54L4l03J98mj02L41j34o1q8j69L61k47J59L15j56M2l73
8044a61k1K53j14K25m95L02M49m81Km8j1l3M81j47j22p5Nj53J39J42n9l58J4K80
8068A4J58N3n52J40J85j53K81O4J10l71J41j68K12n7l5p0K90j32j88J32M8Mp2
8091C4P4l70M64R7j60m0k37N5j72J79k65L76J80J06m99K43N4n9k16K8M02m57M6
8114a37L05J96l24J11m0J4J6l78l5K06p6R0m9J55qN5l59J84K12r7O4l33K58k28
$$ plain form
8138 -198 273 -41 183 344 -189 -105 -272 -47 -97 91 -316 -299 183 85 238 17 77 111 120 -29 -316 -29 112
8161 112 -357 -164 278 38 86 -165 256 175 97 245 -253 -59 -21 91 118 241 -207 138 -153 195 -144 -7
8183 -7 45 -230 159 279 -50 116 -55 18
$$ packed form
8138a98M71l14K24J61n33Q4j67K25n0J88m07J7M82r8J53k21O0L4Rj49k87K87J41
8161A12m69J93M42k40M8k51M21q1p8J48m98J94L8J12K7J23m48L45k91L48l39J37
8183gN2k75L89J20l29J66j71P3
8191A8
$$ Imaginary data points
##PAGE= N=2
##DATA TABLE= (X++(I..I)), XYDATA
$$ plain form
0 0 0 0 0 0 0 0 0 0 0 0 -8 8 -8 8 -8 16 -16 16 -24 24 -32 32 -40 48 -51 59 -69 78 -88 97 -110 125 -139 155
34 155 -173 191 -215 239 -263 292 -323 356 -396 439 -486 541 -601 668 -749 843 -955 1088
52 1088 -1255 1469 -1753 2151 -2750 3752 -5747 11264 -58125 -216503 -130761 30707 109011
65 109011 38997 -52548 -61339 29412 115815 111162 21547 -30060 17414 87086 60379 -31264
77 -31264 -68477 -4717 70811 74435 6925 -60458 -61800 7937 73092 56599 -21556 -60608 -26349
90 -26349 9981 -14182 -62445 -73476 -42898 -6416 15358 13024 -4872 -6734 26513 60346 50415
103 50415 10686 -18230 -30773 -39104 -25255 21805 57357 37117 -14509 -38023 -17798 15914
115 15914 35538 24320 -17729 -53505 -42529 -3105 8645 -11383 -15886 3942 3724 -28462 -42163
$$ packed form
0@%%%%%%%%%%qJ6j6J6j6K4l2L2m0M8n6O4p2Q8r9J10j28J47j66J85k07K35k64K94
34A55l28L64m06M54n02N55o15O79p52Q35r25J027j142J269j417J592j798K043
52A088k343K724l222L904m901O502r499J7011o9389j58378Q5742J61468P8304
65A09011p0014r1545q791R0751Q6403m653q9615n1607M7474O9672k6707r1643
77c1264l7213O3760P5528L624o7510o7383j342O9737O5155j6493p8155l9052L4259
90b6349L6330k4163m8263j1031L0578L6482K1774k334j7896j862L3247L3833r931
103E0415l9729k8916j2543q331J3849M7060L5552k0240n1626k3514K0225L3712
115A5914J9624j1218m2049l5776J0976L9424J1750k0028m503J9828k18l2186j3701
$$ plain form
128 -42163 -5842 49849 75727 51702 -6159 -47727 -28003 32455 51403 -1967 -53352 -32203
140 -32203 27024 45328 13394 -17131 -14171 8617 20308 -2388 -46046 -56760 -5611 50706
152 50706 40898 -16523 -35182 4151 34299 11723 -26304 -27183 13555 54799 50042 -7558 -57015
165 -57015 -27105 57593 85881 7138 -87928 -89319 -6482 60976 51709 -8911 -55651 -44114
177 -44114 6432 28490 -9059 -47885 -21432 37033 41229 -17558 -57287 -27794 30516 49557
189 49557 10193 -50527 -67335 -10175 71116 86629 23586 -35200 -24150 19518 28847 -1565
201 -1565 -30668 -33096 -9643 23961 37347 15749 -11732 -6066 21294 27791 7433 -11433 -19156
214 -19156 -25600 -21795 3195 21701 6644 -23933 -31125 -13402 7193 21077 26035 15104 -911
$$ packed form
128d2163L6321N5691K5878k4025n7861m1568J9724O0458J8948n3370n1385K1149
140c2203N9227J8304l1934l0525K960K2788J1691k2696m3658j0714N1149N6317
152E0706r808n7421j8659L9333L0148k2576l8027q79M0738M1244m757n7600m9457
165e7015K9910Q4698K8288p8743r5066j391Q2837O7458r267o0620m6740J1537
177d4114N0546K2058l7549l8826K6453N8465M196n8787l9729K9493N8310J9041
189D9557l9364o0720j6808N7160Q1291J5513o3043n8786J1050M3668R329l0412
201a565k9103k428K3453L3604J3386k1598k7481N666K7360O497k0358j8866p723
214a9156o444L805K4990J8506j5057l0577p192J7723K0595J3884M958j0931j6015
$$ plain form
227 -911 -670 6658 -7964 -34711 -29073 7726 22352 -8013 -37051 -19703 34325 75658 65500
240 65500 1471 -65327 -66201 -534 46568 12681 -53109 -61989 -6437 43627 40821 3818 -22930
253 -22930 -10927 27287 40268 1142 -44535 -31818 23501 41239 -4085 -49231 -37211 12019
265 12019 43114 33517 2891 -10622 13989 47497 33420 -31682 -73085 -40737 17377 26389
277 26389 -13229 -40684 -21072 24885 56691 47256 2508 -33044 -24672 3400 4227 -18780 -20192
290 -20192 7153 18550 -2885 -23204 -12990 16096 35648 29334 -3408 -35384 -27093 16803
302 16803 38076 5762 -38711 -43960 -16396 6322 13581 15173 13897 12923 18686 23726 11015 -9377
316 -9377 -12905 -4672 -7492 -17342 -9658 9270 13511 3594 2772 10174 7119 -4635 -11336 -14708 -17693
$$ packed form
227i11K41P328j4622k6747N638L6799J4626l0365k9038J7348N4028M1333j0158
240F5500o4029o6798q74O5667M7102l3887o5790q880N5552N0064k806l7003k6748
253b2930J2003L8214J2981l9126m5677J2717N5319J7738m5324m5146J2020M9230
265A2019L1095r597l0626j3513K4611L3508j4077o5102m1403L2348N8114R012
277B6389l9618k7455J9612M5957L1806r435m4748l5552Q372K8072Q27k3007j412
290b0192K7345J1397k1435k0319J0214K9086J9552o314l2742l1976Q291M3896
302A6803K1273l2314m4473n249K7564K2718P259J592j276r74N763N040j2711k0392
316i377l528Q233k820r850P684J8928M241r917q22P402l055j1754o701l372k985
$$ plain form
331 -17693 -11878 2568 5453 -6397 -10910 -1729 -1550 -13997 -10666 17667 35895 20495 -7472
344 -7472 -16982 -1330 24591 36585 12041 -35077 -51927 -9334 44431 45589 1348 -28354 -18606
357 -18606 5662 13020 -2303 -24613 -28258 -2787 22702 10728 -22918 -24461 13874 36912 9555
370 9555 -32448 -38035 -3291 34909 43192 14414 -20985 -18934 21428 44176 10074 -40803 -43571
383 -43571 -1355 29888 20906 -9088 -28519 -20057 8143 26045 7935 -25630 -30189 -2482 15732
396 15732 4410 -8405 -3182 4439 -472 -9382 -10284 -1746 16299 35931 34928 7944 -12512 -1124
410 -1124 20233 16673 -6591 -23492 -24777 -17537 -478 20582 24254 6777 -8603 -9068 -6270 -8419
424 -8419 -8374 -8320 -19033 -29611 -19206 2700 7919 -3589 -8343 1536 10332 12266 14025 12708 6723
$$ packed form
331a7693N815J4446K885j1850m513R181J79j2447L331K8333J8228j5400k7967
344g472r510J5652K5921J1994k4544m7118j6850M2593N3765J158m4241k9702R748
357a8606K4268P358j5323k2310l645K5471K5489j1974l3646j543L8335K3038k7357
370I555m2003n587L4744L8200Q283k8778l5399K051M0362K2748l4102n0877k768
383d3571M2216L1243q982k9994j9431Q462K8200J7902j8110l3565m559K7707J8214
396A5732j1322j2815N223P621m911q910r02Q538J8045J9632j003k6984k0456J1388
410a124K1357l560k3264j6901j285P240J7059K1060L672j7477j5380m65K798k149
424h419M5N4j0713j0578J0405K1906N219j1508m754R879Q796J934J759j317n985
$$ plain form
439 6723 5369 11945 7402 -9769 -16060 -1326 10751 2813 -3925 10392 31342 34104 16379 -9185
453 -9185 -27433 -24225 -2221 7451 -17242 -46610 -35972 7181 34438 24158 968 -10480 -6229
466 -6229 5831 13732 5210 -11099 -9791 7969 10708 -9294 -18929 2520 27422 24951 3423
479 3423 -9390 -3532 14325 27402 13369 -25052 -51072 -33867 308 7100 -13831 -24064 -7340
492 -7340 16292 26663 20122 420 -16576 -13423 4100 8106 -6925 -13832 1785 17290 15323
505 15323 8507 10116 14518 12400 8066 2253 -6433 -8278 4572 13138 -2503 -26649 -30160 -13081
519 -13081 2009 5663 4494 -1181 -9180 -5751 11373 19318 5384 -13587 -19281 -14044 -4253 9758
533 9758 21652 17038 3314 2487 14471 16957 4781 -4559 -4119 -4693 -5850 -2470 1107 -2219 -4769
$$ packed form
439F723j354O576m543j7171o291J4734J2077p938o738J4317K0950K762j7725k5564
453i185j8248L208K2004R672k4693k9368J0638M3153K7257j0280k3190j1448M251
466f229J2060P901q522j6309J308J7760K739k0002r635K1449K4902k471k1528
479C423j2813N858J7857J3077j4033l8421k6020J7205L4175O792k0931j0233J6724
492g340K3632J0371o541j9702j6996L153J7523M006j5031o907J5617J5505j967
505A5323o816J609M402k118m334n813q686j845J2850Q566j5641k4146l511J7079
519a3081J5090L654j169n675p999L429J7124P945j3934j8971n694N237R791J4011
533I758J1894m614j3724q27J1984K486j2176r340M40n74j157L380L577l326k550
$$ plain form
548 -4769 -694 -2912 -15966 -20425 -5016 9264 2568 -12069 -13300 -2435 7245 8600 -310 -17539
562 -17539 -23355 -3182 24453 25211 1345 -11893 -1369 14374 16969 8687 -2578 -10505 -5205
575 -5205 10653 17660 5920 -2579 3491 6998 -5908 -18513 -12093 3997 11346 7201 -851 -7088
589 -7088 -3830 11030 20002 2860 -23638 -28039 -6283 11666 10975 2825 -2614 -3707 1562 11024
603 11024 10906 -3642 -14014 -7474 1401 -1764 -7430 -4662 -2275 -7614 -11364 -6616 -620 1533 6272
618 6272 11031 5136 -4901 -2943 6871 4174 -9010 -15939 -11341 -2479 8335 21354 24522 11630
632 11630 -200 4131 13199 10190 -1446 -10059 -14980 -15677 -5318 10220 12347 -1148 -8311 -1346
646 -1346 5288 4055 2501 3171 -1532 -8382 -7938 -4431 -6865 -9002 -3488 2067 -3112 -5149 8068
$$ packed form
548d769M075k218j3054m459J5409J4280o696j4637j231J0865R680J355q910j7229
562a7539n816K0173K7635P58k3866j3238J0524J5743K595q282j1265p927N300
575e205J5858P007j1740q499O070L507j2906j2605O420J6090P349m145q052o237
589g088L258J4860Q972j7142k6498m401K1756J7949o91q150n439j093N269R462
603A1024j18j4548j0372O540Q875l165n666K768K387n339l750M748N996K153M739
618F272M759n895j0037J958R814k697j3184o929M598Q862J0814J3019L168j2892
632A1630j1830M331R068l009j1636q613m921o97J0359J5538K127j3495p163O965
646a346O634j233j554O70m703o850M44L507k434k137N514N555n179k037J3217
$$ plain form
661 8068 23875 22371 7522 -4406 -10136 -10784 -5434 -604 -8635 -20886 -14875 7985 22214 15705
675 15705 3383 -1270 -2518 -2089 1409 646 -8433 -14551 -7437 2115 1273 -2281 3475 10587 6156
690 6156 -894 1150 8100 10400 7854 1855 -10368 -20923 -15208 1449 6779 -3035 -9387 -892
704 -892 10693 16446 16284 9242 -6017 -16096 -10356 638 559 -4577 -2038 4374 5225 6020 11427 12210
720 12210 3151 -4216 -2903 -1415 -3635 -2122 2570 -884 -11134 -13921 -4874 1638 357 -426 -401
735 -401 -2982 -3259 5768 11596 2440 -12403 -15287 -7058 -49 5350 9347 7433 -176 -236 9649 14528
751 14528 5510 -4756 -6426 -5312 -4970 -15 7342 5998 -2367 -5460 -3469 -4292 -5946 -956 3936
766 3936 -1141 -7868 -3600 7040 9756 4845 -483 -5362 -9262 -4015 9249 13051 2857 -4088
$$ packed form
661H068J5807j504j4849j1928n730o48N350M830q031j2251O011K2860J4229o509
675A5705j2322m653j248M29L498p63r079o118P114R552q42l554N756P112m431
690F156p050K044O950K300k546n999j2223j0555N715J6657N330r814o352Q495
704h92J1585N753j62p042j5259j0079N740J0994p9n136K539O412Q51P95N407P83
720A2210r059p367J313J488k220J513M692l454j0250k787R047O512j281p83K5
735d01k581k77R027N828r156j4843k884Q229P009N399L997j914p609o0R885M879
751A4528r018j0266j670J114L42M955P357j344q365l093J991q23j654M990M892
766C936n077o727M268J0640K716m911n328m879l900N247J3264L802j0194o945
$$ plain form
780 -4088 447 7332 6621 3357 836 -4717 -9130 -3235 5558 4688 -3778 -6868 -5956 -8283 -10965 -5267
796 -5267 1283 -516 -4139 -611 5522 6607 6734 7332 652 -11169 -12983 -848 9884 9251 5197
811 5197 4755 4382 4741 10508 14125 5299 -9049 -12276 -4997 -1483 -2117 -2103 -2639 -9287 -12043 -4848 3707
828 3707 2580 -686 221 1287 -2826 -3518 2264 1569 -6906 -10599 -5246 2005 6694 12767 17622 12924
844 12924 4651 5280 10211 6041 -5111 -11301 -11008 -9560 -4952 4146 7538 -826 -7477 -2972 3147
859 3147 2314 -1266 -2827 -6796 -12286 -9933 -278 3310 -1832 -4851 -1351 1426 4692 13258 19999
874 19999 15766 3514 -1633 -79 -907 -2927 -2582 -3984 -10169 -9757 2149 12463 10458 2704 -1176
889 -1176 -5240 -9241 -8489 -3786 -5319 -11912 -11295 -2343 3441 3412 4995 6681 3922 1076 5719 12285
$$ packed form
780d088M535O885p11l264k521n553m413N895Q793q70q466l090R12k327k682N698
796e267O550j799l623L528O133J085J27N98o680j1821j814J2135J0732o33m054
811E197m42l73L59N767L617q826j4348l227P279L514o34J4n36o648k756P195Q555
828C707j127l266R07J066m113o92N782o95q475l693N353P251M689O073M855m698
844A2924q273O29M931m170j1152o190K93J448M608R098L392q364o651M505O119
859C147q33l580j561l969n490K353R655L588n142l019L500K777L266Q566O741
874A9999m233j2252n147J554q28k020L45j402o185M12J1906J0314k005p754l880
889a176m064m001P52M703j533o593O17Q952N784k9J583J686k759k846M643O566
$$ plain form
905 12285 9138 1499 -511 122 -2564 -3479 1079 2866 -3001 -5664 1141 8506 7722 4572 647 -7977
921 -7977 -16159 -14163 -4385 -506 -5097 -7588 -3236 670 4169 10650 12845 3716 -6437 -5237 2177
936 2177 5189 5214 6176 4017 -2238 -4219 2533 7050 2986 -1187 -342 -430 -2637 -519 3763 398 -8867
953 -8867 -11907 -7665 -4400 -4103 -706 2069 -523 -2016 3439 8503 4218 -3693 -4325 -1079 1395 4802
969 4802 9455 8083 -344 -3024 3039 6938 3190 -1463 -2292 -4232 -5560 348 8348 6671 -2855
984 -2855 -7669 -7430 -8081 -6858 -276 3939 -1525 -7345 -4102 3199 5628 5061 4699 775 -5808 -4899
1000 -4899 4831 10290 5251 -441 -1432 -1895 -2831 942 5093 2865 -2523 -319 5864 5580 560 -2544
1016 -2544 -3430 -8124 -9529 -4822 -232 -1543 -2592 2449 6509 5598 4512 5698 2383 -6414 -9253
$$ packed form
905A2285l147p639k010O33k686r15M558J787n867k663O805P365p84l150l925q624
921g977q182J996R778L879m591k491M352L906L499O481K195r129j0153J200P414
936B177L012K5R62k159o255j981O752M517m064m173Q45q8k207K118M282l365r265
953h867l040M242L265K97L397K775k592j493N455N064m285p911o32L246K474L407
969D802M653j372q427k680O063L899l748m653q29j940j328N908Q000j677r526
984b855m814K39o51J223O582M215n464n820L243P301K429n67l62l924o583R09
1000d899R730N459n039n692r91m63r36L773M151k228n388K204O183k84n020l104
1016b544q86m694j405M707M590j311j049N041M060r11j086J186l315q797k839
$$ plain form
1031 -9253 -2970 2448 1960 534 -586 -3594 -4973 2235 11096 8190 -1657 -5879 -3333 -423 1095
1046 1095 2779 -491 -9427 -13219 -6157 3529 5641 6254 8821 8255 2550 795 3689 4033 -2261 -6518
1062 -6518 -6292 -6163 -5132 2507 9982 7548 84 -1160 2453 2230 -1832 -3609 -5202 -8376 -7922 -807
1078 -807 1709 -3779 -7305 -2331 4252 5737 6005 7019 4096 -1489 -1232 3760 3156 -2894 -5821 -4312
1094 -4312 -3649 -1667 6405 13146 10727 2565 -1114 -2070 -3242 -3320 -710 -2079 -9671 -12928 -5243 4160
1110 4160 6120 4623 2399 -1647 -5357 -1558 6549 6243 -1060 -4905 -2578 -688 -1186 18 2162
1125 2162 305 -1228 3036 7350 5050 1096 1827 2066 -3405 -7246 -4487 -1153 -2789 -3565 79 2699
1141 2699 3259 5165 6299 270 -7907 -6858 2220 6067 1596 -3107 -3711 -2860 108 5845 6646 -1061
$$ packed form
1031i253O283N418m88j426j120l008j379P208Q861k906r847m222K546K910J518
1046A095J684l270q936l792P062R686K112O13K567n66n705j755K894L44o294m257
1062f518K26J29J031P639P475k434p464j244L613k23m062j777j593l174M54P115
1078h07K516n488l526M974O583J485K68J014k923n585K57M992o04o050k927J509
1094d312O63J982Q072O741k419q162l679r56j172p8K610j369p592l257P685R403
1110D160J960j497k224m046l710L799Q107l06p303l845K327J890m98J204K144
1125B162j857j533M264M314k300l954P31K39n471l841K759L334j636p76L644K620
1141B699N60J906J134o029q177J049R078L847m471m703o04Q51K968N737Q01p707
$$ plain form
1157 -1061 -7561 -4658 1798 2805 1269 2921 1714 -4087 -7161 -3639 313 544 1421 2880 -187
1172 -187 -3729 313 8540 8895 862 -4020 -2457 47 2248 6018 5965 136 -4181 -474 3569 -229
1188 -229 -4887 -4351 -2243 -2674 -1088 2720 2165 -3854 -6142 -2973 -1837 -4063 -4178 -1496 -1726 -3031
1204 -3031 1128 7492 8022 3987 2105 1994 -305 -550 4874 8289 3382 -3379 -3513 -523 1790 3025
1220 3025 4448 297 -6808 -5996 2053 5906 842 -5511 -7917 -8771 -8536 -3964 85 -649 -2324 1686
1236 1686 6843 5780 2472 4018 5559 1285 -3685 -2503 1526 2905 3955 5052 3254 -366 2209
1251 2209 7827 7144 -2004 -7027 -3797 352 -663 -3206 -6748 -10891 -10358 -3590 2870 1104 -3163
1266 -3163 -1447 3168 3147 988 1595 1336 -2988 -5696 -3883 -680 1438 5926 10556 8356 1352 377
$$ packed form
1157a061o500K903O456J007j536J652j207n801l074L522L952K31Q77J459l067
1172a87l542M042Q227L55q033m882J563K504K201L770n3n829m317L707M043l798
1188b29m658N36K108m31J586L808n55o019k288L169J136k226j15K682k30j305
1204c031M159O364N30m035j882j11k299k45N424L415m907o761j34K990K313J235
1220C025J423m151p105Q12Q049L853n064o353k406q54K35M572M049p34j675M010
1236A686N157j063l308J546J541m274m970J182M029J379J050J097j798l620K575
1251B209N618o83r148n023L230M149j015k543l542m143N33O768O460j766m267
1266c163J716M615k1k159O07k59m324k708J813L203K118M488M630k200p004r75
$$ plain form
1282 377 5462 7545 2484 -3120 -5454 -6915 -5527 139 3619 -609 -5647 -3880 1011 1899 1057 2284
1298 2284 1429 -2339 -3644 -631 1247 -1870 -4215 -1923 470 1040 3474 7997 7289 2239 645 2086
1314 2086 361 -3220 -3514 -2454 -4792 -6390 -2274 3554 4153 972 -846 -1793 -3499 -1603 3951 3749
1330 3749 -3355 -7418 -2562 3899 4364 2015 645 -987 -1074 3238 7557 5597 706 -201 1603 -820
1346 -820 -4924 -3865 -247 -153 -3177 -3419 -1375 -140 1702 4131 590 -6856 -8078 -843 4577 1962
1362 1962 -2269 -1999 508 2845 5073 5317 622 -3555 -472 5363 5182 1059 771 2240 694 -2063
1378 -2063 -1441 -316 -1606 -3057 -1781 -1873 -3434 -1709 3086 3029 -3680 -7082 -3316 908 1790 1344 859
1395 859 -1333 -2840 1043 5569 3954 -898 -1424 943 1985 2885 5477 5952 900 -3352 -2219 69
$$ packed form
1282C77N085K083n061n604k334j461J388N666L480m228n038J767M891Q88q42J227
1298B284q55l768j305L013J878l117k345K292K393N70K434M523p08n050j594J441
1314B086j725l581k94J060k338j598M116N828N99l181j818r47j706J896N554k02
1330C749p104m063M856O461M65k349j370j632q7M312M319j960m891r07J804k423
1346h20m104J059L618R4l024k42K044J235J842K429l541p446j222P235N420k615
1362A962m231K70K507K337K228K44m695m177L083N835j81m123k88J469j546k757
1378b063O22J125j290j451J276r2j561J725M795n7o709l402L766M224Q82m46m85
1395H59k192j507L883M526j615m852n26K367J042R00K592M75n052m252J133K288
$$ plain form
1411 69 -1291 -3110 -2444 -2302 -3632 -1948 2893 3390 -448 -2323 -665 -1556 -3477 -2045 1387 906 -2543
1428 -2543 -2141 1263 2584 2883 3986 3293 -1131 -1209 4177 7038 2988 -3473 -4642 -2559 -1526 -328
1444 -328 751 -1381 -3251 -343 4739 4650 95 -1432 -294 -1864 -5178 -5196 -1434 737 231 758 632
1461 632 -144 2040 6287 5958 -892 -5992 -2603 2502 2619 -569 -3111 -4001 -3944 154 4078 2834 -1659
1478 -1659 -912 3006 2831 -7 -1085 -313 -1977 -4685 -3394 -876 319 2354 4699 4739 541 -383
1494 -383 3177 4663 79 -4552 -4810 -3026 -2062 156 2265 246 -3224 -1749 2167 2497 142 -683
1510 -683 -432 -2191 -3281 -227 1992 -389 -3741 -2724 384 1999 3198 4986 4382 713 -48 2534
1526 2534 2540 -912 -2671 -1383 -1261 -2752 -1260 3216 3884 1070 -716 -1811 -2199 -1574 1235 1683 -2730
$$ packed form
1411F9j360j819O66J42j330J684M841M97l838j875J658q91j921J432L432m81l449
1428b543M02L404J321K99J103o93m424p8N386K861m050o461j169K083J033J198
1444c28J079k132j870K908N082q9m555j527J138j570l314j8L762K171n06N27j26
1461F32p76K184M247l29o850n100L389N105J17l188k542q90N7M098L924j244m493
1478a659P47L918j75k838j078P72j664k708J291K518J195K035K345M0m198r24
1494c83L560J486m584m631k58J784R64K218K109k019l470J475L916L30k355q25
1510f83K51j759j090L054K219k381l352J017L108J615J199J788o04l669p61K582
1526B534Ol452j759J288J22j491J492M476O68k814j786j095l88O25K809M48m413
$$ plain form
1543 -2730 -6387 -2656 2369 3152 543 -1448 -1204 -1144 1357 4307 3305 -513 -1486 1592 1738 -1672
1559 -1672 -2350 -14 818 -1411 -1619 211 767 932 1879 626 -3284 -4472 -604 3367 791 -3375
1575 -3375 -2920 908 2617 3184 2123 -547 -3127 -1373 3215 3882 548 -636 713 900 -1090 -1461
1591 -1461 439 -10 -2653 -2775 -2063 -1406 -490 2164 2533 -1801 -4477 -1915 2019 1723 114 42 -312
1608 -312 -817 694 3518 3885 500 -713 1542 2745 2226 2972 3285 1388 -2150 -1672 273 -565 -3080
1625 -3080 -2934 -2432 -1840 -1311 1219 1428 -1710 -3503 -2215 -1005 -2198 -3009 -812 -1019 -2323 -1693 1405
1642 1405 3416 2850 2305 1922 -17 -357 3741 6125 2573 -2835 -3531 -473 1372 1548 1093 -1 -1372
1659 -1372 -267 2987 3523 38 -1949 -1103 -1140 -4035 -4292 -1571 806 624 579 1478 1418 1440 3540 3950
$$ packed form
1543b730l657L731N025P83k609j991K44O0K501K950j002l818r73L078J46l410
1559a672o78K336Q32k229k08J830N56J65R47j253l910j188L868L971k576m166
1575c375M55L828J709N67j061k670k580J754M588O67l334j184J349J87j990l71
1591a461J900m49k643j22P12O57R16K654L69m334k676K562L934k96j609p2l54
1608c12n05J511K824L67l385j213K255J203n19P46L13j897l538M78J945q38k515
1625c080J46N02N92N29K530K09l138j793J288J210j193q11K197k07j304O30L098
1642A405K011n66n45l83j939l40M098K384l552n408o96L058J845J76m55j094j371
1659a372J105L254N36l485j987Q46l7k895k57K721K377j82m5Q99o0K2K100M10
$$ plain form
1677 3950 397 -3292 -2041 1759 1489 -1124 -1948 -1314 -764 557 2021 1175 -2245 -2580 405 1728
1693 1728 -657 -2651 -2416 -2974 -4005 -2892 198 1213 615 1162 2208 1327 1442 3377 4023 766 -2987
1710 -2987 -2533 -92 1116 1384 2451 1641 -966 -1022 1252 2327 807 -776 -1497 -2368 -3112 -1529 896
1727 896 -75 -2581 -2572 -421 931 1230 1776 2509 908 492 1601 2289 84 -1847 -131 669 4 21
1745 21 1921 2434 895 -649 -140 116 -1012 -876 -696 -2892 -4676 -2502 1316 1124 -1424 -3088 -2078
1762 -2078 -919 470 2123 1568 -788 -2111 405 2211 1225 192 897 1237 -636 -700 1192 2847
1778 2847 2384 1355 780 -1283 -2203 83 2303 891 -2526 -2373 -209 1101 451 60 -693 -1515 -1018
1795 -1018 1122 2211 476 -908 900 1705 385 -28 817 302 -1517 -1171 501 1101 445 832 834 -552
$$ packed form
1677C950l553l689J251L800k70k613q24O34N50J321J464q46l420l35K985J323
1693A728k385j994K35n58j031J113L090J015n98N47J046q81J15J935O46l257l753
1710b987M54K441J208K68J067q10k607n6K274J075j520j583p21q71p44J583K425
1727H96r71k506RK151J352K99N46P33j601m16J109O88k205j931J716Q00o65J7
1745B1J900N13j539j544N09K56j128J36J80k196j784K174L818j92k548j664J010
1762b078J159J389J653n55k356j323K516J806r86j033P05L40j873o4J892J655
1778B847m63j029n75k063r20K286K220j412l417J53K164J310o50l91p53q22M97
1795a018K140J089j735j384J808Q05j320m13Q45n15j819L46J672O00o56L87Kj386
$$ plain form
1813 -552 -1953 -658 732 131 -2498 -2831 -1590 -1718 -629 672 1185 -900 -2037 -696 1277 1664
1829 1664 1752 1825 578 -1544 -754 1452 1693 -78 -1043 -271 457 947 1990 2775 1071 -1333 -876 -47
1847 -47 -1249 -2154 -1204 -382 -1324 -1669 423 1646 1053 435 475 306 -482 163 1888 657 -1850 -1860 522
1866 522 1592 821 160 59 -99 444 2181 2449 466 -1879 -1809 -1263 -1829 -1906 -699 -107 -1184 -1309 599
1885 599 1641 1209 1574 1490 -529 -2575 -1034 1250 1381 -45 -1106 -163 294 885 2064 2207 333
1902 333 -853 310 1138 -87 -1058 -755 -862 -1896 -1806 -129 594 -82 4 795 721 252 324 1088 -508
1921 -508 -1875 -1562 362 471 410 493 949 387 279 1389 2252 397 -1716 -1344 -645 -874 -435 797 -236
1940 -236 -1819 -1861 324 1371 1130 365 233 -417 -696 227 1493 515 -1190 -1160 -47 274 -68 1429
$$ packed form
1813e52j401J295J390o01k629l33J241j28J089J301N13k085j137J341J973L87
1829A664Q8P3j247k122P90K206K41j771r65P72P28M90J043P85j704k404M57Q29
1847d7j202r05R50Q22r42l45K092J223n93o18M0j69p88O45J725j231k507j0K382
1866E22J070p71o61j01j58N43J737K68j983k345P0N46n66p7J207N92j077j25J908
1885E99J042m32L65q4k019k046J541K284J31j426j061R43M57N91J179J43j874
1902C33j186J163Q28j225r71L03j07j034R0J677P23o76Q6P91p4m69P2P64j596
1921e08j367L13J924J09o1Q3M56n62j08J110Q63j855k113L72O99k29M39J232j033
1940b36j583m2K185J047k41p65j32o50k79R23J266r78j705L0J113L21l42J497
$$ plain form
1958 1429 1658 508 -655 -395 415 -24 -515 -463 -1094 -2010 -1495 954 1036 -590 -1541 -673 103 -216 289
1977 289 498 -304 -987 358 1707 1251 -218 82 782 199 216 1215 1901 523 -140 139 241 -51 84
1996 84 520 -146 -1847 -2043 -230 843 -171 -807 -1005 -1617 -1429 134 1223 799 -980 -351 576 616
2014 616 282 671 597 -799 -643 489 1314 1049 729 980 476 -263 -386 569 429 -1296 -1534 -896 -247
2033 -247 -435 28 613 -339 -1051 -110 1020 641 56 -175 -22 -540 -475 383 913 -230 -647 0 845 1263
2053 1263 1262 1144 81 -862 -788 324 -117 -1229 -1488 -929 -1217 -835 591 1224 556 -602 -181 -149 -147 174
2073 174 975 437 -802 -829 413 1525 913 899 885 627 606 876 1199 666 -1320 -1358 -922 -739 -1544 -1023
2093 -1023 -301 -709 -1126 -132 688 363 -460 -435 -651 -1468 -1181 372 526 -477 -381 399 1559 1513 1349 1260
$$ packed form
1958A429K29j150j163K60Q10m39m91N2o31r16N15K449Q2j626r51Q68P76l19N05
1977B89K09q02o83J345J349m56j469L00P00n83J7R99O86j378o63K79J02k92J35
1996H4M36o66j701j96J813J073j014o36j98o12J88J563J089m24j779O29R27M0
2014F16l34L89p4j396J56J132Q25k65l20K51n04p39j23R55j40j725k38O38O49
2033b47j88M63N85r52p12R41J130l79n85k31J53n18O5Q58N30j143m17O47Q45M18
2053A263jj18j063r43P4J112m41j112k59N59k88L82J426O33o68j158M21L2KL21
2073A74Q01n38j239k7J242J112o12j4j4k58k1K70L23n33j986l8M36J83q05N21
2093a023P22m08m17R94Q20l25q23K5k16q17K87J553J54j003R6P80J160m6j64q9
$$ plain form
2113 1260 1100 -538 -113 1461 967 -263 -478 -681 -726 -915 293 228 -396 -864 -393 -119 -158 -415 -191
2132 -191 -971 -1923 -1656 -207 433 -90 373 494 587 213 1124 1639 423 -471 -393 434 114 -127 554 511
2152 511 -455 -716 140 756 135 -260 -363 -334 -671 48 418 6 -719 -789 29 140 386 445 896 216 -389
2173 -389 315 1063 158 -441 -301 -256 -624 -360 244 730 -581 -1266 -831 -254 -261 -290 -145 -390 -1055 -377 433
2194 433 295 -257 -528 -422 45 -290 618 1059 422 -85 215 1087 406 404 456 415 -407 -701 298 979 -94
2215 -94 -299 -236 -295 -505 56 609 396 -495 -726 161 300 -105 -299 -274 -517 -861 569 1282 849 187 409
2236 409 776 285 191 415 76 -812 -1219 -263 192 -297 -351 0 -267 -961 -198 173 68 -524 -627 -325 -703
2257 -703 -537 183 403 -104 -687 241 675 916 969 1242 502 -73 -329 562 478 -522 -838 -380 47 210
$$ packed form
2113A260j60j638M25J574m94j230k15k03m5j89J208o5o24m68M71K74l9k57K24
2132a91p80r52K67J449O40n23M63J21R3l74R11N15j216q94P8Q27l20k41O81m3
2152E11r66k61Q56O16o21l95j03K9l37P19L70m12p25p0Q18J11K46N9M51o80o05
2173c89P04P48r05n99J40M5l68K64O04M86j311o85M35N77pk9J45k45o65O78Q10
2194D33j38n52k71J06M67l35R08M41o37n07L00Q72o81kN2m1q22k94R99O81j073
2215i4k05O3n9k10N61N53k13q91k31Q87J39m05j94K5k43l44J430P13m33o62K22
2236D09L67m91r4K24l39q88m07R56M55m89n4L51k67o94P63L71j05n92j03L02l78
2257g03J66P20K20n07n83R28M34K41N3K73p40n75k56Q91q4j000l16M58M27J63
$$ plain form
2277 210 458 497 347 -516 -262 -63 16 -354 -522 -316 -757 -352 498 785 621 125 274 506 288 263 929
2298 929 445 -689 -666 56 238 -51 -247 -18 -39 -21 -122 820 187 -430 -739 -482 -505 -901 -316 -260 -703
2319 -703 -616 60 430 509 236 564 10 -395 -250 730 547 -141 -382 -412 -98 122 438 751 440 -236 21
2340 21 866 584 -268 -106 -260 -679 -744 130 400 227 61 344 242 474 390 530 299 -645 -320 196 102
2361 102 -235 91 -220 -353 -495 235 230 8 -885 -990 -246 -591 -180 -146 -253 -592 -836 -218 267 178 40
2382 40 42 49 45 285 611 533 -618 62 403 115 142 670 596 123 -324 -51 278 64 -285 -43 -244 -442 -479
2405 -479 115 -82 -722 -590 -427 -272 3 40 318 237 -266 23 599 572 191 89 224 -112 -380 761 273
2426 273 -63 -298 -33 228 74 -191 271 -221 -514 -534 -162 90 -269 -466 -128 -101 -474 -204 666 370 -66
$$ packed form
2277B10K48L9j50q63K54J99P9l70j68K06m41M05Q50K87j64m96J49K32k18k5O66
2298I29m84j134K3P22J82k89j96K29k1J8j01R42o33o17l09K57k3l96N85N6m43
2319g03Q7O76L70P9k73L28n54m05J45R80j83o88k41l0L14K20L16L13l11o76K57
2340B1Q45k82q52J62j54m19o5Q74K70j73j66K83j02K32q4J40k31r44L25N16r4
2361A02l37L26l11j33j42P30nk22q93j05P44l45M11L4j07l39k44O18M85q9j38
2382D0KPmK40L26p8j151O80L41k88K7N28p4m73m47K73L29k14l49K42k01j98l7
2405d79N94j97o40J32J63J55K75L7K78q1n03K89N76k7l81j02J35l36k68J141m88
2426B73l36k35K65K61j54k65M62m92k93k0L72K52l59j97L38K7l73K70Q70k96m36
$$ plain form
2447 -66 -98 587 240 432 402 54 -235 -574 320 637 415 442 187 137 -292 -225 271 4 -491 -531 -220 -233 -548
2470 -548 -297 -29 -204 -529 -90 352 486 223 279 -34 -395 -314 350 219 4 -266 145 370 126 244 827
2491 827 251 -92 -252 110 76 -95 -357 -158 -458 -281 325 38 85 -484 289 415 310 -259 311 20 -316
2512 -316 -388 2 576 258 103 445 -63 29 436 691 118 -314 -352 -6 -12 -604 -150 -487 -98 -298 -49 419
2534 419 120 -209 -6 55 28 34 13 388 -164 -132 -105 372 86 369 666 218 -307 100 122 172 -104 -503 -211
2557 -211 -248 -361 4 193 -182 -619 -217 250 394 -70 -207 63 -278 -538 -63 260 125 216 422 56 145
2578 145 405 388 -36 -201 88 236 282 10 336 28 -278 -391 -224 119 -477 96 -149 -236 -13 -27 72 -234
2600 -234 -413 -71 -121 -35 53 284 571 309 -60 -67 147 -99 41 -231 187 97 -180 305 114 -400 -473 -11
$$ packed form
2447f6l2O85l47J92l0l48k89l39Q94L17k22K7k55n0m29O7M96k67m95m0L11j3l15
2470e48K51K68j75l25M39M42J34k63N6l13l61Q1O64j31k15k70M11K25k44J18N83
2491H27n76l43j60L62l4j71k62J99l00J77O06k87M7n69P73J26j05n69N70k91l36
2512c16p2L90N74l18j55L42n08R2M07K55n73m32l8L46on92M54l37L89k00K49M68
2534D19k99l29K03O1k7Ok1L75n52L2K7M77k86K83K97m48n25M07K2N0k76l99K92
2557b11l7j13L65J89l75m37M02M67J44m64j37K70l41k60M75L23j35R1K06l66Q9
2578A45K60j7m24j65K89J48M6k72L26l08l06j13J67L43n96N73k45q7K23j4R9l06
2600b34j79L42n0Q6Q8K31K87k62l69pK14k46J40k72M18r0k77M85j91n14p3M62
$$ plain form
2622 -11 56 75 77 -91 -107 -80 -255 197 427 188 -125 -31 -252 -30 -109 590 63 -116 -23 87 28 287 257 71
2646 71 -309 -197 -18 -102 -294 -216 -17 -60 -153 52 89 -59 -75 -69 -97 69 -48 30 -49 -107 -414 122 517 283
2670 283 107 210 394 171 189 78 -91 -233 -317 19 -170 -82 -57 -1 -118 -263 -24 197 301 -308 -498 -126
2692 -126 -120 -94 80 188 -257 -210 -59 32 179 366 141 94 -280 184 319 -117 -326 -275 -4 -67 -91 41 124
2715 124 -43 -218 89 78 23 33 126 252 17 -258 134 111 25 43 157 177 88 214 536 221 -105 -285 228
2738 228 101 -124 -145 15 -126 -176 14 99 -53 -35 -141 -218 154 -28 -228 -270 -99 -320 196 259 210 -20 257
2761 257 -97 49 -85 61 87 79 54 52 121 96 87 312 -237 -197 -290 259 -78 -258 -65 93 -89 -164 -5 -10 164
2786 164 -380 526 -52 31 184 134 -57 -306 13 186 210 -152 83 -276 70 22 264 459 -54 9 -120 38
$$ packed form
2622a1O7J9Kj68j6K7j75M52K30k39l13R4k21K22p9O99n27j79R3J10n9K59l0j86
2646G1l80J12J79q4j92P8J99m3r3K05L7j48j6Ok8J66j17P8p9n8l07N36L95k34
2670B83j76J03J84k23J8j11j69j42q4L36j89Q8K5N6j17j45K39K21J04o09j90L72
2692a26OK6J74J08m45M7J51R1J47J87k25m7l74M64J35m36k09N1K71o3k4J32Q3
2715A24j67j75L07j1n5J0R3J26k35k75L92k3q6J8J14K0q9J26L22l15l26j80N13
2738B28j27k25k1J60j41n0J90Q5j52J8j06p7L72j82k00m2J71k21N16O3m9k30K77
2761B57l54J46j34J46K6qk5kO9k5rK25n49M0r3N49l37j80J93J58j82p5J59nJ74
2786A64n44R06n78Q3J53n0j91k49L19J73K4l62K35l59L46m8K42J95n13O3j29J58
$$ plain form
2808 38 -87 -63 -49 -96 -158 21 49 -238 -143 69 -103 3 26 27 385 369 58 -32 344 322 188 -23 166 -40
2832 -40 -156 119 -121 -73 -328 86 57 80 -202 8 -123 -342 -77 304 -37 -25 -179 39 249 -42 93 -16
2854 -16 0 105 -203 27 117 -240 -226 391 64 -333 9 -148 68 211 17 -239 -75 -226 -3 -210 -305 -274
2876 -274 172 -136 11 164 308 -305 -205 147 108 52 -121 278 167 102 200 244 209 370 -180 80 105 -60
2898 -60 81 393 -124 -228 -66 -179 -60 62 -37 34 -173 -93 -2 114 -43 -27 56 -56 -112 -214 177 38 -440
2921 -440 196 87 142 4 275 121 174 -70 3 109 -577 -282 -44 -234 -64 -34 167 175 -80 -282 31 151
2943 151 -43 263 68 48 -106 -186 43 75 -35 241 339 -219 400 270 23 94 58 -132 69 85 -126 29
2965 29 -34 -41 163 80 199 92 -246 67 -78 -82 -225 -170 -424 -163 207 309 72 -163 -90 -42 -31 61 45 66 -124
$$ packed form
2808C8j25K4J4m7o2J79K8k87R5K12j72J06K3JL58j6l11r0L76k2j34k11J89k06
2832d0j16K75k40M8k55M14k9K3k82K10j31k19K65L81l41J2j54K18K10k91J35j09
2854a6J6J05l08K30R0l57J4O17l27l97L42j57K16J43j94k56J64j51K23k07r5L1
2876b74M46l08J47J53J44o13J00L52l9n6j73L99j11o5R8M4l5J61n50K60K5j65
2898f0J41L12n17j04J62j13J19J22r9P1k07Q0R1J16j57J6Q3j12n6j02L91j39m78
2921d40O36j09N5j38K71j54N3k44P3J06o86K95K38j90J70L0K01Qk55k02L13J20
2943A51j94L06j95k0j54q0K29L2j10K76R8n58O19j30k47P1l6j90K01J6k11J55
2965B9o3pK04q3J19j07l38L13j45mj43N5k54K61L70J02k37k35P3M8J1R2j6K1j90
$$ plain form
2990 -124 40 112 10 269 -5 -356 59 150 -67 129 216 -172 -151 3 262 190 -450 12 -39 -158 153 88
3012 88 -19 -121 330 108 -25 -237 132 258 -185 -75 57 241 -83 7 213 46 -121 21 -14 17 -93
3033 -93 -16 170 -302 -246 78 115 -155 109 -1 -32 -160 97 63 109 -53 -47 145 100 -74 261 -42 -90 -91 49
3057 49 -51 -85 17 -118 123 91 -212 0 -75 -50 -59 -152 246 -72 -249 118 98 -195 -91 -62 107 -158 124
3080 124 306 39 -25 176 190 -147 -19 -50 -13 -25 117 165 278 -149 74 91 -24 -119 -116 -218 -173 36 -82 -139
3104 -139 85 82 14 22 134 80 91 -28 -168 -311 -154 115 -162 -31 -49 202 -66 129 267 -251 -102 -122 72
3127 72 -145 98 -280 193 -316 -155 -31 55 75 -200 -32 -172 5 119 116 -204 76 101 -226 -105 207 -383
3149 -383 86 -48 -131 -264 267 -74 -42 -175 -258 213 -245 98 -74 38 150 -356 118 6 36 8 189 -121
$$ packed form
2990a24J64P2j02K59k74l51M15R1k17J96Q7l88K1J54K59p2o40M62n1j19L11o5
3012H8j07j02M51k22j33k12L69J26m43J10J32J84l24R0K06j67j67J42l5L1j10
3033i3P7J86m72N6L24L7k70K64j10l1j28K57l4M6j62OJ92m5j74L35l03m8jJ40
3057D9j00l4J02j35K41l2l03K12p5K5rr3L98l18j77L67k0k93J04K9J69k65K82
3080A24J82k67o4K01J4l37J28l1L7j2J42M8J13m27K23J7j15r5Lj02M5K09j18n7
3104a39K24lo8QJ12n4J1j19j40j43J57K69k77J31j8K51k68J95J38n18J49k0J94
3127G2k17K43l78M73n09J61J24Q6K0k75J68j40J77J14ll20K80K5l27J21L12n90
3149c83M69j34q3j33N31l41L2j33q3M71m58L43j72J12J12n06M74j12L0k8J81l10
$$ plain form
3171 -121 126 149 66 40 -116 295 236 209 -30 72 72 -45 68 -22 -174 -163 217 125 135 -129 -206 -167 -41 -37 -71
3196 -71 -5 -152 -346 42 58 -60 196 183 59 -99 122 -2 42 -112 197 146 -189 -224 -54 -280 -26 -170
3218 -170 119 52 199 -349 5 158 -455 -29 -27 103 -268 -208 -152 337 -309 -17 171 46 46 -174 151 125 4
3241 4 -142 66 336 -67 105 156 -129 -146 -162 41 -437 -340 83 257 172 80 -49 -60 -101 40 319 157 -133
3264 -133 -57 -243 -40 113 -243 -31 300 -13 219 -8 12 -81 196 56 -138 -247 -235 59 -199 61 9 -203
3286 -203 21 57 -8 192 -143 2 180 -157 40 -404 -243 -119 -97 45 -2 -41 212 17 290 33 -137 301
3308 301 -214 -234 -215 -33 4 -221 -159 -25 198 -295 -133 436 347 -121 97 51 -378 -157 144 -149 19 -37
3330 -37 69 255 -231 -4 232 -130 -131 -88 -178 266 -100 40 -278 90 -309 -92 -87 86 -36 -30 -291 321 -169
$$ packed form
3171a21K47K3q3k6j56M11n9k7k39J02%j17J13r0j52J1L80r2J0k64p7L9J26Ml4
3196g1O6j47j94L88J6j18K56j3j24j58K21j24M4j54L09n1l35l5J70k26K54j44
3218a70K89o7J47n48L54J53o13M26KJ30l71O0N6M89o46K92J88j25%k20L25k6j21
3241Dj46K08K70m03J72N1k85j7j6K03m78R7M23J74q5r2j29j1m1J41K79j62k90
3264a33P6j86K03J53l56K12L31l13K32k27K0r3K77j40j94j09J2K94k58K60n2k12
3286b03K24L6o5K00l35J45J78l37J97m44J61J24K2J42m7l9K53j95K73k57j70M38
3308C01n15k0J9J82L7k25O2J34K23m93J62N69q9m68K18m6m29K21L01k93J68n6
3330c7J06J86m86K27K36l62jM3r0M44l66J40l18L68l99K17NJ73j22Ok61O12m90
$$ plain form
3353 -169 16 103 31 15 100 161 122 -53 16 57 -201 247 -48 143 -300 43 177 -315 -152 -72 -24 65 -51 -278
3377 -278 -47 -184 31 126 -42 -49 45 77 140 2 -189 42 30 -10 -121 29 -222 166 -134 39 -116 -54 -391
3400 -391 -252 -164 -120 76 -65 -91 -164 -175 35 25 -57 -120 -217 -262 21 111 -101 -270 -119 146 7 76 17 279
3424 279 122 230 324 13 -84 -57 -21 123 -63 78 58 -250 -36 -103 -140 -6 76 49 120 288 -117 2 -198
3447 -198 8 91 335 227 -14 -218 -133 310 80 2 182 -261 -12 57 296 -50 -148 -120 256 -307 -32 107
3469 107 74 220 -155 -96 -259 158 -426 -78 62 43 -15 10 267 -56 25 -87 102 -228 228 128 146 -210
3491 -210 -91 254 233 179 68 6 -180 29 256 -234 146 73 175 -95 25 -1 73 -71 88 -78 6 339
3513 339 -45 169 -10 -30 243 -178 121 356 29 -70 -35 93 -298 14 65 201 -243 82 -162 -59 -314
$$ packed form
3353a69J85Q7p2j6Q5O1l9j75O9M1k58M48k95J91m43L43J34m92J63Q0M8Q9j16k27
3377b78K31j37K15R5j68pR4L2O3j38j91K31j2m0j11J50k51L88l00J73j55O2l37
3400c91J39Q8M4J96j41k6p3j1K10j0q2o3r7m5K83R0k12j69J51K65j39O9n9K62
3424B79j57J08R4l11r7K7L6J44j86J41k0l08K14o7l7J34Q2k7P1J68m05J19k00
3447a98K06Q3K44j08k41k04Q5M43k30p8J80m43K49O9K39l46r8K8L76n63K75J39
3469A07l3J46l75N9j63M17n84L48J40j9n8K5K57l23Q1j12J89l30M56j00J8l56
3491b10J19L45k1n4j11o2j86K09K27m90L80p3J02k70J20k6P4j44J59j66Q4L33
3513C39l84K14j79k0K73m21K99K35l27r9L5J28l91L12N1J36m44L25k44J03k55
$$ plain form
3534 -314 72 -153 86 226 87 201 323 -47 -63 -148 232 84 231 146 -222 -7 274 126 -235 -10 -43
3555 -43 105 -113 -22 -487 44 -95 -77 -31 -19 74 68 46 -177 -307 -185 62 -28 138 -136 181 118 -340 78 322
3579 322 -241 19 -10 -22 -104 -58 -120 -269 137 231 166 -54 -196 -19 -130 55 -93 206 87 123 169 58 410
3602 410 -51 -77 195 -288 314 -211 339 34 208 -31 37 300 126 -58 208 148 -213 -45 -308 -117 -60
3623 -60 -191 -14 -103 45 -20 -259 -54 -229 168 302 -306 -263 136 297 145 -418 231 191 -192 237 197 54
3645 54 -82 -130 79 90 167 -6 27 139 342 -6 159 339 -101 -74 -96 126 -181 -193 -202 -20 113 55 -100 145
3669 145 175 179 96 64 -26 79 38 -193 -41 -129 177 136 -28 -231 -44 23 -109 368 169 -206 102 32 96 -2
3693 -2 133 -5 -33 15 50 192 -102 298 177 -89 -44 -270 371 171 12 42 -171 239 -75 281 -120 34
$$ packed form
3534c14L86k25K39J40j39J14J22l70j6q5L80j48J47q5l68K15K81j48l61K25l3
3555d3J48k18R1m65N31j39J8M6J2R3ok2k23j30J22K47r0J66k74L17o3m58M18K44
3579C22n63K60k9j2q2M6o2j49M06R4o5k20j42J77j11J85j48K99j19L6M6j11L52
3602D10m61k6K72m83O02n25N50l05J74k39O8K63j74j84K66o0l61J68k63J91N7
3623f0j31J77q9J48o5k39K05j75L97J34o08M3L99J61j52n63O49m0l83M29m0j43
3645E4j36m8K09J1P7j73L3J12K03l48J65J80m40K7k2K22l07j2rJ82J33n8j55K45
3669A45L0Mq3l2r0J05m1k31J52q8L06m1j64k03J87O7j32M77j99l75L08p0O4r8
3693bJ35j38k8M8L5J42k94M00j21k66M5k26O41k00j59L0k13M10l14L56m01J54
$$ plain form
3715 34 -68 128 143 87 152 34 398 -124 83 -106 15 -263 -130 -144 -67 -5 49 160 -22 136 112 74 -82
3738 -82 -130 -310 76 -206 -139 -9 -132 5 33 -161 222 -454 23 -35 -14 -39 95 196 -206 133 -111 147
3760 147 45 -7 157 199 -132 114 93 238 78 80 241 261 141 -7 -272 59 -73 -152 124 92 150 1 -39
3783 -39 32 174 -302 118 -85 119 80 -65 -19 202 211 282 -25 -17 272 -106 -132 -110 21 186 121 -248 -227 17
3807 17 -152 -162 -245 12 63 -327 139 237 -140 27 -131 -105 -136 115 80 -39 232 27 96 92 -42 -35 107 -211
3831 -211 102 -38 50 -46 -10 -48 127 53 96 227 -117 45 -405 -121 -19 197 255 67 -260 68 301 -234
3853 -234 153 18 -89 -25 103 -68 147 -200 -241 -193 67 49 -131 8 74 -220 -338 -23 -30 31 -276 -13 -3
3876 -3 -83 -78 214 168 158 -125 170 -88 -91 -46 98 147 -153 7 -123 136 66 176 162 84 146 -132 -102 14 109 -195
$$ packed form
3715C4j02J96J5n6O5j18L64n22K07j89J21k78J33j4P7O2N4J11j82J58k4l8j56
3738h2m8j80L86k82O7J30j23J37K8j94L83o76M77n8K1k5J34J01m02L39k44K58
3760A47j02n2J64M2l31K46k1J45j60KJ61K0j20j48k65L31j32p9K76l2N8j49m0
3783c9P1J42m76M20k03K04l9j45M6K21RP1l07QK89l78k6K2J31J65o5l69K1K44
3807A7j69j0q3K57N1l90M66R8l77J67j58K6l1K51l5j19K71k05O9mj34PJ42l18
3831b11L13j40Q8r6L6l8J75p4M3J31l44J62m50K84J02K16N8j88l27L28K33n35
3853b34L87j35j07O4J28j71K15l47m1M8K60j8j80J39O6k94j18L15pO1l07K63J0
3876cq0NK92m6j0k83K95k58lM5J44M9l00J60j30K59p0J10j4p8O2k78L0J16R5l04
$$ plain form
3902 -195 -145 167 -4 234 225 -230 -28 356 -77 -85 159 77 -195 -149 -100 121 290 171 -183 110 -246 -36 84
3925 84 -30 -12 -294 -42 276 291 -161 -197 -240 38 4 -39 -59 -148 -131 28 85 227 -26 -81 -55 104 302 14
3949 14 176 308 210 164 -69 352 204 -74 88 26 97 62 177 -156 99 90 -419 231 -8 -107 -15 86 -64
3972 -64 65 -274 -61 190 92 123 -151 97 -39 11 -183 -143 -13 -25 -26 26 106 -165 113 -121 -343 -218 -10
3995 -10 -143 -380 17 2 182 -124 -206 177 -41 49 126 71 -79 89 113 48 -96 -198 188 -161 -56 -137 95
4018 95 157 68 -84 341 257 -17 -76 51 -4 -259 -119 -427 76 286 -216 158 -98 42 -262 -347 -22 58 -90
4041 -90 22 -292 46 185 37 -74 -42 276 -322 -232 -140 -48 152 -89 12 70 -62 -152 -126 -13 206 -339 160
4064 160 39 58 -271 311 206 45 58 -187 49 -215 112 94 200 248 176 128 -173 -99 11 298 -172 -65
$$ packed form
3902a95N0L12j71K38rm55K02L84m33qK44q2k72M6M9K21J69j19l54K93l56K10J20
3925H4j14J8k82K52L18J5m52l6m3K78l4m3k0q9J7J59N7J42k53n5K6J59J98k88
3949A4J62J32r8m6k33M21j48k78J62o2P1l5J15l33K55rn09O50k39r9R2J01j50
3972f4J29l39K13K51r8L1k74K48j36N0j94M0J30j2jN2Q0k71K78k34k22J25K08
3995a0j33k37L97j5J80l06q2L83k18R0P7n5j50J68K4o5j44j02L86l49J05q1K32
4018I5O2q9j52M25q4k74n9J27n5k55J40l08N03K10n02L74k56J40l04q5L25Q0j48
4041i0J12l14L38J39j48j11L2L18n98R0R2R2K00k41J01N8j32r0K6J13K19n45M99
4064A60j21J9l29N82j05j61J3k45K36k64L27j8J06M8p2m8l01P4J10K87m70J07
$$ plain form
4086 -65 -260 -185 1 -125 232 -53 -30 -106 -55 169 -99 64 -189 15 -107 -57 228 180 -38 -143 465 199
4108 199 -84 53 -80 93 -221 -47 144 149 81 -59 206 239 -76 213 -79 30 -3 53 -33 102 193 143 -290
4131 -290 1 -188 -12 18 -42 -24 181 -128 82 -119 289 -129 42 -113 193 94 -167 -62 214 114 -359
4152 -359 -71 -76 -173 3 -19 -53 105 -96 91 -195 149 -211 -98 -19 63 -67 -6 -240 37 -227 -56 108 50
4175 50 171 89 198 -139 276 -90 -63 60 47 -110 -180 56 -35 -337 222 -277 196 -36 7 3 -229 113 -2
4198 -2 28 -89 174 -21 -39 -197 -78 -76 34 67 298 155 -142 -33 215 -64 275 -86 -185 -146 84 11 -287
4221 -287 -129 65 -153 -39 -159 -119 26 -105 14 -35 -70 157 -192 83 -30 -96 124 90 29 -163 -35 123
4243 123 40 -232 -2 -89 -292 -25 37 -145 35 -39 0 -145 232 467 -7 1 -123 -152 -208 -359 -120 97 -259
$$ packed form
4086f5j95P5J86j26L57k85K3p6N1K24k68J63k53K04j22N0K85m8k18j05O08k66
4108A99k83J37j33J73l14J74J91No8j40K65L3l15K89k92J09l3N6q6J35R1n0m33
4131b90K91j89J76L0o0J8K05l09K10k01M08m18J71j55L06r9k61J05K76j00m73
4152c59K88nr7J76k2l4J58k01J87k86L44l60J13P9Q2j30O1k34K77k64J71J64n8
4175E0J21q2J09l37M15l66K7J23j3j57p0K36r1l02N59m99M73k32M3mk32L42j15
4198bL0j17K63j95j8j58J19KJ10L3K31j43k97J09K48k79L39l61r9L9K30p3k98
4221b87J58J94k18J14j20M0J45j31J19m9l5K27l49K75j13o6K20l4o1j92J28J58
4243A23q3k72K30q7k03K67O2j82J80p4L9j45L77K35m74Qj24k9n6j51K39K17l56
$$ plain form
4266 -259 -25 94 162 -240 89 142 70 -37 -294 -388 448 -298 -98 8 61 144 -135 -115 45 -74 -142 -131 -12
4289 -12 15 40 241 -154 -68 -146 202 -74 -33 -127 70 124 -279 -34 14 -240 -75 -62 -175 91 137 -131 87 -9
4313 -9 -366 43 -187 -50 -218 -120 251 -47 -153 154 33 -118 53 179 19 27 -179 186 150 148 -40 194 -290
4336 -290 -133 244 -44 -39 58 131 -121 -65 91 255 -66 118 -122 157 -143 124 218 222 222 -133 119 229 280 23
4360 23 179 -3 319 70 7 3 -152 -1 58 90 61 -137 -100 -100 166 124 0 37 -260 29 -119 97 38 8 -136
4385 -136 -95 169 270 -111 189 -192 42 393 -97 -26 4 -49 133 195 112 -337 45 195 20 -215 -125 -141 -132
4408 -132 -264 114 -168 51 6 -2 -127 -65 -24 -137 -128 -296 -90 247 168 -76 -39 -146 -78 -179 -54 -208 137
4431 137 -24 -91 242 164 32 -184 69 164 -16 -289 -247 -61 168 -97 -30 -70 -219 -70 -47 -4 271 -37 -86
$$ packed form
4266b59K34J19O8m02L29N3p2j07k57r4Q36p46K00J06N3Q3k79K0J60j19o8J1J19
4289a2K7K5K01l95Q6p8L48k76M1r4J97N4m03K45M8k54J65J3j13K66M6k68K18r6
4313il57M09k30J37j68R8L71k98j06L07j21j51J71J26j60Qk06L65l6kj88K34m84
4336b90J57L77k88NR7P3k52N6J56J64l21J84k40K79l00K67R4M%l55K52J10N1k57
4360B3J56j82L22k49o3mj55J51N9L2k9j98L7%K66m2j24L7k97K89j48K16n9l0j44
4385a36M1K64J01l81L00l81K34L51m90P1L0n3J82O2q3m49L82J50j75k35R0j6R
4408a32j32L78k82K19m5qj25O2M1j13Rj68K06L37p9k44L7j07O8j01J25j54L45
4431A37j61o7L33p8j32k16K53R5j80k73M2J86K29k65O7m0j49J49K3M3K75l08m9
$$ plain form
4454 -86 -130 -181 193 -63 -20 13 -41 95 157 48 148 179 110 136 19 -44 -273 201 218 -130 -172 -142 -53 -328 23
4479 23 -15 106 -22 -218 -150 -85 -232 -172 -33 77 -197 -59 -421 -337 246 -289 8 0 111 29 35 -30 -105 -28 -12
4504 -12 274 -47 25 62 11 -260 287 50 -7 -47 -175 -181 302 153 -17 204 71 -182 122 169 123 142 33 82
4528 82 -162 -36 -168 222 -87 -132 -27 232 -51 -185 130 311 -84 91 215 86 92 -109 -45 263 158 147
4550 147 176 167 135 -143 228 47 -190 1 190 -40 142 -90 -81 -137 -62 3 -552 -2 -337 78 -183 -181 15 13
4574 13 189 -150 178 155 -143 -69 -193 163 -65 -242 -120 60 1 -138 -37 10 11 234 -17 191 -44 -55 62
4597 62 177 -148 -163 -385 -40 79 -34 -40 11 -61 -34 -48 -215 -173 -264 28 -93 -36 9 -209 -174 76 243 156 -28
4622 -28 -55 -362 -71 -83 -153 4 -28 9 67 201 95 120 119 107 -260 -112 -42 143 -134 -108 -87 -27 -35 -27 218 154 -77
$$ packed form
4454h6m4n1L74k56M3L3n4J36O2j09J00L1o9K6j17o3k29M74J7l48m2L0Q9k75L51
4479B3l8J21j28j96O8O5j47O0J39J10k74J38l62Q4N83n35K97qJ11q2Oo5p5P7J6
4504a2K86l21P2L7n1k71N47k37n7m0j28oM83j49j70K21j33k53L04M7m6J9j09M9
4528H2k44J26j32L90l09m5J05K59k83j34L15J81l95J75J24j29Ok01O4L08j05j1
4550A47K9rl2k78L71j81k37J91J89k30J82k32Rn6P5O5n55N50l35M15k61KJ96k
4574A3J76l39L28k3k98P4j24L56k28j77J22J80n9j39J01M7JK23k51K08k35j1J17
4597F2J15l25j5k22L45J19j13oN1p2K7j4j67M2r1K92j21N7M5k18L5K50J67q7j84
4622b8k7l07K91j2p0J57l2L7N8J34j06K5jj2l67J48P0J85k77K6K1O0qQK45o4k31
$$ plain form
4649 -77 145 54 -162 162 -16 -182 -68 54 -19 -211 -155 -83 134 133 45 -180 191 162 -84 23 109 85 -359 -273
4673 -273 -85 77 55 104 124 140 8 13 -168 -157 132 -53 -114 238 277 -424 -169 -105 -60 131 109 215 121 -21
4697 -21 -139 42 -84 94 123 -49 93 129 -201 16 185 0 13 -99 -13 238 -6 -87 165 -138 -288 165
4719 165 -282 157 7 375 252 322 75 178 169 -32 137 -12 -10 -160 -98 -118 -136 145 212 184 -40 33 370 166
4743 166 75 -158 104 16 -94 -272 -87 6 153 -2 176 159 -47 -104 -375 56 85 136 -141 -127 -134 -321 -115
4766 -115 120 116 -102 -114 70 164 -46 133 -10 16 21 112 20 -130 5 103 222 -19 -79 -67 450 -75 -87 18
4790 18 -168 205 -40 -63 145 230 -86 -73 90 33 180 -73 -143 104 185 60 -27 -20 183 77 255 3 85 30
4814 30 150 -148 -2 340 -225 175 -16 -217 35 45 77 213 -95 -168 7 -254 7 172 -137 -157 33 -39
$$ packed form
4649g7K22r1k16L24j78j66J14J22p3j92N6P2K17jq8k25L71k9k46J07Q6k4m44Q6
4673b73J88J62k2M9K0J6j32Nj81J1K89j85o1L52L9p01K55O4M5J91k2J06r4j42
4697b1j18J81j26J78K9j72J42L6l30K17J69j85J3j12Q6K51k44q1K52l03j50M53
4719A65m47M39j50L68j23P0k47J03rk01J69j49Kj50O2k0j8K81O7k8k24P3L37k04
4743A66r1k33K62q8j10j78J85R3J47j55J78j7k06n7k71M31K9N1k77J4pj87K06
4766a15K35mk18j2J84R4k10J79j43K6NR1r2j50J35R8J19k41o0J2N17n25j2J05
4790A8j86L73k45k3K08Q5l16J3J63n7J47k53p0K47Q1j25q7PK03j06J78k52Q2n5
4814C0J20k98J46L42n65M00j91k01K52J0L2J36l08p3J75k61K61J65l09k0J90p2
$$ plain form
4836 -39 -12 -326 92 -3 -179 29 15 137 104 198 -117 339 160 -134 -109 138 175 -75 94 244 -297 -162 37
4859 37 -25 43 -261 224 -103 -245 63 217 185 69 -69 23 -10 -56 74 234 125 -89 -7 299 -92 146 -87
4882 -87 305 124 -291 -64 97 163 -141 129 -7 -54 -172 -53 96 -296 222 -68 -212 -177 1 -139 -176 93
4904 93 -57 -190 105 80 -131 419 199 161 -175 -364 -93 11 -137 -83 -33 119 -79 -2 227 -33 8 66 -116
4927 -116 126 -27 93 104 85 -208 -184 -158 -211 -81 -48 -260 121 -36 -292 -312 221 -165 -22 -75 -279 127 219
4950 219 -170 -177 -102 254 80 6 -137 61 -70 -37 11 47 -148 66 45 16 163 21 -271 -69 -53 -283 53
4973 53 -11 43 -255 -200 -26 144 89 -324 34 14 -149 253 35 -324 81 195 -178 123 -323 256 -163 -334
4995 -334 -204 52 -46 25 109 -276 -74 103 86 319 -48 -249 264 -225 -129 39 -111 174 -73 -183 -210 37
$$ packed form
4836c9K7l14M18r5j76K08j4J22l3R4l15M56j79k94K5K47L7k50J69J50n41J35J99
4859C7o2O8l04M85l27j42L08J54l2j16j38R2l3m6J30J60j09k14Q2L06l91K38k33
4882h7L92j81m15K27J61O6l04K70j36m7j18J19J49l92N18k90j44L5J78j40l7K69
4904I3j50j33K95k5k11N50k20l8l36j89K71J04j48N4N0J52j98P7K29k60M1N8j82
4927a16K42j53J20J1j9k93K4K6n3J30L3k12L81j57k56k0N33l86J43n3k04M06R2
4950B19l89pP5L56j74p4j43J98j31L3M8L6j95K14k1k9J47j42k92K02J6k30L36
4973E3o4N4k98N5J74J70n5m13L58k0j63M02k18l59M05J14l73L01m46N79m19j71
4995c34J30K56r8P1Q4l85K02J77j7K33l67k01N13m89R6J68j50K85k47j10k7K47
$$ plain form
5017 37 -124 -146 41 6 184 -203 -76 17 22 98 -53 -119 -189 -177 -105 -69 129 94 217 132 -264 -58 -68 128 -89
5042 -89 268 107 210 85 176 327 7 -84 70 -105 306 71 63 128 213 128 157 -204 -55 5 27 -111 224 33
5066 33 -180 53 136 222 -217 117 -71 65 -134 113 41 206 -92 98 2 6 157 79 72 -4 68 -132 9 10 -86
5091 -86 -10 -156 236 -31 -80 494 86 74 -147 190 -227 -15 -364 -34 -18 -182 -235 -30 243 -55 28 288
5113 288 260 -145 -105 -92 23 -75 247 -13 147 -138 25 171 -84 -65 33 321 -17 -85 -123 89 -85 -7 81
5136 81 314 99 -155 14 -58 -218 -38 45 -377 -303 -215 -54 -102 -24 17 -39 -127 -240 20 -35 146 -8 -66 -81
5160 -81 20 334 -126 -163 280 66 39 -155 -199 101 -60 143 -18 -210 -64 -41 -33 183 -405 129 23 22 -8
5183 -8 -92 148 148 168 111 -31 -238 -115 -207 157 164 -235 160 239 -89 57 44 16 -59 -106 -141 138 -212 265 -36
$$ packed form
5017C7j61k2J87l5J78l87J27R3NP6j51o6p0J2P2L6J98l5J23q5l96K06j0J96k17
5042h9L57j61J03j25R1J51l20r1J54j75M11k35qO5Q5q5K9l61J49O0K2j38L35j91
5066C3k13K33Q3Q6m39L34j88J36j99K47p2J65k98J90r6MJ51p8pp6P2k00J41Jr6
5091h6P6j46L92k67m9N74m08j2k21L37m17K12l49L30J6j64n3K05K73k98Q3K60
5113B88k8m05M0J3J15r8L22k60J60k85J63J46k55J9R8K88l38o8l8K12j74P8Q8
5136H1K33k15k54J69p2j60J80Q3m22P4Q8J61m8P8M1n6q8j13K60n5J81j54n8j5
5160h1J01L14m60l7M43k14k7j94m4L00j61K03j61j92J46K3QK16n88N34j06jl0
5183hq4K40%K0n7j42k07J23r2L64Pl99L95P9l28J46j3k8p5m7l5K79l50M77l01
$$ plain form
5208 -36 -328 -141 61 157 61 -25 -43 -28 -104 -58 170 -7 -233 50 254 -138 -106 -193 -48 -208 -218 -38 -78 136
5232 136 -13 347 -38 0 -68 -40 28 4 172 -62 89 20 147 169 49 14 -64 16 276 155 48 -21 -34 6
5256 6 160 144 -372 -83 -16 -45 -12 55 187 69 194 -149 -70 155 26 57 -41 10 -161 275 -113 -268 8 9
5280 9 108 0 112 31 43 -137 -149 74 87 48 -110 152 -108 -258 34 191 -77 -234 116 2 -4 -85 -131 44
5304 44 51 10 -5 102 162 163 -3 -3 184 -110 -315 92 -38 -106 -67 -122 -17 39 182 -29 -177 193 -254 131 -1
5329 -1 -30 13 -13 -323 -57 -63 142 -117 12 64 3 -315 64 -56 -52 180 -54 -10 -300 -109 -140 132 -231 33
5353 33 136 -54 -200 -230 6 59 74 -306 -79 -9 -108 196 -5 -233 29 -77 158 277 -83 -33 239 55
5375 55 -70 -84 -21 156 -58 -55 -88 -81 -323 81 -183 -13 -60 -130 266 -11 -110 80 -105 0 54 -130 89 -176
$$ packed form
5208c6k92J87K02R6r6q6j8J5p6M6K28j77k26K83K04l92L2q7J45j60j0J80m0K14
5232A36j49L60l85L8o8K8O8k4J68k34J51o9J27K2j20l5p8Q0K60j21j07o9j3M0
5256FJ54j6n16K89O7k9L3O7J32j18J25l43P9K25j29L1r8N1j71M36l88j55K76J
5280IR9j08J12q1J2j80j2K23J3l9j58K62k60j50K92J57k68j57L50j14oq1m6J75
5304D4Pm1j5J07O0Jj66%J87k94k05M07j30o8L9n5J05N6J43k11j48L70m47L85j32
5329ak9M3k6l10K66oK05k59J29N2o1l18L79j20MK32k34M4k90J91l1K72l63K64
5353C3J03j90j46l0K36N3J5l80K27P0r9L04k01k28K62j06K35J19l60N0K72j84
5375E5j25j4O3J77k14Ll3Pk42M04k64J70m7p0L96k77r9J90j85J05N4j84K19k65
$$ plain form
5399 -176 -99 -371 38 61 -306 -129 11 -306 -7 -82 -43 -15 111 -41 55 -374 -164 -267 -41 125 98 -203
5421 -203 153 -103 -162 -210 -15 -82 -111 -286 -82 68 -73 -26 145 -149 -39 121 85 149 -129 248 -115 219
5443 219 -165 104 17 48 -78 -37 -236 187 -52 -6 16 -117 11 -145 -91 -18 -23 30 217 -102 -126 22 -252 244
5467 244 90 -52 48 -99 30 -73 -224 -75 -277 87 -108 -55 -211 156 162 272 -56 -263 142 -167 -164 -120
5489 -120 -122 84 32 -287 -221 58 50 39 -255 -181 139 -58 317 23 -135 -91 -129 -159 7 -214 -277 -9 116 184
5513 184 -185 6 -168 175 -89 95 -170 57 161 56 274 13 -212 -103 129 -3 -198 -238 18 142
5533 142 103 -235 -325 -102 -395 81 119 10 -44 -23 75 -216 102 -153 306 46 -283 -48 126 -133 -147 -56 -209
$$ packed form
5399a76P7k72M09K3l67J77J40l17K99p5L9K8J26j52R6m29K10j03K26J66k7l01
5421b03L56k56n9m8J95o7k9j75K04J50j41M7J71k94J10J60l6O4k78L77l63L34
5443B19l84K69q7L1j26M1j99M23k39M6K2j33J28j56N4P3nN3J87l19k4J48k74M96
5467B44j54j42J00j47J29j03j51J49k02L64j95N3j56L67OJ10l28k07M05l09LM4
5489a20kK06n2l19O6K79qj1k94P4L20j97L75k94j58M4l8l0J66k21o3K68J25O8
5513A84l69J91j74L43k64J84k65K27J04j05K18k61k25J09K32j32j95m0K56J24
5533A42l9l38r0K23k93M76L8j09n4K1R8k91L18k55M59k60l29K35J74k59j4R1j53
$$ [...]
8191B16
##END NTUPLES=NMR FID
##END=
