##TITLE=1H_EC-3171
 CDCl3, 8 sc, 
 10.1.2019
##JCAMPDX= 6.0         $$ Bruker NMR JCAMP-DX V2.0
##DATA TYPE= NMR FID
##DATA CLASS= NTUPLES
##ORIGIN= UXNMR, Bruker Analytische Messtechnik GmbH
##OWNER= root
$$ XWIN-NMR		Version 3.5
$$ Thu Jan 10 14:00:26 2019 Russian Standard Time (UT+4h)  she@DPX200
##.OBSERVE FREQUENCY= 200.1313
##.OBSERVE NUCLEUS= ^1H
##.DELAY= (6, 6)
##.ACQUISITION MODE= SIMULTANEOUS
##.ACQUISITION SCHEME= undefined
##.AVERAGES= 8
##.DIGITISER RES= 18
##SPECTROMETER/DATA SYSTEM= spect
##.PULSE SEQUENCE= zg30
##.SOLVENT NAME= CDCl3
##.SHIFT REFERENCE= (INTERNAL, CDCl3, 0, 15.7039)
##AUDIT TRAIL= $$ (NUMBER, WHEN, WHO, WHERE, WHAT)
$$ ##TITLE= Audit trail, XWIN-NMR		Version 3.5
$$ ##JCAMPDX= 5.01
$$ ##ORIGIN= Bruker BioSpin GmbH
$$ ##OWNER= she
$$ F:/spectra/data/she/nmr/H-F/1/audita.txt
$$ ##AUDIT TRAIL=  $$ (NUMBER, WHEN, WHO, WHERE, WHAT)
(   1,<2019-01-10 13:58:39.56 +0400>,<she>,<DPX200>,
      <created by zg, POWCHK disabled, PULCHK disabled
       configuration hash MD5:
       00 E9 B6 7A A2 85 ED C7 34 08 36 98 17 FE 4E 26
       data hash MD5: 16K
       A1 25 3F D6 2F 49 E6 4C BE FF 57 7F 94 03 21 86>)
$$ ##END=
$$ 
$$ hash MD5
$$ 0B 26 04 AD 7E 54 4A 03 8B 72 9E 32 27 0B 59 4A
##$RELAX= 
##$RELAX= 
##$RELAX= 
##$RELAX= 
##$RELAX= 
##$RELAX= 
$$ Bruker specific parameters
$$ --------------------------
##$DU= <F:/spectra>
##$EXPNO= 1
##$NAME= <H-F>
##$PROCNO= 1
##$TYPE= <nmr>
##$USER= <she>
##$AMP= (0..31)
100 100 100 100 100 100 100 100 100 100 100 100 100 100 100 100 100 100 
100 100 100 100 100 100 100 100 100 100 100 100 100 100 
##$AQSEQ= 0
##$AQ_mod= 1
##$AUNM= <au_zg>
##$AUTOPOS= <>
##$BF1= 200.13
##$BF2= 200.13
##$BF3= 200.13
##$BF4= 200.13
##$BF5= 200.13
##$BF6= 200.13
##$BF7= 200.13
##$BF8= 200.13
##$BYTORDA= 1
##$CFDGTYP= 0
##$CFRGTYP= 5
##$CHEMSTR= <none>
##$CNST= (0..31)
1 1 145 1 1 1 1 1 1 1 1 1 1 1 1 1 1 1 1 1 1 1 1 1 1 1 1 1 1 1 1 1 
##$CPDPRG= <>
##$CPDPRG1= <>
##$CPDPRG2= <>
##$CPDPRG3= <>
##$CPDPRG4= <mlev>
##$CPDPRG5= <mlev>
##$CPDPRG6= <mlev>
##$CPDPRG7= <mlev>
##$CPDPRG8= <mlev>
##$CPDPRGB= <>
##$CPDPRGT= <>
##$D= (0..31)
0 1.2 0 0 0 0 0 0 0 0 0 0.03 0 0 0 0 0 0 0 0 0 0 0 0 0 0 0 0 0 0 0 0 
##$DATE= 1547114318
##$DBL= (0..7)
120 120 120 120 120 120 120 120 
##$DBP= (0..7)
150 150 150 150 150 150 150 150 
##$DBP07= 0
##$DBPNAM0= <>
##$DBPNAM1= <>
##$DBPNAM2= <>
##$DBPNAM3= <>
##$DBPNAM4= <>
##$DBPNAM5= <>
##$DBPNAM6= <>
##$DBPNAM7= <>
##$DBPOAL= (0..7)
0.5 0.5 0.5 0.5 0.5 0.5 0.5 0.5 
##$DBPOFFS= (0..7)
0 0 0 0 0 0 0 0 
##$DE= 6
##$DECBNUC= <off>
##$DECIM= 24
##$DECNUC= <off>
##$DECSTAT= 4
##$DIGMOD= 1
##$DIGTYP= 9
##$DL= (0..7)
0 120 120 120 120 120 120 120 
##$DP= (0..7)
150 150 150 150 150 150 150 150 
##$DP07= 0
##$DPNAME0= <>
##$DPNAME1= <>
##$DPNAME2= <>
##$DPNAME3= <>
##$DPNAME4= <>
##$DPNAME5= <>
##$DPNAME6= <>
##$DPNAME7= <>
##$DPOAL= (0..7)
0.5 0.5 0.5 0.5 0.5 0.5 0.5 0.5 
##$DPOFFS= (0..7)
0 0 0 0 0 0 0 0 
##$DQDMODE= 0
##$DR= 18
##$DS= 0
##$DSLIST= <SSSSSSSSSSSSSSS>
##$DSPFIRM= 0
$$ [...]
##$SUBNAM2= <"">
##$SUBNAM3= <"">
##$SUBNAM4= <"">
##$SUBNAM5= <"">
##$SUBNAM6= <"">
##$SUBNAM7= <"">
##$SUBNAM8= <"">
##$SUBNAM9= <"">
##$SW= 24.933730806125
##$SWIBOX= (0..15)
0 0 2 0 0 0 0 0 0 0 0 0 0 0 0 0 
##$SW_h= 4990.01996007984
##$TD= 16384
##$TD0= 1
##$TE= 0
##$TE2= 300
##$TE3= 300
##$TEG= 300
##$TL= (0..7)
0 120 120 120 120 120 120 120 
##$TP= (0..7)
150 150 150 150 150 150 150 150 
##$TP07= 0
##$TPNAME0= <>
##$TPNAME1= <>
##$TPNAME2= <>
##$TPNAME3= <>
##$TPNAME4= <>
##$TPNAME5= <>
##$TPNAME6= <>
##$TPNAME7= <>
##$TPOAL= (0..7)
0.5 0.5 0.5 0.5 0.5 0.5 0.5 0.5 
##$TPOFFS= (0..7)
0 0 0 0 0 0 0 0 
##$TUNHIN= 0
##$TUNHOUT= 0
##$TUNXOUT= 0
##$USERA1= <user>
##$USERA2= <user>
##$USERA3= <user>
##$USERA4= <user>
##$USERA5= <user>
##$V9= 5
##$VALIST= <valist>
##$VCLIST= <CCCCCCCCCCCCCCC>
##$VD= 0
##$VDLIST= <DDDDDDDDDDDDDDD>
##$VPLIST= <PPPPPPPPPPPPPPP>
##$VTLIST= <TTTTTTTTTTTTTTT>
##$WBST= 1024
##$WBSW= 4
##$XGAIN= (0..3)
0 0 0 0 
##$XL= 0
##$YL= 0
##$YMAX_a= 105601
##$YMIN_a= -205098
##$ZGOPTNS= <>
##$ZL1= 120
##$ZL2= 120
##$ZL3= 120
##$ZL4= 120
##$ABSF1= 10
##$ABSF2= 0
##$ABSG= 5
##$ABSL= 3
##$ALPHA= 0
##$AQORDER= 0
##$ASSFAC= 0
##$ASSFACI= 0
##$ASSFACX= 0
##$ASSWID= 0
##$AUNMP= <proc_1d>
##$AZFE= 0.1
##$AZFW= 0.1
##$BCFW= 1
##$BC_mod= 2
##$BYTORDP= 1
##$COROFFS= 0
##$CY= 11.3945322036743
##$DATMOD= 1
##$DC= 2
##$DFILT= <>
##$DTYPP= 0
##$F1P= 18.9103706918063
##$F2P= -1.10871071338519
##$FCOR= 0.5
##$FTSIZE= 0
##$FT_mod= 4
##$GAMMA= 1
##$GB= 0.15
##$INTBC= 1
##$INTSCL= 1
##$ISEN= 128
##$LB= 0.24
##$LEV0= 0
##$LPBIN= 0
##$MAXI= 10000
##$MC2= 0
##$MEAN= 0
##$ME_mod= 0
##$MI= 1.114404
##$NCOEF= 0
##$NC_proc= 0
##$NLEV= 6
##$NOISF1= 3.799351
##$NOISF2= 2.8
##$NSP= 1
##$NTH_PI= 0
##$NZP= 0
##$OFFSET= 15.70392
##$PC= 1
##$PHC0= -8870.708
##$PHC1= 16.20006
##$PH_mod= 1
##$PKNL= yes
##$PPARMOD= 0
##$PSCAL= 0
##$PSIGN= 0
##$REVERSE= no
##$SF= 200.130013532006
##$SI= 16384
##$SIGF1= 3
##$SIGF2= 2
##$SINO= 400
##$SIOLD= 16384
##$SREGLST= <1H.CDCl3>
##$SSB= 0
##$STSI= 0
##$STSR= 0
##$SW_p= 3612.71676300578
##$SYMM= 0
##$S_DEV= 0
##$TDeff= 0
##$TDoff= 0
##$TI= <>
##$TILT= no
##$TM1= 0
##$TM2= 0
##$TOPLEV= 0
##$USERP1= <user>
##$USERP2= <user>
##$USERP3= <user>
##$USERP4= <user>
##$USERP5= <user>
##$WDW= 1
##$XDIM= 8192
##$YMAX_p= 0
##$YMIN_p= 0
$$ End of Bruker specific parameters
$$ ---------------------------------
##NTUPLES= NMR FID
##VAR_NAME=  TIME,          FID/REAL,        FID/IMAG
##SYMBOL=    X,             R,               I
##VAR_TYPE=  INDEPENDENT,   DEPENDENT,       DEPENDENT
##VAR_FORM=  AFFN,          ASDF,            ASDF
##VAR_DIM=   8192,          8192,            8192
##UNITS=     SECONDS,       ARBITRARY UNITS, ARBITRARY UNITS
##FACTOR=    0.0002004,     1,               1
##FIRST=     0,             0,               0
##LAST=      1.6414764,     0,               0
##MIN=       0,             -205098,         0
##MAX=       1.6414764,     105601,          0
$$ Real data points
##PAGE= N=1
##DATA TABLE= (X++(R..R)), XYDATA
0@%%%%%%%pJ5j6J6j6J9k7L2m0M8n6P2q6J00j17J35j53J76k02K30k62K98l38L81
31B02m28M81n40O03o73P50q35R28j027J137j259J395j546J712j896K104k340K609
49A377k923L287l720M247m899N733o846Q418j0830J5032k4457Q5658l1489j53365
63a14777M5184J03891P1303n1039q1315m2590N4099P4817J7888o5938m9381K1461
75a6397M8082j7425n8302k7523L4346M1560P554l1045l5179j741M7231M5316r000
88B7477m3440m396M1633K4224l0900m1936p753K2792K5883J1309j5189k7993q00
101a9089M2304M1639n769l7602l0566j8883j1641J1479L5821J8780k3718l3522
113c0767k165K7031K8963J3046j4858l9019k4544K1189L7391N05k8134n218K4673
$$ y = [0, 0, 0, 0, 0, 0, 0, 0, -7, 8, -8, 8, -8, 11, -16, 16, -24, 24, -32, 40, -46, 54, -63, 72, -81, 95, -107, 123, -139, 159, -179, 202, -226, 255, -285, 318, -355, 395, -440, 488, -539, 598, -661, 734, -812, 900, -996, 1108, -1232, 1377, -1546, 1741, -1979, 2268, -2631, 3102, -3744, 4674, -6156, 8876, -15581, 70077, 38588, -114777, -69593, 34298, 105601, 54562, -26753, -69343, -15244, 59573, 77461, 11523, -37858, -16397, 31685, 14260, -44042, -71565, -37219, 4341, 11895, -19150, -54329, -56070, -8839, 36477, 27477, -15963, -20359, 21274, 45498, 14598, -27338, -35091, -12299, 13584, 24893, 9704, -18289, -19089, 23215, 64854, 59085, 21483, -9083, -27966, -39607, -28128, 7693, 26473, 2755, -30767, -32932, -5901, 23062, 36108, 21250, -17769, -42313, -21124, 16267, 16772, -11362, -16580, 8093]
126H093J0431k1179j9463O938K6639K7110N825k8104l7887k25L6711J4556l3582
139d137l3724J0035K8468M644j3583k898J4560J7351K703k6227m1781r557M4813
152i333M5896j4162m9658j0924M1879L7061q407l4504k0070J3400L4990J6279
164D2447l1740m4708Q871O0047L1403m4209o4461j2176M0141M0468M273k7716
176B640k9118L429L2215J4209k9549k9422J8777M0013k640m3140k2435K9820N0224
189C5023K0106k9764n7057k9496L7179O7173J8215m9541n0066O936L9865K1709
201C0282j1956k8275k4896j168K7890K5711m513k0943q03J7759Q904n221o073
214F698j0765j8084k785K6234K6882l087k1486j0631M079R568J2394N078j5223
$$ y = [8093, 18524, -2655, -22118, -15180, 11459, 38569, 44394, 16290, -21597, -21822, 14889, 29445, -4137, -37861, -27826, 642, 5286, -8297, -11195, 3365, 20716, 23419, -2808, -44589, -54146, -9333, 36563, 22401, -27257, -38181, 3698, 40759, 32352, -2152, -22222, -8822, 26168, 42447, 10707, -34001, -25130, 34917, 66320, 22111, -42350, -54526, -14385, 26083, 30356, 2640, -26478, -23049, 9166, 23375, -6174, -35596, -16819, 23194, 20554, -22586, -45021, -15201, 35023, 55129, 25365, -31692, -61188, -24009, 43164, 61379, 11838, -38228, -31292, 8573, 30282, 18326, -9949, -34845, -36013, -8123, 17588, 13075, -7868, -8671, 9088, 17992, 12771, 6698, -4067, -22151, -24936, 1298, 28180, 25093, 3607, -7024, -2945, 6623, 19017, 24095, 8872]
227H872k3613k568J5622L184j1166K259J4308m128k7660j5476J8606L6972K5672
240D0884n575l9343l9618Q774N2864K9689l7287n7842o849M6608M6410O499k7429
253A7785k8724Q98K9906J6980l0778m6721j790M2175K5902j8082k7842o39K2284
266A354J9854J394j7272j7821O138K3232J898k9259j7906K2862K9946p321l4926
279a7827j5704J9840L5749K1920j0692l7247k5353J4293K8720m512l3834j6255
291d0902J7720K1861L277l595L736R078R740J920j8262k7662m452K7110K1532
304B1101j1145k1065J27J5079R205K634K187m334r014k103K888n451p361N176
318b076P888j0978k0820r12J7601J2237J400K474K265o012o295K843J432r652
$$ y = [8872, -14741, -17309, -1687, 1497, -9669, -7410, 6898, 2770, -24890, -40366, -21760, 15212, 40884, 35309, -4034, -43652, -34878, 17986, 47675, 10388, -47454, -54303, -7695, 38715, 45214, 17785, -10939, -10041, 19865, 36845, 6067, -40654, -42444, -269, 25633, 7551, -20291, -20930, 1354, 21208, 22602, 5330, -12491, -6353, 16879, 18777, -10482, -28388, -5526, 24420, 17099, -17827, -33531, -13691, 22058, 43978, 33286, -3961, -29314, -15021, 13699, 9187, -24647, -40902, -23182, -1321, 1956, -1639, 2097, 11175, 20915, 22835, 4573, -23089, -27541, -431, 21101, 9956, -11109, -10982, 4097, 13302, 15936, 18123, 13789, 4775, 2672, 5560, 109, -7252, -2076, 5812, -5166, -25986, -26898, -9297, 2940, 4340, 6814, 9079, 3067, -3228, -385, 1047, -8605]
332h605p573K267L151J94J0884J8977K930j5699o117J4984J0639j3966k4334j1958
346b4226Q453K2985K0547q378l6823k2118K6630M3005O651l3382k9894J178K1652
359c720K0293J420k0626k2244K650K0534M898j3873K13K4645J5988j5589k4941
372a0352l911J6582J5732j249k3834k6925M684M1077L1195j8468m1166j0193K6741
385h7K4507o073k6049k1695J822K8646K8051o807l4214j7406J8431K2928J436
398A3490j0337m735k083o64O890R369Q4o566l461m912j2319k998J8970K0388m665
413A6451k0739r997M903P106O413L087q137j6090k408J6728J4189k104o637k764
427An863n287P692J3684j012j0899L16J3492O814o859r064p259n686M023J1924
$$ y = [-8605, -16178, -13911, -10760, -10566, 318, 19295, 22225, 6526, 409, 15393, 26032, 12066, -12268, -24226, -15773, 7212, 27759, 19381, -17442, -39560, -12930, 30075, 36726, 3344, -26550, -25372, -3720, 16573, 17993, -2633, -24877, -22227, -1693, 3205, -10668, -10455, 14190, 30178, 14589, -10352, -14263, 2319, 18051, 16802, -7032, -33957, -29273, 11804, 42999, 24531, -16635, -26828, -87, 24420, 18347, -7702, -29397, -27575, 1071, 29122, 22315, -11899, -29305, -10874, 12054, 13490, 3153, -1582, -3665, -4329, 2561, 11930, 12014, 5448, 1987, -2925, -15244, -18242, 728, 21116, 16451, -4288, -14285, -9382, -2276, 4137, 7224, -913, -17003, -19411, -2683, 11506, 9402, 2765, 1, -5862, -11149, -3457, 10227, 9215, -1684, -1368, 12124, 18938, 12079, 3015, -4244, -9930, -5907, 6017]
442F017K15j6401q309J6261J8476k625j6136q212J415K289L247J277n099k861
456a0446J1463J2513q686j8187K258K1972J1809j0699j3899j994O305R070M213
469A5692j1192k0289m364J6407J0985j1397j0327J2763J9725Q71j7927j6730n802
482b1585R484J6750L871k0208k0607J2941L5825J7856j3379j9525n268N653Q137
495I945N783n799j4855n032J1255P836q293q246O141P567m804o214L449N027j794
510A966m497m014q903n696Q832J1764l941j2157M493K1639J5396j093r709j2957
524A123j2196J078J6079R606j2641j7967n36J4802J4666R731o96j7771k2389j580
538a8691J9828J2649r834j6243o640J776P367J1970O981q498r207O554J2744J793
$$ y = [6017, 6232, -10169, -18478, -2217, 16259, 13634, -2502, -10714, -9299, -7010, -3763, -2486, -7585, -10446, 1017, 13530, 4844, -13343, -11085, 10887, 22696, 11997, -1902, -3896, 2409, 11479, 15692, 4500, -15789, -20153, -3746, 7239, -4158, -14485, -1722, 18003, 18874, 947, -15783, -21585, -12101, 4649, 8520, -11688, -32295, -19354, 16471, 34327, 20948, 1423, -3845, 1808, 9945, 15728, 9929, -4926, -9958, 1297, 9133, 840, -7406, -1265, 6302, 1498, -4716, -1267, 3760, 1966, -2531, -6545, -15448, -21144, -12312, -548, -4489, -16646, -12153, 9486, 24882, 23789, 14080, 1123, -11073, -9995, 6084, 15690, 3049, -14918, -15454, -652, 14014, 23745, 23049, 5278, -17111, -18691, 1137, 13786, 3952, -12291, -18931, -17155, -9788, 2182, 9163, 665, -8542, -1988, 10756, 12549]
552A2549n303J101J135r978j0775J865Q188L836M41J066k193j953J0096J2704
566B2779q465k8000j5329J1080J6927K231r573j0309k563J1850K2525R870j7393
579E630k1122J983J7949P371m966m103m22j408J643N345R82m194K421R110j500
594A4719j2130k765J0221L901j2108j3925m072M03L655P972L621p258m880R769
608b877J0515o757j3901k657O834L677N94K594K82j685N991J2780J400j1788o512
623a510O782N781k096j739J262k746m557L070L804p172j0966J518R348K410m294
638a105j182p25m748L89Q055J438j1731q033P339J1152L470M45K301l750q035
653d720L92Q537K677l776O41K258m965n361P884J1547m384j5916r702J676P603
$$ y = [12549, 7246, 8347, 9482, -496, -11271, -9406, -1218, 2618, 3059, 4125, 1932, -21, 10075, 22779, 14314, -13686, -29015, -17935, -1008, 1223, -8350, -18659, -21222, -9372, 13153, 23023, 5630, -15492, -13509, 4440, 11811, 6845, 2742, 2320, 912, 2555, 7900, 8882, 4688, 7109, 16219, 14719, 2589, -176, 10045, 13946, 1838, -12087, -16159, -15756, -12101, -4129, -508, -7766, -12646, -2877, 7638, 881, -13020, -15677, -8843, -5166, -4572, -1978, -1696, -3381, 2610, 15390, 16790, 5002, -1510, 5272, 11053, 8957, 7218, 8480, 5734, 1177, 4247, 8051, 879, -10087, -8569, 779, 3189, -1105, -2287, -3012, -7760, -7371, 684, 2122, -9609, -17642, -10303, 849, 4319, 4764, 7065, 3315, -4720, -4328, 4209, 6886, 3110, 3751, 6009, 1044, -4317, 3567, 15114, 10730, -5186, -14888, -13212, -5609]
668e609J0151P955n551j7093m612J5976J3808p292j6430p252L137Q000J1723O118
682A3029q743j2568K875J3772M333p835n389K35j902j114O706O154n121r958l108
697h634K046J818O928J1390r07j5178r128R673J2532j140j0845j0815p643K590
711a7313J7751J7850k619j7636o621Q034P695k25l927p550j1421k856J3285J3105
725G552k290q006O1L808J27K158O444j008r700m144O519L986l809j607J558l461
741a812l840P831J2602J248q883n014N61k912l229J095k868j1948n394J1155J4822
756C414L261l545j552k229l832K129N429l510j1219j246R776O377k387N32N907
771G305J594k634K020K220m244m312L977L134q331r926J398N098o43j018M385
$$ y = [-5609, 4542, 12497, 6946, -10147, -14759, 1217, 15025, 7733, -8697, -15949, -12812, -4812, 6911, 13029, 4286, -8282, -5407, 8365, 12698, 4863, -526, -291, -2193, -3307, 3399, 9553, 4432, -5526, -8634, -6588, -4770, 2158, 13548, 12641, -2537, -11665, -1992, 10540, 9400, -1445, -12260, -19903, -17313, 438, 18288, 15669, -1967, -8588, -554, 7141, 6916, 2989, -4561, -15982, -18838, -5553, 7552, 5262, -2744, -2683, 1125, 1252, 3410, 9854, 8846, -854, -4998, 1521, 5507, 1698, 91, 1649, -1812, -5652, 2179, 14781, 16029, 7146, 2132, 2693, -219, -3448, -2353, -5221, -17169, -22563, -11408, 3414, 6675, 3130, 1578, -651, -4483, -2354, 3075, -435, -11654, -12900, -3124, 3253, 866, 1398, 7305, 8899, 6265, 8285, 10505, 6261, 1949, 5926, 9060, 729, -9197, -7799, -2701, -3344, -4362, 23]
786B3K731k766N17O158O45r186n806J463j938n012K794J0377M274k434K061N861
802I762m73l262J258j431j0446o747O938J0306k312p686j616K235J138M946O339
817H949m506j2714l207J0842P653m010p069l701m347K39J1150J2486r16r258j453
832A38O619L416m02M07n079j2689o725Q965J2093R74m600j753k812l526L999P919
848F944k607j4377p780O553Q631L665J099j907q873m568J0502J3258m68j0337
862b65l874M339M280N151M582m508j4534o746R652J2046N80n260l495m400l160
877e612M886Q891l202j3816p024M827N849M059M639J378r323q579N386J1232J854
892E445m708j598K52r99M337J0174J703j1369q772L014M897k50l11K585k777n163
$$ y = [23, 2754, -12, 505, 6663, 7308, -1878, -7684, -6221, -8159, -13171, -10377, 0, 4274, 1840, 3901, 9762, 9289, 6027, 7285, 5854, -4592, -11339, -4401, 5905, 3593, -4093, -5709, -3474, -2336, 2610, 8949, 4443, -8271, -11478, -636, 7017, 3007, -4062, -7763, -12110, -11871, -721, 11765, 10849, 1591, 138, 6757, 10173, 9771, 10178, 5099, -7590, -14315, -5350, 6743, 7717, 3117, 1364, -1448, -4974, -975, 6944, 4337, -10040, -17820, -11267, -2636, 1029, 2128, 221, -8652, -13220, -2718, 10540, 10072, -265, -4139, 200, 4480, 9631, 14213, 9705, -4829, -11575, -1923, 10123, 10703, 5443, 1948, -2452, -5612, -726, 8165, 4963, -8853, -15877, -11050, -5201, -1142, 3497, 4875, -4448, -13027, -7641, 3591, 5445, 737, -861, -609, -1608, 2729, 12903, 14606, 3237, -5535, -2521, 2376, 2126, 1815, 4400, 1623, -3540]
908c540L394P569k111j0164m290L494L90j151L576L077m902l807O352O566k642
923A811m417K960L301k056K07N971R20p422m060K975L33l615J399O485P63m009
939A546M75M252k595o649l93J082m941n298L491O629J000R44N731K343o355m271
955c009M913L896l298l161Q51k125l774M217R101n2q617l457N053L398O69J943
971F548j102r037q094M142P277k910o028N91M485L328N292Q255k17j0542o355
986d367M474L876l701l664K06j523r67P797J1285k48j0593o186J513J220P88L565
1002C475j541j1696q462O764J2674K984m009k855k386j075P720J2752J252j3428
1016B169j0619J920N120K654K078J011n354l733Q621J2286J50j0174p388j583
$$ y = [-3540, -146, 7423, 5312, -4852, -9142, -5648, -5258, -6409, -2833, 244, -4658, -8465, -2113, 4453, 1811, -2606, 354, 3655, 1599, 1806, 7777, 8697, 1275, -2785, 190, 523, -3092, -1693, 4792, 5555, 1546, 2021, 6273, 3678, -2971, -3364, -2282, -7223, -12521, -9030, -2401, -1401, -457, 5274, 7617, 1262, -3009, 1904, 5800, 2502, -659, 192, -1933, -5707, -1490, 7611, 7559, -1058, -4515, 538, 3936, 4605, 6548, 5446, -3591, -11685, -7543, -266, -3176, -9204, -8613, -4128, -800, 4492, 12747, 12530, 1988, -4367, 107, 3983, 282, -3382, -3176, -4699, -5666, 2131, 13416, 13168, 2575, -3611, -2098, -878, -90, 3475, 1934, -9762, -18224, -11460, 1214, 4198, 189, -2666, -5052, -6127, 1593, 14345, 15597, 2169, -8450, -6530, -1410, 1244, 3322, 4333, -1021, -4754, 3867, 16153, 16303, 6129, -1259, -2842]
1030b842l186j223M244P58o955m179O991R185O81k500K37l215n862K630R998K812
1046G574q442o336J907L931L301O628K731p706q173M879J2225K394p736o896m542
1061d261m705L66P606L362o579m083N948N932j882j719K156j865p130j205M856
1076c203J472k281K879O057o52l681J997M872k449n367J912M128k289l856R27
1091D66Q65m462j870M723J637n674l165N682M119k046o70J925k165n956Q07N951
1107A67K94l574K894O794P5m382N38K572j786j461K713J04p065m243O994P691
1123H325k547o979l614k694k744N136Q364p26r113l189O244M255j051J006R26
1138A599m957n762M025Q868K590j330J014n51n065j094Q260M893p036r227J095
$$ y = [-2842, -6028, -7251, -3007, -2249, -9204, -13383, -6392, 2793, 3474, 974, 1211, -2004, -7866, -5236, 4762, 7574, -868, -7204, -5297, -1366, 1935, 8563, 11294, 3588, -4585, 294, 12519, 14913, 7177, 281, -4261, -8966, -8600, -994, 2368, -4211, -8294, -2346, 3586, 1704, -15, 2141, 276, -6854, -8059, -3203, -1731, -4012, -1133, 4924, 4272, 591, 2588, 7460, 5011, -356, 1556, 5684, 3395, -461, 466, 1331, -3131, -5001, -278, 1359, -4315, -7480, -1798, 2321, 275, -395, 1530, -635, -6591, -5784, 167, 461, -3113, -219, 6575, 6650, 2268, 2806, 5378, 3592, 2131, 4844, 4948, -2117, -6360, 634, 8325, 5778, -1201, -4815, -7509, -10253, -5117, 3247, 2521, -6592, -9781, -3537, 718, -333, 673, 1599, -3358, -9120, -5095, 3773, 6363, 5033, 6047, 5496, 431, -663, 7597, 12490, 5454, -3773, -2678]
1153b678M896K027l10j106p489p276N020J1352J704r900n166L730N052J660J561
1168C077k921r781n526Q155J1320J695l160K09P27k958R20P502K251r041q993
1183f524l57L404K774N604M125o528j0574L52J0661N138m525n164k375l248L94
1198f843P442M023p085p790L222Q423K979j46K135j334m697P4N750m40r722n927
1214i936L434M770J164L657L556k957n714K172N914j560o508k102N94l459j468
1229h443P112O788j287n004l7J860j25K951N423k318j0683m422O055M194l660
1244a596l501J534P20j53M385M422k352m457L219L363o260r307O40O889K540j56
1260g0J737J192j551K981O938j24r205n295L954K366m432k704L287J210k202N00
$$ y = [-2678, 2218, 4245, 3935, 2829, -4660, -11936, -6916, 4436, 6140, -3760, -8926, -5196, -144, 1516, 3077, 156, -9625, -15151, -6996, 4324, 6019, 2859, 3068, 3795, 837, 1757, 9259, 11510, 2469, -6524, -6881, -3477, -703, 4901, 9026, 2498, -8076, -7724, 2937, 8075, 3550, -1614, -3989, -7237, -6843, 599, 4622, -2463, -10253, -7031, 1392, 4371, 4225, 6360, 5026, 329, 403, 6153, 5713, -4009, -9936, -6502, -1732, -568, 3089, 6645, 3688, -2026, 146, 6060, 4500, -2008, -4110, -3516, -6975, -8443, -1331, 5457, 4170, -834, -871, 989, 864, 3815, 9238, 6920, -3763, -8185, -2130, 2064, -1596, -5097, -3563, -2843, -2996, 1389, 5811, 3459, -998, 2221, 5584, -676, -9983, -9343, -2454, 86, -70, 1667, 2859, 1308, 4289, 11227, 11103, 1898, -3397, 557, 2923, -1509, -4213, -926, 284, -1918, -1418]
1276a418K786k253l858L142M223l209n248J402L704l501n254J819N460J867N92
1291B54L226J99l492L214Q927J319r987q913R51M068K744L936J738n960p519L238
1307b057R301J495o738n285k791l858Q51P953M499o360p126K110N394J212P84
1322f16L141l75m844O23O939K198m380k818J427q32k122M503O501k552p713o76
1338a596N658K047k666k532n313p350J674J2049O840q185j0797L70P017M651J796
1353C663p35o083n707L887J0926L003n386k791J640k041l515L196O035l34m982
1368G76j149P14q44P68M926r20j0329n740O351P817j240m308q98R11N81L475L765
1385D656l683p082K483R214K377n273k889J814o62k040K671K803l719k616L106
$$ y = [-1418, 1368, -885, -4743, -1601, 2622, -587, -5835, -4433, -729, -4230, -9484, -7665, -2205, -338, 254, 3480, 3679, 187, 3401, 12328, 13647, 3660, -5253, -4302, -234, 2510, 6446, 8184, 2224, -5295, -2057, 7244, 8739, 2001, -3284, -6075, -9933, -9082, -1129, 3370, -2990, -10116, -8006, -2612, -1400, -616, 2525, 2150, -2694, -2071, 4868, 7066, 2686, -132, 1295, 463, -1659, 2844, 9345, 6793, -920, -1596, 4062, 6109, 3443, 911, -4402, -11752, -10078, 1971, 8811, 626, -10171, -9801, -2784, 1867, 3663, 2928, -3155, -8862, -4975, 5951, 8954, 3568, 777, 2417, 376, -3139, 57, 6092, 5758, 776, -373, 341, -503, 265, 5191, 4271, -6058, -11798, -5447, 2370, 1130, -3178, -4076, -3165, -2584, 891, 4656, 973, -6109, -3626, 5588, 7965, 2692, -197, 1617, 955, -1085, 1586, 4389, 670, -1946, 1160]
1400A160L809k533k276K919m50o902m706L291K735j527L20M401N46l506Q84N705
1416C870N75m070k36J882k687l011M121N230j957m524J567K813j974j631L847
1431C815K861l790m077J38j111m217P73M680o55o604q21Q387O397j228k100j018
1447A430l600j780N072K915o090o225M632R721J756l664r93N28j567P55L208j637
1463D461p643k945L847J253l350L58N082n91o142j169O483N450K98j404m375p815
1479h202j485R365Q233m814j0016k36Q082O072K975Q64n555q941j345O529K239
1494C765n746m328K297J473o99L125N004j423n875p79L963Jj937J590N85n192
1510d176k845O274O766k500n085O38L182J406K010L267l556r592l839N328L875
$$ y = [1160, 4969, 2436, 160, 3079, 2629, -4273, -8979, -5688, -2953, -4480, -4160, 241, 787, -2719, -1835, 3870, 4445, 375, 139, 2021, -666, -3677, 444, 5674, 3717, -807, 760, 3573, 1599, -32, 3815, 6676, 2886, -1191, -1053, -2164, -6381, -5608, -928, -1583, -8187, -9008, -621, 5776, 4548, 2448, 1430, -2170, -3950, 1122, 4037, -2053, -8278, -3646, 6075, 7831, 4167, 3174, 3702, 2135, 2890, 6098, 4461, -3182, -6127, -2280, -1027, -4377, -4019, 1063, 472, -5670, -6839, -356, 5094, 5392, 3988, -387, -8202, -9687, -322, 7911, 3097, -6919, -7155, 927, 6999, 9974, 10838, 5283, -3658, -5003, 1526, 3765, -1981, -6309, -4012, -2539, -3238, -113, 4891, 3468, -2407, -3186, 777, 778, -1159, 431, 1016, -4176, -7021, -747, 6019, 3519, -1566, -928, 2254, 3660, 5670, 8937, 5381, -4211, -8050, -2722, 1153]
1525A153j833j773J16k771p84O784Q233k541r721l704K794K033J010K434n11m191
1541c272j219P550M842l491l999K920J841l950j768K593J437l181j414J062k195
1556b244l602L168N369k614n519J391O124J89m905j841J015p11J334M130N52m893
1572c057m07Q250M636m586n128J685K392j128j431J325j279j989K841K901m221
1587H04p128J649O784o7n364j887J928K31L60L888N76n526l424M174L935j938
1603a005J33M574J294m756j265M537K751k592j692N07k793k436M229N247k829
1618C904p489j615L268J024n18J843K6m717k070N673M862l718n059j99P73N54
1634c458L380O052j222o657k90P456L635l436l802j836k958r25N203M775l983
$$ y = [1153, -680, -2453, -2337, -5108, -5892, 892, 9125, 6584, -3137, -6841, -4047, -2014, -1004, 1430, 919, -3272, -4491, 3059, 7901, 4410, 411, 3331, 5172, 1222, -546, 2047, 3484, 303, -1111, -49, -2244, -5846, -2678, 2691, 77, -5442, -4051, 2073, 2262, -2643, -4484, -3469, -4180, -2846, 1284, 1836, -3057, -3464, 4786, 9422, 4836, -292, 1393, 3785, 2657, 1226, 2551, 1272, -717, 2124, 5025, 804, -6324, -4675, 2109, 2042, -3322, -5209, -3281, -3050, -2690, 1198, 1774, -3752, -7176, -3002, 933, -1005, -872, 3702, 4996, 240, -1025, 3512, 6263, 3671, 1979, 2486, -307, -2743, 1486, 6733, 3904, -3585, -5200, -1932, -908, -1426, 417, 443, -4274, -6344, -671, 4191, 473, -4586, -4785, -4012, -3458, -78, 5974, 4752, -1905, -2195, 5261, 8896, 5460, 1658, -178, -3136, -4061, 1142, 5917, 1934]
1649A934n843O99L701n63j324K958P54n326m494L069M447K65q58n10l188l180
1665g459N677J0633R90p536m760M033L544L1j083l348n876k032P432N752k864
1680C134n295R99L948j285k394O45o98m921j850L634K178j400J340L987j184m319
1696c481K216P420J858n112l176O47M3K86K994L92o007l902M801O416m24l024
1712A947K29L4l667j673K318m75m856j638L707J790j397K371M834J79l783L38
1728B58K736j190l992J433L159j786k865K077L617j239j424K684N91l606j568
1743a115L922R70n171l596K128J342k703K46L404J71j776K215M402q45m156R96
1759D34K223l395m241K226M953n2k708R24J205n06J272L686j891q463l041N986
$$ y = [1934, -3909, -3210, 491, -72, -1396, 1562, 2316, -3010, -7504, -4435, 12, 277, -581, -1091, -4279, -7459, -1782, 8851, 9841, 2305, -2455, 1578, 5122, 5153, 4070, 722, -5154, -7186, 246, 5998, 3134, -2161, -1162, 2786, 1501, -893, -248, -946, -5867, -7717, -4083, -1905, -3305, -1965, 2022, 838, -3481, -1265, 6155, 8013, 2901, -275, 372, 415, 701, 3695, 4087, -1920, -5822, -1021, 5395, 4971, 1947, 2176, 2210, -1457, -3130, -812, -1287, -6143, -7781, -4074, -2284, -3681, -1310, 3524, 3703, -80, 258, 2994, 1804, -2188, -755, 2404, 618, -2247, -170, 3447, 2208, 784, 3468, 4059, 453, -1115, 2807, 3777, -1394, -4990, -2862, -1520, -4223, -3977, -573, -402, -2178, 37, 4439, 3594, -562, 434, 2657, -738, -4979, -2753, 2200, 2148, -560, 364, 1569, 1063, 2335, 6021, 4130, -4333, -7374, -1388]
1775a388M773l087l781j28j63K09M076L839k562n764J803N133O04k501P94P11
1791B568l331l081K786M544m36j228M49o14k862J172N173l05q099n098L062M394
1807i06M07L37m42l410k417M720O425j610n965j098L178J402Q60L083N40m989
1823A15l244L862M538j564k318Q27n59l267J606N068o28o733l176K282Q79o60
1839b972J404J742k759l929K424N053P49l133J04M26j688J050N984L066n214m608
1855b301J829L776Q9k7P68k091l188J252N439j05o069k477J633o57k528P74K525
1872a358j118k054K097K965j672j655L041J562l733k433L662L406j068j845J853
1887A650N60j427J793L169j103m195n3M015o72m236j422J618j354k557J031K183
$$ y = [-1388, 3385, 298, -3483, -3611, -3774, -3565, 511, 4350, 1788, -3976, -2173, 2960, 3564, 1063, 1857, 2568, -763, -3844, -1058, 3486, 3050, 1822, 2271, 1657, -1205, -33, 5140, 4835, -3264, -8362, -5300, -906, -499, -162, -604, -4014, -6431, -1711, 4714, 3104, -2861, -3959, -781, 621, 1481, 4564, 5104, 115, -3129, 733, 5271, 3707, 1389, 2216, 1657, -1610, -4, 5064, 4436, -2297, -5473, -3191, -2312, -2972, -1568, 174, -2585, -6514, -4090, 963, 1712, -1421, -1317, -891, -2579, -1529, 4455, 7521, 2307, -2301, -472, 3304, 3393, 3366, 4134, 2043, -1145, 107, 5546, 5441, -628, -3105, -1472, -2129, -4657, -3883, -1358, -2476, -4530, -2433, 532, -1140, -2795, 246, 1808, -1925, -4358, -696, 2710, 1642, -203, 1650, 2210, 783, 2576, 5745, 4642, 447, 394, 4409, 3737, -499, -1921, -303, -1657, -4214, -3183, -1000]
1903a000j161l96L392K124m259k415L019K418k876l077J741R33j09K357M073k47
1919D517m384r0M273M30l345r89R08k630k864K394L520j320l724J003K133o10
1935g78J98K996J105m772k959K758K288j681j173J853m10j581K872O227O08m883
1951B668k373J369n85j305J091M79m498m116M074O143P0l403j136j78j334J206
1967a828M203R5o169l084L784L391n7J11J984j347k507K164N235J034l651j861
1983A497m70k429j582L642K440l594m204J616M740Q19p06q9k381m678M40M680
1999b59J573m576k304L183K826k66J812K092k189l002J545M221p74l295j88J244
2015A643k534j487K912K601k458l328J382K074p00l07J874j481m846j279M195
$$ y = [-1000, -2161, -2557, 835, 2959, -1300, -3715, -696, 1722, -1154, -4231, -2490, -1557, -1666, 691, 4764, 4517, 133, 43, 4316, 4746, 1401, 412, 1320, -1310, -4174, -1780, 1740, 420, -3304, -2301, -168, -778, -580, 2416, 3521, -1251, -4210, -1452, 836, -845, -2018, -165, -575, -2156, 716, 6943, 7551, 2668, 295, 1664, 1079, -226, 865, 1344, -3154, -7270, -3196, 2947, 3017, -386, -1522, -1700, -3034, -1828, 2375, 2470, -3699, -6783, -2999, 392, 335, 446, 2430, 1083, -1424, 740, 5975, 7009, 3358, 1497, 1027, -1402, -2984, 658, 3098, -496, -4700, -3084, 1656, 2475, 1769, 1680, -701, -5379, -4939, -259, 1314, -3262, -5566, -2383, 443, 177, 1989, 4081, 1892, -1110, 435, 4656, 3882, 587, 399, 1643, -891, -2378, 534, 3135, 677, -2651, -1269, 805, 105, -202, 1672, 191, -4655, -5934, -1739]
2030a739J884j988o73K378J77q47K375L165j352l853M09K180q74j522J829K049
2046C598k780k281J976J882k665j265K101N55l141j200K672J132k583q65K219
2061f45q35k413K069L567l56k887J594K602k49k068J088J455k622j723K570K311
2077C458j977k700J566J009k274o22K494j59l723r85L137J355j919j57J743k190
2093a944l117K023N250P83k991k74J733l33P09L192M76n060l625K497L437q17
2109A939j567Q87j037k884L36M142O48m063k076J344K31j254J913K246k689l421
2125e305J824M457J007q84Q87N70k101P0L582J815m484m036J247K423L10N07J529
2142C418j864l597N89M148N35m318k508K25p98o97K609L543k481l275J706L939
$$ y = [-1739, 145, -1843, -2516, -138, 39, -808, 1567, 4732, 3380, -473, -64, 2116, 1242, -280, 1549, 3598, 818, -1463, 513, 2395, -270, -1535, 566, 1121, -2020, -3220, -548, 584, -1999, -2864, -645, -1480, -3893, -1824, 1743, 1387, -1500, 94, 2696, 2447, 379, 1467, 2922, 300, -1423, 1147, 3458, 1481, -1219, 347, 1356, -918, -1540, 954, 795, -2928, -3913, -776, 579, -1340, -1497, 246, -1944, -5061, -3038, 2212, 2995, 4, -270, 1463, 1130, 1839, 5031, 5507, 447, -3178, -681, 2756, 1939, 372, 1259, 222, -2662, -2326, 1816, 2464, -1599, -3675, -2331, -2100, -3354, -1441, 805, -1884, -5305, -3481, 976, 1983, 1099, 1986, 2556, 455, 525, 4107, 5922, 1438, -2598, -1351, 1072, 1382, 1889, 3418, 1554, -2043, -1454, 2694, 3229, -1089, -3597, -3372, -4170, -4867, -2258, 1285, -1196, -4471, -2765, 1174]
2158A174R16p13J191l6l253j299L780K421k968k164J486N22j066J753L356r59
2174D141m184j014K416l86l135m90O62k241j354L209L915j081k062J311K388j569
2190E26o55J740J29l219j544L518K127j597r01K015L04k092O93L022q94l336j153
2207a317J189j658k011J689J958j872k405J838L731j06r63J851Kk968j393K731
2223B96J196k151n53K511N66j886J453L251Ol616j044J181r72k151J148J283k244
2240a726k864J717L343p91k021J818O80j832o6L398Q35l765j792K246J775j083
2256a28N17K489o82k452J494L716l32l305j660M73j590q39K537J662l097l308
2272d505K095K975l51j073R70q04k792J09M252J655k544j799J156L39l11K265
$$ y = [1174, 2090, 1377, 2568, 2532, -721, -2020, 1760, 4181, 1213, -951, 535, 1057, -9, 1744, 5100, 4141, -43, -1057, 1359, 973, -2162, -2652, -1990, -4231, -5585, -2376, 1539, 458, -1604, -293, 2095, 526, -129, 1611, 1740, -1479, -3023, 495, 2622, 1025, 124, 2139, 2443, 351, 1044, 4066, 3172, -164, -1317, -128, -1786, -3797, -2108, -150, -2022, -4427, -2589, 1142, 1036, 73, 1924, 1926, -1042, -2435, 296, 1492, -659, -1212, 1299, 1865, -21, 1432, 4683, 4689, 1073, 29, 1210, 238, -1913, -765, 518, -1726, -4590, -2873, 470, -321, -2342, -524, 156, -1676, -1742, 1656, 2491, -1274, -3066, -820, 955, -128, 389, 2878, 2196, -256, 1238, 4954, 4622, 1317, -343, 130, -1460, -2299, 238, 1900, -1197, -4505, -2410, 565, 214, -859, 111, -693, -3485, -3376, 876, 2531, -13, -1812, -656, -317, -628, 1637]
2288A637K783j965l912M13L734J055k356o4q44k501j420L121K654k560k633O87
2304b171J739m80jJ679n87l340j85L936J596j674o10J077o99j419K095L222j260
2321B918l642K93K238K47o81R53k85l877k202K664K651j963j957O50R96j499R99
2338a497L036j56l400r99K670O27r15Q75J763j510j897J847L484p80k358P61J141
2355B692j409j406J575Q24l079k284J394J334j835k43K580L75k532K0L111N1k792
2372a624k96J682p20j686K158K892n60k060J574K226m65j531Q94M90k610k234
2388a870J834J016k186o13J014M64k510K35L293N78k763j243J413M1j274J042
2404a529J857j730k156K339M129K55j465J397N43j823j064J964R42l294k492J554
$$ y = [1637, 4420, 2455, -1457, -1044, 2690, 3745, 1389, 1325, 481, -2020, -3440, -319, 2335, -225, -2858, -2171, -432, -912, -913, 766, 179, -3161, -3346, 590, 2186, 512, -98, 979, 280, -1139, 956, 4178, 2918, -724, -431, 1807, 2054, 1373, 2326, 2041, -1836, -4038, -1374, 1277, -686, -2643, -1993, -997, -2496, -1497, 1539, 1383, -2017, -3016, -346, 281, -634, 241, 2004, 494, -1403, 444, 3928, 3148, 790, 1551, 2692, 1283, -123, 1452, 2276, -803, -3087, -1693, -359, -2194, -2437, 143, 518, -2014, -1994, 1117, 1168, -1624, -1920, -238, -958, -2644, -486, 2406, 1846, -214, 1360, 3586, 3121, 1590, 2484, 2974, 364, -1870, -36, 980, -1206, -1819, -805, -341, -2851, -2616, 677, 1255, -1508, -2751, -1338, -1297, -2571, -1529, 328, -1402, -3558, -1219, 2910, 3165, 1700, 3097, 3640, 1817, 753, 2717, 3659, 365, -2127, -573]
2420e73J031j182M71K300q10l297k44K965N35k731j331O76j017j323K612L128
2436A210j562k604J440L449N49j47Q47n18l327r97L034J542k198k219J156L31
2452a4n29J621K829j320m066j248K495K17j682M36M47j974j277K909L497m52k280
2469c91N89J045p15k39K461M71l559k113K038K347j456o30J041p31j874J252L321
2486B857r24l775j027J493m34j019J479J403j634j861K856K982j107r37J101L76
2502A829j878n80K625R53k703q85J605P91j426O03J865j455l446P78K201n5k401
2519a579l52J036j565j172K194K375j796j701J602K278j192n18K471L36k815m52
2535h50K180Q75j521k96J832p36k457N65K872m69l209R3J027o67j612J834J192
$$ y = [-573, 458, -724, -253, 2047, 1237, -2060, -2304, 661, 1196, -1535, -2866, -2190, -3207, -4530, -1918, 1210, -352, -2956, -1516, 1933, 2482, 2335, 3182, 2664, -663, -1660, 1374, 2916, 718, -1501, -345, -14, -543, 1078, 3907, 2587, -1479, -2727, -232, -15, -1697, -1261, -814, -2788, -4065, -1156, 2341, 1889, -391, 198, 1243, 528, 289, 2750, 3221, -338, -2451, -413, 1934, 478, -152, 889, 158, -1716, -464, 2857, 1933, -1842, -2869, -1376, -1810, -2829, -1350, 53, -1581, -3442, -586, 2396, 1289, 352, 1453, 1829, -49, -629, 1996, 2949, 246, -639, 966, 1757, 331, 934, 2799, 1344, -2102, -1324, 877, 822, -1579, -1931, -895, -2460, -3632, -1438, 937, -859, -2560, -958, 1320, 128, -390, 2081, 2417, -398, -850, 1330, 2205, 684, 388, 2220, 1484, -973, -408, 2464, 1995, -1214, -1121, -94, -761, -2373, -539, 653]
2552F53k304k311J745K313p10j078J891O42j608k5L186P60k565r36J685P7j667
2569b52J222J760j003k871M23K718l70j895L09O47k166j822K297K114k283k676
2585c848J181J571m96P71K404j96l189J77L364J462k283n11P11q61j637K170K616
2602C406q05l190O62K106r21j145Q93L40l258k396K101K368j478j174J324L07
2618h60j531J269L526L40l327r78J794R50r02K09J179j672k025K550L093o64k294
2635F57k64J376j289j509J312O91l398j943J819J679q34j17K150O6k279L81L481
2652A979K92k643n03J005k28r12J933K317j134k684J487K499p29j586O75k93k274
2669g99j426J741J123k815j423J570J037j237Q33K341k35k377N0J883l08j561
$$ y = [653, -1651, -3962, -2217, 96, -614, -1692, 199, 841, -767, -792, 2394, 3154, 589, -347, 1338, 1415, -252, 970, 2730, 1727, -1144, -721, 1997, 1627, -268, 41, 688, -1478, -3300, -1003, 1111, -1172, -3848, -2667, -1096, -1592, -821, 1583, 1387, -1802, -1625, 1739, 3201, 918, 407, 1118, 257, -1380, 790, 3406, 2601, -589, 73, 2179, 1258, 113, 1006, 1346, -1912, -4308, -2207, 161, -1317, -2491, -1167, -860, -2391, -1122, 2404, 2744, -583, -1561, 233, 1183, 281, 490, 1669, -3, -2028, 522, 3615, 2951, 657, 393, 1769, 480, -1029, 283, 974, -2424, -4367, -2548, -869, -1703, -1820, 330, 396, -1883, -1502, 1979, 2271, -372, -875, 130, -98, -1010, 923, 3240, 2106, -578, 909, 3408, 2679, 1093, 1768, 1475, -799, -2225, -484, 639, -2176, -3599, -2029, -992, -2229, -1396, 945, 710, -1667, -1617, 266, -42, -1603]
2685a603Q16J723j159j529K240L254r67j627Q54Q69j861p47J638L10l556j475
2701b820J747J372j422n94J758m17j962N39K510J89k224m24J598r43j298J739
2717f52K702j118j822J528K080m45q77J269J20l141j124K282J126k237j185R50
2733e44J7j048Q88K064p85l126J51K435p0j314L52R90j157j328K621K573j372
2750A347j831J537J351j360n68K045L74l136j612J918J251j874j83J109q64k285
2766b781J192L296o01k912p64J657J03q50J872J130k141j785K556K259q08j326
2782I7J521K23j647m22K974M39k960j433J455J3j435O34J597j239k529L96K730
2799D14K74k200K90P61j364p47K193J821j732j823J794J871q86p4J582M87k335
$$ y = [-1603, -787, 936, -223, -1752, 488, 3742, 2775, 1148, 2002, 2871, 1010, 263, 1901, 2211, -1345, -2820, -1073, 299, -1123, -1717, 41, -376, -2338, -1799, 711, 900, -1324, -1748, -150, -1093, -2391, -652, 2050, 932, -890, 638, 2718, 2273, 1396, 2665, 2785, -356, -1480, 802, 1928, -309, -1494, -544, -527, -1575, -687, 1377, 592, -2534, -2383, 52, -18, -1332, -980, 10, -1147, -2475, 146, 2719, 1347, -484, 1053, 2404, 1044, 476, 2521, 2895, -241, -1853, 65, 1316, -558, -741, 368, -496, -2781, -1589, 1707, 1106, -1806, -2570, -913, -810, -1660, 212, 1342, -799, -2584, -28, 2231, 1423, 97, 1618, 1841, 194, -228, 2746, 3185, 225, -1208, 247, 260, -1175, -541, 1056, -183, -2712, -2316, 414, 688, -1512, -1222, -461, -1825, -2572, -379, 1442, -290, -2113, -319, 1552, 666, 592, 2174, 2661, 326]
2816C26l86K576M45k730q51R73m55j747J088J783p96k287L97J994p20j287J272
2833d05R36k333j642K073K178q83q02J111J206j263M82K550K20k891j114K265
2849A688J49j937p3J349j100k201J073K212p98j740M80J179j600j310J654J048
2865G3j277j615J288J406p36N72K709k43k146J33K780N56k581j009J442j026j517
2882a191J456J888j199k413P18K083r45j508J350q9k243j799K424J631j808m80
2898b125J577R96j179O15K876J87k394p37J682M1j406O77Q23j759j898K046K570
2915B592r41k063K62R41j679q22J431O33k698j608J799J901p24o6J616K47k035
2932a214O78K924L34k418n42J442n33j076J091K095j262k227R22J770m56j463
$$ y = [326, -60, 2516, 2961, 231, -620, 353, -102, -1849, -761, 1022, 226, -2061, -1664, 330, -390, -1677, -405, 531, -1802, -3444, -1371, 807, -76, -878, 233, 1439, 176, 658, 3208, 3428, 537, -577, 1688, 1837, -100, -173, 1176, 76, -2125, -1052, 1160, 362, -1378, -898, 281, -1319, -2629, -975, 73, -1204, -2819, -1531, -125, -861, -289, 2420, 2177, 31, 164, 2944, 3500, 919, -90, 1352, 326, -1191, 265, 2153, 954, -1459, -741, 1342, 397, -1111, 239, 150, -2093, -3892, -1468, 163, -1645, -2125, -548, 448, -731, -116, 2760, 2947, 553, -184, 1498, 1539, 133, 810, 1633, -126, -2024, 22, 2592, 1651, -412, -150, 791, -888, -1710, -279, 354, -2344, -3952, -2153, -252, -976, -1042, 574, 821, -1214, -536, 2388, 2722, 304, -238, 1204, 671, -405, 686, 2781, 1519, -708, 214, 1984, 1528, 65]
2948F5P92m94k614r31K560Q72k100j631J671J144q58O97K043m18k051J59K625
2965A531J50j787M62J387j101j433J375K560j037k116R13Q82j608n13J291K25
2981A181k763j538J991J061j271k35J148j00j950J552K451n58k139K08J877m62
2997D53j090J470J295j371j606J486J743j152j126R40O9j689o03J889N13k342
3013a121j137J453L47j432P50J814r78j759Q38K233Q6j285M44J024j159j352K126
3030H92J975j492k177J024J432p67p28J876p1k952o04J743M74j923p18J347n74
3047a243j456R51K104q0k085J054J160n34n42J304J551k159j778J950K061q52
3063A406j337J127M30j506r2J971M43l163o19J292J26j898K52J487q52j829R29
$$ y = [65, 857, 363, -2251, -3182, -622, 250, -1850, -3481, -1810, -666, -1524, -827, 1216, 798, -1253, -1094, 1531, 1681, -106, 356, 1743, 642, -791, 584, 3144, 2107, -9, 904, 1786, 178, -335, 956, 1181, -1582, -3120, -1129, -68, -1339, -1574, -426, -526, -2476, -924, 1527, 969, -1170, -962, 915, 453, -637, 833, 2128, 757, -849, 637, 2380, 1228, 102, 1042, 1111, -578, -1181, 708, 1221, -1121, -2258, -805, -458, -1890, -1140, 674, -304, -2063, -1225, 1008, 1094, -191, 253, 1277, 118, -1234, 892, 2867, 1375, -802, 222, 1654, 887, 159, 2035, 1964, -988, -1592, 151, 625, -1298, -2016, -669, -1243, -2699, -1748, 356, 276, -1809, -755, 405, -129, -671, 633, 2184, 25, -1753, 197, 2258, 1406, 69, 1196, 1626, 120, 28, 1999, 2442, -721, -1340, -48, 78, -1820, -1568, -81, -933, -2762, -1833]
3080a833K536j73j316Q39O80j187q01J692J777j903j596J534J583q81k05J796
3096B542n47k126n02K357Q6k401r38Q80o43j468J040K148r37j759N45K004n30
3113b49j054J608Q22j999j250K159J575q77r17J440O91j265K88J899J95k772n85
3130b91J494k18k021J95J009j112j776J645K087p44j989N59J210j086r25J687
3146b76R32j813j326J790J960j000N0J981k29j692o6K381M3k386n20Q84j052j356
3164a695J332J620j338k002J078J450n11j181J214N9k154k48J891J434j771p89
3180a611J876O78q14M00K023J5k157l68J915k33j821J74J048j354j576J275J949
3197A419q58k024L67J031r82n12J384O60k383j037K114J496r08l05J816l01j482
$$ y = [-1833, 703, 530, -786, 53, 733, -454, -1255, 437, 2214, 311, -1285, 249, 1832, 951, 746, 2542, 1995, -131, -633, 1724, 1810, -591, -1529, -649, -1292, -2760, -1720, 428, -509, -2268, -1723, 281, -249, -1303, 305, 1127, -872, -2122, 37, 1612, 735, -182, 1258, 1949, 684, 972, 2871, 3066, 294, -291, 1203, 985, -1036, -841, 168, -944, -2720, -1075, 1012, 268, -1721, -1162, 48, -1038, -1963, -276, 656, -1157, -2483, -693, 1267, 267, 317, 2298, 2069, 377, 311, 2692, 2735, 349, -171, 713, -339, -1695, -363, 1257, -81, -2083, -1005, 445, -66, -1247, -33, 26, -2128, -2376, -485, 949, -822, -1611, 265, 943, 129, 529, 2552, 2567, 410, 42, 1957, 1724, -97, 77, 1125, -229, -1805, -530, 1419, 561, -1463, -1096, -65, -1047, -1559, -175, 485, -1898, -2935, -821, 675, -233, -538, 1278, 977, -505]
3214e05P02K599k29k182q5J220n96j271J158P60j259j983J153J605j052j309J262
3231a2J51j843p91K284P09j736q77J397R05q78K52K010k86j962N87K068J57j568
3249E67R5P07r72j423J521J503j503j707P14J023q77p28R70N28k287m46J986O33
3267C04j390m24J414k19j147Q09K534N1k041J5J642l93r71J100R45k060j474J287
3285a8J560j268j221J286K34j845m44J911O54k153j026J759J46j258N00J968o22
3302A63j604O86K275M02j735N31J084j420r28J638P17j450j657J133J330j194
3318b9m83J574o3k305n25K000K24j686n48R52J29j600J623J934m77j682N98J927
3336A563m02q76J058O44j631j553J593J624j231j272J092K69r77j95J889n51k302
$$ y = [-505, 197, 2796, 2567, 385, 300, 1520, 924, -347, 811, 1571, 312, -1671, -518, 1087, 35, -1274, -12, 139, -1704, -2495, -211, 498, -1238, -2115, -718, 187, -691, -439, 1571, 1285, -677, -90, 1978, 2135, 567, 662, 1369, 397, -1026, 495, 1998, 495, -1212, -498, 525, -352, -1080, -110, 418, -1869, -2315, -329, 304, -1086, -1510, -96, -315, -1462, -653, 1881, 1932, -109, -94, 1548, 1155, 184, 1284, 2229, 169, -1305, -18, 1542, 274, -947, 339, 573, -1272, -1716, 195, 849, -1304, -2330, -571, -425, -1683, -1183, 785, 163, -1441, -755, 1520, 1922, 187, 718, 1802, 382, -546, 1092, 1809, 359, -1298, -165, 1165, -29, -512, 1062, 999, -1306, -1831, 169, 393, -1293, -1841, -889, -760, -2360, -737, 1197, 720, -962, -364, 1563, 1161, 285, 1343, 1987, 356, -1197, 396, 2020, 789, -483, 609, 878, -99, -294, 1595, 1044, -1258]
3353a258n99R70N70j433M1J594p58j168Q06K608m22j280Q18P69o66q17J255J076
3371B106j867j251J477J332r56p29J326J41j791p51J938k45j775j055J079l84
3387a405q42R41J620p16j467J017J992n98m13N14O13j363j237K222R73j237q02
3404a88J155N02r65j56J759l52k358l72J509l35j594L29J080j119j405J201J842
3421E33l02j527Q95J174r18n75J580L97j658n28J574P38o95l80J185O7j701M76
3439C35J501l03k058n91R32l14j194J125R04q85j781Q63J846m38p19P85M73j211
3457g30o41J667J524j561o62R17O80o94K15J506m82j875o9J341N2j681J83N27
3475B17j222j363J449J280r27j655J057J171n75n25J395K65j189p16J567J226
$$ y = [-1258, -1857, -887, -317, -1750, -1709, -115, -873, -2041, -1235, 1373, 951, -329, 489, 1258, 592, -225, 1030, 2106, 239, -1012, 465, 1797, 841, 112, 1438, 1579, -212, -963, 975, 730, -1045, -2100, -1021, -1405, -2247, -1306, 314, -402, -1869, -852, 1140, 542, 129, 643, 1256, -107, -1344, 878, 1851, 614, -188, 967, 1469, 504, 348, 2107, 1755, -603, -975, 534, 199, -1395, -1066, 14, -1105, -2510, -1309, 533, 231, -1296, -401, 773, -145, -720, 860, 1257, -401, -929, 645, 1383, 688, 308, 1493, 1560, -141, 335, 1836, 1533, -525, -1116, -184, -498, -1692, -567, 337, -548, -2329, -1466, 380, -58, -777, 8, 481, -730, -1371, 296, 1820, 259, -403, 514, 1194, 500, 715, 2221, 1739, -136, -205, 1136, 1188, -493, -310, 217, -1005, -2368, -919, 361, -566, -2221, -1164, 7, -568, -1093, 302, 567, -622, -1338, 229, 1455]
3491A455j306l68J282M4j347P66J883m54k229K95R23n12j395Q71Q21j470j710
3508b451J102J693q03j217R96O19j309L23J378P03j680o92J421P72j075L07J276
3525A363J6j586M55J784l65j273J56K95p96j548J465R85j733r80P94J027j047
3542i88j15J149J61j365l16J818L29j270n16J288M15j027Q37J451k9j873K70J595
3560A814m10r89%Q70j370j581J235J099j059j072R61L02j121m9J713M02j674n48
3578a477J204M87j096K02J266j83j345J053J953l27j191K57Q83j252p58Q26N56
3595A058j368j434J244M88o80m32J381R1j336o99J653N22j230q94J301J79j236
3612a392J227J445Oj679P42J710n35p61L08M55j459j036J231N81r63q92Q08L32
$$ y = [1455, 149, -219, 1063, 1107, -240, 526, 2409, 1955, -274, 21, 944, 432, -963, -92, 729, -741, -2451, -1349, 344, -459, -1676, -680, -61, -1370, -1047, 331, 1034, -646, -1338, 83, 855, -220, 87, 1363, 1379, -207, 248, 2032, 1667, 394, 550, 845, 49, -1499, -34, 951, -782, -1762, -968, 59, -988, -1103, 46, 207, -1158, -1474, 344, 673, -597, -1113, 175, 590, -437, 400, 1851, 1822, -51, 219, 1814, 1404, 415, 415, 1285, -85, -1666, -431, 668, -391, -1463, -502, -200, -1321, -1370, 343, 745, -929, -1477, -273, 214, -882, -680, 586, 403, -942, 111, 2064, 1737, 546, 803, 1686, 434, -324, 502, 1058, -310, -1744, -500, -12, -692, -1124, 257, 348, -988, -1687, -34, 488, -742, -1636, -335, -156, -1392, -165, 1280, 1286, -393, 349, 2059, 1524, 763, 1071, 1526, 67, -969, 262, 843, -120, -1012, -204, 128]
3630A28j078K70J388l58j785q14J681M07q66k83J240n3j173Q95K169j24j531O71
3648G84P92p86n47J190L70j703r80J038Q39r37n17P45J52j744R8J573J54k041
3666a520l93J017R1o78P26J481q03j108R91J884k64j096M27P81j280m72Q69J353
3684B006j381j317J157J14p51j53J216m95k132K51J482P9j285j3P22o69j038J473
3702g34J368n09j015R58Q87l91n36R66P52j466j144J437J091j093m28P50j31j385
3720f23M5J580n61j515j76J294o21r44Q50L79q01j020J488J345n12o30P32O36
3738I46o30l80J387N35j616m94J064J36p45J47Q23l46j492J66J013L0j475L85
3756e46M22p56j093J048J077p85j068P55J375o69j23J172M34j382k41J099P97
$$ y = [128, -950, -680, 708, 350, -1435, -2249, -568, -161, -1027, -1310, -70, -123, -1296, -401, 1768, 1644, 113, 784, 1576, 790, 243, 1433, 1803, 100, -880, 158, 997, 60, -457, 288, 440, -1304, -1206, 367, 521, -1520, -1913, -896, -805, -1483, -757, 724, -79, -1187, -196, 1688, 1424, 328, 755, 1536, 256, -216, 653, 2006, 625, -692, 465, 579, -172, -325, 891, 396, -1736, -1485, -3, 76, -1209, -1222, -500, -1169, -2207, -734, 634, 125, -890, 68, 955, 564, 28, 994, 1746, 280, -864, 573, 1664, 571, 143, 893, 762, -623, -578, 1002, 441, -1074, -1250, 44, -577, -1521, -671, -292, -1093, -2113, -625, 720, 208, -422, 310, 946, 316, -64, 1323, 1858, 242, -252, 812, 948, 203, 350, 1173, 827, -665, -499, 514, 544, -931, -546, -124, -880, -1973, -925, 152, -633, -1701, -946, 429, -240, -363, 809, 1243, -139, -380, 719, 1516]
3773A516j076m90R79l6j095K65J372j25j649j19Q16m15j111O28N02p68j485J092
3791a199J241n60n29P01P79j252K01J991M68j858n32J212M27r07J11R09l61j538
3809f96P06J474k21j532k0Q77j259j029J113J049j218j258R02J106n74j47J121
3826C94K58j329j41J691J84j118k59Q55L45j144R74J210p12j201J23J188n75q45
3844a02K57L87j544j057J385P20q39r45R50R01o57j61J333Rj489N7J133K53p11
3863a20M7R70l69p12M68J641m54j668Q71K69q81q45O11R58j949o03R34R50n81
3882d63p46J131P2r53r6J595K72j428q0J172j87j013J077J131p0j424M12J472
3900A874q32q05O18K62j421r94R50Q80j182p91J034J03p93K30J017k66j249J68
$$ y = [1516, 440, -50, 929, 893, -202, 63, 1435, 1310, -339, -458, 358, -57, -1168, -540, -38, -806, -2291, -1199, 42, -518, -1047, -346, 433, -819, -618, 1373, 1841, -17, -549, 663, 1090, 183, 294, 1203, 842, -696, 10, 1484, 1263, -269, -289, 588, -671, -1700, -587, 462, -756, -2014, -1112, -6, -580, -727, 394, 652, -677, -818, 873, 1057, -61, -320, 535, 880, -264, 710, 1920, 1208, 7, 130, 1318, 743, -102, 155, 542, -1002, -2059, -674, 46, -793, -1738, -788, 113, -544, -705, 628, 637, -852, -795, 338, 591, -120, -73, 897, 528, -184, 284, 1925, 1471, -197, 674, 943, 62, -783, -172, 786, -1163, -1766, -832, 118, -463, -1209, -78, -6, -959, -1055, 540, 812, -616, -696, 476, 289, -724, 353, 1484, 1414, -10, 402, 1874, 1042, 237, 855, 1117, -304, -1298, -348, 532, -650, -1441, -407, -304, -1097, -867, 150, -116, -1365, -1197]
3918a197J400j00p45K65J234p11q32Q18J645p14p04L67O74o98r25J258J80j403
3936a88j149J117N47r26k65N38Q3j414M71J505k61j300PJ287l62p25J447N93o32
3955C73r61N81J397l89p20P93K11j143l05Q91R66k019o90R40J07p50j68J082k56
3974f0j593M60J247j20r16J93O40j58q67R54J310n40r85O63J026l91l50Q43K0
3993A376j164l38P68P88j565n63J011k92j089J19J541n54j347m1J193o1o28O9
4011g77R12j116m01J412R72l73n00L18Q07p01l35J282P5j504n08J282Nj254K8
4030c76J047o91j071L34J395k88j311K04P26l54j064J022P43o53n36O50J211o86
4048C02l86J155L63j062l41J082j17j153n05J217j51j191N51J071m19j246l1J257
$$ y = [-1197, 203, 103, -642, -377, 857, 146, -686, 132, 1777, 1063, 359, 726, 1400, 702, -223, 1035, 1215, -188, -1337, -220, 327, -599, -864, -326, -243, -1657, -1186, 319, 58, -1242, -1235, 52, -310, -1035, 412, 1005, 373, -588, -7, 1390, 1001, 281, 1074, 1285, 142, -163, 728, 1694, -325, -1015, -75, 32, -718, -886, 196, -60, -1653, -1193, 54, -66, -982, -789, -149, -307, -1174, -220, 1090, 550, -435, 228, 1254, 863, 513, 1356, 1376, 212, -126, 642, 1430, -135, -698, 313, 21, -1068, -949, 592, 38, -1309, -1350, -157, -218, -846, -777, 135, -981, -1382, 30, 1002, 629, 129, 447, 1254, 553, 218, 1500, 1575, 71, -437, 845, 850, -404, -376, 671, -20, -1091, -757, 638, 350, -961, -757, -31, -385, -1449, -427, 316, -337, -873, -223, 988, 302, -84, 1071, 1434, 372, 31, 1113, 996, -157, -662, 555, 404, -787, -236, 835, 416, -830, -861, 396]
4066C96q99n04K66R23r79q07Q89J079n69m69Q97K50m93J44J329O9j320m60R66
4085G08J74r16K28O07l94j352P15J037m61r23K58L96n99j135J102P79o56r17N55
4104g94J260n31k96J208J27r16J4J237K83j542P8N10n6p37J14J114m28j753Q39
4123b69P17j46j188M21M65j218p84J303O86p11n60R88P22p29K21J160N9j538j55
4142e56J388J53q47K83O89o62q67Q01O74j39j592N41L19l97p68P87M90j512o41
4161a856R26J139o94m19Q29O10j201L22J482k28j025p0J094j03p86M98Q08q60
4179D66r92O29Q87n09q39N77K15j006q12J157O98j295q81J231J63n40O3J510k16
4198E06j108N3J249Q1p26N4Q22l49o09K57J037m46j074L20R33p11o91J030J5j442
$$ y = [396, -503, -1007, -741, 182, -797, -1604, -715, 364, -205, -674, 223, 473, -20, 124, 1453, 1522, 202, -258, 708, 882, -34, 194, 801, 407, -945, -230, 807, 346, -577, -319, 77, -522, -1657, -555, 224, -432, -1349, -794, 466, -65, -361, 847, 974, 58, 72, 1309, 1592, 50, 128, 638, 582, -155, -41, 1073, 645, -1108, -269, 448, 302, -886, -465, 0, -1218, -2002, -699, -13, -724, -1284, -296, 426, -303, -82, 1078, 1137, -401, -556, 832, 985, 138, 421, 1110, 448, -419, 382, 1056, 917, -675, -134, 185, -212, -980, -193, 297, -1215, -1856, -930, 209, -485, -904, -75, 535, -666, -344, 1138, 910, -115, -185, 909, 806, 20, 518, 1326, 466, -526, 103, 990, 481, -358, 219, 434, -572, -1384, -227, 471, -824, -1705, -474, -311, -851, -788, 722, 506, -602, -549, 700, 781, 55, 109, 931, 582, -27, 230, 1267, 821, -253, 67, 1000, 289, -402, 628, 643, -799]
4218g99n75J075J82r55n5R14j30o81p7J577p2m13m35R91k67o43Q46P39r86q63
4238f27R25J041p10p46Q98J95j219m35R35K78j277p34R91K31p88J86J071n45p81
4257a111K35J500j28q66j70J183p72n42Q11J325n33j393P58Q15l66m46Q55J72
4275A327j743l46J091K89j438j34M36Rp45M08J333l57j278O06P90k13n43N27O21
4294F40n72o04J081Q29q10p58Q34N40r88L9Q59lj115r48J177K89j078k89P93n04
4314e88r63P72J028K9j294M38Q39m56q56Q63J234j243m74Q32J001m22o58J045
4332A127J4j062n53J276K17j247o54P64K09j184L56J112n17r47M9J271l57n64
4350f90K28Q79p53m57R80P15p70n19J122L20n70k58Q30pj060n86J295k53r65O2
$$ y = [-799, -1374, -299, -117, -1072, -1127, -213, -343, -1024, -1101, 476, 404, -9, -444, 547, 280, -363, 483, 1222, 236, -627, 298, 1339, 629, -117, 781, 976, -243, -678, 257, 535, -742, -1476, -485, -254, -1042, -856, 215, -330, -1111, -876, 624, 496, -370, -540, 643, -129, -671, 140, 1465, 932, -461, 297, 1112, 746, 300, 1155, 1327, -416, -762, 329, 618, -820, -954, -518, -509, -1254, -846, 487, 130, -1148, -542, 248, 35, -508, 19, 640, 68, -536, 545, 1374, 564, -194, 640, 1180, 192, 231, 1090, 1087, -28, -976, 201, 490, -588, -877, -84, -588, -1551, -779, 249, 278, -1016, -578, 261, -195, -1051, -188, 1046, -197, -671, 161, 1162, 740, 82, 1127, 1141, 79, -474, 802, 1019, -228, -882, -118, 91, -1093, -737, 375, -142, -1089, -1040, 231, -126, -690, -462, 417, -336, -793, 187, 902, 132, -387, 735, 1055, 485, 227, 1057, 1050, -10, -596, 699, 446, -519, -457]
4370d57P96l88j153O76P45j91j221L10R97n85o15Q28P01r94n04R99R98q73M8O78
4390G95M47j085j45J470m39p34m98P96k28j364R60P70o61j143M43J032p89o50
4408a023M62N21j070k55J154Q55o70m96N82P70q46L21R51nj073k73J132R7j104
4427C0j38R85o22j173N88J034o51q81l8R05o48n20Q74N18q85q03J286M56q45j33
4447f61J159J89j265O95J104R4q24n97R08k06n50K86P28q96j256Q75O26o04o56
4466h51N67L62p52n10Q24O26j244k13Q41K70l60j96J225J11p69J82R87O5q84k4
4486B57N32m91n68N89O11q23o93N85L95l23q83O26L23j209k99J394J00q53m22
4505a152R89j4n72K85J494k96r90J10J145j26o17M23M15m12j156Q05O25l89p52
$$ y = [-457, 339, -49, -1202, -526, 219, 28, -1193, -883, 114, -471, -1086, -258, 443, -551, -1055, -56, 942, 69, 117, 795, 1242, 157, 12, 1482, 1043, 309, -189, 607, 379, -985, -25, 745, 84, -1059, -616, 416, -373, -1023, -561, -40, -1110, -1365, -211, 644, -26, -522, 60, 830, -16, 305, 1256, 1251, 178, -95, 1037, 1134, 30, -108, 877, 255, -918, -330, 704, 53, -828, -866, 39, -609, -1129, -255, 263, -622, -1425, -139, 317, -528, -661, 498, 687, -578, 117, 1221, 1315, 491, -106, 802, 596, 46, 332, 1060, 164, -1092, -217, 409, -195, -851, -284, 78, -674, -1184, -360, 266, -978, -1191, -350, -80, -440, -636, 589, 700, -69, 113, 1100, 1165, 281, 257, 789, 298, -270, 319, 930, 107, -586, -1, 394, 71, -812, -186, 137, -1072, -1371, 23, 123, -730, -1152, -163, -177, -749, -464, 1030, 734, -256, -146, 999, 873, 256, 679, 1094, 682, -474, 331, 956, 567, -185]
4524a85J51O23j121k57P71m9o76l04M64M20p54Q3J138l30p19M89R22J41r57M41
4544B91R12q56m15N58O07n84j022P53O87q31j79M59K93j093l75R47Q1j256j73
4563a196P08J01o35N27J169n60o93L79Q53k06m22M57O57o84j090J049Q02n46q96
4582b26P54O07j192m33J207j04j121n85J025L8p63m03J034M4j127R11Q46l09o40
4601d37K09R27n72n29P41N49n98n93O97P45r40r9O44R4r93j86J089l17r63m29
4621i61N76J63j077N09P67l44q21P07R20j66r34Q69K84o01l89Q10R69o69q42N59
4641C29O19o75k41R95m58r56k18Q97Mo41l66M55j63r26N22J116m75j024P55J109
4661F58o46n83J187L70j296l39Q48R71p69m40R72P8j110O2J024l52j013r5R12
$$ y = [-185, -34, 589, -532, -789, -18, -67, -743, -1047, -583, -163, -917, -834, 304, -26, -745, -256, 666, 807, -150, 291, 1203, 347, -68, 490, 1097, 513, -509, 244, 931, 100, -79, 380, 673, -420, -795, 152, 233, -1023, -1196, -488, -387, -1022, -495, 674, 114, -579, -200, 653, 447, 25, 482, 1139, 455, -635, 414, 1216, 670, -226, 528, 1135, -57, -490, 717, 613, -508, -1093, -68, -30, -793, -1196, -162, -118, -1245, -334, 512, 203, -437, -228, 699, 127, -402, 339, 888, 290, -303, 394, 1139, 199, 100, 744, 838, -155, -341, 748, 431, -532, -961, -385, -222, -1299, -790, -23, -367, -1188, -481, 439, 273, -661, 208, 492, -109, -498, 312, 1281, 612, -230, 329, 948, 273, 32, 1027, 569, -387, -605, 292, 296, -345, -711, -256, -419, -1345, -823, 293, -182, -1206, -451, 658, 12, -571, 616, 986, -310, -649, 199, 1170, 401, -39, 933, 1011, -99, -37, 987, 635, -378, -473, 439]
4680D39l80r92L72N53m40r02P40J026o61n68N65N88o10m60Q94O45q40l43P68M45
4700H39n77m04J148Q6j196n0J434n48j207K19N41o01o74N00O29l54q41K98Q81
4719A23p89m27Q99N60p95m80J290J79m50n74J021L04j040O35P43j79j066N3Q21
4738H28k20j122L47O97q56m96K31R88o58n73M21M02n80j75Q46K56q10l47R20K29
4758C28n96L76N55N9o58K06J001j28r90K5O35n02r71M84R71q02q55K35Q52p21
4778d96l41P31J68o50o55J275K43p79k43J012K50q47M57O98J90j079K36R17m55
4797F32n84L30L02q88m52N44P26p87o20N25M81p02o57J091J23q03k81Q94n1m97
4817f74J50Q33J82j060P82J037l67p56L29L29j60q51O38O10q79p71O37N69q70
$$ y = [439, 59, -933, -561, -8, -448, -1350, -610, 416, -245, -813, -248, 340, -270, -730, 164, 809, -31, -374, 394, 839, 262, -142, 1006, 1092, -104, -154, 1280, 732, -475, -256, 285, -316, -990, -490, 139, -215, -1056, -758, 123, -666, -1093, -194, 366, -429, -909, 381, 560, 110, -464, 557, 861, -179, 456, 1199, 1020, -46, 7, 828, 608, -514, -167, 530, -326, -822, -591, 397, -261, -834, -413, -11, -591, -766, 80, 336, -474, -821, 99, 328, -268, 108, 663, 722, 64, 270, 1271, 1143, 153, 178, 813, 311, -660, -176, 795, -7, -862, -627, 225, -496, -837, -106, 62, -588, -1243, 32, 275, -504, -747, 265, 515, -332, 125, 823, 1013, -66, 170, 1087, 632, 48, 378, 680, -208, -660, -116, 610, -177, -797, -272, 209, -493, -1150, -59, 64, -739, -1020, -126, -177, -674, -524, 309, 491, -569, 213, 1250, 883, 127, 456, 785, 625, -226, 412, 1022, 143, -628, 9, 578, -292]
4836b92j81L32L76p73m20J112k64r33K52L73L49n86L91J018m10p07M44R01q15
4855A67r3L13M82o50n39N80N13q62l39N27M40p20k97P38j76p04l11R24j73n04
4875f84K27M77J45j017O12R35m13r30R30L89j50n76M97L67o40o59M06P72q37k17
4895c66O46m8j039K62R80K3j218K1Q98n14m93N80N58j14r65N98P63r7m83M07N26
4916I25r28k51P09N53q03n58P84j38j58o84Q50j61q51j07Q67R3q98P1N18l13m43
4937i23J14J162m11n89L49Q57l00j14O04J75m25q17R92L36p92j73N85j84q23K3
4957c54R91l24j281J02J055p25l71K4J117q51n55Q13O19j1r35O97O89j30o31P00
4977F39K63p50n01P87N83o63j78P58l04p89k20J119n47p65L2N71n18n38L58P65
$$ y = [-292, -473, -141, 235, -538, -958, 154, -110, -1043, -791, -418, -69, -655, -264, 754, 344, -363, 81, 982, 167, 74, 387, 869, 219, -320, 260, 773, -89, -428, 99, 539, -181, -478, 260, 84, -620, -931, -7, -180, -684, -457, 20, 165, -852, -240, 695, 282, -648, 282, 671, 521, -55, 442, 809, 169, -490, -84, 688, -149, -366, 280, 232, -807, -545, 435, 458, -760, -739, 159, -355, -848, -268, 290, 176, -789, -191, 572, 475, -8, 399, 925, -3, -254, 455, 1008, 205, -353, 431, 293, 135, -549, 301, 140, -711, -818, 49, 142, -756, -685, -167, -480, -923, -809, 353, -58, -647, -298, 559, 259, 145, 749, 924, 499, -318, 674, 1010, 218, 45, 630, 446, -377, -354, 637, 313, -968, -866, 189, -536, -907, -883, 234, -617, -1172, -359, 260, 249, -686, 11, 700, 570, -61, 639, 902, 152, -349, 438, 1021, 358, 180, 938, 634, -155, -375, 744, 197, -568, -536, 35, -483, -1021, -663, 102]
4997A02l15o62L55M89l59l86Q16M76o62o5N55M69q15j57O49J60n98j37Q63j50
5017F28q25Q2O09l68n89n2N60p92k78L21P25l51n30M34N28k16l76O81M25p83j86
5038c53N56M18o18J20O02n3o12k4O44J6j033J17N09m54o02P37L04n92n79N31O56
5059B90q00j35P77j84o26O5R75k5n67K0O45K17p88M61P69k77r64J24O20j38p02
5080b43K09O65q32o57M03N69m85q06J115o0l65j55R33M3q09k24O59N10l62l42
5100b34Q25p4n90N02M94m01p00M48L27m93m02M08M21r92m35Q42K89q23j58O88
5120e8k9m63j24J038o0m93l71O26K44o42M01R12o62n08L07R22l96o23J15L83m49
5141G0o10P64N1n31l67M32K62n63j69O69L6m94k87P99L31q18M05K48N0o64R04
$$ y = [102, -213, -875, -520, -31, -390, -776, 40, 516, -146, -211, 344, 813, -2, -159, 490, 650, 52, -85, 778, 628, -197, -115, 494, 126, -463, -515, 45, -747, -1025, -704, 21, -330, -860, -426, 102, -114, -490, 191, 616, -167, -353, 203, 621, 3, 123, 725, 672, 60, 36, 680, 696, -337, -220, 289, -165, -767, -30, 274, -318, -897, -366, 290, -510, -645, 132, -52, -678, -613, 362, 337, -230, -210, 435, 652, -136, 325, 1094, 817, -147, -23, 597, 459, -243, -34, 631, -201, -858, -455, 114, -371, -1177, -62, -122, -487, -642, 291, 334, -475, -699, -40, 470, 108, -234, 591, 517, -73, 429, 923, 522, -178, 270, 597, 104, -298, 110, 531, -461, -896, -54, 235, -588, -746, -58, -87, -550, -674, 364, 304, -189, -560, 66, 310, -332, 69, 981, 319, -189, 118, 1040, 644, 21, 136, 519, 70, -540, 224, 275, -256, -623, -191, 71, -492, -661, 8, 44, -450, -737, 62, 393, -425, -20, 228, 278, -386, 518]
5162E18M35m66o06K87R54m96m32K82J97o85n63M80K84j56q86Q28j87n07r4N94
5182b19M2m31j74O00J68l31J53R48n44o28Q22N64k73q06M12M48p53j41P31j7p93
5203b22m42M85O7l31J99L15j91o91k2P37l0n48K01N24j86l68M94J006q18l73K81
5224H7N73m52j26O16L03p49l40O41J08o94l16L61J69l15k88N28k33p77o4Q44k26
5245c50o05N12N40n90l26N30Q15k31o75O52L74l45j80P74J7q54k21O14m3m78m8
5266a18M31o8o90J27O24j0j094M75M88o70j91M25L05m73j03K75O37m00j86Q10
5286E94p7m93j27R36j72n79j41L38L13n52j04N04Q0j050j89J044j31p94L41L43
5306H4m52m19N34N62n59l32P45K11m08k2O99K05p60n33J062n8p39J23N35m4n66
$$ y = [518, 953, 487, -119, 168, 1122, 626, 194, 476, 673, -12, -575, -95, 189, 33, -853, -25, -212, -719, -813, -219, -177, -608, -782, -182, -14, -345, -192, 756, 212, -416, 406, 970, 697, -109, 303, 751, -2, -143, 588, 571, -222, -664, -179, -112, -443, -244, 71, -120, -811, -833, -96, -126, -674, -473, 51, -135, -503, -9, 997, 179, -194, 87, 660, 208, 82, 698, 1001, 252, -88, 553, 661, -33, -349, 12, 181, -134, -422, 106, -127, -904, -968, -124, -350, -955, -443, 97, -493, -819, -289, 526, 295, -380, 272, 646, 301, 121, 895, 912, 58, -163, 451, 408, -70, -118, 313, 245, -445, -318, 306, 296, -798, -323, 165, -505, -696, -271, 34, -439, -542, -267, 370, -30, -216, 594, 517, 24, -103, 833, 661, 82, -59, 279, 592, 40, -64, 440, 520, -530, -719, 325, 194, -600, -259, 84, -368, -787, -253, 309, -250, -582, 163, 374, -34, -56, 643, 848, 88, -445, 617, 559, -180, -57, 478, 434, -132]
5327a32Q8L51j8q06J88L72k78m56K91L15k82j89K29N97l12l61O93n9m59K08M90
5348D70M13r60j25N83o0l05P3N93p30k74NN38J43r43Q6N24n30n66Q47M65o30l54
5370g37O68K24l25p2O97J2n28P4M51J89o68J2L41K53o81J85L54l10l65J7L69l09
5392a49k60M25M2n82n38P57J15m5n05O20J73l28j17L38N28o78o8N91K75q40K84
5413C8M59J36q77N88Q8m5n73Q5K48l11l42J03O96o18l84K72L89l92j8O15L26r31
5435d48N9P13L38q50K06O36l59l54K53O08q5o61N5M80k98n79Q6M97p41o4N68j10
5457e0l86j00K45M5n36K33L40L33o28L69P80m86l58L44M63o7o70P04J18j85m35
5478G3K63J36l01n04P28k35m88n04M88M19q05K68M06l13m00L45O27l2l99r2O42
$$ y = [-132, -44, 307, 289, -517, -329, 43, -235, -691, -400, -85, -367, -556, -327, 270, -42, -403, 290, 231, -228, -20, 470, 883, -77, -202, 381, 321, 16, 89, 682, -48, -322, -317, 221, 364, -579, -493, 31, -499, -1065, -218, 247, -383, -737, -69, 155, -170, -242, 455, 467, -61, 13, 464, 653, -15, -3, 338, 591, -90, 95, 449, 139, -226, -209, 160, -149, -409, 16, 58, -524, -1062, -305, -190, -235, -740, -120, 53, -275, -392, -54, 474, -204, -272, 319, 594, -246, 38, 497, 633, -244, 344, 432, 387, -186, -101, 147, -164, -506, -403, 293, -325, -709, -437, -48, -440, -458, 157, 483, -448, -389, 324, 662, -188, 18, 654, 295, -59, 194, 802, 717, 56, 111, 591, 293, -286, -200, 297, -444, -508, 60, -50, -436, -536, -291, -246, -782, -549, -209, 124, -504, -135, 645, 159, -199, 145, 608, 541, -129, 575, 693, 508, 73, 336, 472, 171, -333, 395, 160, -328, -832, -344, 75, -730, -462, -56, -369, -769, -424, 203, 171, -228, -320, 322]
5499C22l85m26R09L44n73l15N06L28k14l86K40K00o05m96P45O5l95n91L53M11
5519C7p40o2P76j25n55PR07j99n07L75K37k08n84R89L14k59k73K55N87q73J23
5540B22M81Rq51k75M50L49r60K13L25J1o91N03M59m97n74K21P94l71l05K99O31
5561D43n64k51O37K31l73j51N50J95n15l48P60l4l30p53Q95j06r33M14K85r2n84
5582f24L05M71k34j76J34J45Q2l63J19N86m47j90K98K31J81p66P04L99r53m9N57
5603D10J08o37k00M97k48n62J06Q20l55n13P0L13j30k51J86O84n75k20M24K99
5623B26l87j18O57N6q13L29P87k22l71l19N40q1o34M10M47n73k59J18M40l55m24
5644e46K19L76l64j94M91J59l99k68O15M88o41m8O92j09k88k07P02L06r53K57
$$ y = [322, -63, -489, 420, 764, 191, -124, 382, 710, 496, 110, 350, 550, -55, -551, 194, 259, -136, -727, -374, 37, -703, -765, 11, -114, -669, -662, 245, 46, -461, -86, 151, -57, -641, 348, 662, 403, 130, 385, 972, 99, 222, 703, 712, -139, -414, 36, 385, -575, -362, -37, -26, -717, -214, 245, -252, -826, -605, 189, -182, -487, -188, 443, -121, -372, 265, 496, 123, -28, 522, 717, 202, -146, 614, 580, 250, -503, 392, 286, -647, -233, 52, -40, -624, -319, 152, -82, -258, -124, 21, 103, -260, -141, 445, -2, -192, 106, 337, 518, -248, 456, 855, -98, -147, 410, 518, -119, -319, 178, -70, -632, -526, 294, -61, -574, -504, -191, -321, -572, -386, 298, -277, -497, -73, 226, -161, -279, 378, 434, -379, -50, 737, 515, 144, -175, 365, 284, -350, 60, 507, -66, -325, -207, 233, -122, -546, -327, 49, -315, -509, -18, 141, -258, -526, 89, 577, -64, -112, 580, 471, 183, -24, 678, 984, 31, 288]
5664B88J4j09m89L58K55l13m69J20L86l18k59J79K21k61m51P05K85o94K32P56
5684D36l49n19L06R90j64n30r9N37R5r71M73K94k61m95K42K48j72o71P56J99o88
5705c43l97O78J31o77j73N74M68n74n2M74M16p69o1Q02j58j62j77M58p9n31n6
5726b08Q33n77k80N03K6l02l54J86L38q50j6N59J88l70p54J005Q7j51l38O87K52
5747D64l62m7K03N6l47M8L48np15M35P35m05l87J13J75n63m42Q96j43o26J1P96
5769B38k27m25M3K11k64m0L8P15O2o94L53N23n40l6L45K53j84l25L75P3k26o24
5791c56N18P4o52j34K55O25r80oM11j81k88M50M35k37j70L07J81l4k53L01L24
5812E90l81l18K18N36k78l18J33J54k93k54K59L40q42N1N71j38m79p2L65L7m05
$$ y = [288, 302, 193, -296, 62, 317, 4, -465, -345, 41, -277, -536, -357, -136, -397, -848, -143, 142, -552, -320, 436, 87, -432, -126, 864, 700, 170, 71, 608, 703, -268, 205, 499, 238, -257, -15, 233, 61, -610, 146, 345, -343, -740, -62, 69, -608, -781, -207, 261, -313, -365, 109, 525, -244, -305, 497, 339, 177, 0, 458, 379, -152, -208, 625, 48, -232, 271, 297, -5, -359, -173, 165, -685, -701, -142, 46, -324, -1078, -73, 14, -137, -475, 212, 464, 102, 55, 258, 314, -33, 15, 363, 358, -357, 78, 813, 408, 21, 134, 309, -254, -696, 200, 57, -569, -558, 238, 11, -414, -371, -160, -424, -464, -426, 289, 351, -343, 10, 533, -7, -43, 302, 555, 371, 46, 421, 494, 268, -356, 162, 236, -416, -550, -295, 330, -650, -656, -245, -426, -714, -264, 171, -66, -236, 71, 252, 218, -35, 266, 590, 209, -109, 109, 645, 367, 49, 182, 336, 43, -211, 48, 388, -454, -403, 168, 30, -449, -521, -156, -119, -524]
5833e24J09O93m52l77L02N30j34r0L81O6n16k16M24N14m76k54R6L16n79j41O56
5854C28J17q44L4K86Mk07p5L76Kp13Q5Q36k82k93K00P06o65j00O69M2r1n55P54
5877F14j3n89M5M80j69n27K61K05J5p15p0O38m33m48K42O06l74k71N05jo3m41
5899e03M42L22l11k82P53K58n47k56N99k4o08K52O62k34q70J37K44n7l72m0O17
5920A82l25n86K24N65l38l76L21M23l39r1N53O1l92j16N66J62l44k84M53J66n06
5941b1J67L73j80m60J55K26l31m50K21L30j29m39J70P05l21l14J13L37l90j87
5961d25P76J20l55q6K57J7k51M1M73K63q89J68L33r8m48j9M56o53j95M50L08l68
5983a25n57O8Q13j47q47Q28J67n65m58Q93J16m77M64L36M5p01J61N75k62l60P7
$$ y = [-524, -415, 278, -174, -551, -249, 281, 147, 57, 438, 504, -12, -228, 196, 710, 234, -20, 76, 392, -187, -328, 328, 445, -399, -365, -79, -75, -282, -357, 19, 21, -692, -607, 229, -53, -346, -146, 560, -105, -205, 464, 506, 415, -140, 614, 601, 12, 57, 537, 368, -159, 102, 307, 322, -393, -463, 175, -258, -706, -464, 142, -232, -503, 2, 1, -62, -503, -61, 261, -50, -332, 421, 679, 132, -124, 475, 451, -157, 95, 757, 523, -347, -210, 34, -23, -395, -435, 182, -143, -729, -505, 60, -278, -654, -333, 90, -249, -340, 213, 274, -118, -234, 332, 494, 150, -134, 319, 485, -21, 146, 519, 339, -121, 34, 260, -71, -521, -300, 30, -99, -538, -368, 337, 16, -298, -185, 152, -238, -425, 351, 471, 116, 30, 287, 304, 53, 94, 567, 830, -59, 109, 442, 344, -104, -123, 333, -320, -515, -65, 243, -125, -682, -614, 199, 52, -795, 33, 200, -365, -823, 70, 186, -291, 173, 509, 554, -147, 14, 589, 327, -33, 44]
6004D4N39l42l56J47L44k77o92K61L59l17K2J40P5l49RJ25K76k41l35O40J41k91
6026g8J09N54J43o00j30O49K5p05J83M32n01j32k25P55m51m26J84M82o40j33L55
6047a50n4r7k34N23Q6n72R2O88k64j36K75L72k0o17K46N08m45J8k71N69m78m04
6069c65L17P15l67q97O83M2l95l59O34p0m32J85J90K38o00L14M13k4n70K63M25
6090C40j53q4R8L16l09j53M9O17n34k13N2Q8k06p5L51Rm91l12N75j27m03K62N50
6113B47m25k84K01O89l14m47K79O39m03J5jK77m25j64M12J55n85k44M57J19m02
6134b04j65O19l39l67J46K00J21m29K0O47m36l47M42L70j72j23J16K94m69J10
6154C4J98K79m28n08P00J55n84L0L21k41l1j39M30o3j74l37K27J6k48J89L54m33
$$ y = [44, 583, 241, -115, 32, 376, 99, -593, -332, 27, -290, -268, -128, -53, -402, -393, -268, 8, -233, -568, 72, 213, -78, 31, 585, 728, 128, -2, 647, 672, -33, 150, 582, 81, -51, -276, 479, 28, -398, -214, 268, -372, -505, -150, -204, -301, -535, -12, 74, -498, -406, 282, 18, -118, 157, 529, 509, -108, 138, 646, 201, 219, -52, 517, 39, -365, -48, 667, 300, -597, 86, 128, -267, -626, 8, -62, -494, -309, -119, 119, -481, -167, 246, 222, -348, -85, 340, 187, 103, 201, 517, 208, 55, 104, 721, 187, -26, 26, 114, -92, -167, 184, 193, -298, -610, -35, -162, -565, -303, 247, -178, -462, -261, 428, 114, -333, -54, 585, 182, 197, 196, 473, 48, -116, 296, 451, -134, -378, 79, 198, -204, -369, 250, -89, -456, -310, -110, 11, -418, -398, 249, -187, -534, -92, 278, 106, -17, 99, 393, -76, 34, 232, 511, 83, -425, 275, 430, -154, -124, 197, -44, -75, -214, 216, 153, -21, -358, -131, -115, -363, -174, 180, -253]
6176b53j86K04L91m30J39J77K98m06j66N51K64p58L15K13k63l57L0N90k89k22
6196a58j0M38l25o10L99K67k64j81K30M23l45j11L60K45j52m50P91k41k17M9J15
6217B53J85l20k16M07p5m76M6L86K2o72K09L48np39M69L44l54j97K82K07k02M8
6239e0K24L32m89j60M24K93n40l72O53J72n87K17K59J22j106L43M66Q6o75M7L28
6260a3m08j91L58L98k89l77M01M15n94k1N19k40K06k38L40R0n60K11J12L58l27
6281A50j14L54m0k06j32K0k01l1o8N95o50o7K52L4p3k66L68L55l67JJ17J60j52
6304C9j86P62l14k21k67O53N1o16J20L14k51j28O8J97m09k26J51J72l22J40M2
6325b31J17m01MM97R6n12o3L78J67m37K53K01J35j81j98P74k25o03K29J98q6p5
$$ y = [-253, -439, -235, 156, -274, -135, 42, 340, -66, -232, 319, 583, -175, 140, 353, 90, -267, -237, 353, 64, -158, -168, 270, -55, -665, -266, 1, -263, -444, -214, 209, -136, -247, 113, 358, 206, -244, 547, 306, 89, 138, 253, 438, 118, -98, 309, 234, -242, -196, 190, 212, -460, -251, 97, 92, -647, -178, 166, -188, -385, -103, 104, -98, -50, 174, 506, 17, -143, 281, 574, 34, -338, 315, 487, -100, 117, 376, 498, -608, -265, 201, 287, -388, -341, -13, -421, -612, -254, 144, -145, -522, -121, 294, -300, -321, 198, -42, 164, -74, 266, 356, -204, 7, 119, 477, 150, 36, 390, 350, 144, 12, 32, -169, -200, -268, 327, -323, -390, -138, -104, -177, -443, -75, 280, -87, -86, 31, 191, 39, -147, 615, 301, 80, -187, 466, 517, -99, 21, 335, 84, -44, 24, 221, -188, -414, -263, -91, -413, -273, -231, -114, -515, -511, -14, 82, -430, -493, -115, 52, -385, -132, 69, 204, 23, -175, 599, 374, -229, 0, 198, 112, 37]
6347C7O1l9j71j63N4J55m80J52nN84n97r7O39L5l70k12Q01r1o46K62K50J29m15
6370a27K19L95j42m15M07rj79l39J53L64n17j87M1K98k64j09J45L27l41L1K26
6391b3j82k03K01M35j50n83M67K77r3l5L3K70l18j63N20P4m37j87M8M81n06l13
6413c87M56N1l12n0J71R0m75K86j55L01j89L44M1j12k71K57M57J09p39L37K26
6434D36j7o06K53K14l10j93J66L52k43l33K94o5l57P1L54r1m93J22L93J51l07
6455b09J88J60K59n93K92O81q05L0M18J70k24m64N53M0l70n2K05L7o42k9L87o5
6477c3j29j69M12Nk30n49N19K04m23M23K32k14l53N39j16Q4l3j16L26m73p6K39
6499F9K95l51j36M45Lq07L5N13j36l37k12L46J63l81L22QJ74l70K54K70l08J70
$$ y = [37, 98, 59, -112, -275, -221, -66, -546, -394, -399, 185, -412, -509, 130, 165, -205, -417, 384, 293, -353, -91, 159, 288, -127, 92, 487, 345, -70, 337, 328, 149, -190, -37, 327, -190, -377, -336, -38, -302, -411, -266, 61, -280, -249, -23, -205, -408, -207, 228, 78, -505, -38, 239, 146, 111, 144, 414, 96, -67, 453, 527, 90, -97, -49, 432, -74, -387, 69, 120, -192, -242, -71, 19, -456, -170, -325, -24, -213, 131, 172, 60, -211, 46, 503, 612, -127, 210, 436, 419, -187, 66, 280, -30, -223, -57, 295, 52, -281, 13, -52, -409, -338, 16, -75, -568, -446, -53, 98, -209, -21, 139, 398, -195, 97, 778, -27, 3, 421, 591, 367, -97, 456, 496, 126, 74, 279, 316, -326, -355, 32, -33, -162, -331, 81, 86, -144, -693, -174, 30, -393, 30, 262, 48, -305, 234, 118, 202, 169, 53, 379, -94, -170, 69, 364, 13, -123, 322, 325, -482, -447, 66, -70, -407, -619, -273, -110, -491, -169, -161, 13, -357, -103, 167, -141, 29]
6521B9O2K46j26j22K46K13m57j8L17J37o40J81J28j89l65J46K85k08j88p0N93
6542B00l84l10M35J16j01k92j92P45l51N2L64L3k96j94L99J62k18l57L05Rk52
6563a27M4L53r5k66k96L14J81o99M54L80n55k21L83J50k04j44L52K49k86J9J72
6584A58K78l72r8K82J7j46j66L15o6j53J96k59R2J7r5O9k01k77P3L58m24j16M95
6607b3K45n08q7O67m29J0L68j6L1k83J20k2J22O9j42m5J75j82N7rK53k16k15J50
6631I0l84j42L83K61l54m71P01j57j38l19M93J18k11P1K58O2k59Q4J41J32n65
6652b06L04M33k85m24L72q1j32j84J04LN9k89L88k61j2j48L50J98m75m1M18L1
6674A22l54K61K00Km07L26K71j72O5j41O5K62m33q0K69n11M5J08L73l18m32M19
$$ y = [29, 91, 337, 211, 89, 335, 548, 91, 73, 390, 527, -113, 68, 196, 7, -358, -212, 73, -135, -323, -393, 200, -184, -494, -59, 57, -44, -336, -528, 217, -134, -82, 282, 315, 19, -175, 224, 386, 168, -189, 116, 125, -127, -83, 270, 175, -91, -387, -73, 108, -591, -137, 243, -312, -533, -150, 0, -204, -348, 4, 253, -33, -14, 158, 436, 64, -34, 248, 265, 119, -47, 268, 202, 49, 245, -14, 78, 95, 0, 69, -132, -409, -336, 22, -402, -518, -23, 222, -286, -373, 294, -135, -125, 243, 227, 258, -25, 95, 73, 195, 264, 122, 77, 252, 70, 127, 118, 371, 155, -60, 90, -294, -436, -53, 208, -146, -617, 84, -73, -211, -530, -37, 81, -130, -59, 199, 261, 2, 86, 227, 359, -206, 98, 531, 246, -178, 194, 113, -19, -203, -99, -96, -37, -326, 62, -199, -211, -359, -9, 189, -286, -327, 91, 122, -232, 29, 229, 231, -176, 150, 421, 249, 314, 173, 238, 500, 67, -13, 256, -255, -210, -102, 271, -47, -479, -60]
6696f0K55k14l68K32Q2j76j9M93jl02n6K85J58l25K54N69l81p99N49J82k06l65
6718b13K36rj67K3k0k0K61n53K67M0l13PN23p2k11O0J76j56K09J1J59mk42P0J8
6743H0J09j21J90n8k46R6L8K10k88l77M45Qn72k1K35Jj26j2L40J12L8l9J16k99
6767a41O2K73k7M7l04M06J59k95l15K94J86m38k7K85j59l6k83J69K74k01k99O05
6789B35q9m25R6K42j21k75L14M10m52Q7K0L91m25P0J32Pj01k41L62M54o61j53
6811a23J69N0j01j73J22L2k08q0M29M2n93K91K95m04r1M30O9k05j23M75J16l61
6833E8N7J13K46m86O4N00l35k24L57j93p3n42L65K91k95k07K25J86j17n71M47
6854a34j76J30k3Q4M90k82l20M09rk86J36L15j29j61K64L8k89l05PL03p3m57K54
$$ y = [-60, 195, -19, -387, -155, -73, -249, -268, 225, 224, -78, -134, 151, 309, -16, 238, 807, 426, -373, 176, 358, 152, -213, 23, 14, -153, -130, -150, -170, 91, -462, -195, -155, -468, -461, 62, -10, -221, -161, 15, -141, 68, 79, 238, 234, -8, 62, 80, 189, 68, 258, 200, -46, 50, 88, 298, 10, -367, 78, 86, -486, -507, -272, -271, -397, -409, -69, 43, 81, 42, 158, -141, -79, 194, 167, 214, -90, 316, 475, 180, -135, 159, 345, -93, -120, 165, 6, -30, -313, -144, 130, -71, -370, 235, 146, -279, -183, 59, -62, -337, -23, 387, -65, 22, 42, 433, 8, 78, 210, 217, 116, -125, 237, 691, 30, -123, 46, 96, -5, -178, -56, -24, -232, -312, 117, 159, -434, -143, 152, -252, -343, 87, 156, -49, -172, 303, 419, 58, 115, 228, 474, -12, 52, 552, 217, -7, 350, 157, 84, -458, -93, 198, -97, -304, -79, 107, -10, -581, -134, -310, -180, -203, -119, 371, 89, -231, 178, 169, -117, 19, 334, 205, 44, 308, 346, 57, -248, -241, 62, -11, -468, -214]
6877b14N15m82q0L73l1k05k42M76p7r7N4j80L84j32j78M39j87j72K67K87q3m64
6899b9p9J82J26m54L98k27K85p2k33m5o6K7J70K15l20k81J45N87l16l52M20L0
6921A11j15k05L70J57k87p4K45J38l60L7K40k82o6o8L75k82No4K36m46Q2R9K56
6944A02J6j28j30J79l45m7M24N3j42J62L36j82n12K63M28l11j98R6K85l58k8k31
6966b68L48j13l24K69J23j9l5J8J66k95j61P18n11j47K46P7jj76p2K7N13n42M65
6989C06L3M4l23j43N29n97l7K61J06m0l59M4L54l77J3j10N82m56M6L29r1k89O8
7012a07J65K17l23J21N2L21l44k06N46j82l79M25j30k91J90R0M1l59K81k27L6
7033f3m46J48K18p5j26J77K07n6j32p1M49k81j22r5O14l77j03K60K67m73J6L94
$$ y = [-214, 301, -181, -261, 112, 81, -124, -366, 110, 33, -64, -10, -190, 194, 62, -116, 323, 136, -36, 231, 518, 435, -29, -108, 74, 200, -254, 144, -83, 202, 130, -103, -148, -214, -187, -17, 198, -122, -403, -258, 329, 13, -339, 81, 111, -4, -209, 161, 318, 31, -43, 202, 340, -20, 17, 257, -25, -91, -159, 216, -66, -61, -125, 111, -335, -253, -154, 102, 118, -10, -140, 39, -306, -353, 71, 124, -18, 144, 480, 298, -214, 49, 477, 166, -32, 64, 349, -9, -37, -268, 80, -33, -357, -88, 35, 16, -19, -1, 165, -130, -291, 427, -84, -231, 15, 92, 91, -85, -157, -130, 383, -159, 306, 339, 383, 60, -83, 446, -151, -188, 73, 179, 139, -220, -176, 178, -199, -186, -296, 286, -170, -124, 205, 114, -175, -107, 58, 275, -48, 73, 125, 446, 102, -104, 442, 260, -119, 306, 176, -115, 75, 165, 206, -153, 128, -99, -63, -509, -361, -143, -218, -344, -167, 40, -16, -148, -219, 230, -51, -173, -268, 346, -31, -134, 126, 393, -80, -64, 330]
7055C30m1m6k20K58j36m3j47l6K71p64L39J42j41J94L3k59K31j66OJ92P5j97K52
7078A27J62j54l5jm8K27m8J91l30J76m09R9J08l94K54N4M8k97O9k2J8Q2p4M68
7102B71n17J98l84N07j02P6j2J82J11l56K09O5m63L43j98M22l97O2K17k25j42
7123a33K30l15J78j87M1J39j34p2NN46k68k83J69L15k79K6j66K72j24j12K59J02
7145B09k26k7J92J50k67r6O6L59m10N4L6j82k26K91J70l50j03K56Q6j62MO1J5
7168a00J59n5Q9Q2j29k08K41O1k22J07J42Oo4k56K49n2k64J11j58J80j30L0J17
7191f4K10l66k3M71j78m43N58j89j1K58k09j10n5l4N24q9k32j02K81k2n26K85
7213f6K17j70j16J91P9j70j90n8L85j53r5K03J9J41n41M04K98m98J04J07J29k64
$$ y = [330, 289, 243, 23, 281, 145, 102, -45, -81, 190, -574, -235, -93, -234, -40, -7, -266, -35, -201, -195, -3, 72, -125, 127, 289, 135, 100, 99, 51, 278, 230, 421, 91, 267, -142, -43, 65, -329, -75, -21, 27, -270, -201, -223, -205, -123, -197, 271, -246, -48, -432, 75, -27, 49, 37, 219, 330, -26, 183, 248, -215, 128, -70, 352, -45, 17, 234, 9, -133, 97, -218, -40, -227, -186, -47, -181, -253, -248, 298, 30, -253, -84, 231, -48, -22, -188, 84, -40, -152, 107, 209, -17, -44, 148, 298, 31, -65, 1, 360, -50, 4, 40, -142, -368, -77, 93, -257, -360, -104, -18, -180, -176, -115, -100, 59, 4, 93, 175, 46, -162, 79, 140, -82, 25, 167, 173, 109, -147, 102, 50, -214, -103, -261, -81, -211, -181, -64, 146, -220, -243, 228, 50, -393, 165, -24, -35, 223, 14, -96, -151, -185, 339, 250, 18, -84, 197, 175, -351, -66, 151, -19, -135, 56, 135, -35, -225, -283, 102, -51, -146, 57, 76, 217, -324, 80, 378, -120, -16, 91, 220, -44]
7235d4R5L62j27j33j71Q0J06l29J26q4O1k33l3L41j50r0M74l37l35Q0N84m01n7
7258b15K16Q8K1k0n6K29j82k86L02J72m0m6L7Qk20l00K08K31j81m94N94k18p9
7281b31J80j28K54l37N0P6J86p8k40J37L88j77j53M66P1l87O0O1j80l5K48O3j92
7304A02p2kJ38Q7l61j2K38r5j00j03J63j12j6J00j29J64k62L53L9k03o3L84k31
7327Gk5R7K62k7j89P2K14k45O0j85K32m78K24l4l6j74Q9J24q9k3M5J38k30K4J6
7352a31L17M5j73J42L24m96n4N7qk11J21J93J17l35O2J13l28L06j06K23J77o35
7374b80k33N75j20N2k26J14Rk18J53K54P1j31m43N14j56l3L24K70o76p7L00K11
7396B54l2m74Q0K37j67q6J71J87m34O9J51k40J68pK61k54j04J65M33m38k4K32
$$ y = [-44, 51, 413, 286, 153, -18, 62, 168, -161, -35, -119, -58, -291, -324, 17, -133, -223, 251, -86, -421, -341, 243, -158, -215, 1, 89, 110, 90, 34, 263, 81, -205, 97, 269, 229, 183, 220, 228, 8, -292, -84, 147, -34, -528, 66, -152, -231, -51, -179, 75, -262, -212, -136, 50, -28, -268, -131, 257, 80, -73, 393, 464, 77, 137, 198, 18, -17, 231, 294, 102, 30, 28, 166, 253, -108, -120, 118, 23, -77, -180, -17, -129, -145, -45, -174, -10, -272, 81, 120, -83, -146, 238, 7, -18, 79, 341, 314, 125, 197, 411, 166, 226, 41, 273, -205, 19, -15, -51, -225, -136, -12, -101, -124, -79, 59, -171, -147, -131, 186, 231, 58, 200, 524, 28, -26, 31, 23, -188, -67, 126, 243, -92, -30, 83, -245, 61, -45, 178, 355, -280, -513, 62, -58, -6, -232, -118, -109, -327, -174, 80, 151, 20, -423, 91, -65, -98, 226, 496, -180, -257, 43, 254, 222, -252, -172, 65, -102, -188, -17, 170, -264, -195, -44, -284, -116, -123, 138, -116, -220, -55, 378, -60, -84, 148]
7418A48ROJ9k4j51L2KK11kk22l27L90j98o3N7K4P0k38J86O4n5k59M85k13J20k56
7444a85P4L15k28p5L47j06k9l4J66K35o24K98k82K49l37J40K76l98Q8m0K45k9
7466F6o1k12k84L10J55j16Q2J87n9j06K92k59K74l7k0l2m21L00Q1j20K2K28rl03
7490d2M9J05k20j55K40J11k51J02k58O22k71j01j60L57j43k85L15K66k87j43M28
7511B79N4k72Q7R5N6k97k26L91k87M3J58J58j28k63O4J64j05k98R4K50P6m2k2
7534B9J49p0j74m5L21k76N8J66Q0k36k13M08K7k13J38O0o0k57L3O1K2j27J50p6
7558d5n4m1K08J81j57j95J48j7k28K99j11P8j99Q0K29k45M17k65mJ77j88j58K14
7581A24O8j46j20K87N4k78P5j11p3o7l1K29j58k34L20j0J01k55p6M24k23J76J85
$$ y = [148, 157, 163, 182, 158, 7, 39, 41, 252, 250, 28, -299, 91, -107, -170, -113, -89, -19, -257, -71, -7, -62, -321, 164, -49, 71, -185, -111, 204, -24, -99, 248, 142, 113, 79, 245, 480, -144, 154, -128, 121, -216, -76, 200, -198, -110, -150, 95, 66, 5, -207, -491, -181, -26, -142, -60, 127, 68, -38, 254, -5, 269, 232, 212, 180, -241, 59, 140, 20, 42, 270, 261, -42, 7, 112, -108, -263, -23, 88, -163, -61, -319, 303, 32, -69, -229, 128, -15, -300, 15, 281, -6, -149, 279, 333, 61, 148, 243, 299, 2, -224, 167, -120, -77, 81, 239, 111, -152, -88, 76, -29, -327, -233, 17, 93, 51, 29, 178, 108, -66, -111, 210, -66, -8, 158, 238, 2, -211, 197, 224, 11, 149, 209, 149, -108, -75, -14, 8, -119, 31, -45, -99, -140, 68, 249, 92, -103, 45, 28, -200, 99, -12, 66, -133, -53, 176, -69, 348, 83, 79, 256, 68, -90, 124, 192, 46, -74, 213, 267, -11, 64, -47, -120, -187, -218, 11, -147, -381, -61, -71, 30, -225, -301, 123, -100, 76, 261]
7604B61k77n7J68j1J15k88o9J37L0j96P6J30r7j58J94Rr6o1P4L29k51J51r7j73
7628a57p1J05J53J26l76L33O2P3k58j79K14o8o5L04J64l08J68l15K89r8k14O9
7650d9J39k14p9J43J02l51J81o3J93r6j18J67J29k96M45j83l6k5P9J15j45k0J52
7673A70k11j18O8J22K40m43K57k53J32k36K95N5j11J46l38L54l14j22K34K57R5
7694B79l53L05j15k28J34k7R8j05j20J77J06m10K89O6j29j54Q2K95j27k44L07
7715A26j92N9j98K32m5r2j36L22m3n8J56m8p1J14j85K05pj53Q8j62K32J12m13
7738a57L48j53p0k17K15M5J07j99J43q8Q2m7j5K24j59m1J72k07k28L48j62J04
7760D5l36J96L21j95j75J37L35j96p7Q0k52J47M1J49l48O8j98K36q1l76L79J29
$$ y = [261, -16, -73, 95, 84, 199, -89, -158, -21, 9, -187, -111, 19, -78, -236, -42, -33, -129, -190, -116, 213, -38, 113, 16, -157, -228, -123, 30, 156, -220, 113, 175, 248, -10, -189, 25, -43, -108, 196, 360, 52, 220, -95, 194, 96, -118, -49, 90, -124, -203, -60, 42, -309, -128, -191, 2, -94, -212, -45, 84, -212, 233, 50, 14, -11, 68, 183, 38, 18, 170, -41, -159, -91, 31, 271, -172, 85, -168, -36, -272, 23, 78, -33, 113, -225, 129, -185, -307, -73, 184, 279, -74, 231, 116, -112, 22, -5, 93, -12, -132, 45, 151, -259, 30, 96, -33, -187, -105, 190, 63, -181, 126, -66, -7, -205, 27, -18, -110, -246, 76, 33, -25, 131, 83, 12, 126, -59, 146, 139, -14, 74, -88, 144, 256, -157, 191, 38, -32, -249, -34, 11, 118, -81, 62, -26, 56, 9, -6, 218, 59, 18, 190, -17, -245, 103, -59, 45, -291, -95, 226, 31, -144, -7, 328, 132, 55, 135, -117, 30, 71, 220, -128, -60, -258, -22, -103, -479, -100, 29]
7782B9j62O8j05J52q1K94j33J9j25P6q0L22l48M6M35l08l24Q5M74k47o5R9j72
7805e1K79m35L60O6m66L07j45k01K83J4o1M3Q7l21L44L1K34l24K17j75p1J37N5
7828B07n6k78j14L55Jo4J0j9q8J7L6M0j75q8M4J76k5j84R4j8J82r6L31k34j10
7853e6K68J5k56k00K25K18j91j06j91M46o6j89J0K06j88k46K20J13j04P1K7o0
7875c4K2J37j27j71j2J77K19l27Q3J9J61k23N8p0K09k9k12J32l9j9J79r7j0P4
7899A00j38o5j00K96j35K08j81l38R0J59r8m9k2L56k92Q6K58m34M80j09m5K42
7921B69j58j97J28J34k88R1k1o0L8j05K9J95k11j76O66l36l15k1L39p2l6K38k45
7944a14j07j9r1O02m7k67k8R7lo3n6Q5J30k55J68M0j99J25M5j67k9j00O34m04
$$ y = [29, -133, -65, -170, -18, -99, 195, 62, 81, -44, 32, -48, 274, -74, -28, 407, 99, -225, -140, 334, 87, 22, 121, -51, 228, -207, 153, 219, -247, 60, -85, -286, -3, 11, -50, -7, 80, -241, 103, 134, 368, 44, 261, 86, 15, 152, 207, 151, -127, -241, 114, 115, 51, 61, 42, -46, -29, 7, 47, -128, -216, -172, 4, -21, -205, -111, -129, 53, -43, 288, 54, -56, 212, 227, -29, -229, -4, 214, 23, -83, -274, 172, 106, -83, -73, 133, -55, -301, -81, 32, -72, -1, 26, -34, -12, 125, -2, -173, -185, -8, 211, -116, -33, -14, 147, -76, -18, -88, 121, 92, -120, 12, -27, -46, 133, 36, 26, 100, -38, -103, -203, 93, -42, 166, -15, -353, -263, -104, -202, -251, -273, 83, -209, -123, 135, -299, 181, 72, 27, 269, 111, -86, 42, 176, -112, -21, -42, -102, -64, -169, -140, 55, -156, -332, 334, -2, -317, -338, 1, -71, -107, 131, -114, -221, -240, -331, 271, 224, -43, -71, 26, 23, -40, -96, -11, 119, -136, 32, 72, -127, -2, 43, -124, -153, -253, 381, -23]
7968b3j96J02K08J9k52j0J12q8J52q8K58m26J22L71k62j89l9L65m5O6k03j10K25
7991F9p3l53M11k2j86O4N7N4k36M0L64k25K22j26K46l25j0J9l3P2rJ17j48M9k18
8016a80J25M48m51k08L57J20k55r4L10k24j99M02j28J77k81j19J39J11k94K46
8036BM00j24m13K01J72O8k23j63M5O7j61M36j07p60O43J6O0p02N71j5J37l51K80
8059G9k98r7K74n0j5J03j62L5K63l47J92J29J33k36k4j23JJ60l10N43l83K83l43
8082a93J57p9J37J65p7k88j59M44kl3j37k30K57J25j76N71n09O8p9J6QJ98k26
8105d2N35l79oK65n6n2l46M1K0j66k9L87j18l50J49K86j57l10K36J89j67r2j08
8128b70K65rk4j30K65m7J49l24o6L80k78L76k79j62L1O8J75k18l5L01j00j26n6
$$ y = [-23, -219, -117, 91, 110, -142, -152, -40, -128, 24, -64, 194, -232, -110, 261, -1, -190, -229, 136, 91, 157, -46, -156, 69, -4, -357, 54, 32, -154, -90, -33, 21, -215, -175, 189, -36, 186, 60, 306, -19, -29, -10, -43, 29, 20, 137, -11, 38, -180, -55, 393, -58, -266, 91, 211, -44, -138, 172, -52, -251, 151, 23, 200, -81, -200, -61, 50, -244, 2, 402, 278, -135, 66, 238, 306, 83, -80, -35, 32, -129, 307, 200, -560, 83, 99, 159, -543, 28, 13, 150, -201, 79, -219, -316, -42, -92, -107, -4, -166, -131, 132, -215, -23, 106, 239, 3, -21, -144, -143, 17, -293, 250, -133, 150, -193, -36, -115, 22, 187, 110, -178, -337, 107, 105, 72, -65, -295, -38, 87, -89, 482, -27, 41, -38, -22, -14, 184, -42, 493, 114, 108, 373, 317, 265, -81, -40, -20, -186, -215, 172, 54, -296, -147, 139, -18, -328, -92, 97, -70, -162, -270, -5, -14, -38, -168, 97, 50, 199, -125, -191, 189, -89, 287, 8, -154, -123, -55, 120, -98, -133, 168, 68, -58, -114]
8151a14K04j40K37l32r9N61j83k32n6L24Lj27O2k10J53m7J14k93J82p4L45k18
8173F0k43J68J85k78m3K06J82m41K01L68k15j27j27J50j83L7o5L43
$$ y = [-114, 90, -50, 187, -145, -244, 317, 134, -98, -154, 170, 173, 46, 108, -102, 51, 4, 118, -175, 7, -67, 278, 60, -183, -15, 170, -108, -151, 55, 237, -204, -3, 365, 150, 23, -104, 46, -137, -100, -165, 178]
8191A78
$$ Imaginary data points
##PAGE= N=2
##DATA TABLE= (X++(I..I)), XYDATA
0@%%%%%%%%%Qj6J6j6K4l2L2m0M8n6P2q2R0j05J24j42J63j87K12k42K76l10L47
32A84l90M36m88N43o04O73p47Q29r18J017j127J246j380J531j699J891k113K369
50A253k670L029l467M019m733N701p099R308j3341K3110r1600j28608J24794J32856
64E2552M3344q1023o9932M186Q5179O6678j1561p8501l8369L7683M8952k4459
76C4729n5240p748M8703L3667j6283m4362k6483J2358M2720K1162l3005n3022
88d2804l306L8450J1377m0600l3833J5419M1799K6271J168j6812j4928J4032M2462
101C8695K3077k8497m8400j9553Q369J5401K3475K9519L695l4254l0810R159L1041
114B0917J4550j2680l1614l4082p436L1711L5018q534l2512k651K7438R368j9824
$$ y = [0, 0, 0, 0, 0, 0, 0, 0, 0, 0, 8, -8, 8, -8, 16, -16, 16, -24, 24, -32, 40, -42, 48, -57, 67, -75, 88, -99, 113, -129, 147, -163, 184, -206, 230, -258, 285, -319, 354, -393, 436, -482, 535, -592, 654, -726, 805, -894, 997, -1116, 1253, -1417, 1612, -1855, 2164, -2569, 3132, -3967, 5341, -8000, 15110, -76490, -205098, -80304, 52552, 95896, 14873, -55059, -50873, 34306, 100984, 89423, 10922, -27447, 10236, 59188, 34729, -20511, -28259, 20444, 54111, 37828, -6534, -33017, -20659, 22061, 43223, 10218, -42804, -46110, -7660, 3717, -36883, -70716, -55297, -13498, 12773, 13941, -2871, -17799, -3767, 38695, 61772, 33275, -15125, -34678, -26309, -10908, 12567, 42086, 45781, 11527, -19283, -10124, 20917, 35467, 22787, -8827, -42909, -50345, -18634, 16384, 7850, -24662, -27313, 125, 9493, -10331]
127a0331j1102J9931K9252J2807j2458l2281k4835J4763L9591P935l6107k5574
139b8409K3171L3785q75k1809o337J0408M838j3077k8746k5015J1656M9005L0690
152C9285l0163n0173J879M9203K6555k5589l7815n813K7476L1868K423l4104k9519
165c4487K3508N5529R312n7759n3422J7279N8800L1582j7652l8698k1069J3414
177a3663L1016N026l2235k2572K4728L5671j1055m2686p907M1341L9019p791m6723
190g831m3850K225N5300N5178r890o4284l9426K7607M7909Q808k8336k9703q817
203c5110J7217L1195J6944j6411k5383l15J8171L575j3613j0482m395m096R143
216a3560K8160J7693j4752k6408m983J3326J2437M947l687j6589j6559O781K1305
$$ y = [-10331, -21433, -1502, 27750, 40557, 28099, -4182, -29017, -14254, 25337, 33272, -2835, -28409, -5238, 28547, 27672, 5863, -474, 9934, 14772, 1695, -27051, -52066, -40410, 8595, 39285, 9122, -41051, -39172, 10031, 36586, 10997, -26818, -32631, -5155, 26713, 29136, -4968, -34487, -10979, 44550, 53862, -3897, -57319, -40040, 18760, 50342, 32690, -6008, -27077, -13663, 17353, 22379, -9856, -32428, -7700, 27971, 16916, -25770, -33677, 7664, 46683, 38892, -7831, -51681, -49456, 5844, 61022, 51132, -13152, -52578, -24971, 22938, 31746, 3410, -26293, -35110, -17893, 13302, 30246, 13835, -11548, -11863, 6308, 9883, -3730, -14212, -18607, -22703, -13560, 14600, 32293, 17541, -8867, -13850, -524, 11913, 16860, 13173, -3416, -19975, -13194, 8111]
229H111N358j2527j203J0979n714k1309l279K7948K9039J367k8425m0652k0697
242e1004K6811N0016J0905m8115m5727J9246O0474L2917k0161m2167k3143J1878
254a8070K8856O823l3109l2130J8081N0091J8093k9387k8051Q929K6542J0620
266B7288j2373k1777j2307J0783K0423k804k7035r114K8829K5369j5372l2357
278b0447j518L2097K9464P00k8710l6804j0920K5479K8933q856l1686n282K9092
291A542K3139m490j2531j783K941j387r320j8900j6532Q314L1682J6342j7897
304A120k0938O973K0598P737n154m279m768o717J067O596o70m174O024P587q374
319B628j3453O761K2484Q717q657q142l873q933q190Q51J608p927m691P771Q612
$$ y = [8111, 13469, 942, -261, 10718, 5004, -16305, -19584, 8364, 37403, 38770, 10345, -30307, -51004, -24193, 25823, 36728, -11387, -57114, -37868, 22606, 55523, 35362, -6805, -29948, -18070, 10786, 17609, -15500, -47630, -29549, 20542, 38635, 9248, -18803, -9874, 16668, 27288, 14915, -6862, -19169, -8386, 12037, 9233, -17802, -26916, 1913, 27282, 11910, -20447, -21965, 10132, 39596, 40296, 11586, -25218, -36138, -10659, 18274, 9418, -22268, -27550, 1542, 24681, 20191, 7660, 5877, 8818, 7431, -1889, -20789, -37321, -29007, 2675, 19017, 1120, -19818, -12845, 7753, 15490, 10336, 6057, 1289, -5428, -4361, 2235, 1565, -2609, 3415, 11002, 2628, -10825, -4064, 18420, 27137, 18480, 10338, 6465, -2468, -10658, -9807, -8199, -16126, -20817, -13046, -4434]
334d434K409O642J0659n111j8944n893J5015O939j5558j7279M410K1659K2733
347B3247P695j7280l1151n464L4927L4883j1512m4011k3108J6317K7870J0679
359B3092j2644k4768j4787J1805K3255M093j5182j198J9152O437k3187k2465N751
372b0646K2429J1542r019k0060j0654J9165L9455J5190l2792m1060K108L5086
384A0744J7939j8378k8647r695J5771K9082J3937k1023l5781o294K7763K3052
396A8470p303j6977m604M090M014O429O655l775r644k920R10k739M652J9054J2105
411B8417j4155k3645n278J2914Q992O38l746r943j1404L966J7778R300j0354j2686
425i206k732l51M63R283J1716k888j1015J215J2951L162j1044r041r99L027P772
$$ y = [-4434, -2025, 4617, 15276, 10165, -8779, -14672, 343, 7282, -8276, -25555, -21145, 514, 23247, 30942, 13662, -17489, -22953, 11974, 46857, 35345, -8666, -31774, -15457, 12413, 23092, 10448, -14320, -29107, -17302, 5953, 10046, -5136, -6334, 12818, 19255, -3932, -26397, -20646, 1783, 13325, 4306, -15754, -26408, -7243, 32212, 47402, 14610, -26450, -24342, 10744, 28683, 10305, -18342, -28037, -12266, 16816, 30753, 9730, -26051, -32345, -4582, 18470, 11167, -5810, -10414, -6324, -2310, 4119, 10774, 6999, -2645, -5565, -4655, -7394, -2742, 16312, 28417, 14262, -9383, -14661, -1747, 7245, 7883, 4137, -5806, -17210, -13244, 4534, 13834, 3480, -9206, -11938, -12289, -11826, -2543, 9173, 6285, -4730, -3515, 9436, 12598, 1554, -7487, -8486, -5459, 2313]
440B313J0610j252j3652l845J7181J3260j1956k1410n969O988M832J123k59m171
454f207j343Q590P104j0054j4878O961K1846N702j7373j3769M532J1698O712j263
468H258j1227j2667M875K1357J0179j3192r641J1343J3343r621k3596j2823N133
481a8279J3902J2175l059j9952j0926J9915L1644L318k7921k2460K176J3421Q778
494B732J806o773r319J994J5720R347p942p339Q006P963n763p793K743L903n157
509D128p600l826l618j32R246R569o068j1610N345J8156M374j4653j7364r271
523b3324j752R790J7909O494j2759j2099R380K1248J0878k500j1378j7923j3111
536a9147Q420K2609P907j6200j6918M68R793Q882O448j164j2182r481O350J0989
$$ y = [2313, 12923, 11671, -1981, -5826, 11355, 24615, 12659, -8751, -14720, -7732, -2900, -1777, -2036, -6207, -7550, 1040, 8144, -1910, -16788, -9827, 12019, 17721, 348, -13421, -8889, 2809, 9521, 8258, -2969, -15636, -10761, 10596, 20775, 7583, -2058, 9285, 22628, 13007, -10589, -23412, -18279, -4377, 7798, 4739, -15213, -26139, -6224, 25420, 28738, 817, -21643, -19467, -6046, 2732, 4538, -2235, -11554, -9560, 6160, 15507, 7565, 226, 8232, 16195, 10432, 2639, 5382, 9285, 4128, -3472, -7298, -10916, -11048, -1802, 7767, 1699, -9911, -4566, 13590, 17964, 3311, -14053, -23324, -25076, -15286, 2623, 9117, -3642, -15741, -6361, 14887, 25765, 23265, 11887, -6036, -19147, -10727, 11882, 19789, 3589, -13329, -12861, -3068, 5814, 12262, 11098, -1084, -10565, -4215, 6774]
550F774l103j0492k158K078n685m498Q784J4079M893j479N6n52n48O109M614j2964
566E908k3996m527K0935J8651l915j4925p041K983J1981J2215m157k4891j9748
579c0527Q629K0364L812j0906o331K667K926L691O328K721k326L037Q021j461
593A0645r346M2J2028K533j2555r449M135Q951N460M324r69r877o342N527M318
608I425j1951j5616k72R917L629l009j3m7j311L992P788k456j2142l756J1616
623d206Q832k102k583K629Q89j905L342N311n181p282N380J1123M74q333m055
638B333n2l059j028M704p94j1174n330J0541J0668j286o042k253l627n314K812
653h901J0018K899n606j81L466k156k686P142Q422p051j5120l028J0593J1145
$$ y = [6774, 3671, -6821, -8979, -6901, -12586, -17084, -8300, 5779, 10672, 9193, 9249, 8697, 8149, 14258, 18872, 5908, -18088, -22615, -1680, 16971, 13056, -1869, -8910, -5927, 6054, 18269, 14112, -10779, -30527, -21898, -1534, 2278, -8628, -14959, -12292, -9366, -5675, 653, 3374, 1048, 4085, 12106, 10645, 1299, 1341, 13369, 15902, 3347, -6102, -1967, 6984, 12444, 16768, 15799, 5922, -420, 5107, 9425, -2526, -18142, -18414, -8497, -4868, -7877, -7890, -7937, -9248, -5256, 2532, 76, -12066, -15822, -4206, 4626, 2524, -59, 2570, 3459, 1554, 4896, 10207, 5026, -2256, 3124, 14247, 14721, 6388, 2333, 2281, -778, -1806, 2898, 2104, -9070, -14400, -3859, 6809, 5523, -519, -2772, -6399, -11713, -8901, 1117, 4016, -1590, -1771, 1695, -461, -3147, 3995, 12417, 5366, -9754, -12782, -2189, 8956]
667H956N448mj0592j4545n7J6474Q731j3581j6951q45J1382R955O153j047j1840
682b363j0343N712J4436J260j1546n709L713K543Q39N365L812o517q872J265P489
697A084M437M047M425n934j5765n174J2611J1232o255j3049n825L149J0265J6382
711A5630Q917j1748k0304m325J1883O953m752p208n255m239M353J5120R464p961
725F528j1709nN593j86j051K213l261q891j647R059N359m292j781L781Q97j27
741D80P479R613l447j2478n244L227R40k088J622O6n680O17J3967J1591m385j2219
757D061n808k134l524K77L416l721q958K145J2313N485m530k218M680O66l759
772a609J45K583k548k991M471L917n805o053N994R903O69k323K950J639m929k662
$$ y = [8956, 14404, 14400, 3808, -10737, -10794, 5680, 14411, 830, -16121, -16966, -5584, 4371, 10524, 9477, -2363, -12706, -6994, 7442, 8702, -2844, -8553, -4840, -2297, -1458, 3907, 7719, 1202, -7670, -6405, 1084, 5521, 9568, 13993, 8059, -7706, -12880, -269, 10963, 4708, -8341, -14166, -11017, -752, 15630, 24547, 12799, -7505, -11830, 53, 7006, 2254, -4954, -10209, -14448, -10095, 5025, 14489, 6528, -5181, -5186, 407, 221, -830, 1383, -1878, -10769, -12416, -3357, 2002, -2290, -4071, -290, 607, 480, 7959, 17572, 14125, 1647, -3597, -370, 570, -1518, 104, 170, -5510, -4893, 9074, 20665, 16280, 4061, -1747, -3881, -7405, -7128, -3712, -7433, -16391, -14246, -1933, 3552, -978, -3196, 1484, 2150, -1609, -1464, 1119, -1429, -4420, 51, 3968, -1837, -7890, -1896, 8007, 8676, 6353, 9303, 10942, 6013, 3351]
788C351K443k655j0566m965M121K547k139M784R199J734o014j498L420k597n251
803d086n58K71m904j529J1385J0460l621q511N39N422K445J005J154o905j1465
818h898j61J1725N004r209r063j015J923L833R989P365o697j2144o53Q199L005
833C203l410k218k783o250J999J4753J1896k449q227k622k7j384L073M740n669
848D625j3552l019J0647R213j964n246m968o618r51R995R698o045j3098j982Q062
863e203O056J125L28n162r419R86J5181J2108l085q730l109K78L16N150N471n679
879F612j3506k577R420P690m51j745l715r661o346P509J0757j462q316k505K991
894e305J357L759N877j497j1315n586Q394R266N77j201K002q49l719L028O210
$$ y = [3351, 5794, 3139, -7427, -12392, -8271, -5724, -7863, -3079, 6120, 7854, 1840, 342, 3762, 1165, -4086, -4644, -4373, -9277, -10806, 579, 11039, 7418, -1093, -554, 4868, 7313, 8318, 9472, 2567, -8898, -9059, 2666, 7670, -1539, -10602, -11617, -9694, -5861, 4128, 11493, 4796, -7348, -8001, 198, 3203, -207, -2425, -5208, -11458, -9459, 5294, 17190, 14741, 6514, 3892, 3865, 2481, 5554, 10294, 4625, -8927, -11946, -1299, 7914, 5950, 704, -4264, -10882, -11833, -1838, 7860, 1815, -11283, -13265, -5203, 853, 1978, 2306, -2856, -12275, -11289, 3892, 16000, 12915, 4185, 1076, 1354, 1670, 6820, 12291, 6612, -6894, -9471, -51, 7639, 7188, 5443, 1728, -7933, -14279, -6770, 3987, 2525, -5791, -8296, -5305, -3948, -189, 5688, 4191, -7124, -12710, -4316, 4950, 5527, 4326, 6328, 5479, 1760, 4788, 10998]
909A0998m283j0645k218O451K369k408J130R47n118l599N032N126m747n938K358
924d545L874j935j135M089O8o368k458O364L928j067J967O435L17o126m13L045
940F040l136o616k38L341k673k877N246O871j73l502J474j132p147m200M861M406
956E45m364l291K498J645p01M846P829j405r349j524P246M543k642k058k449p184
972e815m375O659Q476k829o855J887O559J794K46P09m810j1766m169P831N939
987e19l488k015K939L031K125O913P065n230j2784m085N462L682j47N28k376q449
1003g348l291J0594J1755k182r398m441j75N94N296O376n187j5524p305Q037J0970
1018a229K745J37M31k180p61Q800Q805n171j3283n337L218K448J835M041J166
$$ y = [10998, 6715, -3930, -6148, 303, 2672, 264, 1394, 2341, -2777, -6376, -1344, 3782, -965, -6903, -4545, -671, -2606, -3741, 348, 416, -5952, -8410, -2046, 1882, 815, 2782, 9217, 9534, 3408, 2995, 6040, 2904, -3712, -3950, -609, -3282, -6159, -913, 5958, 5785, 2283, 3757, 2625, -4522, -8722, -3861, 545, -3819, -7110, -4612, -2967, -3668, 1178, 9007, 7602, -1747, -3271, 3975, 8518, 5876, 3818, 1369, -5815, -10190, -3531, 4945, 2116, -4739, -2852, 3707, 5501, 5747, 6456, 1646, -10120, -14289, -6458, -519, -4007, -6022, -3083, -52, 2073, 8986, 16051, 10821, -1963, -6048, -586, 3096, 2949, 3477, 1101, -7348, -10639, -45, 11710, 9528, 130, -4311, -4486, -3892, 1404, 7780, 2593, -12931, -20236, -12199, -1229, 1516, 1653, 2084, -96, -857, 7943, 16748, 11577, -1706, -7043, -3825, -1377, 458, 4499, 5665]
1033E665n667k209P830O472m053p997l289k282l763K807P398j15j0229m939O132
1048h239P110L155K405k07o911m857P528J1572j277j0513o086J026J881M345P815
1063H747J894o997l739N617M234m929n858k83k004o022K22O416K186l120J650
1078a986M252j295n234J698M751k022m392K734N273j251m086K248L119k747r63
1093I9M893J575n673k447N115L080m764m135M89k089m523J276O156J55l960K331
1109b422N334j396n495L87L766l37j344L211J424m279q98Q491O751n407q375j297
1125a886J431J019M441N072l898j0525k550O841L043m255k691o28m046l025N871
1140e786Q607M54n116j230K08k691J503Q052L538p598o841N441Q114J376k185
$$ y = [5665, -2, -2211, 5619, 12091, 8038, 41, -3248, -5530, -9293, -6486, 912, 797, -9432, -14371, -8239, -1129, 2026, 4431, 4224, -2687, -7544, -16, 11556, 10279, -234, -6320, -5294, -3413, 932, 8747, 10641, 3644, -95, 5522, 9756, 4827, -1031, -1314, -3318, -9340, -9118, -2702, -516, -3636, -1986, 2266, 971, -4263, -2565, 2186, 164, -4228, -1494, 3779, 2528, -1558, 690, 3809, 1062, 99, 4992, 6567, 894, -1553, 3562, 6642, 1878, -2257, -1768, -3857, -8380, -7104, -948, -793, -4753, -2422, 2912, 1516, -3979, -3592, 174, -163, -1507, 1704, 3128, -1151, -2049, 6442, 13193, 7786, -589, -1886, -455, 564, 5005, 10077, 6179, -4346, -6896, -55, 2988, -1267, -3958, -4586, -8632, -11657, -5786, 2821, 3275, -1841, -3071, -2863, -5554, -4051, 4001, 7539, -59, -6900, -1459, 6655, 8031, 5846]
1155E846k425m102k680O953R679k025j2535m844N910M908k375l389m177o391o41
1170a2288J0344R937k124p844j718J526j314P72N119K28q638n566N832Q431L997
1185F694K562J76p259p977L695J0898K251q912o943l27M63K184N382J532p640
1200c221o314O133Q980J197m386j700j622l750M05M854m19p584k370Q090P522
1215E815R15P5L97l992n984K023M970k651p079j330L370R2L71O449M993m388o904
1232b858L47L834L6R28J860l707q582j247R499N244m284l243K803K911l12K278
1248E507J393m527n953J203K358o085o773M139R587K735k925k37J020j488J247
1263A201L892k300q889k835P224M960k954j167M864K638k070k57K422k253l559
$$ y = [5846, 3421, -681, -3361, 3592, 13271, 11246, -1289, -6133, -223, 4685, 2310, -1079, -5256, -11647, -12288, -1944, 7993, 5869, -1975, -3693, -2167, -3481, -2709, 2410, 2638, -6000, -11566, -5734, 2697, 6694, 9256, 9432, 2173, -5804, -2109, 8789, 11040, 2128, -4815, -5142, -4679, -2495, 2887, 4419, -3221, -9535, -3402, 5578, 6775, 2389, 689, -933, -4683, -4278, 576, 157, -7427, -9797, -1707, 5815, 6730, 6805, 7202, 3210, -2774, -751, 4219, 1568, -5511, -6841, -3471, -3379, -3008, 3441, 8434, 4046, -2858, -2511, 1323, 1359, 2287, 4147, 440, -8142, -9389, 110, 5354, 1070, -2173, 630, 3541, 3229, 5507, 6900, 2373, -3580, -2377, -19, -6104, -12877, -8738, 849, 3584, 659, 422, 1442, -46, 1201, 5093, 2793, -6096, -8931, -1707, 3253, 299, -868, 3996, 6634, 4564, 4307, 6729, 4476, 917]
1278I17J873K830m410o072J453L181l252n028L119N930K08k535O12p69k955J279
1294c619O157j536j0506m866P534Q870L592J613J14m766m183N079Q999j038r464
1309A980m745P86M82K422O145J092q505p299L709O157q35k892K25j727m461O54
1325f812N891J427o166k413M285J839l4M687N328l275p156J502P260J451m525
1340C289l584j950j684M608R926K171j1890j0954L779R000K262l087m159n108
1354g381l277O094R737p1q424l752L336J218j152L660O072j086n176m62L300N08
1370C144N35K430k020q316k933Q402P535m000p413q02K135M39J227J087m409n819
1386h778L684Q431L85p907k636L564J952o40L141L004k432k435L944M093k731
$$ y = [917, 2790, 5620, 1210, -4862, -3409, -228, -3480, -8508, -5389, 541, 749, -1786, -1174, -1943, -4898, -3619, 2538, 1002, -9504, -14370, -6836, 2034, 5626, 7239, 7353, 2587, -1596, 3483, 12482, 11444, 1980, -2765, -1979, -1497, 925, 7070, 8162, -343, -7642, -3933, 2224, 1389, -1503, -1278, -3005, -7466, -6812, -921, 506, -5660, -8073, -3788, -1949, -1983, 2704, 8032, 4757, -2399, -897, 6363, 7814, 3289, -295, -2245, -3929, 679, 10605, 12776, 886, -10068, -6289, 2711, 4973, 1886, -2273, -7381, -10658, -4564, 5173, 5102, -3322, -7074, -3738, -2520, -3672, -12, 6060, 4974, -202, -664, 2636, 3144, 3679, 6109, 4089, -4227, -7160, 1242, 8777, 4777, -2636, -3438, -1303, -864, 363, 1450, -2959, -8778, -5094, 3337, 3722, -4185, -6821, -3257, -1305, -1945, 1196, 4200, 1768, -667, 3277, 7370, 4639]
1401D639l526J383k07n414k416N256M578k639j351K604j078m760L5M175q88n647
1417e256j170K753o87j334M335N395k378m393K263M320j034j675L451J578m175
1432A993l886J414J154j831P65M900j112o179M81P773L147n910o016k006j928
1447g241l81M459K673m598m219P055R748p25o350j654J866K60M88K317j662n861
1463c825m00O004L670l803l8L754p08o414o99O291K690m272n414m673l294K220
1479h911R984N707p169r284L440J0492M769j900l790o004n812K302Q573K609n364
1494c58l548M577L925j088R64K442l613o915m82M411P1l516j6Q38l037j042O437
1511E0N760l959n898J859M954J112p65O17l614p301L5Q613N105k998l146Q54J77
$$ y = [4639, 1113, 2496, 2289, -3125, -5541, -285, 4293, 1654, 303, 2907, 1829, -2931, -2896, 1279, 391, -5256, -6426, -3673, -4360, -5694, -1359, 4036, 1658, -2735, -472, 3848, 2814, 1139, 4590, 6168, 1993, -1893, -479, 675, -1156, -391, 4509, 3397, -2782, -2301, 5472, 8619, 2709, -3307, -5313, -7241, -7622, -3163, -490, -5088, -9307, -2252, 7496, 6771, 421, -1233, 633, 893, 1381, 3698, 2036, -3825, -4225, 1779, 5449, 1646, 1608, 5362, 4654, -1760, -2459, 3832, 6522, 2250, -3164, -7837, -11131, -8911, 1073, 6780, -389, -9673, -6233, 4259, 9028, 7128, 3338, -2666, -8478, -6176, 2397, 5006, -358, -3906, 671, 4596, 3508, 4472, 6914, 3301, -3614, -4096, 315, 386, -3130, -3146, -2308, -5345, -6387, 50, 5810, 1851, -4047, -2188, 2766, 3878, 3113, 3730, 116, -7185, -7150, 1463, 6568, 3570, 424, 1278, 1455]
1528A455p45N058L886o649j1183j986N931L851q84q9r8l088K1O382L659n494m008
1545c981K922L074k783j688M242K154k759j082K020j5j583K639M498l336n920
1560a598Q95N415j656p389j644K238M36M53K741o16m249k05O794K861o535n279
1576g338L770M224o00j089K268P10q51K260L249l948n286L342O826j037o663j759
1592a922L079Q11j363Q08j591n267k442N067L752k165k073L041M68m484j092N288
1608h5K479l022j655J598L79m58M225M199l593o955P35N750J762k064R9o49m432
1625a687j655M900K653n819n885J523K943J221K043L459k892o741Q89P588K307
1640D847n472m465R92J100K060N845L157m312n735K034N271r92k119O22o2n582
$$ y = [1455, 710, 5768, 9654, 3005, -8178, -10164, -4233, -382, -1266, -1355, -1453, -4541, -4520, 1862, 5521, 27, -3981, -1059, 2015, -768, -2456, 1786, 3940, 1181, 99, 2119, 2104, 521, 3160, 7658, 4322, -1598, -703, 4712, 3056, -4333, -5977, -3739, -3303, -2850, -109, -725, -4974, -5179, 1615, 4476, -2059, -7338, -3568, 656, 56, -1033, 1235, 1945, 1094, 3354, 6603, 2655, -2631, 711, 7537, 6500, -163, -1922, 1157, 1968, 605, 1413, -178, -5445, -7887, -2820, 932, -1233, -3306, -265, 203, -4281, -5373, -85, 2394, -628, -2283, -685, -306, -764, 3461, 7660, 4067, -2888, -2153, 3597, 5359, 3295, 3394, 2745, -1687, -3342, 1558, 4211, -1608, -7493, -5970, -3027, -1806, 237, 3696, 804, -5937, -5048, 2540, 4847, -625, -5090, -4098, -2998, -938, 4907, 8064, 3752, -1983, 51, 5322, 4330, 2211, 2833, 2771, -2811]
1656b811l561M527M720j961l777n68j638n06N719P276k360j0005l210N870M617
1671B332j387k566j499j543J926Q444N114m691o186J838M322k198l912m31n2l419
1687c908p20M215K388k313o25J806j588m081J958N764k87p221k701L441K015J064
1703g93K391M75m186j360O803O551k139n628n51P72k598j250K213N58m055n86
1719c383M735K067k692K17K259j670n563p68K879r02l231J633M031q89j801K694
1735c84M250q44k431K072J131l364j406L654J022m907k727L802K156k213j59L000
1751B652O3k769P55K108k430m920L54K649j764k822L774N482m66k967P51K337
1767B787n10p5J561k199o507n93P512M076m184m802N35K242N70K427J201m136
$$ y = [-2811, -6372, -1845, 2875, 914, -2863, -3431, -5069, -5575, 144, 7420, 5060, -4945, -8155, -2285, 2332, 945, -1621, -3120, -4663, -2737, 5707, 10821, 6130, -56, 1782, 6104, 3906, -6, -437, -489, -3908, -4628, -413, 1975, -338, -963, 843, -745, -4826, -2868, 2896, 2609, -4612, -7313, -3872, -1857, -793, 1598, 2073, -2113, -3473, 3330, 9881, 7742, 2114, 1563, 2335, -263, -1513, 700, 1258, -2797, -3383, 1352, 3419, 727, 944, 3203, 1533, -4030, -4798, -1919, -2821, -6052, -4419, -388, -1277, -3078, -384, 3866, 3022, 591, 2663, 3794, 430, -976, 2678, 3700, -1207, -3934, -132, 2024, -189, -348, 2652, 2715, -54, 701, 2809, 379, -4541, -4187, -1538, -3302, -6124, -2350, 3132, 2666, -301, 450, 2787, 2277, 2202, 3763, 1564, -4943, -5536, 1976, 6052, 1868, -2934, -2399, -157, 413, 2840, 4041, -95]
1783i5n472J781N452n84m048l80J986k034j631M435N126j010k482N4J042j755
1799C85J254L843j615p184k267N641N519j225k507j436k603j382L622M110l747
1814D08p057l08M918J820r79Q25k19m036j407N347M921k171k603R74J386r21J314
1831B212M343j215o311k203M765K472j551j63M92l222l794K464M525j669m924
1846c779r21J282r13N71M460R14n456l894M114N188J36j085J086m19j776K746
1862B254M728j390n871j532L457J337k029M60K476j435k795J241J427k592l211
$$ y = [-95, -5567, -3786, 1666, 1082, -2966, -3346, -1360, -3394, -5025, -590, 4536, 3526, 1044, 1098, 2140, 385, 1639, 5482, 3867, -3317, -5584, 57, 5576, 4351, 1844, 408, -2195, -3577, 45, 4155, 408, -6649, -6957, -2039, -219, -1198, -373, -592, -4628, -6035, -688, 4233, 2062, -541, 433, 1819, 898, 2212, 6555, 5340, -971, -3174, 1591, 4063, 2512, 2349, 2841, -381, -4175, -1711, 2814, 1145, -3779, -4700, -3418, -4331, -3760, 700, 1614, -3842, -7736, -3622, 1566, 1702, 617, 1703, 1284, -492, 2254, 6982, 5592, -279, -1811, 1646, 2983, 954, 1414, 3890, 2455, -340, 901, 2328, -264, -3475]
$$ [...]
8191E5
##END NTUPLES=NMR FID
##END=
