##TITLE=1H_EC-3133(II-3)
 CDCl3, 8 sc, 
 11.2.2019
##JCAMPDX= 6.0         $$ Bruker NMR JCAMP-DX V2.0
##DATA TYPE= NMR FID
##DATA CLASS= NTUPLES
##ORIGIN= UXNMR, Bruker Analytische Messtechnik GmbH
##OWNER= root
$$ XWIN-NMR		Version 3.5
$$ Mon Feb 11 14:13:13 2019 Russian Standard Time (UT+4h)  she@DPX200
##.OBSERVE FREQUENCY= 200.1313
##.OBSERVE NUCLEUS= ^1H
##.DELAY= (6, 6)
##.ACQUISITION MODE= SIMULTANEOUS
##.ACQUISITION SCHEME= undefined
##.AVERAGES= 8
##.DIGITISER RES= 18
##SPECTROMETER/DATA SYSTEM= spect
##.PULSE SEQUENCE= zg30
##.SOLVENT NAME= CDCl3
##.SHIFT REFERENCE= (INTERNAL, CDCl3, 0, 15.7039)
##AUDIT TRAIL= $$ (NUMBER, WHEN, WHO, WHERE, WHAT)
$$ ##TITLE= Audit trail, XWIN-NMR		Version 3.5
$$ ##JCAMPDX= 5.01
$$ ##ORIGIN= Bruker BioSpin GmbH
$$ ##OWNER= she
$$ F:/spectra/data/she/nmr/H-F/1/audita.txt
$$ ##AUDIT TRAIL=  $$ (NUMBER, WHEN, WHO, WHERE, WHAT)
(   1,<2019-02-11 14:10:48.57 +0400>,<she>,<DPX200>,
      <created by zg, POWCHK disabled, PULCHK disabled
       configuration hash MD5:
       00 E9 B6 7A A2 85 ED C7 34 08 36 98 17 FE 4E 26
       data hash MD5: 16K
       34 B0 CA 4A 01 B9 B7 20 E3 CD 69 C0 4A 8C 6C 2C>)
$$ ##END=
$$ 
$$ hash MD5
$$ CE E5 0D C2 C7 63 97 2F 88 BB 27 B4 4C 40 79 CA
##$RELAX= 
##$RELAX= 
##$RELAX= 
##$RELAX= 
##$RELAX= 
##$RELAX= 
$$ Bruker specific parameters
$$ --------------------------
##$DU= <F:/spectra>
##$EXPNO= 1
##$NAME= <H-F>
##$PROCNO= 1
##$TYPE= <nmr>
##$USER= <she>
##$AMP= (0..31)
100 100 100 100 100 100 100 100 100 100 100 100 100 100 100 100 100 100 
100 100 100 100 100 100 100 100 100 100 100 100 100 100 
##$AQSEQ= 0
##$AQ_mod= 1
##$AUNM= <au_zg>
##$AUTOPOS= <>
##$BF1= 200.13
##$BF2= 200.13
##$BF3= 200.13
##$BF4= 200.13
##$BF5= 200.13
##$BF6= 200.13
##$BF7= 200.13
##$BF8= 200.13
##$BYTORDA= 1
##$CFDGTYP= 0
##$CFRGTYP= 5
##$CHEMSTR= <none>
##$CNST= (0..31)
1 1 145 1 1 1 1 1 1 1 1 1 1 1 1 1 1 1 1 1 1 1 1 1 1 1 1 1 1 1 1 1 
##$CPDPRG= <>
##$CPDPRG1= <>
##$CPDPRG2= <>
##$CPDPRG3= <>
##$CPDPRG4= <mlev>
##$CPDPRG5= <mlev>
##$CPDPRG6= <mlev>
##$CPDPRG7= <mlev>
##$CPDPRG8= <mlev>
##$CPDPRGB= <>
##$CPDPRGT= <>
##$D= (0..31)
0 1.2 0 0 0 0 0 0 0 0 0 0.03 0 0 0 0 0 0 0 0 0 0 0 0 0 0 0 0 0 0 0 0 
##$DATE= 1549879848
##$DBL= (0..7)
120 120 120 120 120 120 120 120 
##$DBP= (0..7)
150 150 150 150 150 150 150 150 
##$DBP07= 0
##$DBPNAM0= <>
##$DBPNAM1= <>
##$DBPNAM2= <>
##$DBPNAM3= <>
##$DBPNAM4= <>
##$DBPNAM5= <>
##$DBPNAM6= <>
##$DBPNAM7= <>
##$DBPOAL= (0..7)
0.5 0.5 0.5 0.5 0.5 0.5 0.5 0.5 
##$DBPOFFS= (0..7)
0 0 0 0 0 0 0 0 
##$DE= 6
##$DECBNUC= <off>
##$DECIM= 32
##$DECNUC= <off>
##$DECSTAT= 4
##$DIGMOD= 1
##$DIGTYP= 9
##$DL= (0..7)
0 120 120 120 120 120 120 120 
##$DP= (0..7)
150 150 150 150 150 150 150 150 
##$DP07= 0
##$DPNAME0= <>
##$DPNAME1= <>
##$DPNAME2= <>
##$DPNAME3= <>
##$DPNAME4= <>
##$DPNAME5= <>
##$DPNAME6= <>
##$DPNAME7= <>
##$DPOAL= (0..7)
0.5 0.5 0.5 0.5 0.5 0.5 0.5 0.5 
##$DPOFFS= (0..7)
0 0 0 0 0 0 0 0 
##$DQDMODE= 0
##$DR= 18
##$DS= 0
##$DSLIST= <SSSSSSSSSSSSSSS>
##$DSPFIRM= 0
$$ [...]
##$SUBNAM2= <"">
##$SUBNAM3= <"">
##$SUBNAM4= <"">
##$SUBNAM5= <"">
##$SUBNAM6= <"">
##$SUBNAM7= <"">
##$SUBNAM8= <"">
##$SUBNAM9= <"">
##$SW= 20.0189088683792
##$SWIBOX= (0..15)
0 0 2 0 0 0 0 0 0 0 0 0 0 0 0 0 
##$SW_h= 4006.41025641026
##$TD= 16384
##$TD0= 1
##$TE= 0
##$TE2= 300
##$TE3= 300
##$TEG= 300
##$TL= (0..7)
0 120 120 120 120 120 120 120 
##$TP= (0..7)
150 150 150 150 150 150 150 150 
##$TP07= 0
##$TPNAME0= <>
##$TPNAME1= <>
##$TPNAME2= <>
##$TPNAME3= <>
##$TPNAME4= <>
##$TPNAME5= <>
##$TPNAME6= <>
##$TPNAME7= <>
##$TPOAL= (0..7)
0.5 0.5 0.5 0.5 0.5 0.5 0.5 0.5 
##$TPOFFS= (0..7)
0 0 0 0 0 0 0 0 
##$TUNHIN= 0
##$TUNHOUT= 0
##$TUNXOUT= 0
##$USERA1= <user>
##$USERA2= <user>
##$USERA3= <user>
##$USERA4= <user>
##$USERA5= <user>
##$V9= 5
##$VALIST= <valist>
##$VCLIST= <CCCCCCCCCCCCCCC>
##$VD= 0
##$VDLIST= <DDDDDDDDDDDDDDD>
##$VPLIST= <PPPPPPPPPPPPPPP>
##$VTLIST= <TTTTTTTTTTTTTTT>
##$WBST= 1024
##$WBSW= 4
##$XGAIN= (0..3)
0 0 0 0 
##$XL= 0
##$YL= 0
##$YMAX_a= 229298
##$YMIN_a= -315182
##$ZGOPTNS= <>
##$ZL1= 120
##$ZL2= 120
##$ZL3= 120
##$ZL4= 120
##$ABSF1= 10
##$ABSF2= 0
##$ABSG= 5
##$ABSL= 3
##$ALPHA= 0
##$AQORDER= 0
##$ASSFAC= 0
##$ASSFACI= 0
##$ASSFACX= 0
##$ASSWID= 0
##$AUNMP= <proc_1d>
##$AZFE= 0.1
##$AZFW= 0.1
##$BCFW= 1
##$BC_mod= 2
##$BYTORDP= 1
##$COROFFS= 0
##$CY= 11.3945322036743
##$DATMOD= 1
##$DC= 2
##$DFILT= <>
##$DTYPP= 0
##$F1P= 18.9103706918063
##$F2P= -1.10871071338519
##$FCOR= 0.5
##$FTSIZE= 0
##$FT_mod= 4
##$GAMMA= 1
##$GB= 0.15
##$INTBC= 1
##$INTSCL= 1
##$ISEN= 128
##$LB= 0.24
##$LEV0= 0
##$LPBIN= 0
##$MAXI= 10000
##$MC2= 0
##$MEAN= 0
##$ME_mod= 0
##$MI= 1.114404
##$NCOEF= 0
##$NC_proc= 0
##$NLEV= 6
##$NOISF1= 3.799351
##$NOISF2= 2.8
##$NSP= 1
##$NTH_PI= 0
##$NZP= 0
##$OFFSET= 15.70392
##$PC= 1
##$PHC0= -8676.429
##$PHC1= 9.800179
##$PH_mod= 1
##$PKNL= yes
##$PPARMOD= 0
##$PSCAL= 0
##$PSIGN= 0
##$REVERSE= no
##$SF= 200.130013532006
##$SI= 16384
##$SIGF1= 3
##$SIGF2= 2
##$SINO= 400
##$SIOLD= 16384
##$SREGLST= <1H.CDCl3>
##$SSB= 0
##$STSI= 0
##$STSR= 0
##$SW_p= 3612.71676300578
##$SYMM= 0
##$S_DEV= 0
##$TDeff= 0
##$TDoff= 0
##$TI= <>
##$TILT= no
##$TM1= 0
##$TM2= 0
##$TOPLEV= 0
##$USERP1= <user>
##$USERP2= <user>
##$USERP3= <user>
##$USERP4= <user>
##$USERP5= <user>
##$WDW= 1
##$XDIM= 8192
##$YMAX_p= 0
##$YMIN_p= 0
$$ End of Bruker specific parameters
$$ ---------------------------------
##NTUPLES= NMR FID
##VAR_NAME=  TIME,          FID/REAL,        FID/IMAG
##SYMBOL=    X,             R,               I
##VAR_TYPE=  INDEPENDENT,   DEPENDENT,       DEPENDENT
##VAR_FORM=  AFFN,          ASDF,            ASDF
##VAR_DIM=   8192,          8192,            8192
##UNITS=     SECONDS,       ARBITRARY UNITS, ARBITRARY UNITS
##FACTOR=    0.0002496,     1,               1
##FIRST=     0,             0,               0
##LAST=      2.0444736,     0,               0
##MIN=       0,             -315182,         0
##MAX=       2.0444736,     229298,          0
$$ Real data points
##PAGE= N=1
##DATA TABLE= (X++(R..R)), XYDATA
0 0 0 0 0 0 0 0 0 0 0 0 -1 1 -8 8 -8 9 -16 16 -24 25 -32 40 -48 56 -64 73 -88 99 -114 133 -152 173 -196 222
34 222 -250 283 -317 355 -398 443 -493 548 -608 672 -744 822 -908 1000 -1103 1214 -1339
51 -1339 1475 -1626 1794 -1982 2194 -2437 2713 -3033 3414 -3872 4428 -5132 6051 -7301 9125
66 9125 -12033 17430 -30890 142077 136851 -133349 -70076 91847 229298 131968 -62820 -152805
78 -152805 -32283 76227 72185 -36515 -113857 -77306 34672 45983 -31887 -97380 -87167
89 -87167 -12447 81436 75030 -14171 -78206 -74649 -25228 46924 49948 -29125 -97786 -101865 -51757
102 -51757 37480 75648 18188 -43613 -40766 3218 68292 90434 29642 -19399 16149 71097
114 71097 84389 38575 -47395 -65784 32176 108243 56378 -66155 -142520 -82032 74633 135650
126 135650 21952 -119312 -143936 -38338 90101 83774 -45789 -109499 -40006 53194 77615
137 77615 16912 -58679 -32794 62242 78718 4200 -61894 -58712 21167 95983 63945 -24022
149 -24022 -56475 -34472 6746 39811 17643 -33001 -43206 -33945 -28035 3421 34866 30798 13879
162 13879 -11773 -36692 -18232 14687 7020 -14798 -22165 -20914 3462 21399 -5598 -19537 19388
175 19388 54414 50207 9970 -47028 -43244 43328 100459 62986 -13084 -60258 -33305 46779
187 46779 64489 -10625 -71959 -66761 -26251 6976 -12556 -56424 -33361 32434 43492 183
199 183 -41500 -39426 24713 81153 44547 -29598 -47904 -16151 28239 43916 3957 -31563 -14522
212 -14522 173 -14259 -20784 -13997 9725 43690 31245 -20083 -26686 13076 45439 53523 24401
225 24401 -20688 -18712 13011 13153 -1798 -7756 -12939 -6764 -8682 -43813 -57973 -18166 17997
238 17997 19617 -4826 -42011 -39196 18786 51445 28596 -138 -12707 -2026 26236 23287 -5500
251 -5500 4816 38138 37561 5331 -38508 -54848 -5505 45997 19610 -42695 -66581 -39882 21550
264 21550 54735 14979 -27171 -10589 19436 24311 4877 -23696 -14497 35938 46578 624
276 624 -32273 -26679 7958 43080 21627 -40072 -58639 -31746 -6702 8424 5646 -8890 2030
289 2030 18311 5125 -2798 14346 25653 25991 11585 -21416 -25335 12882 32358 19129 2427
302 2427 -12952 -11240 5049 -9406 -38891 -27020 6473 18571 5297 -32137 -49479 1691
314 1691 62119 54561 218 -45318 -43467 16419 61228 28194 -24707 -32299 -4925 28072 27276
327 27276 -19849 -42787 -6565 24245 12142 -19690 -44998 -24352 34368 50729 9421 -25334
339 -25334 -28686 -4253 33616 36973 4933 -8259 -4014 -7684 -2248 6924 3746 3486 -4110 -29667
353 -29667 -30091 416 14976 9485 -1392 -14965 -5075 19509 7457 -22994 -19958 7484 32580
366 32580 33826 -8133 -43380 -10084 47229 58527 19140 -41355 -63621 -9580 49858 38660
378 38660 -10988 -41834 -29745 18472 40561 -2278 -43750 -32018 -370 17205 2297 -36733
390 -36733 -36735 17210 52715 36327 -844 -30592 -22049 19634 33274 7779 -10964 -16451 -14097
403 -14097 4840 15768 9156 10737 5675 -18446 -22940 -3922 8531 14435 7698 -10216 -1614
416 -1614 27892 27010 2775 -11432 -10332 11285 25893 -7959 -50850 -40023 4523 35243 25772
429 25772 -27956 -65652 -29762 27263 36740 5050 -34490 -40500 6257 44194 25324 -6638
441 -6638 -10794 6698 31995 28483 -11901 -29286 554 27262 27088 3790 -30871 -33021 3144
454 3144 20210 6102 -9236 -19708 -17534 2650 9052 2803 9969 12490 -1211 -6059 -2874 2298
468 2298 18930 19609 -6714 -16160 197 8654 6782 -5340 -22990 -14453 10110 2861 -22122 -26476
482 -26476 -8874 22923 39300 6689 -33115 -23820 11431 31167 23776 -13031 -37081 -11124
494 -11124 20394 15644 -2988 -14319 -11475 9714 12742 -15121 -26779 -5233 17151 25960 13162
507 13162 -12097 -8386 23208 32498 17249 1627 -10587 -5819 10882 4021 -12473 -4875 6673
520 6673 3990 -3876 -18757 -22716 823 15557 -2528 -21151 -24814 -14547 11293 19379 -3410
533 -3410 -13954 -1497 3719 1813 -4885 -16489 -7031 15300 10181 -10075 -13659 -3343 16577
546 16577 31242 14265 -7766 59 14915 16621 15127 6025 763 15213 15530 -8556 -17507 -5275
560 -5275 5264 7534 -10799 -38834 -32142 1112 11391 -1839 -19225 -26081 -4478 22692 12889
573 12889 -10646 -8828 8106 24061 23960 -5349 -26316 -3945 23754 21032 -1553 -28027 -31428
586 -31428 2091 26176 11572 -8992 -14519 -5379 16395 22496 1734 -5461 8687 13668 12133
599 12133 7424 -4760 -4116 8941 1800 -13136 -14697 -16358 -17733 -13210 -14779 -12680 2834 3536
613 3536 -11745 -11332 3233 18943 30026 13669 -15750 -10082 22809 39005 29552 1912 -20854
626 -20854 -4543 24650 16145 -16613 -36340 -31770 -3644 14803 -10902 -40597 -29206 4107
638 4107 26504 22556 -10658 -30153 -2189 30777 32049 14254 -7563 -12116 11724 27205 10757
651 10757 -7464 -14385 -15688 -6125 -1253 -12291 -14022 -4288 -3773 453 11171 9683 6946 10285
665 10285 6101 8771 23331 19256 -2023 -12051 -9440 4562 19036 817 -36674 -43505 -20100
678 -20100 3820 11026 -13439 -42840 -27108 15550 31066 15607 -8519 -16275 14758 48621
690 48621 35775 449 -13341 -60 28088 37103 2214 -33998 -27330 -970 14012 8121 -20642
703 -20642 -38034 -15913 9497 11010 1823 -10700 -16113 380 14399 8808 5304 5216 -785 2948
717 2948 10582 4559 -1142 -5719 -16348 -13192 4078 5351 -7057 -15065 -16267 1654 28175 23363
731 23363 -5816 -17039 -4241 20263 37190 17299 -18330 -18220 9789 27181 20188 -11500 -38072
744 -38072 -20713 11923 10633 -13887 -33454 -30898 1313 27138 9073 -20506 -20165 633 23638
757 23638 28452 1154 -19714 -4961 15795 20581 14038 -3780 -12650 1299 9920 1149 -3493
770 -3493 -5139 -8390 -1665 2594 -2882 -485 3830 -3589 -2864 6130 6524 3878 -67 -10888 -7563
785 -7563 10037 9944 -5093 -14731 -17125 -4229 15353 8312 -15778 -18629 -4510 11256 19824 4179
799 4179 -16511 -5999 17213 20786 10371 -4709 -11264 7268 23066 6903 -15038 -18300 -9420
812 -9420 6802 10556 -11425 -24151 -8197 7627 10582 5189 -8088 -7408 12174 16185 1880
825 1880 -5009 -3638 2706 11782 3347 -14806 -12513 -447 812 -1879 -8664 -15083 -4231 10050
839 10050 5141 -142 4457 6889 11957 14887 4646 528 8977 6927 -1493 -3794 -7738 -8436 -1667
854 -1667 -5872 -15123 -8837 -2028 -4816 -4422 -6319 -6176 8034 14500 1266 -5000 856 8988 19034
869 19034 15169 -6659 -11478 5869 14235 9246 -4722 -20834 -13563 10903 12242 -7637 -19616
882 -19616 -17142 930 19386 7239 -19189 -18728 1387 17047 19780 850 -18000 -4105 20561
895 20561 22406 9839 -5825 -14330 -538 13623 2591 -13027 -16284 -14428 -4398 4499 -4300
908 -4300 -11837 -5450 -920 3712 13025 10716 2626 4445 6299 9460 19536 15104 -4314 -11479 -6789
923 -6789 352 6348 -4267 -28017 -27959 -6184 7064 7027 -6455 -21666 -8308 21641 26715 9346
937 9346 -6952 -10516 8637 30998 18987 -11101 -19911 -7418 11181 19489 -2028 -28857 -21613
950 -21613 1992 13279 9529 -9461 -22913 -6138 15898 13206 964 -8618 -10999 3096 15589
963 15589 6320 -4101 -3275 -2449 4182 12975 6756 -994 -677 -2664 -846 9799 6521 -7698 -12851
978 -12851 -12201 -5708 7334 3085 -16830 -19886 -5711 8168 17088 7014 -12654 -8472 13673
991 13673 22324 14832 -1479 -15530 -4432 17536 13867 -6672 -18260 -17991 -1656 14836 3755
1004 3755 -17540 -16610 -2534 11022 17488 4611 -10025 -744 13955 14234 9572 216 -8248 -1245
1018 -1245 6015 -708 -4410 -3899 -7636 -5496 -16 -3125 -2976 151 -7202 -9774 -224 3179 968
1033 968 -773 -8790 -6788 10425 15777 3353 -4179 -5625 2019 18161 16090 -4148 -9574 126
1047 126 8599 13317 3096 -15988 -14752 794 3694 -2505 -10798 -18204 -7887 9898 8803 -834
1061 -834 -1953 -707 7257 17430 10395 -1750 -500 2284 2185 5037 -584 -9198 -6267 -5108 -10166
1076 -10166 -6464 -2739 -6702 -4630 -1712 -3528 4195 12497 5818 -192 3414 6114 11118 11301 -3367
1091 -3367 -10479 1169 8230 5078 -2169 -13999 -14128 3360 8798 -3281 -10291 -9504 -1497 12328
1105 12328 10908 -4483 -6123 3092 6449 7745 1701 -9103 -4857 6472 4329 -896 -2396 -5664
1119 -5664 -2036 5016 -1065 -7056 -3249 -2487 -2346 3066 647 -1013 5879 5397 -1121 534 2868 1527
1135 1527 5174 2130 -6178 -1306 6039 3260 1025 -2385 -7738 -2458 4748 -3750 -10126 -5877 -2414
1150 -2414 3159 6392 -2233 -6467 3295 6570 2563 506 -4837 -4908 5302 5198 -3470 -1037 3344
1165 3344 2500 3728 -16 -6252 1418 8931 2310 -2621 -1396 484 8539 11019 -2678 -9095 -1785
1180 -1785 1276 441 -3305 -13652 -13123 1669 5218 -2953 -7615 -9805 -3936 10270 9169 -3773
1194 -3773 -5205 1146 7744 15793 11101 -3056 -2730 5800 6451 5028 -553 -10713 -7148 3016 1275
1209 1275 -2473 -2691 -6811 -4913 3451 1837 -2002 491 -2420 -3094 5630 8487 3924 1163 -5906
1224 -5906 -8930 1940 6818 -4536 -12717 -14170 -7985 7151 11098 -5254 -12793 -2330 10116
1237 10116 17944 11715 -6016 -6136 13961 23661 17754 3988 -9738 -4914 12656 11406 -7487
1250 -7487 -19836 -21890 -12016 3275 124 -16233 -18642 -9502 181 9127 4643 -8379 -6707 5983
1264 5983 11540 13957 10134 -974 -163 9742 9418 5247 102 -10694 -11455 359 4002 600 -1963
1279 -1963 -8589 -7720 7359 13839 5937 -1962 -6906 -2596 14517 18732 2746 -8346 -6569 1886
1293 1886 13188 7707 -16232 -24560 -11083 1166 3647 -6676 -23348 -18562 5084 13854 5675
1306 5675 -5186 -11129 -136 20422 20819 5657 -452 2047 9786 19156 11641 -5667 -9172 -4737
1320 -4737 -3302 -476 -4906 -15397 -13482 -4943 -3068 252 1256 -6219 -5711 3698 7834 9764 10238
1335 10238 1651 -964 8791 13114 8713 2614 -9026 -12099 358 5764 -3277 -10707 -13725 -8227
1349 -8227 7666 10573 -3242 -10171 -4275 4770 13821 9163 -7609 -8969 5039 11738 8807 -1358
1363 -1358 -14841 -11709 2597 2951 -6599 -11533 -12214 -4420 7472 4891 -3659 -700 3608 5128 8804
1378 8804 6104 926 6017 9864 5587 6040 7624 3120 2684 1589 -4790 -3605 753 -5153 -9473
1393 -9473 -6346 -5169 -1081 2819 -4957 -11157 -4178 478 738 104 -6553 -8399 2720 7816 1994
1408 1994 -1560 -3528 -2880 5261 5258 -5401 -6691 625 4651 8152 6251 -2177 370 9635 8009 2880
1424 2880 644 -2582 1210 7760 2146 -4722 -766 1898 972 -529 -7945 -11383 -1493 2446 -3749
1439 -3749 -6517 -5235 -1367 8030 7188 -4308 -5644 1270 3125 3066 -923 -7791 -2998 6816 4561
1454 4561 -1684 -3241 -4372 -243 5041 -655 -6170 -928 2460 3126 5738 3698 1134 5505 4531
1469 4531 -2037 -1361 512 -1157 120 -2008 -6853 -1968 3692 -614 -4984 -5774 -6390 -349 5325 -1758
1485 -1758 -5919 748 6671 11420 10414 -1196 -6114 4335 10407 5234 -2746 -11564 -9661 5143
1499 5143 9002 -3315 -11136 -10779 -4506 4948 3011 -10026 -10320 640 7294 9295 5587 -2428 1036
1514 1036 9897 7684 1857 -298 -3751 -2760 2081 272 -2120 479 -2603 -7381 -3315 -68 -98 848
1530 848 -3850 -7792 1717 11096 8462 2881 -2379 -3930 6687 12178 459 -9695 -8257 -1648
1544 -1648 7784 7949 -7056 -15953 -5862 5235 7303 601 -13798 -15030 2827 13789 9251 -372
1558 -372 -8043 -3560 12244 15085 1286 -7493 -6068 691 9844 7297 -6251 -8777 -1003 2601
1572 2601 2743 -1824 -9924 -8900 -407 894 1175 3395 -474 -2557 2316 4630 5720 7147 -1161
1587 -1161 -8678 -2110 6815 7897 3943 -6199 -11039 828 10345 2854 -8853 -14167 -8996 6643
1601 6643 12090 -2069 -11888 -5469 6179 15228 10537 -7718 -13823 -397 11421 10953 2076 -9837
1615 -9837 -8839 7000 12372 3177 -6382 -11551 -6745 4941 5254 -6375 -9157 -3393 2022 6925 3738
1630 3738 -5723 -5011 2092 3176 2881 2871 -1290 -93 4172 2930 3355 6554 927 -5836 -4806 -1928
1646 -1928 1607 4431 -3065 -10490 -3384 5565 6386 1644 -7354 -9885 2829 11269 3362 -5931 -6440
1661 -6440 297 12012 12358 -3116 -11311 -4404 3575 6527 680 -11318 -11523 1766 6741 1917
1675 1917 -2558 -6046 -2614 6266 4914 -2482 -1970 2224 5659 8937 4989 -1692 1362 5862 1856
1690 1856 -1367 -3982 -7281 -3568 -798 -6071 -7545 -2681 -1872 -1827 -3348 -7510 -3929 5737 5835 -28
1706 -28 130 2527 8364 13869 7530 -2307 -64 5280 5039 1488 -4629 -7708 1295 6644 -849 -6381
1722 -6381 -5321 -2056 3679 2722 -6581 -7711 663 4020 2335 -126 -3449 -647 5022 -248 -8410
1737 -8410 -6693 -2114 799 1244 -5144 -8920 137 7790 4879 -522 -4307 -3255 6304 9778 1617
1752 1617 -2112 2141 6910 11580 8683 -2737 -4453 4205 6912 2845 -3299 -9563 -5743 4535
1766 4535 4100 -4468 -8034 -7848 -4180 1003 -3007 -9471 -4850 1707 1854 1793 280 -474 5347 7115
1782 7115 24 -2743 707 1994 2450 434 -3899 -185 7165 2994 -4955 -5168 -1530 4584 7388
1797 7388 -2447 -9603 -1903 8056 9235 3624 -6553 -9422 1025 6928 -729 -7479 -8269 -3226 6993
1812 6993 8263 -1573 -5072 1381 7378 9375 4674 -4559 -4580 4685 7182 3631 -835 -6000 -5379 987
1828 987 -926 -6548 -6161 -5106 -4105 -1056 -1484 -2571 2816 4896 34 -1281 550 865 3086 685
1844 685 -6334 -3497 4848 4617 -729 -5291 -5918 3110 10955 3430 -7194 -4950 3948 13495 14629
1859 14629 2353 -6546 1607 10771 9844 1832 -8018 -8997 1379 5819 -2613 -9553 -9470 -5929 608
1874 608 -1000 -10777 -12876 -6540 -2333 503 540 -3587 -2214 4404 5310 4536 6527 4727 3580 5748
1890 5748 4104 3294 7660 6870 183 -1712 -1880 -1423 1832 -1296 -9804 -8588 -794 3033 3160 -1730
1906 -1730 -6744 664 12225 10013 -381 -6446 -5359 5039 11885 1283 -11903 -11683 -3709 2929
1920 2929 1452 -10556 -16922 -6699 3583 3220 -580 -3472 -102 10964 14187 6563 2288 3921
1934 3921 5799 8411 6375 -1005 -2522 863 -1325 -3257 -2665 -5161 -6015 -4832 -8552 -7681 -602 1670
1950 1670 -713 -1667 -2438 1123 8996 7843 -807 -2781 828 4670 7789 2197 -6558 -3962 5088
1965 5088 6147 1156 -6619 -11645 -3040 7394 3637 -4988 -7784 -3686 6165 11579 2816 -5926 -2313
1980 -2313 4269 6532 4404 -3375 -5545 2444 5716 -198 -4773 -5952 -4486 518 -1108 -7999 -6708
1995 -6708 -1434 467 1238 1331 218 4295 7696 2484 -485 3249 5931 6296 3964 -3017 -3937 3606
2011 3606 5405 -580 -4778 -7402 -4556 2329 986 -6545 -6026 -753 3033 5130 126 -6355 -2178
2026 -2178 5155 4493 192 -3961 -5927 508 6760 2033 -3528 -2937 -895 1985 2982 -2469 -4500 2095
2042 2095 5158 2254 236 -1196 1007 7157 4771 -4022 -4812 -624 2184 3062 -1368 -6708 -2046
2057 -2046 4599 2167 -3295 -5259 -4172 2598 5811 -2370 -7304 -2166 3450 5820 3725 -4175 -6049
2072 -6049 1708 4674 725 -1799 -3462 -1071 4869 4213 -1822 -1108 2392 2353 3190 377 -3452 191
2088 191 4461 1332 -404 293 -413 1024 499 -4994 -5559 36 648 -2365 -4531 -6036 -1600 6268
2104 6268 4343 -3680 -4821 -1046 4404 8437 2387 -5463 -1647 6489 7719 3550 -3453 -7199 539
2119 539 7473 1553 -6544 -8032 -3843 4535 7108 -2073 -7808 -2716 2742 4862 2939 -3421 -4340
2134 -4340 2494 5258 1198 362 -683 -641 2162 475 -3942 -2405 -553 -2255 -1773 -1060 -1625 1469
2150 1469 2271 -2681 -1888 3118 4232 2974 177 -3683 -13 8216 7354 -161 -4388 -4530 627 6271
2166 6271 827 -9020 -8386 -2574 2470 3481 -3428 -9473 -2872 6216 5688 717 -4305 -4251 5178 11131
2182 11131 4682 -2356 -2468 943 5630 6170 -2493 -6403 -2034 355 -232 -1067 -3395 -3371 1556 620
2198 620 -2641 -802 828 420 992 -153 -1580 2756 4305 -769 -2287 -229 1121 3039 638 -6498
2214 -6498 -5532 2064 3771 1360 -3144 -6969 -2371 6365 5378 -2037 -4751 -3193 2879 8037 3515
2229 3515 -4233 -2290 3591 6229 5076 -1436 -6412 -391 5837 2810 -2149 -4779 -4823 757 3913
2244 3913 -1777 -5345 -2893 -1450 88 1075 -1959 -1506 3385 2332 -574 449 1945 2449 3268 -485
2260 -485 -3808 430 3666 462 -2069 -3753 -3071 2643 3410 -4054 -6677 -2044 2110 4869 1857 -5113
2276 -5113 -4032 4580 7071 3880 -1057 -4634 -475 7069 4881 -2274 -3465 -1686 2069 4608 -799
2291 -799 -6967 -3592 1060 965 -479 -3627 -5431 668 4346 749 -947 106 652 3239 3309 -854
2307 -854 -591 3546 2435 -446 -1144 -2041 205 2980 -1745 -6550 -4032 -395 511 511 -3452 -4863 1734
2324 1734 5872 2150 -656 -947 1398 6604 6397 -1186 -2896 1476 3770 4257 539 -6216 -4979 1558
2340 1558 1304 -2560 -4164 -5202 -1625 3322 16 -4119 -1057 2073 2940 2974 -530 -2458 2997 5370
2356 5370 1617 -921 -1625 -871 2767 2141 -3974 -4489 24 678 472 -1655 -5093 -1301 5417 3363
2372 3363 -1073 -2064 -663 3570 6884 2339 -3109 -872 2569 2834 1724 -2845 -5064 -311 2001
2387 2001 -2200 -4079 -3499 -2564 1343 1544 -3124 -2623 1256 1739 1573 1550 -652 1298 4458 1356 -1593
2404 -1593 755 2036 2468 1840 -2975 -4361 1413 3812 400 -2513 -4322 -2137 4313 4350 -2897 -4945
2420 -4945 -1216 2300 4724 602 -6317 -4246 3251 4702 1108 -3222 -6315 -1055 6042 3230 -2803
2435 -2803 -3794 -1843 2422 6066 1207 -3559 -982 2399 2468 2321 -908 -2802 1103 2648 -550 -934
2451 -934 -270 -1463 282 586 -2115 -543 1726 -1320 -2390 -467 422 1854 2191 -3159 -4721 933
2467 933 3785 1945 -1106 -5242 -3926 3765 4782 -1005 -4318 -3237 1045 6860 4648 -3620 -3700 2632
2483 2632 6134 6042 641 -5777 -2347 5067 4818 -510 -4507 -6700 -1589 3421 -469 -5638 -5096 -3046
2499 -3046 -122 2080 -931 -3489 264 2715 1986 2571 1889 847 2773 2837 346 1399 2689 -187
2515 -187 -1019 -1147 -1614 289 1366 -3312 -5299 -1819 1115 2575 1928 -3416 -3832 3340 5907 3043
2531 3043 -213 -3640 -1354 4974 4551 -2474 -5126 -3174 138 2969 -608 -7257 -5929 426 2636
2546 2636 1795 -1319 -4268 492 6362 5022 1609 1072 861 3793 5911 1522 -1597 533 1099 -499
2562 -499 -1111 -3585 -4259 -1143 -1824 -4762 -3656 -1756 -1398 316 -677 -2084 1611 4771 2402 302
2578 302 532 1275 4453 5499 -113 -3413 -457 1959 2466 523 -4764 -5363 389 2202 -754 -2417
2594 -2417 -3445 -1035 4060 3654 -1698 -1574 1447 2734 3834 1138 -3389 -1001 2922 1410 -1252
2609 -1252 -2345 -3945 -1428 569 -3251 -4251 -1496 -199 131 173 -1870 -654 4202 4169 838 657
2625 657 1025 2673 5280 2611 -2139 -406 2158 1192 169 -3006 -5640 -1345 1895 -1215 -3775 -3581
2641 -3581 -1930 1722 3572 -1076 -2988 468 2175 2388 2093 -1089 -1468 2787 2409 -564 -1350 -1104
2657 -1104 -568 1517 -178 -3933 -1581 1072 562 352 -741 -1721 1290 3164 -336 -2122 -46 712
2673 712 1902 1275 -2687 -2573 2405 2885 329 -1542 -3288 -1253 3834 2417 -2137 -2365 -658 1353
2689 1353 3066 64 -3945 -1277 2040 1143 439 -1280 -2507 1285 3945 995 -929 -429 -62 1067
2705 1067 2007 -958 -1752 534 389 -860 -517 -1062 -428 1654 -211 -2899 -1032 540 613 929 -796
2722 -796 -2190 1530 3524 673 -1069 -959 -140 2962 3091 -1629 -2927 1016 2827 3307 673 -3775
2738 -3775 -3206 2327 2826 -772 -2886 -4058 -1483 2864 1158 -3083 -2220 -145 1101 2259 142 -2355
2754 -2355 472 3367 1709 794 447 -1143 663 1268 -1371 -1779 -302 -1971 -2212 -889 -1488 -737 2097
2771 2097 -212 -1898 168 1414 2696 2947 596 -1527 1959 3989 2297 777 -1719 -2447 1426
2786 1426 2647 -2115 -4435 -3081 -885 2122 1614 -3548 -4019 169 2911 2585 349 -2893 -1760 3660
2802 3660 3568 216 -708 -862 505 2793 632 -2604 -1460 127 -390 1 -658 -2310 -74 845 -932
2819 -932 -662 604 -255 106 218 -552 1044 3791 1687 -7 373 557 1856 2902 -777 -3403 -1281
2836 -1281 504 222 147 -2593 -3917 -21 2164 -513 -1591 -2418 -1372 2938 3827 -99 -1312 673
2852 673 1792 3700 2363 -2078 -2682 831 1204 21 -690 -2898 -1602 1415 154 -2441 -1139 -732
2868 -732 -75 1008 -304 -1712 1163 2492 787 673 675 -25 1417 1148 -1742 -898 1511 1039 484 -788
2886 -788 -2567 -547 2328 -146 -2611 -2060 -1313 270 1884 -811 -2355 456 2208 1490 1368 -274
2902 -274 -1299 1748 2940 287 -616 -301 -610 1744 1405 -2044 -2152 -1020 -1342 -955 -578 -2039 -1469
2919 -1469 1137 391 -512 737 512 1276 2400 439 -893 1371 2104 993 445 -986 -1652 1269 1071
2936 1071 -2621 -2871 -1489 -620 984 -84 -2946 -1429 2261 2307 1227 -114 -1180 828 3602 1942
2952 1942 -641 183 577 1262 1959 -506 -2479 -819 -510 -1944 -1186 -1801 -2552 -162 333 -1297 -108
2969 -108 630 -124 810 1015 -206 1176 2583 1002 72 1324 602 1176 1626 -1148 -2796 -577 -47
2986 -47 -696 -156 -2223 -2447 1032 2020 27 -550 -938 -215 2774 2574 -1363 -1011 875 1909 2350 524
3004 524 -2855 -2056 794 -126 -1174 -1685 -2928 -1049 1222 -322 -1146 222 170 539 1489 366 -24
3021 -24 1865 1986 498 1043 1329 375 919 -72 -1973 -824 356 -1191 -1953 -1653 -1770 95 1246 -1165
3039 -1165 -2290 -851 -317 1035 1533 -878 -1435 1272 1902 1154 946 -725 -912 1538 1507 -875 -1002
3056 -1002 -1098 -235 2270 1503 -1204 -839 745 491 1146 663 -1394 -506 1235 260 -249 293 -237 -138 309
3075 309 -1331 -2068 -72 144 -1209 -955 -1016 -457 1652 566 -1609 -785 655 355 605 -752 -2220
3092 -2220 552 2683 697 -127 -399 -455 1619 2856 -105 -1080 469 1220 1543 1955 -194 -1233 805
3109 805 449 -507 -328 -1424 -2328 -97 11 -1442 -892 -449 -1206 12 657 -932 -581 356 -311 509
3127 509 1456 733 1041 1749 84 -193 1222 518 -274 -288 -1631 -1070 1150 503 -1550 -1268 -534 46 1625
3146 1625 6 -2293 -508 2124 1896 1578 275 -1268 1251 2732 559 -1067 -1283 -1522 191 951
3162 951 -1565 -2181 -393 -554 -576 402 -921 -916 1070 874 -19 1574 1668 921 1961 1415 369 996 498
3181 498 -1554 -911 -523 -1468 -839 -799 -2523 -2140 -414 -586 -441 -236 -1353 -572 1959 1860 1530 1705 706
3200 706 1128 3188 1854 -786 -228 -343 290 963 -897 -2767 -1201 532 -249 -590 -1547 -2245 -259
3217 -259 1454 -112 -509 979 782 1586 1913 44 76 1178 237 -1003 -533 -588 -776 57 -938 -2200
3235 -2200 -432 367 -1146 -403 -692 -770 1645 1963 414 652 1693 1733 2581 2088 -260 -231 1082 214
3253 214 163 -13 -1882 -1694 80 -397 -1560 -1092 -2234 -1280 666 -18 -1254 292 736 734 1977 980
3271 980 -357 527 1301 63 383 377 -623 372 655 -1251 -738 436 -441 -1083 -871 -1351 -164 1467
3289 1467 353 -1366 316 1024 1278 1418 -215 -1386 617 1382 11 -404 -812 -719 1065 1174 -1276
3306 -1276 -1629 -836 -477 304 290 -1501 -779 993 613 628 939 -277 -216 1391 571 -280 456 1 -21 1126
3326 1126 521 -567 60 -8 -773 -446 -172 -1132 -6 93 -1439 -383 416 -55 -175 58 -1460 -522 1494
3345 1494 601 -674 20 57 883 2216 296 -1130 33 564 184 623 -1456 -1838 627 1194 -122
3362 -122 -581 -878 -842 821 754 -1072 -588 694 97 767 1274 -327 255 1549 487 -387 410 -238 -368
3381 -368 563 -811 -1151 222 73 -957 -282 -514 -1014 492 133 -988 -154 1153 308 1205 1017 -675
3399 -675 143 1380 278 -165 -117 -968 -280 528 -268 -1433 -695 -967 -559 233 -832 -1863 -70 489
3417 489 136 913 252 -404 1606 1708 -48 102 532 157 902 521 -981 -168 825 -171 -1153 -868 -1245
3436 -1245 -332 433 -1446 -1252 158 592 298 1031 -126 -634 1670 1225 -330 -72 -168 -110 1387 677
3454 677 -1169 -641 -157 -585 -92 -336 -1774 -827 499 -217 -57 270 -335 198 1545 410 -93 739
3472 739 101 58 1127 213 -322 723 436 -899 -30 -268 -978 -331 -648 -1679 -272 689 -104 49 -114
3491 -114 -512 1072 2116 109 -831 373 429 1302 1629 -528 -1252 750 908 -281 -443 -1912 -1552 671
3509 671 345 -1520 -977 -484 -214 916 498 -1279 -339 672 227 870 930 -333 514 1553 520 356
3527 356 820 -316 -526 217 -611 -652 546 -135 -1198 -194 -87 -520 312 -256 -1018 371 977 398 964
3546 964 36 -546 930 1588 309 -708 -674 -1061 394 585 -1137 -1900 -482 -139 -42 244 -1561 -1564 975
3565 975 916 304 555 66 417 2617 1673 136 392 787 310 1092 244 -1245 -159 129 -845 -521 -298
3584 -298 -1057 -545 -158 -1203 -968 443 -28 -154 714 256 326 1549 623 -481 436 442 -44 599 -348 -1277
3604 -1277 -144 594 -749 -533 -886 -1610 128 699 -330 -366 -27 113 1307 1807 -90 -11 1182 1087
3622 1087 788 460 -960 -815 906 693 -1181 -920 -811 -792 63 -943 -1571 -312 404 -41 415 532
3640 532 22 1155 1873 7 232 927 359 456 379 -937 -472 697 6 -969 -847 -1178 -695 494 -864
3659 -864 -1589 -201 550 111 861 264 -468 815 1141 267 -83 239 -270 1144 1148 -574 -512 467 -436 100
3679 100 59 -973 -804 579 17 -258 169 -225 130 1252 250 -1165 111 542 330 381 -25 -784 471
3698 471 809 -826 -644 -947 -803 140 346 -1326 -1051 378 -103 261 448 -681 30 1383 497 -294
3716 -294 391 26 494 1408 288 -586 582 931 -285 160 -339 -1009 277 691 -887 -496 -73 -452
3734 -452 34 -22 -1073 -886 309 -155 -206 462 -398 -88 1242 344 -413 249 394 577 1148 -275 -888
3753 -888 533 944 265 72 -728 -1078 171 634 -679 -629 -486 -402 704 818 -696 -699 717 483 102
3772 102 499 -574 -380 1019 193 -698 61 -254 -381 22 -543 -1163 243 185 -562 -252 219 228 930 1088
3792 1088 -431 127 1423 1029 739 435 -930 337 1415 112 -1000 -837 -1197 -708 351 -1007 -1952
3809 -1952 -791 -314 -79 214 -683 -1167 517 1332 692 708 140 21 1493 1948 -24 -59 602 215 418
3828 418 372 -1061 -708 27 -622 -936 -406 -593 117 776 -215 -433 574 752 -31 634 155 141 1343 606
3848 606 -652 -325 226 -284 125 -482 -1671 -1029 485 209 -499 -851 -685 241 1638 266 -322 410
3866 410 840 1390 1852 465 -623 950 723 179 110 -888 -1491 -398 -81 -1070 -1104 -924 -1123 182 228
3885 228 -1086 -249 657 350 777 872 -145 511 1465 636 -16 617 327 -52 510 -676 -834 142 97 -987
3905 -987 -647 -754 -384 584 261 -967 -225 887 469 831 203 -673 252 1258 331 -354 -134 -655 170
3924 170 812 -918 -1503 -280 -336 -223 593 -882 -931 305 597 43 360 -73 -127 1139 1253 -135 137
3943 137 572 240 497 207 -1014 -247 257 -440 -378 -167 -842 -461 641 -771 -901 106 -55 -442 370
3962 370 -458 -320 1130 822 -203 402 202 48 858 407 -1074 -49 519 4 1 -330 -908 124 768
3981 768 -282 -705 -503 -287 575 777 -569 -567 546 579 162 530 -519 -627 1031 815 -356 -139 -35
4000 -35 -99 667 192 -1236 -617 22 -276 114 -406 -798 -122 1274 137 -321 285 43 514 950 36 -33
4020 -33 581 282 -42 207 -578 -461 328 -115 -1055 -698 -101 -227 106 -452 -994 7 748 53 -194 75
4040 75 13 759 1444 104 -567 487 510 523 341 -818 -467 478 154 -326 -376 -715 -652 627 -28 -1051
4060 -1051 -398 344 320 681 191 -699 337 1193 412 -45 327 -411 396 1041 -243 -650 157 -341 -373 77
4080 77 -1049 -874 39 258 -120 209 34 -182 817 257 -414 581 707 80 373 -203 -568 383 933 -556
4100 -556 -875 -299 -480 -149 295 -967 -956 22 460 399 144 -610 -393 1435 719 -301 -117 -10 500 1031
4120 1031 535 -1036 -384 393 22 289 -539 -1266 -223 625 -363 -688 -98 -554 204 600 -577 -304 628
4139 628 519 104 654 -241 26 710 217 -169 -159 -116 -239 -74 -54 -677 -31 80 -586 -436 -198 -688 275
4160 275 721 -294 -291 532 350 793 534 -553 -279 738 732 -193 -344 -743 -454 889 91 -1093 -797 -555
4180 -555 137 505 -429 -1074 -116 759 479 186 -280 -263 556 1176 107 14 422 -21 532 429 -568 -546 -49
4201 -49 -253 -446 -159 -468 -761 274 -261 -713 35 298 -228 340 213 22 859 1003 -141 -174 348 475
4221 475 659 158 -1110 -672 79 145 -114 -274 -1489 -242 590 151 -402 -389 -247 364 1383 91 -788
4240 -788 257 556 696 469 -535 -1173 286 681 131 -620 -637 -946 244 241 -802 -809 -36 -105 280 624
4260 624 -108 36 840 691 -8 424 546 -57 787 -134 -417 152 123 -642 -527 -373 -523 -198 -220 -1004 -513
4281 -513 15 54 434 285 -661 77 915 485 -135 191 -200 193 988 60 -636 -416 -206 301 225 -577 -1316
4302 -1316 -301 421 143 -328 -511 -379 718 802 181 -94 89 337 807 493 -621 -463 233 466 149
4321 149 -87 -828 -398 159 -81 -774 -146 -191 -153 412 -311 -278 447 506 3 422 687 218 499 356 -295
4342 -295 2 671 12 -192 -305 -752 -82 419 -141 -832 -500 -269 363 591 -524 -1136 -211 488 262 377
4362 377 -296 -521 937 952 110 -128 -248 -43 742 598 -508 -501 -87 208 415 19 -578 -419 537 243
4382 243 -199 -165 -557 154 768 46 -458 60 -25 -334 251 -211 -325 465 517 -540 -318 25 -78 230 -26
4403 -26 -432 -152 528 68 -207 -225 -178 595 814 -36 -260 167 396 292 513 -497 -607 163 422 -333 -188
4424 -188 -736 -890 226 407 -792 -874 -431 -304 561 98 -533 -256 806 600 276 358 -237 162 1192
4443 1192 400 -175 -127 -106 40 468 -167 -865 85 -238 -534 -246 -371 -350 317 262 -523 269 236 -116 196
4464 196 -5 -242 424 741 342 -313 -24 -207 95 364 -957 -1067 -150 186 117 -47 -570 -463 539 684
4484 684 254 -15 -122 330 800 662 -162 -114 313 383 250 -123 -1183 -518 143 -127 -470 -573 -812 -177
4504 -177 439 -136 -480 -124 236 261 860 93 -38 666 713 239 509 -84 -328 386 -69 -583 -154 104 -530
4525 -530 -184 -296 -601 -28 291 -304 -503 162 143 564 287 -116 -148 852 696 299 17 -457 -352 181
4545 181 257 -637 -478 -254 -9 386 -18 -728 -43 317 98 471 4 -643 62 916 515 -108 175 -332
4565 -332 66 722 82 -440 -374 -183 -192 98 -211 -685 76 134 -335 -256 40 -44 369 473 -48 241 618 143
4587 143 375 445 2 346 542 -227 -555 -197 93 -384 -178 -656 -514 471 597 -612 -323 -320 169 836 147
4608 147 -791 -30 426 491 552 -96 -602 16 712 189 -353 -376 -276 -34 366 -291 -493 27 -382 -167 496
4629 496 176 -308 66 276 254 423 25 -509 567 322 57 -41 -74 -140 131 173 -395 176 27 -725 -468
4650 -468 -101 -289 96 258 -746 -610 463 437 347 234 -252 160 992 462 -147 -121 371 348 373 -162 -1028
4671 -1028 -240 49 -104 -30 -621 -557 110 709 -154 -198 35 146 156 462 -152 51 133 174 339 606 -452
4692 -452 -223 208 127 -232 82 -346 -453 214 293 -313 -67 155 -117 121 320 -44 354 487 -63 85 308
4713 308 453 360 459 -397 -440 401 132 -474 -392 -524 -318 340 -339 -715 -329 157 128 76 -181 -310 328 541
4735 541 409 130 40 162 519 633 -315 -382 24 -61 335 400 -560 -500 243 133 1 128 -150 -239 594 462
4757 462 91 9 356 55 272 330 -103 296 453 -186 -28 76 -392 122 299 -624 -195 159 -230 -100 -45
4778 -45 -267 -227 648 349 -214 115 430 299 525 120 -242 342 228 202 -57 -135 -696 -65 393 -270 -451
4799 -451 -494 -429 136 277 -493 -397 464 522 624 280 -97 -265 580 484 -23 -20 -353 -72 497 290 -372 -174
4821 -174 -241 -379 80 -289 -478 65 313 -113 6 237 -249 208 391 -52 227 519 -72 -60 257 152 49
4842 49 391 -177 -582 12 -54 -160 -121 -334 -642 -8 573 -104 -403 -134 -58 525 506 -79 -213 236 38 682
4864 682 493 -553 -595 213 177 125 -179 -874 -489 235 470 -474 38 -130 -31 387 356 -123 28 320 -71
4885 -71 470 369 -130 313 234 -168 170 -153 -163 -214 -9 -296 -256 -112 -297 -317 158 -23 7 359 199 -220
4907 -220 332 266 295 295 -182 -122 235 286 -84 -178 -70 -344 306 411 -795 -494 -144 183 436 174 -761 -347
4929 -347 784 599 53 37 5 131 628 199 -205 -225 -168 -236 129 -220 -628 -211 -26 -220 -126 211 -379 -333
4951 -333 23 -124 121 521 -53 96 109 185 239 277 -100 -276 241 33 -190 -165 -323 -411 184 26 -238 -409
4973 -409 -394 -501 169 238 -164 -53 91 63 550 472 241 -308 454 294 246 217 -251 -136 460 99 -278 -314
4995 -314 -280 70 396 -233 -429 -80 209 102 226 53 -303 10 338 46 275 296 138 -60 17 -193 76
5016 76 -1 -88 -78 104 -191 -152 96 -368 -231 394 359 -347 182 -308 121 472 238 67 -15 -5 -31 233 220
5039 220 -424 -359 -139 -219 -137 177 -919 -544 248 198 54 -313 -324 21 513 136 -485 25 159 164 336 58
5061 58 -306 243 458 18 326 -232 -292 -129 196 -405 -138 -177 -206 171 215 -223 -408 403 -247 -176 523 325
5083 325 177 309 -38 209 316 130 -254 96 -49 -285 108 -156 -372 -251 275 70 159 9 -331 -142
5103 -142 460 231 279 97 -73 255 506 207 -256 45 -240 33 548 -301 -398 -240 -39 33 40 -572 -484 -78
5125 -78 191 -55 72 108 45 343 614 -29 81 192 133 527 417 -66 35 151 -126 -121 121 -249 -388 -95
5147 -95 -228 -84 -177 -99 -324 -126 259 131 475 86 -387 88 464 -139 36 -206 -459 -52 198 28 -160
5168 -160 -237 -155 -108 458 -226 -347 -135 104 494 283 139 -394 280 533 474 150 -266 -38 256 397 -288
5189 -288 -198 -223 -316 55 277 -555 -246 -370 -134 -53 268 222 -51 361 216 262 251 65 -256 198 78 -25
5211 -25 346 146 -382 -182 380 152 129 -270 -657 -57 269 -113 -69 -9 -319 429 829 282 -145 -14 163
5232 163 549 465 26 -315 -136 340 -141 130 -465 -559 -121 -24 64 -225 -240 -333 195 433 127 -28 135 134 266
5255 266 331 -124 -141 32 -199 -77 202 -41 -178 47 -255 -34 166 -146 -105 -208 -46 0 257 -268 -281 48
5277 48 109 425 -99 -219 -263 212 725 97 31 -23 -323 124 193 -157 -490 -177 30 -98 -5 -129 -429 7
5299 7 63 216 177 144 -346 447 585 110 -60 1 -260 241 277 -201 -355 30 -175 -330 175 -277 -177 78
5321 78 -40 -26 -56 -56 -119 165 338 -186 354 92 -178 -123 141 36 280 25 -324 -101 327 -47 108 -70
5343 -70 -339 -130 219 -106 -394 54 -191 107 547 -314 11 268 203 41 -47 -275 -47 449 -126 -28 -176
5364 -176 -355 -145 -38 172 -260 -248 2 -284 -24 132 -124 -17 519 275 -76 332 15 -49 287 -121 -150
5385 -150 48 -191 -293 54 -237 -123 -136 -202 -216 -36 -1 -294 -140 -95 -5 388 232 -45 67 -9 -332 165
5407 165 181 -400 -174 154 49 -206 -66 -285 -198 306 -98 -154 -236 -249 -209 270 333 -97 -176 227 361 160 152
5430 152 113 -83 114 19 113 -114 -594 64 342 -196 -336 -379 -313 -172 182 -11 -206 339 11 -215 444 182
5452 182 -42 140 -169 83 124 421 -59 268 -100 -99 -62 -131 -200 -152 36 -70 -80 -144 -339 22 21 105 -58 161
5476 161 -237 -170 324 473 -315 60 -12 195 425 69 -270 -67 -18 21 147 -118 -442 -353 189 25 163 -242
5498 -242 -417 -100 504 351 82 201 -60 -27 455 -104 -104 -294 -320 -94 186 -210 -307 -204 -235 -57 304 101
5520 101 -185 -216 170 319 744 283 -121 -72 190 474 135 77 -318 -284 234 27 -64 -362 -74 -31 225 133
5542 133 -501 -440 126 -213 608 -36 -475 173 318 136 113 169 -105 139 362 288 -14 105 -52 -115 -19 -126
5564 -126 -153 -124 -219 -478 109 145 -92 -65 60 82 160 267 14 10 382 158 231 276 -165 113 490 73 -62 -105
5588 -105 -413 -229 69 -64 196 -103 -353 -157 402 432 -30 80 -61 175 637 -143 -28 -226 158 -103
5608 -103 170 54 -276 -48 -254 -28 -49 -167 -117 -104 131 11 -216 9 -183 135 24 205 100 117 -96
5629 -96 -301 386 155 -258 85 -93 -90 -4 133 -271 -310 -58 -194 -141 63 -479 -89 277 289 318 118 7 154
5652 154 372 230 -72 66 -234 -64 127 -182 -283 -187 -246 -178 -464 -184 -267 117 195 -105 -124 -88 39 61 378
5675 378 112 -5 68 -251 87 250 -136 -207 41 106 -214 -120 -154 -247 120 121 -128 -69 26 -234 38 371 -87
5698 -87 82 42 39 27 359 -140 213 13 -45 126 392 -184 -176 -99 -206 20 137 -143 -302 -115 42 171 85
5721 85 -76 -385 38 157 148 153 -394 -285 151 294 -262 -28 6 -36 -10 341 -441 -407 111 -20 139 -43 -327
5744 -327 -275 295 117 379 378 36 188 48 160 -31 257 -151 -5 284 128 -35 -73 -17 -233 100 -133 -267
5766 -267 -112 -96 -220 -27 296 -105 -184 123 -42 440 391 -171 -234 272 202 159 94 -513 -365 -102 296 -117
5788 -117 -425 -166 -76 343 66 -285 -439 -184 153 259 455 3 -86 52 137 112 174 -120 -130 418 99 -99
5810 -99 -240 -300 -341 -108 61 -392 80 -98 -223 306 141 102 195 25 48 460 583 -61 -300 84 131 298
5832 298 192 -253 -378 -201 159 25 -84 -623 -326 330 307 57 109 -224 -260 384 425 48 -144 -117 143 422
5854 422 288 -141 -319 -47 41 60 232 -334 -452 -144 -121 -114 -117 -158 -338 435 163 -33 30 168 104 242 318 -161
5878 -161 -50 76 -266 325 161 124 -468 -137 -180 -67 267 -69 -219 -136 -11 242 31 -248 -425 -80 247
5899 247 179 192 -229 -321 400 394 -156 -292 -163 -298 240 4 -547 -75 -41 -68 53 -17 -143 -262 169 -70 177
5922 177 176 -95 110 418 206 -182 -62 -42 -210 124 104 -114 -75 -125 -435 -167 87 -137 48 -192 -400 98
5944 98 329 -197 104 228 -70 100 429 24 -179 152 -77 58 -62 -228 -399 137 -140 -261 -53 -277
5964 -277 124 333 297 -235 -158 -26 210 319 368 -70 97 438 110 324 -62 -255 29 338 -246 -469 -167
5985 -167 -25 -114 50 -195 -338 15 -44 139 133 -59 -21 405 290 203 309 163 49 35 244 219 -225 134 -383
6008 -383 -221 110 9 -285 -95 -558 -195 151 -73 -133 -179 92 191 418 388 -140 149 128 383 435 -240 -291
6030 -291 -4 161 -112 -106 -253 -501 37 269 7 -221 -334 -96 398 252 -88 47 -19 426 176 408 75
6051 75 -98 199 261 -48 -64 -411 -488 -222 -4 -150 -126 -8 -195 145 358 52 149 -56 -147 361 340 334 14
6074 14 -270 -224 -52 350 -126 -198 -300 -200 22 325 -244 -188 -344 54 475 188 -135 -655 -226 467 100
6095 100 108 -232 -215 164 263 -50 -236 -38 -32 237 413 -103 -511 -90 -280 247 128 -247 -154 -142 358 -152 166
6118 166 267 -323 100 200 147 287 246 -444 -223 326 92 -117 -303 -500 101 204 128 -370 -237 -278 -24
6139 -24 585 254 -161 39 -140 104 437 180 -485 126 535 484 384 -282 -343 -77 352 142 -74 -246 -134
6160 -134 252 328 -101 -569 -261 -23 514 354 -65 -101 259 41 86 180 -37 -161 151 108 -141 104 -91 -236
6182 -236 26 -3 -26 191 -170 -272 -29 212 5 250 57 -128 147 669 367 61 36 -22 122 573 -147
6203 -147 -280 -178 -40 -190 78 -376 -660 -149 167 246 37 -328 -132 302 427 210 190 190 163 242 363 -63
6225 -63 -127 76 55 -219 270 -212 -266 -192 38 -78 -209 -137 -49 152 -8 56 -3 214 213 96 167 -178 137 441
6249 441 -325 -76 296 177 -216 27 -361 -303 -32 -158 -222 -62 -93 33 309 175 -244 155 353 -5 149
6270 149 -46 -20 257 198 -39 58 -228 -224 -41 -27 -541 -390 210 -67 175 175 -263 -387 232 327 -155 192 -246
6293 -246 200 152 -64 -65 22 27 82 -9 -94 -166 -341 48 -30 -334 17 -297 336 -65 -219 -27 110 -152 -30 42
6317 42 308 -74 523 27 -85 279 391 -181 -118 -279 -232 261 125 -305 -103 -374 152 188 215 -184 -154 75
6339 75 61 216 22 2 -190 218 271 315 109 -225 -141 435 -6 -134 -166 -650 -76 298 -480 -582 -129 102
6361 102 -288 252 86 -573 138 10 78 259 53 -10 184 187 -48 -122 -102 -248 -54 207 -280 -56 -161 -403
6383 -403 -286 259 241 124 -310 -332 22 391 406 -106 -73 12 297 258 540 -468 -368 168 191 72 -160 -514
6405 -514 -431 215 354 13 -83 -419 -106 708 254 19 -192 -299 340 525 160 12 -20 64 88 286 -54 -145
6427 -145 -214 153 16 -46 -330 -411 -435 -103 -97 97 343 -178 -238 341 451 104 94 -286 -166 314 352 -157 -170
6450 -170 -436 -228 147 170 -525 -308 -38 154 194 -120 -264 -179 353 332 216 -299 -186 -125 507 342 318 -147
6472 -147 30 156 340 162 -171 156 -185 129 307 -69 -415 -330 144 168 -85 80 -47 54 121 -193 286
6493 286 146 -146 162 13 16 70 160 -419 -444 177 92 -138 -35 -519 -241 349 364 -320 -222 -6 149 462 293
6516 293 -440 -397 325 473 307 -230 -111 -133 448 183 -235 -43 -256 -117 183 20 -219 25 -14 111 396
6537 396 83 -199 376 49 200 -137 36 -41 162 6 -63 142 208 -160 -125 -182 -301 154 21 -375 -110 77
6559 77 -113 195 278 -41 -204 526 40 95 41 -41 -112 -6 256 -301 -183 -280 -13 -28 -135 -166 -260 223 216 -233
6583 -233 -258 -398 105 331 59 41 308 210 198 164 -281 2 186 275 0 109 -248 -162 166 -14 -81 -155 -280
6606 -280 -404 118 14 -97 -100 183 157 218 237 -107 -99 278 2 30 46 -113 -168 340 -5 -119 102 -137 -415
6629 -415 333 -7 -268 314 -119 -468 115 303 -138 43 -40 96 439 343 97 -64 -65 -40 259 -22 -410 -498
6651 -498 5 123 240 -7 -453 -173 155 192 -151 -353 -130 -42 721 283 39 126 34 91 506 273 -57 -101
6673 -101 -82 -75 28 -272 -225 -269 61 -161 86 12 -171 -134 137 172 265 461 -7 76 169 212 121 -199 376 -158
6697 -158 257 385 -78 -262 -313 -413 396 284 -123 -687 -239 -160 155 295 -408 -451 195 555 217 118 -56
6718 -56 -458 403 373 -33 -128 -284 -465 104 279 -351 -516 -7 248 232 184 -410 -143 97 262 658 279 -15
6740 -15 292 366 183 141 28 -355 -422 161 407 203 -63 -257 -376 -27 22 -7 -40 -284 -172 342 479 -143
6762 -143 -108 212 -103 379 477 -2 -257 -79 274 254 594 -462 -319 495 206 -21 -254 -438 -468 226 242
6783 242 -91 -242 91 172 423 360 -18 -179 32 125 211 303 -38 102 3 -235 2 -82 -286 -105 -181 -221 -36
6806 -36 169 18 -431 -137 347 58 396 30 -225 354 402 217 31 -398 -120 145 403 -65 -63 -432 -152
6827 -152 -124 257 -353 -167 237 -15 218 -56 -41 -268 324 367 131 3 29 61 298 100 -1 -193 89 -146
6849 -146 -137 -82 -262 -197 6 -327 160 23 -184 22 -93 -44 -60 358 -87 261 123 -151 219 344 -1 57
6871 57 -77 -133 -161 73 16 54 22 154 -242 18 -111 -245 194 119 88 75 197 -112 103 2 106 -14 227
6894 227 -93 141 -5 -337 16 192 -162 -163 -193 -112 -277 -134 -227 -552 204 367 254 38 24 204 442 239
6916 239 73 -107 -10 245 -3 171 -193 -520 213 27 -281 -162 -278 -203 294 16 -195 -145 29 -2 172
6937 172 301 71 265 116 -77 109 230 -23 216 189 -219 81 250 -93 -334 -179 -227 -100 361 162 -236
6958 -236 -93 81 203 164 177 -231 205 351 35 423 -319 -176 130 147 1 -227 -337 -420 235 215 -371 -289
6980 -289 -99 -71 197 66 340 -276 -163 453 238 409 26 -257 166 237 242 -114 -178 -224 -197 -87 -69 29 -388
7003 -388 -288 270 282 -204 69 -179 -435 59 643 339 -138 -82 -152 327 528 -340 -404 -117 44 247 31
7024 31 -269 -529 62 316 155 -237 -233 -233 103 375 272 -211 107 65 282 356 30 -152 95 -134 94 130 -367
7047 -367 -408 -356 -19 54 33 14 -398 24 -167 202 201 -203 23 48 172 114 283 143 -116 60 407 249 12
7070 12 -149 -472 112 66 -194 -600 -232 -250 81 221 -168 -399 -12 346 337 572 -216 -296 484 504 211 83
7092 83 -68 -25 59 394 -162 20 -11 -327 144 185 -384 26 151 -85 59 296 25 -170 402 81 -23 119
7114 119 148 -150 -224 87 23 -58 368 -323 -152 -31 -60 -27 -313 -430 57 251 -182 122 -111 78 417 318
7136 318 149 -19 2 224 224 154 -161 -153 105 180 -176 -138 -296 -401 -134 -6 -33 143 -293 -36 236 446 -40
7159 -40 338 360 -93 321 392 102 -89 211 -242 -81 -200 -187 -280 -131 -362 -133 0 -4 -99 -265 50 -76 -93
7182 -93 70 -98 165 334 62 276 124 75 -22 162 -163 -90 183 67 303 -1 -21 -109 -202 -94 -79 -100 -150
7205 -150 -152 212 401 90 -22 176 280 531 45 -254 147 258 77 215 -191 -409 -6 -78 -300 -311 -44
7226 -44 -205 227 378 -83 -219 39 -181 -77 372 73 -105 252 62 17 184 -157 -345 254 2 -99 -45
7247 -45 -191 -270 119 295 -280 -178 -87 -169 -221 367 65 35 206 -70 115 270 280 -111 129 -190 173 61
7269 61 -279 -205 -49 -2 -194 301 -65 -455 226 -53 153 -293 -2 -106 304 470 83 -63 -112 -39 350 465
7291 465 291 -352 -294 -54 -29 186 -165 -59 177 -61 -113 47 -201 -197 101 259 67 416 -139 -174 238 329
7313 329 212 441 169 -403 85 433 149 -113 -232 -310 104 358 92 -510 -351 -202 162 467 -27 -200
7333 -200 -104 308 143 431 -249 -536 114 244 25 180 -230 -562 139 410 -36 -196 -323 -280 -40 192 -144
7354 -144 -8 -36 -178 179 243 52 24 196 107 84 551 40 -289 -98 -278 90 289 -209 -518 -118 150 -41
7376 -41 59 17 -447 -139 74 300 125 -247 -110 148 299 -102 -132 -17 -139 172 367 181 -694 -552 -203
7397 -203 -192 -22 -436 -309 -142 477 -97 149 117 -219 212 321 38 170 -64 -210 99 464 133 -41 -42
7418 -42 -160 -308 66 -135 -126 -173 5 -229 212 203 -189 297 18 255 86 315 43 243 338 65 63 170 -30
7441 -30 -59 -86 -77 -215 -146 -397 -205 138 -6 -399 -6 -20 175 138 -39 -157 141 378 -2 249 306 27 -79
7464 -79 215 -80 -4 -160 -83 21 93 -300 -127 267 -192 -454 71 -172 55 239 -72 45 400 213 166 229
7486 229 190 89 183 122 -201 161 -132 -65 171 54 -2 6 154 -149 15 -21 -241 -36 151 17 -184 64 234
7509 234 325 402 152 -236 202 10 7 106 -68 -207 112 -34 -138 -267 58 -309 -28 -132 -424 -141 150 -55
7531 -55 308 -145 -61 40 491 111 -252 47 -237 143 289 -237 -376 -138 -138 -193 12 -354 -316 -204 -53 -285
7553 -285 384 315 -504 154 290 -134 145 125 14 -4 397 84 -38 -293 -207 -325 197 236 -216 -9 -383 -340
7575 -340 75 141 -203 -87 -66 92 634 127 -121 5 347 169 79 -263 -549 -133 550 306 140 -70 -432
7596 -432 -58 260 -37 -617 -213 -73 9 245 246 -54 5 -113 166 161 240 -196 -165 115 78 85 109 -339 -361 -151
7620 -151 -124 -28 -164 -358 -246 464 -41 -81 -55 -22 188 506 93 -202 99 -86 59 477 287 -182 -203 -50
7642 -50 48 226 -29 -344 -58 -78 -7 5 215 -265 -142 489 137 -173 464 -199 86 392 -20 -21 -12 -111 60
7665 60 206 -229 -370 -240 -107 -249 91 6 -169 57 -17 -20 118 328 -333 -53 170 301 445 -41 -208 -10
7687 -10 415 -50 40 149 -270 -214 210 91 -324 -209 -247 -44 67 -16 -361 -146 78 52 363 57 156 -28
7709 -28 70 -48 14 186 -52 -2 -67 -17 -148 -94 -213 -248 333 85 -273 -142 124 -126 435 339 -1 146 102
7732 102 -444 275 224 -31 144 -34 75 93 232 -71 -180 237 -58 127 -10 -425 -167 59 -4 -328 104
7753 104 100 -136 214 178 209 123 28 -46 299 202 14 -109 -99 -322 31 -109 -295 -96 -30 -297 78 195 -325
7776 -325 123 85 25 1 224 -150 159 279 -28 21 374 -22 -189 36 -139 -201 178 -75 -360 46 -249 -224
7798 -224 -106 65 -27 -125 176 125 -59 199 -10 -226 272 44 337 234 242 -316 -267 -271 142 71 -219 -383 255
7821 255 20 -44 -135 -175 181 57 201 -183 -42 375 268 330 397 159 -195 95 -158 39 -32 -403 -277 107
7843 107 13 -414 41 -372 -368 38 -37 -45 -167 78 -48 258 79 -99 -109 440 161 233 67 -402 32 -131 -135
7866 -135 48 59 -209 -175 302 52 -78 -6 -343 -34 69 541 -43 -29 -72 -132 373 282 120 -156 -74 48 306
7889 306 32 -304 -127 10 -59 85 -270 -547 -178 16 -85 -246 86 -162 -4 242 258 74 -130 290 -82
7910 -82 270 53 -178 172 -255 -466 156 -2 -350 -124 -345 -198 146 321 -42 -7 264 117 243 290 32
7931 32 -33 269 279 4 21 -404 33 126 102 -279 -261 -328 -409 29 159 -218 -522 -313 -290 486 52 8 25 105
7955 105 415 190 192 -206 137 61 39 -208 0 -151 -269 516 -175 -6 -211 -291 -214 -112 -105 -125 -128 21 46 385
7979 385 439 -26 -43 -66 218 285 214 -148 -48 -69 -62 93 4 -369 -353 58 -225 -32 56 -241 -42 324 316 97
8003 97 167 -110 -23 195 206 124 -32 131 190 91 28 -505 -254 138 8 -294 27 -421 -117 86 -135 164 77
8026 77 -140 -118 211 158 159 421 171 -128 18 -152 -56 125 -292 -409 -27 -46 -244 -131 24 -614 -66 330
8048 330 -137 -149 85 -262 -60 234 -57 -152 222 285 -14 315 -125 -249 207 101 3 22 -328 -141 -9 -96
8070 -96 -11 -170 -45 -270 -215 -153 -144 77 147 13 97 451 99 169 266 93 -206 -109 31 -127 5 -57 -157 337
8094 337 -40 -186 -89 -47 162 -46 -198 -122 129 414 -210 -87 -139 99 185 112 -181 108 228 -217 -15 62
8116 62 -377 -64 -38 -190 -585 115 112 99 18 -97 17 249 181 219 199 87 -166 87 260 -158 -85 34 148
8139 148 111 39 -413 -254 19 -112 -185 -20 -240 -219 305 65 167 142 171 169 274 423 82 352 129 74 30
8162 30 -111 -177 -156 58 31 -120 -80 -267 -104 -31 -320 -220 168 -444 -33 79 114 271 52 39 37 264 32
8185 32 -7 17 16 -64 -93 232
8191B32
$$ Imaginary data points
##PAGE= N=2
##DATA TABLE= (X++(I..I)), XYDATA
0 0 0 0 0 0 0 0 0 0 0 0 0 0 0 -8 8 -8 8 -8 16 -16 16 -24 24 -32 33 -40 48 -56 64 -72 85 -96 109 -121 137
35 137 -156 174 -196 219 -244 270 -301 333 -366 406 -449 497 -546 602 -664 729 -805 888 -981
54 -981 1084 -1201 1334 -1488 1670 -1884 2142 -2463 2872 -3415 4170 -5300 7169 -10835 20771
69 20771 -107883 -315182 -123683 107556 193760 61230 -99740 -100328 80250 186476 126560
80 126560 3147 -38802 29703 132064 113527 8413 -40790 3686 71219 108423 47211
91 47211 -69574 -115395 -68221 -5100 36298 10365 -75532 -115612 -69301 1509 56442 47072
103 47072 -38899 -98001 -62470 4242 50258 49904 -8199 -39991 16017 71406 54231 -6991
115 -6991 -67173 -58554 34928 78575 -6695 -110756 -112353 1478 140863 147878 1816 -109624
127 -109624 -62123 71702 154009 90563 -57013 -98438 913 80237 52974 -33700 -95422
138 -95422 -59012 24700 14249 -77096 -116346 -65807 24978 78172 31300 -46013 -35721 34960
150 34960 84461 94713 56160 -1080 -8521 13646 15630 21610 27501 -2324 -37061 -53241 -58460
163 -58460 -32616 1833 -10401 -38352 -36781 -23528 -4432 10452 -9148 -18269 23034 51762
175 51762 28183 -10351 -34748 -7956 70082 94874 19903 -58339 -66683 -11230 60791 58241
187 58241 -24912 -68758 -27241 27048 43474 12413 -31538 -13173 40964 32023 -25121 -47144
199 -47144 -16885 44752 77042 21745 -52962 -48376 3532 32638 19260 -32172 -66986 -40702
211 -40702 -12220 -22214 -23777 -4007 16525 33094 14691 -29578 -23474 29383 53241 38456 7038
224 7038 -21193 -2969 40313 40977 13771 4497 -1583 -6417 -12341 -38689 -45738 -3829 25150 6512
238 6512 -22233 -37979 -18269 37368 54908 9264 -28006 -27171 -8665 14380 10949 -15638 -5536
251 -5536 27881 20104 -15751 -37783 -28457 20525 54681 9565 -54429 -52770 -2171 48932 57147
264 57147 4876 -36720 -8953 27709 20040 -6189 -24372 -12017 28552 27651 -24462 -45223 -13810
277 -13810 25504 42554 11605 -43463 -44154 2829 26731 21050 5113 -14612 -10445 6668 -3595
290 -3595 -12944 6548 16472 5981 -8204 -26698 -20844 18991 32161 4404 -15188 -16741 -6115
303 -6115 13371 8364 -12623 3377 34563 29296 -858 -30575 -33655 13687 54423 20009 -43024
316 -43024 -61674 -27667 34004 60283 10064 -45027 -34347 7038 28988 15715 -25342 -35726
328 -35726 10948 41247 16236 -16562 -23727 2215 43892 36710 -22764 -54147 -33642 1727
340 1727 29608 23641 -12043 -20252 170 6848 9495 16495 8098 -1978 -6484 -20177 -14436 18948
354 18948 28704 9867 -4232 -11128 -4395 12698 -1749 -32493 -23799 7336 18519 5803 -27364
367 -27364 -42238 3498 55995 42958 -11914 -52175 -42344 21669 67965 33338 -25805 -36753
379 -36753 -3387 40140 46524 -3451 -40350 -14936 19333 19294 -7541 -38814 -30948 19878 39778
392 39778 1973 -36922 -42282 -15123 27614 33833 -2934 -22302 -13410 -2628 12521 18508 3689
405 3689 -3269 -4533 -18380 -16043 9064 18614 10558 640 -13083 -5465 20468 16125 -10716 -14442
419 -14442 1836 21638 28592 -1132 -31788 -7761 36966 42645 8139 -41225 -57939 -8260
431 -8260 45157 32932 -14621 -41576 -28319 17848 41877 5532 -34823 -29103 -4415 11828
443 11828 3902 -27488 -30617 11031 36795 21349 -6069 -25919 -15446 22825 34307 6687
455 6687 -11265 -10241 -558 17683 21280 5515 1719 1244 -14499 -20583 -11479 -5547 2494 2223 -17666
470 -17666 -19088 8019 20652 12927 3372 -5457 3340 23939 13429 -13815 -11253 11545 29159
483 29159 26230 -10611 -42797 -21037 18681 22625 -2604 -34850 -44756 -10219 22686 10005 -13413
496 -13413 -14771 -2641 16109 17361 -8270 -15758 10278 26299 17054 -3053 -23069 -14682 16543
509 16543 19449 -5859 -19546 -18702 -7792 9485 5166 -11024 -1844 14048 9892 2579 10 4970
523 4970 28078 38365 13968 -6848 -2156 10053 21496 15446 -15515 -30658 -15185 -8866 -16691
536 -16691 -22035 -25521 -16205 2721 -4166 -24985 -21352 -2021 14128 20625 3702 -13342 3380
549 3380 25969 24098 16115 8797 3492 11631 10868 -11961 -17950 989 10080 4330 -10147 -25312
563 -25312 -10036 24332 25865 319 -15177 -12643 7543 26961 11459 -15051 -7819 13377 19334
576 19334 8137 -18530 -32358 -7308 15644 -558 -29708 -42461 -30119 6288 25569 3325
588 3325 -17837 -10170 8155 25429 26258 4345 -2428 15794 22066 13353 8002 886 1308 11703
602 11703 4514 -14329 -15748 -11605 -13910 -10844 -10005 -10829 5 1580 -12381 -8598 10671 19531
616 19531 17362 -122 -22031 -10096 24076 28541 5169 -18912 -26485 -2695 25913 12948 -20842
629 -20842 -26254 -5878 19316 26753 -2257 -27920 -6910 27340 32979 12444 -19150 -28548 4061
642 4061 32081 16234 -13843 -28599 -23001 1794 13989 -6945 -24807 -18437 -8059 3789 9227
655 9227 -591 -3909 7138 8536 5785 11795 8328 1458 5190 6050 6196 16145 11027 -9749 -13221
670 -13221 -847 9907 13729 -5491 -34291 -27306 7715 25274 16517 -9693 -30097 -8935 29523
683 29523 28007 -4796 -27607 -24084 6017 29294 6654 -29972 -29527 -2121 21101 19496 -14854
696 -14854 -39302 -15584 20589 27819 12607 -9657 -14691 14667 39235 27483 6669 -4142
708 -4142 -6604 6083 14404 -116 -11920 -11641 -14108 -11837 -3689 -8782 -15773 -13634 -14374 -8239 8839
723 8839 9033 -5308 -7074 1457 16898 32671 19270 -11947 -16060 5123 22589 22681 -4101 -34661
737 -34661 -24432 9824 19868 1765 -23107 -32064 -3687 30353 22109 -7795 -16594 -1866 25680
750 25680 37524 8886 -22523 -14358 11259 21816 11287 -18416 -35285 -14816 6628 1290
762 1290 -13405 -24995 -25441 -5129 9119 1364 -1386 5386 8540 15551 21136 14071 11250 14659
776 14659 7459 3423 9703 6201 -3300 -7724 -13998 -11711 2161 -1389 -20154 -24593 -16099 -1334
790 -1334 13020 4996 -15411 -10226 12599 24243 21594 3989 -13045 -893 20574 14958 -4674
803 -4674 -15957 -14929 2517 14577 -4750 -24988 -17361 -469 10753 8854 -10838 -18954 3213
816 3213 20078 14763 5169 -2659 474 17858 19401 79 -7163 -744 3487 5804 -3463 -20048
830 -20048 -15845 -187 -1162 -9411 -13230 -15200 -4634 8191 1387 -7145 453 6840 9743 13373
844 13373 7126 4029 14711 14902 3738 1142 333 -2370 428 -4295 -15614 -10953 -3328 -7743 -10031
859 -10031 -7232 -5527 5480 10686 -3074 -8083 4418 13355 15483 8813 -8346 -9602 10603 16470
873 16470 2110 -12143 -19063 -8646 12649 9266 -14428 -20111 -6125 11637 21479 5855 -17761
886 -17761 -11046 13396 20931 10300 -9809 -22595 -5518 18471 12509 -6857 -15999 -12946 4442
899 4442 18098 5347 -10942 -7126 1392 7798 10798 -764 -11725 -4729 1168 130 2647 -1311
913 -1311 -10734 -7209 642 3045 9778 7098 -7261 -7246 7360 14840 14842 3683 -14717 -11096 11264
928 11264 15604 985 -15574 -24610 -9849 15715 12527 -11615 -20511 -10921 10452 25872 9582
941 9582 -18357 -16349 6172 20812 18278 -5054 -25143 -10123 17257 19235 4163 -13162 -19166
954 -19166 476 19986 9643 -8710 -12979 -8040 4758 13294 317 -13040 -8492 -3021 411
967 411 5544 -526 -9169 -4007 2089 5506 14155 12660 -857 -1973 5750 10384 14056 4723 -16162
982 -16162 -17918 -1359 6723 3222 -9876 -25027 -15358 9620 13828 7 -10992 -12461 4084
995 4084 25314 17525 -6105 -10860 -858 12430 19052 1243 -21987 -17409 879 7397 3663
1008 3663 -9734 -20038 -5586 12863 10685 2760 -1258 -3723 5920 14936 6807 -734 1524 -213
1022 -213 -443 4507 582 -3428 -479 -4820 -7531 2448 5252 -1826 -4785 -7488 -5339 8309 9223
1037 9223 -7461 -14445 -8385 754 10708 5885 -12782 -13956 3818 12897 11141 1914 -9862 -3303
1051 -3303 15564 15876 3101 -4414 -7373 459 12464 4558 -11933 -13134 -7336 -1653 4512 -1445
1065 -1445 -11676 -5229 4735 5870 7172 4882 -1787 1996 6735 1509 1933 5118 -306 -2487 296
1080 296 -2687 -1000 4122 -4668 -12240 -5875 -637 862 1115 -7734 -10526 4709 13162 5051 -2966
1095 -2966 -7883 -4188 11701 14496 -1629 -7880 -513 7412 14594 9091 -7711 -9183 2542 4060
1109 4060 -913 -6480 -13985 -8757 4298 1563 -6443 -5085 -3299 988 8108 3645 -3084 3244 7397
1124 7397 5292 7853 5813 654 3876 3172 -6471 -7056 -2865 -5760 -5443 -6268 -11825 -5961 4599 2168
1140 2168 -1030 510 584 6602 14538 7274 -178 6337 10335 8954 7329 -2833 -9577 -1512 232
1155 232 -8465 -11771 -13130 -11937 -2565 -1500 -9897 -6213 2165 2231 2642 3176 391 8080 16456 9451
1171 9451 2711 6085 7988 9952 8318 -5317 -11927 -2067 1928 -3616 -7413 -12646 -9893 4019
1185 4019 6207 -6189 -9618 -5255 1563 11522 8908 -4786 -4522 6514 10561 10616 3389 -10364 -9089
1200 -9089 1884 1134 -4933 -8431 -12648 -6867 5530 3948 -2669 -400 356 2463 10436 9168 3158
1215 3158 5755 5982 4262 10992 11422 1594 -3693 -6957 -9119 -803 1601 -11975 -19662 -13472 -5199
1230 -5199 4818 4017 -12186 -16520 -649 11458 11276 2743 -9714 -4907 17162 23474 9292 -3471
1244 -3471 -7923 947 17480 13207 -8268 -15939 -7655 4129 12830 5367 -12406 -12464 1136 8090
1258 8090 8228 693 -11661 -7607 6966 9348 3649 -2093 -10177 -8340 2554 1512 -6605 -9974
1272 -9974 -13441 -10136 2876 6377 -901 -3601 -4037 -854 12484 16461 4285 -2984 -1003 5915
1286 5915 18300 17349 -2132 -11286 -2929 6281 10259 934 -18591 -20598 204 11838 6459 -5786
1300 -5786 -16126 -7443 13987 16566 -1619 -12992 -12121 -91 15132 9360 -10249 -13621 -3881
1313 -3881 3988 8368 333 -13625 -10705 2050 5889 6193 4003 -3019 387 10385 9962 5841 3360
1328 3360 -4091 -5637 2975 4041 -573 -3079 -8651 -10184 734 4534 -3374 -8316 -11422 -8629 5833
1343 5833 11412 1160 -5027 -946 6961 17073 15502 -1804 -7842 2340 10317 10757 2774 -12159
1357 -12159 -11314 5036 8857 -1169 -11183 -16937 -9955 5879 5019 -7630 -9528 -3800 3769 11634
1371 11634 6401 -5078 -2738 4101 2851 1778 -748 -6366 -2895 1811 -3271 -4799 -1533 -4122
1385 -4122 -4138 -766 -2249 633 8230 5881 2840 8782 12305 12526 13054 4504 -2050 3884 7614 1857
1401 1857 -3056 -8539 -11153 -2850 -264 -10524 -15084 -13124 -9966 -3188 -1652 -9149 -8060 3994
1415 3994 8630 8453 6353 176 1944 11188 8539 -82 -1211 -944 1583 6374 346 -7346 -2874
1430 -2874 1730 -1452 -3646 -6298 -6743 3804 9115 1290 -936 4284 7740 11800 8593 -3823 -5451
1445 -5451 3147 3876 -472 -4228 -9268 -5351 3243 -1198 -10259 -9979 -6953 -3662 1283 -2721 -6972
1460 -6972 921 7491 6253 7079 5824 2662 5742 6081 -928 -685 3206 582 -396 -1189 -5324 -2365
1476 -2365 2561 -3108 -8877 -6804 -4677 109 4609 -1895 -5758 2866 9275 8053 4557 -3982 -6078
1491 -6078 5922 11653 2801 -5160 -7140 -2123 10028 10128 -5234 -12374 -6163 642 5619 1156
1505 1156 -10837 -9172 4332 8457 4317 -702 -6074 -2320 7223 4533 -3191 -3023 -1819 -300 4966
1520 4966 3229 -1820 -155 -1225 -5916 -1884 2359 133 -1261 -3081 -4899 3396 11130 4689 -3341
1535 -3341 -4771 -2504 5832 9556 -2045 -10719 -3168 5820 9987 6259 -7781 -13118 204 9763
1549 9763 5506 -4209 -13333 -10010 8087 15153 2685 -8811 -10337 -3045 9490 8886 -7164 -12846
1563 -12846 -4076 5215 10248 5787 -6308 -6121 4870 7832 3401 -1528 -6814 -4334 4490 4783 92
1578 92 -183 -2898 -5543 -815 1595 -180 -822 -5355 -9357 644 10258 7729 845 -5018 -5439 6227
1594 6227 13621 1965 -9928 -8953 8 10732 10351 -6234 -15246 -4399 7687 8721 -368 -14656
1608 -14656 -15036 3397 14157 7395 -3219 -9157 -3479 11768 14189 233 -8439 -6256 802 9943
1622 9943 7301 -5461 -7918 596 4521 3699 -1393 -9964 -8126 1335 2213 -964 -759 -2511 -1411
1637 -1411 4133 3031 997 3068 -408 -6016 -1835 3755 4335 4672 -1380 -7559 107 8800 4411
1652 4411 -3701 -8630 -7534 4512 10667 278 -8819 -4380 4522 11037 7423 -7682 -12858 -666
1666 -666 8332 6052 -1192 -9449 -6346 6785 9653 -377 -6117 -5941 -2507 4437 2487 -5943 -4603
1681 -4603 2255 4264 4110 805 -4285 -544 5721 2483 -1267 -135 68 3210 6497 1431 -1451
1696 -1451 2989 3087 -1538 -3784 -6317 -4907 2325 439 -7879 -7409 -2412 1075 3430 -2188 -10248 -4845
1712 -4845 4413 3837 307 -1532 -857 7663 12134 3309 -2885 1379 5691 7383 5088 -3396 -4424
1727 -4424 5302 7266 1150 -2327 -3919 -2227 1937 -2802 -10642 -6411 383 1113 -302 -5019 -7166
1742 -7166 1799 8047 1497 -5382 -5791 -2493 4996 6444 -2948 -7204 -688 3304 3052 -836 -9473
1757 -9473 -8517 2844 6725 1126 -2128 -1716 4842 14782 12913 2230 79 3424 6214 7811 1835
1772 1835 -6281 -3065 2287 -1726 -6371 -7832 -8941 -5001 -3255 -9330 -9937 -2404 1176 1644 2305 1088
1788 1088 4841 11057 6683 -1979 -271 5088 7690 5884 -3888 -9432 -641 7937 3501 -5015 -11983
1803 -11983 -10780 788 6112 -3147 -9559 -5042 2180 8624 7610 -3144 -5457 3498 8590 6705
1817 6705 1211 -5389 -2463 7919 9298 1602 -2656 -4966 -3424 2280 203 -6212 -5092 -1221 -685
1832 -685 1565 1507 206 4094 5975 564 -616 2738 3302 2666 656 -5057 -3637 2921 -572 -9292
1848 -9292 -12544 -10484 -3581 1724 -6210 -14486 -6939 5588 12117 9714 -61 -4380 7509 18251
1862 18251 13170 3447 -1903 532 10267 11936 173 -7635 -4684 -341 2093 -1414 -10391 -10825 -1565
1877 -1565 2773 1202 -411 -4427 -3748 2137 2139 -2176 -1795 -2718 -4595 -2303 -1417 -2459 1205 1617 -4033
1894 -4033 -3860 -65 1646 3954 2422 -3954 -745 7916 9124 4704 -243 -3240 3207 11830 5502
1909 5502 -5853 -7622 -1472 7805 10592 -679 -12004 -6798 4126 6617 683 -10144 -13320 -2106
1923 -2106 6630 1526 -5599 -6739 -2913 5277 6217 -3392 -6806 -897 3005 4706 3086 -2110 -1457
1938 -1457 4134 3330 383 1431 414 -1008 551 -1087 -681 5247 5749 425 -1751 -837 1357 5100
1954 5100 1563 -7521 -8202 -2198 1368 894 -3775 -9994 -4738 5211 4451 -2158 -6222 -5426 4332 13131
1970 13131 7301 -2891 -2801 3755 9832 9677 -1094 -10557 -4582 3144 2355 -2005 -7365 -6945 1964
1985 1964 5896 -1443 -4762 -1821 1721 5727 4247 -2382 -1605 4955 4765 1495 -29 -2544 -1480
2000 -1480 331 -5413 -8959 -3356 363 -1285 -2760 -5379 -4058 5509 7395 747 -2009 -86 4291
2015 4291 9547 7305 -874 -133 5895 6610 3529 -2178 -7725 -4087 2857 -218 -6726 -8192 -7095
2030 -7095 -870 4301 -1160 -7446 -3963 941 2821 3206 -285 -1517 5545 8198 2737 134 -61
2045 -61 1424 4899 1544 -7206 -6673 200 1474 -8 -3414 -6485 -1030 5856 2192 -3602 -2613 1543
2061 1543 6594 7816 242 -4299 2312 7486 5246 -70 -6740 -7628 406 2287 -4560 -7239 -5892
2076 -5892 -3261 1473 664 -5073 -3045 2760 3350 2789 1865 366 3979 8391 4998 1171 2629 2480
2092 2480 1738 1077 -3204 -4558 607 978 -4187 -5735 -4806 -1164 4249 834 -7240 -6527 860 5190
2108 5190 5852 299 -5880 -22 8602 7063 -24 -4952 -5142 2284 7552 -570 -8828 -6301 460
2123 460 5725 4967 -4170 -8950 -818 5533 4559 1134 -3492 -3192 4525 6752 1006 -934 126 -307
2139 -307 1542 397 -3996 -2690 648 -1275 -2089 -304 -1186 -313 483 -3398 -2979 2789 3138 -413 -1941
2156 -1941 -2668 1453 8219 5640 -3057 -4434 -680 4162 7438 1131 -7505 -4794 3627 5580 2486
2171 2486 -4383 -8914 -1818 6204 1891 -5416 -7743 -4573 3851 7992 -122 -6993 -2936 3032 5702
2186 5702 4935 -2489 -4973 1843 5072 2134 508 -1085 -1413 2249 1684 -3411 -1694 1246 -388 -695
2202 -695 -896 -1574 1790 3509 -1498 -2786 1081 2532 1878 246 -4685 -2974 4964 5391 -612 -4036
2218 -4036 -5131 -575 6468 3085 -6194 -7108 -1962 2639 5068 -508 -7355 -3360 4368 4835 1465
2233 1465 -2718 -4643 2358 8563 4210 -1602 -2049 45 4337 5826 -759 -5450 -1709 659 -80
2248 -80 -241 -3106 -3189 911 462 -3429 -1270 1180 1069 1351 -707 -2681 2054 5650 1441 -1388 -1266
2265 -1266 -140 3395 2505 -4420 -6461 -393 3064 1851 -1876 -6754 -3835 5036 5601 -808 -4080
2280 -4080 -4126 747 7100 4043 -3478 -2823 1651 4173 4279 -572 -5665 -1546 4045 2282 -1331 -3078
2296 -3078 -3404 1469 4234 -655 -3801 -1275 154 844 1112 -2151 -1774 2704 1992 -1403 -538 88 1501
2313 1501 3429 -430 -4581 -991 2888 1765 -131 -2940 -4181 1482 4343 -1274 -4552 -2700 41
2328 41 3404 2119 -4439 -4610 2148 4636 2750 -57 -3842 -1397 5676 4799 -814 -1967 -493 2274
2344 2274 4781 799 -4494 -1451 2112 801 -1030 -3325 -4562 590 3524 -1449 -3982 -2032 -31
2359 -31 2525 2258 -2941 -2712 3191 3835 1233 -529 -2253 459 5561 2417 -4344 -3730 -669 1665
2375 1665 3117 -1697 -6119 -1795 3020 1951 268 -1580 -2606 2598 5302 931 -1114 826 2073
2390 2073 3476 2738 -2192 -2900 1409 617 -1904 -2735 -3984 -2840 350 -2106 -5165 -1828 967 613
2406 613 198 -2042 -1856 4480 6977 2463 -692 329 2664 6817 5293 -3025 -4337 753 3101 1725
2422 1725 -2645 -8084 -5020 2693 2398 -3259 -6022 -5178 841 6699 2918 -3706 -2278 2364 5038
2437 5038 5931 847 -3819 -670 3619 1304 -607 -2837 -4468 -760 1264 -2374 -3200 -853 -758 36
2453 36 1793 71 984 4135 1789 343 3169 3995 3082 2232 -1948 -3765 1602 3109 -1528 -5079
2469 -5079 -6705 -4644 1839 2047 -5108 -7036 -2958 1930 5405 2227 -4928 -2771 5670 8071 5030
2484 5030 -142 -3691 812 8120 5280 -2041 -4552 -3235 710 4445 -664 -6610 -4298 -559 606
2499 606 1019 -1641 -4080 106 2605 853 -15 541 -444 1328 2125 -854 -669 1367 -958 -2309 -962
2516 -962 -1049 -27 954 -2768 -4065 731 3422 2581 1110 -2576 -1934 4822 6860 1421 -2123 -2109 463
2533 463 5560 3811 -4028 -5305 -1146 1701 1781 -2024 -7411 -4635 2354 2826 -685 -3622 -4276 109
2549 109 5482 2494 -2295 -1475 528 2425 3946 715 -2314 925 2870 558 312 -473 -993 1755
2565 1755 1571 -1886 -1181 1574 880 231 -308 -1968 21 2368 -807 -3924 -2048 -696 1222 1369
2581 1369 -3041 -5210 -112 2898 1650 -183 -3394 -2430 3798 5302 602 -1269 10 1458 4782
2596 4782 3093 -3106 -2616 1553 1939 849 -920 -4290 -1510 3035 980 -1932 -1758 -1303 865 2928
2612 2928 -198 -1897 1420 2518 761 119 -1899 -2020 1655 1000 -3805 -3910 -1299 -366 1335 -501
2628 -501 -3827 -1224 3125 2400 497 -326 -545 3215 6222 2027 -1280 180 1639 3097 2441 -2319
2644 -2319 -4877 -1216 658 -483 -1808 -3736 -3482 650 1300 -2233 -1925 7 585 2057 1371 -1598
2660 -1598 924 4248 2734 870 368 -424 1685 2204 -1404 -3590 -772 212 -574 -1168 -4232 -3568 1788
2677 1788 2372 -1663 -2518 -1935 913 4960 3638 -1269 -562 2830 3478 3122 160 -3517 -1284 2026
2693 2026 -130 -2764 -3406 -3658 -454 1864 -1283 -3572 -1135 929 1841 2862 747 140 2994 3481
2709 3481 1369 1577 1276 385 1030 -550 -3546 -1981 250 -1588 -2091 -2648 -3488 -391 1795 -1073 -2836
2726 -2836 -736 1072 3250 3094 -1216 -1649 3334 4833 2490 23 -2959 -1625 3619 3092 -1885 -3388
2742 -3388 -2326 8 2810 691 -3842 -2752 531 824 542 -740 -2676 431 3715 1503 -45
2757 -45 653 -40 983 2379 -44 -1113 427 -434 -1490 -508 -1093 -1187 21 -1762 -4042 -1751 515
2774 515 206 894 -932 -2128 1784 4528 1881 -186 -294 -72 3075 3590 -1496 -3149 -199 1665
2790 1665 2331 530 -4112 -4153 810 2479 -68 -1804 -3181 -1236 3797 3192 -866 -1505 -28 1047
2806 1047 2564 528 -2644 -729 1912 969 509 -41 -1508 141 1455 -1047 -1862 -201 -892 -1244
2822 -1244 -527 -1205 -193 2105 -73 -2295 -581 711 1487 2435 94 -2091 1311 3453 1976 719
2838 719 -1152 -1882 1098 2349 -1598 -3162 -2534 -1139 1462 1541 -2709 -3393 92 1905 2143 1087 -2168
2855 -2168 -1530 2960 3447 919 335 -478 81 2614 725 -2623 -1711 -243 -702 -268 -1393 -2370 -148
2872 -148 1288 -461 -926 -243 -68 842 1327 -1141 -242 2811 2022 168 -263 -653 610 2730 274
2889 274 -3018 -1656 -92 351 1064 -1209 -3226 -354 1427 -76 -1031 -1434 -1341 1344 2710 -47 -692
2906 -692 907 1271 2165 1997 -1248 -1792 689 417 -298 164 -1361 -1032 1170 -262 -2191 -797 -210
2923 -210 -116 628 -557 -1744 1377 2679 611 69 154 -232 1577 1504 -1892 -2080 215 716 785 -221
2941 -221 -2699 -1474 2119 1124 -1539 -1738 -1791 -176 2625 945 -1729 -143 1087 1353 1689 -90 -1597
2958 -1597 407 1961 166 111 219 -314 929 1497 -1210 -1108 -44 -994 -1154 -774 -1809 -595 783
2975 783 -932 -1257 125 373 255 807 -869 -1997 926 2269 1121 672 -263 -582 2045 2333 -679
2992 -679 -1712 -1022 -435 1270 1007 -2469 -2244 941 1422 700 -611 -2593 -1306 2262 1469 -491 -190
3009 -190 -128 1042 2755 743 -1449 -168 396 -781 -485 -1201 -1927 -78 211 -1754 -980 504 -535
3026 -535 53 272 -581 982 2828 1139 460 1591 1717 1983 2557 -241 -2272 -156 233 -250 -733 -2711
3044 -2711 -3411 -515 426 -1451 -1533 -1937 -1686 1096 1494 -615 -536 968 1611 2650 2352 -586 -316 1810
3062 1810 1190 172 -151 -1849 -991 763 -271 -1480 -325 -633 -727 245 -672 -996 1295 1797 354
3079 354 828 1282 1161 2158 992 -1493 -882 608 -283 -1448 -1968 -3035 -1188 518 -1799 -3401 -2125
3096 -2125 -1202 519 1505 -863 -1422 1650 2762 2728 2887 1342 307 2357 2421 277 423 -357 -1067 255
3114 255 432 -1833 -1552 -779 -1753 -1039 -172 -1261 -926 427 134 371 1743 575 415 1379 39 -623
3132 -623 963 468 -995 -713 -1248 -1057 872 65 -2248 -1758 -636 -207 844 81 -1794 434 3018
3149 3018 2150 1002 262 -670 1335 2920 -85 -1903 -859 -100 760 650 -1368 -2409 -373 -6 -908
3166 -908 -427 -979 -1433 701 846 -431 633 1203 451 1068 1318 238 747 1009 -473 179 908 108
3184 108 134 431 -1162 -1208 666 -254 -1080 -487 -1474 -1242 942 951 -750 -456 -666 -192 1227 435 -1779
3203 -1779 -1061 1039 921 1175 528 -1308 222 2527 1057 -202 -786 -882 518 2095 247 -1088 673
3220 673 1000 313 470 -809 -1134 565 16 -1276 -321 342 -144 941 187 -1334 479 895 -812 -971
3238 -971 -201 -828 375 802 -1262 -974 339 -66 157 74 -1433 -1287 1150 1048 483 896 90 216 2405
3257 2405 1689 -93 134 342 -140 1279 473 -1537 -825 25 -396 -346 -1010 -2515 -1113 170 -901 -1224
3275 -1224 313 131 750 1492 81 481 1852 905 -471 557 202 461 1619 290 -1677 -565 327
3292 327 -307 -473 -1433 -2310 125 1439 -454 -728 -252 358 2044 1946 -439 -816 939 1025 926 1100 -993
3311 -993 -1091 719 305 -1289 -820 -1483 -1956 -156 -395 -1359 221 173 303 1144 1359 37 1004 1421 303
3330 303 872 1190 382 652 951 -541 -303 580 -821 -1628 -1044 -1903 -1405 507 -690 -1723 -332 330
3348 330 751 1308 25 -1059 781 1804 724 667 93 -414 1379 1839 -586 -1491 -365 -1064 -194 -126
3366 -126 -2002 -1790 466 22 21 458 -521 -37 1743 613 -301 1032 897 191 1138 453 -353 629 527
3385 527 -1257 -871 -607 -1473 -774 -223 -1484 -505 869 48 43 337 -947 -17 1826 853 196 607 404
3404 404 614 1774 489 -1024 -58 -125 -374 119 -885 -2218 -270 620 -888 -384 -431 -1337 577 640
3422 640 -998 -421 851 647 776 985 -112 374 1607 373 -862 16 -268 -24 695 -1079 -1540 293
3440 293 613 -372 -317 -916 -1222 702 885 -851 -299 526 556 1701 1190 -792 92 1129 300 -65 -48
3459 -48 -1170 -378 819 -493 -608 -49 -833 -1051 403 -335 -1376 -126 37 -223 909 711 -85 1076
3477 1076 1105 -188 401 820 -178 378 305 -1015 -129 849 -572 -1263 -616 -1187 -395 808 -926 -1642 0
3496 0 1196 1135 1165 -193 -842 1472 2045 486 -180 -434 -63 1205 1136 -1216 -1061 -24 -492 29 -412
3515 -412 -1970 -1227 344 -277 -384 182 -562 139 1058 346 -221 736 57 -274 884 561 -130 1032 410
3534 410 -787 43 142 -734 -124 -461 -1360 -172 994 -39 -188 79 -191 957 1892 247 -419 93
3552 93 381 1051 1545 -703 -1463 547 214 -111 -509 -1646 -1786 371 569 -1096 -1293 -552 -192 1097
3570 1097 595 -1161 -744 928 358 677 769 -146 335 1416 140 -182 583 -276 -271 482 -729 -378 577
3589 577 267 -638 202 94 -542 465 56 -1095 -363 673 44 691 175 -625 719 1603 14 -325
3607 -325 -350 -684 417 1061 -820 -1145 10 0 213 492 -1273 -1163 703 649 -266 61 -387 -285 1450
3626 1450 1167 -499 -20 446 167 600 141 -1172 -117 853 -183 -517 -337 -889 -344 379 -1062 -1184
3644 -1184 535 133 -72 719 -165 164 1540 986 -384 390 602 489 1239 421 -1003 33 878 -147
3662 -147 -427 -770 -1725 -568 199 -1170 -1332 -167 -425 -88 902 -381 -329 945 631 373 780 88 86
3681 86 1296 879 -509 18 -119 -308 184 -545 -1665 -627 197 -642 -216 -476 -751 481 1345 193
3699 193 -203 682 442 817 1318 -430 -641 1058 334 -569 -730 -1366 -1596 -57 -696 -1722 -744 -215 -382
3718 -382 411 -73 -838 881 1567 678 642 1218 261 1413 1675 -181 -178 628 143 -204 -259 -1276 -1416 105
3738 105 -759 -1254 -846 -800 -617 763 -198 -1015 170 734 534 1052 373 -522 870 1480 210 -114 -332
3757 -332 -648 264 396 -1098 -1091 -76 -156 78 344 -499 -440 1018 725 -8 665 52 728 1311 541 -651
3777 -651 435 468 -385 -164 -724 -1414 -109 -1 -1546 -1306 -136 -536 354 -66 -1227 -346 1266 524
3795 524 164 535 197 614 2199 805 -410 84 194 182 570 -333 -1762 -442 30 14 -249 -711 -1257
3814 -1257 -35 703 -577 -620 -353 -280 599 1023 -395 -443 588 131 432 217 -722 -206 862 291 -621
3833 -621 111 19 -115 348 -166 -937 127 437 -355 -90 79 -83 902 696 -918 -401 566 365 111 -208
3853 -208 -1002 -440 1127 40 -762 -524 -499 -154 883 -394 -1511 -245 474 349 563 -303 -921 732
3871 732 1406 250 30 -130 -326 1084 1207 -327 -609 261 -238 324 305 -1002 -702 190 -344 -893 -349
3890 -349 -727 -622 510 -247 -884 -150 362 -12 602 234 -211 1062 881 -332 402 304 197 1174 215
3909 215 -1191 -580 444 -103 -558 -611 -1018 -193 894 -188 -859 -269 44 537 933 -246 -895 856
3927 856 1010 477 396 -350 -913 282 672 -701 -991 -577 -753 169 251 -1009 -793 505 265 239 208 -401
3947 -401 69 1419 488 118 420 245 303 907 16 -957 144 103 -567 -490 -831 -1211 -16 80 -1145 -377
3967 -377 50 93 399 513 -392 257 1586 849 246 314 133 256 1231 17 -951 -441 -161 -108 -214 -1079
3987 -1079 -1336 132 366 -389 -438 -470 -282 1124 1031 -424 -143 823 693 873 745 -837 -419 715 -34
4006 -34 -293 -505 -1084 -352 448 -555 -1091 -307 -262 -15 498 -44 -277 757 994 236 483 539 -197 1115
4026 1115 644 -479 -141 452 -198 -6 -482 -1171 -225 782 -422 -849 -369 -492 68 676 -452 -736
4044 -736 674 913 769 307 -510 -191 1182 960 -403 -472 -198 -156 551 -43 -1322 -783 252 -34 -132
4063 -132 -190 -829 -118 657 305 -46 13 56 671 1047 -122 -450 686 452 161 540 -440 -608 295 -25
4083 -25 -1068 -372 -427 -361 77 -24 -934 103 520 196 170 260 92 371 1211 286 -516 369 693 601 379
4104 379 -738 -707 510 365 -457 -530 -980 -525 363 412 -1202 -585 319 285 1102 227 -598 78 1331 643
4124 643 298 120 -602 494 875 -253 -534 -249 -438 -87 307 -520 -909 -5 110 -595 250 181 -272 490
4144 490 546 -63 486 513 432 633 271 -591 291 749 -446 -647 -191 -435 218 482 -1132 -868 5 277
4164 277 199 49 -636 -272 1262 940 -254 -413 100 292 1174 349 -780 -494 395 345 200 -683 -1493 -288
4184 -288 307 -93 -593 -479 -653 281 1087 -192 -159 428 522 397 735 -203 -198 1063 439 -208 62 -77 -393
4205 -393 149 98 -990 -248 290 -318 -162 -116 -399 299 620 -343 -359 403 404 520 304 -382 -387 764 549 -249
4227 -249 -500 -758 -147 700 158 -1215 -621 -158 372 732 -312 -1490 -122 951 345 193 -153 -690
4245 -690 628 1322 88 -376 -273 27 490 661 -591 -946 -96 74 -232 81 -677 -556 308 178 -497
4264 -497 -113 -1 216 394 -3 -235 532 709 -151 198 275 197 587 355 -532 -216 199 110 -244 -440 -915
4285 -915 -393 677 -204 -826 -708 -278 123 666 32 -831 -31 769 588 472 -234 -719 564 1179 369
4304 369 -439 -555 -762 469 721 -882 -1155 -224 57 57 293 -473 -336 571 594 65 97 235 -75 837 526
4325 526 -224 211 111 -96 -87 -81 -492 -254 44 -874 -610 -419 -305 -18 220 -197 103 951 446 207 249 -230
4347 -230 724 1272 203 -277 145 553 65 179 -697 -1124 -459 205 -364 -342 -874 -764 145 909 -253 -352
4367 -352 -53 23 1084 1094 -350 -165 539 897 497 178 -717 -552 566 71 -752 -667 -498 -346 551 36
4387 36 -781 78 365 20 218 225 -81 635 602 -86 -18 685 -37 -200 -110 -630 -640 75 -374 -827 -472 -332
4409 -332 -149 414 -131 -727 481 718 331 643 -18 -90 914 1113 233 159 -208 -147 508 434 -598 -822
4429 -822 -204 -45 163 -207 -1211 -791 240 135 -275 -94 -386 -50 827 466 -296 167 248 200 492 53
4449 53 -561 94 388 -377 -282 -243 -110 -138 -120 -489 -199 253 -35 9 96 -61 290 750 176 -678 265 228 152
4472 152 169 -303 -477 279 51 -169 -363 -513 -632 221 453 -487 -572 56 341 694 337 -910 27 612
4492 612 473 414 139 -434 281 766 514 -448 -256 -386 38 472 -174 -949 -409 107 -174 51 -109 -545
4512 -545 360 490 -105 24 194 166 222 662 -158 173 714 -113 -25 419 9 26 453 -446 -688 171 71
4533 71 -184 -166 -687 -478 474 482 -160 -344 -376 -19 841 498 -826 -383 573 597 333 -20 -723 -125 442 254
4555 254 -101 -63 -585 -109 382 65 -466 17 -206 197 792 -20 -262 362 475 183 670 19 -348 349
4575 349 358 -248 -99 -307 -375 -154 40 -577 -28 116 -346 -468 -35 73 160 578 107 -208 619 805 -87
4596 -87 -4 -71 -71 562 273 -657 -459 -176 64 455 -123 -945 -91 199 253 -167 -120 -532 470 909 250 -120
4618 -120 97 -99 306 804 198 -347 -192 89 60 166 -319 -874 128 233 -104 -336 -54 -414 -67 421
4638 421 -315 8 205 -23 316 479 219 56 355 -169 -41 79 268 -103 30 -365 -493 201 108 -813
4658 -813 -137 -351 -65 774 79 -461 -67 395 599 624 117 -567 84 818 417 -175 -336 -390 -35 310 -240
4679 -240 -781 -505 -230 -8 94 -520 -429 444 330 71 32 -94 -394 579 458 10 202 67 -213 -104 406
4700 406 -426 -213 -335 -673 -158 394 -321 -377 222 -333 -287 322 32 241 291 -71 -3 544 624 -215 150 -25
4722 -25 121 333 -112 -819 -295 341 19 -389 -539 -593 -212 708 -176 -487 -143 -222 316 484 -249 -269 143
4743 143 430 284 193 -185 -210 348 74 -343 -17 -117 -283 57 133 -452 -238 3 -135 297 155 -309 159
4764 159 421 193 219 524 -217 -96 329 -53 -234 183 154 -174 -129 -532 -410 139 -148 -393 -218 396 -75
4785 -75 225 263 -444 176 589 231 166 -38 -299 532 763 -220 -686 127 -142 -124 251 -364 -594 132 133 -119
4807 -119 -349 -356 -319 547 411 -164 36 313 -8 531 413 -274 -42 308 2 107 76 -360 18 373 -114
4828 -114 -241 -200 -496 -364 92 -83 -163 304 -45 224 310 264 -93 209 303 -90 370 343 43 -129 -82 -442
4850 -442 -176 483 -268 -288 -371 -238 142 399 -618 -562 252 543 754 265 -375 -76 589 276 -171 -106 -575
4871 -575 -69 306 127 -651 -228 59 -221 109 -1 -661 -187 176 100 139 253 -26 196 354 349 340 108 122
4893 122 0 283 387 33 203 -267 -375 64 25 -287 -432 -382 -651 95 106 -120 -121 -194 -196 -6 671 -249 -54
4916 -54 335 122 595 521 -470 -489 187 116 69 -57 -447 -777 601 325 -266 -267 -355 209 671 516 -333 -365 312
4939 312 94 441 247 -298 -33 211 -35 -74 -263 -364 -232 -114 125 -141 150 -172 -285 134 -79 19 129
4960 129 99 12 425 501 -42 226 108 3 310 552 -190 -588 -250 -150 -77 464 -601 -540 -53 -10 32 -170
4982 -170 -575 -442 238 227 254 -191 -187 294 602 659 -325 -35 -31 115 377 251 -535 196 345 19 -145 -252
5004 -252 -632 -96 137 -66 22 196 -39 88 110 204 97 402 -36 -203 387 110 -144 15 -115 -367 122
5025 122 -80 -447 -164 -263 -366 16 65 -91 -260 229 102 279 325 -382 -430 447 496 -181 110 -411 -64 466
5047 466 84 -301 -299 -417 -299 58 -113 -652 -586 -125 145 330 -107 -242 177 626 167 -103 229 218 350
5068 350 490 -287 -340 179 -172 -217 52 -360 -200 -46 -204 -144 75 -133 -156 23 132 27 268 510 -309
5089 -309 104 293 220 -14 26 -221 65 4 -246 -232 -203 -221 -359 465 42 -222 -299 1 6 702 115 -126 150
5112 150 361 374 300 75 -365 150 505 107 -302 -204 -133 49 173 -250 -488 -282 -66 27 350 -364 -196 210
5134 210 -31 -89 390 -209 86 398 -11 220 297 160 -238 54 -27 31 -233 -180 -125 153 312 52 -25 -175
5156 -175 -229 -36 456 80 -237 117 -11 271 611 -112 -562 -14 48 -109 131 -140 -867 -180 56 73 -124
5177 -124 -277 -713 26 508 185 -80 -163 169 498 478 254 151 -37 -4 181 298 -237 -314 51 -69 -235
5198 -235 307 -506 -447 -182 -272 -138 167 -205 -201 152 0 199 216 265 -49 336 377 266 67 47 -127 455 552
5221 552 -206 -590 52 -290 -68 256 70 -408 -88 255 268 338 31 -258 367 243 279 71 -91 -113 376
5242 376 357 -182 -76 2 -185 -173 81 -520 -349 -103 -200 -271 244 -182 -382 273 162 -130 386 192 -62 152
5264 152 369 117 51 178 -275 -82 161 -242 -281 -241 -419 -200 332 161 -379 -85 -388 260 485 -12 -74
5285 -74 215 43 538 493 -87 -484 224 28 42 372 -351 -435 94 215 -224 -78 -90 -222 104 57 27 -66 -155
5308 -155 241 172 84 -36 -119 159 -53 -136 322 -51 -266 21 -135 -277 -20 -301 -244 -12 80 -260 115 6
5330 6 -165 -62 537 249 147 266 -49 18 394 200 -177 196 -42 -327 366 -311 -500 53 -224 -207 -41
5351 -41 -417 -274 151 271 -99 223 -187 -161 550 267 -147 -156 136 -55 192 -79 -93 -224 106 -152 107 19
5373 19 -345 -113 98 39 -277 -19 76 -50 452 328 165 289 287 187 164 -78 -161 125 -18 -140 -227 30 -96
5396 -96 -170 -170 -125 204 220 -229 -82 193 41 79 30 -149 62 165 236 -139 -1 -195 133 373 416 -287 7
5419 7 -233 13 43 -113 -443 -313 173 63 143 -191 -348 -7 570 281 -14 -39 -43 18 206 91 -249 104 -207
5442 -207 -62 147 79 -419 -401 -153 -122 81 -37 -281 -16 160 92 158 520 -170 -138 188 123 155 -148 -97 -198
5465 -198 459 -142 101 -429 -451 -55 333 137 -240 -189 -373 16 413 106 -361 -282 310 349 481 319 -528
5486 -528 -266 366 -93 92 -98 -231 -179 192 149 -263 -79 -281 -126 149 332 -270 -249 55 -2 478 162
5507 162 10 80 57 263 198 28 -171 -123 -52 4 -42 -40 -674 -521 130 112 -44 -143 -690 -2 478 308 286 -242
5531 -242 90 130 492 285 -173 18 -67 255 326 28 -408 -327 22 -62 67 182 -429 -151 465 361 87 -71
5553 -71 -120 41 132 222 154 161 -86 -90 170 88 140 -184 11 -25 92 95 -329 -204 -42 -307 291 405 -202 -346 257
5578 257 234 -106 -23 -188 38 725 392 24 59 -350 -82 149 400 -482 -270 -366 -50 59 9 -442 -352 -215
5600 -215 -23 -3 -62 -98 110 379 2 275 -56 -121 174 298 107 -98 -52 -294 71 212 121 -36 -245 -187
5622 -187 -222 11 -100 -199 179 -270 -267 314 142 -287 156 117 -162 288 347 -30 -221 271 -56 -473 -55 -598
5644 -598 -369 71 -86 37 -115 -137 75 258 49 -110 -59 185 -122 349 346 12 321 403 201 161 195 -268
5666 -268 -151 191 -267 -191 -339 -209 -173 -53 -240 -214 224 -34 113 182 -77 -112 372 381 96 218 82 -65
5688 -65 202 251 -196 -18 -112 17 -58 -245 -111 -215 -64 -139 168 334 -57 -173 -51 77 141 314 31 -33
5710 -33 49 158 372 240 -352 -639 15 352 46 -206 -149 -246 219 82 5 -188 35 126 632 384 -187 -214
5732 -214 34 5 376 357 -399 -272 58 27 -37 -100 -865 -400 18 -33 -282 -48 -51 -51 158 425 249 -283 138
5755 138 123 328 325 7 -113 -66 -100 -30 264 -270 -252 -207 -280 -8 -152 -426 -654 -223 279 72 99 -548 -116
5778 -116 397 567 340 -176 176 -72 135 460 -181 -378 -275 -240 446 31 -400 -341 -3 34 67 233 -127
5799 -127 -93 442 371 32 214 86 -241 350 75 136 239 -158 -308 29 -53 -341 10 -306 -198 -208 166 -149
5821 -149 -263 -173 92 278 256 -293 -255 229 24 293 413 -216 -489 113 142 114 175 -421 -502 166 236 -118 -156
5844 -156 -179 -152 264 267 -368 -349 77 151 269 268 -205 -76 236 196 169 93 -125 -383 174 25 -37 -470 -308 -315 257
5869 257 107 6 -100 -155 -300 31 323 121 62 289 -254 424 570 -75 -121 -111 -135 178 295 -438 -303 51
5891 51 183 117 170 -68 -282 144 259 -93 -11 -420 -209 588 351 14 -83 246 171 284 288 -360 -20 224 -10
5914 -10 -1 24 -425 -194 124 -53 -380 -106 -277 -198 -82 64 82 81 157 -228 166 -73 -32 172 185 -68 -14 229
5938 229 -185 -107 -26 -100 -171 74 -213 -99 82 122 -14 106 51 -252 168 -6 232 -76 -171 -27 595 149
5960 149 -230 -59 14 34 64 318 -262 -299 15 -4 -121 -243 -177 24 217 166 82 -27 17 49 376 161 4
5983 4 62 -65 -5 -108 -83 -348 99 185 -236 208 -16 -211 165 309 112 -137 7 335 79 311 -63 64
6005 64 206 78 -11 194 -245 -467 130 -240 -367 123 85 -205 16 111 -185 273 -50 -222 -127 469 -45 303
6027 303 -106 -322 306 255 215 -73 -131 -310 48 507 -98 -254 -246 -26 232 -184 -439 -439 17 217 77 181
6049 181 -45 -13 213 612 319 77 108 -143 248 408 61 -72 -35 -404 18 -8 -135 -361 -98 -381 -56
6070 -56 179 -283 77 -114 -65 292 254 145 -248 -191 260 346 586 207 -280 -190 239 140 -282 -474 -389 74 304
6093 304 38 -476 -269 -218 426 571 132 -261 -103 258 307 148 -110 -555 50 272 29 55 -291 -430 125
6114 125 99 84 30 -247 -78 -104 160 -76 -185 185 53 54 332 76 -86 4 53 231 524 168 -298 -458 18
6137 18 26 49 -170 -594 -236 -31 93 339 -166 -688 -217 539 119 180 -30 -13 197 593 46 -309 -170 -6
6159 -6 305 325 -180 -528 -382 68 37 300 -457 -298 65 174 -109 320 -148 -316 171 246 129 34 -50 -78 -311
6182 -311 285 18 61 -161 -709 -205 263 117 -127 -115 -454 -96 381 189 -280 26 129 75 262 -188 -306
6203 -306 324 140 -197 46 -89 -596 -20 220 -146 -181 -149 -564 102 329 -50 -332 -4 -32 433 580 -79
6224 -79 10 292 94 29 -19 -145 -273 153 17 -68 -197 -36 -286 -229 -76 -472 -49 41 -247 -12 20 164 247
6247 247 -132 -4 -107 54 165 33 -38 -118 -33 257 104 -303 -54 15 64 142 -109 -328 109 316 30 -34
6269 -34 -226 17 251 237 -65 206 37 155 156 222 -193 -169 172 473 193 -56 -271 -215 58 -423 -297 -176
6291 -176 -521 7 198 64 -430 -288 371 518 351 80 -193 131 568 212 -50 -132 -89 -289 195 -263 -175
6312 -175 36 -337 -530 21 -136 -111 211 149 -113 271 -30 36 -36 -149 277 121 -1 -268 -121 260 342 42
6334 42 17 -481 -683 48 -49 -12 230 -511 -296 242 293 43 -244 -190 -4 621 407 -260 -100 56 217 357
6356 357 164 -377 -295 228 1 -51 -257 -498 -268 23 -37 -234 0 -144 61 442 213 -241 406 -51 -104
6377 -104 126 252 147 78 -14 -337 185 222 -210 -303 -452 85 264 105 -438 -419 -36 169 343 86 -733 -24
6399 -24 527 397 80 -175 -37 -472 155 250 -386 -310 -141 56 462 87 -335 -519 106 144 146 -79 -354 -212
6421 -212 310 142 99 -78 -115 31 282 71 -78 204 -243 67 136 -152 -134 -95 -276 -286 91 161 -192 -162 -124
6444 -124 6 507 213 196 -241 24 170 367 80 -508 -293 599 347 48 -221 -347 -497 227 -35 -177
6464 -177 -177 -775 -142 579 242 -268 -36 134 234 302 202 -507 64 17 -65 160 -259 -199 -295 240 -52 26 -45
6487 -45 -241 -486 94 -45 -80 178 -247 -28 393 220 257 96 -119 -170 344 322 44 -107 -260 -83 48 190
6509 190 -728 -491 -340 133 53 46 -565 -378 361 524 178 -33 -225 371 527 200 -177 -50 -84 300 485
6530 485 50 -82 -213 132 -235 -527 -373 -405 -310 170 -353 -184 91 -133 14 311 -106 71 208 81 194
6551 194 191 -106 145 367 45 -389 186 -135 -52 -251 -218 -140 168 110 40 69 -48 -74 356 56 -423 15 34
6574 34 -114 44 200 -459 -216 270 -18 -256 -9 -100 -24 132 -234 -138 -52 102 91 58 -207 -88 441 455 327
6597 327 94 447 -37 636 170 -494 -231 342 -62 -148 162 -392 -224 30 130 40 -226 -536 -602 308 78
6618 78 -4 65 178 58 98 382 -103 11 83 -5 42 57 -64 -125 -87 -197 -39 286 -100 -375 -458 -333 196 87
6642 87 6 -430 -99 163 244 263 -272 -185 239 326 138 -12 -325 -310 231 204 -355 -179 -273 107 114 3 -122 -34
6666 -34 23 -26 384 65 -267 -38 314 473 -90 267 -250 -189 221 321 -24 -138 -311 -279 111 44 -371 -217
6688 -217 -46 -396 486 267 -276 -90 30 -282 208 315 90 101 26 182 89 266 -371 -271 -39 122 190
6709 190 23 -226 -634 210 367 123 -174 -683 -108 691 397 84 -427 -154 217 346 289 -241 -182 347 100
6730 100 399 210 -325 -585 248 71 22 6 -128 -276 335 -25 -5 10 -111 -182 180 286 219 174 208 -11 47
6753 47 370 -6 -490 -210 -347 155 394 -398 -593 -182 237 556 454 -453 -288 43 173 494 100 -136
6773 -136 -81 339 641 91 -7 -328 -4 29 270 -439 -674 -242 147 -34 -90 -338 -323 187 307 230 395 -90
6795 -90 -13 89 125 -70 279 12 -174 12 -7 -26 -34 -263 -384 -93 185 -39 18 -358 -76 333 180 12 59
6818 59 -131 93 358 459 -95 -75 325 31 333 56 63 -263 -4 232 37 -114 -437 -385 299 54 -68 -154
6840 -154 56 47 606 327 -164 -307 402 54 225 255 15 -39 132 -121 -103 12 -128 -177 -9 -273 -263 307
6862 307 -43 24 90 25 77 312 -83 -499 78 54 45 286 63 -501 50 203 -471 -107 124 117 -249 -69 96
6885 96 -87 160 28 -138 253 -127 -114 341 51 -79 216 46 60 116 223 -9 -49 139 38 -313 -214 -222 -25
6908 -25 129 -36 -254 -84 2 299 349 9 -195 28 169 0 227 -97 -303 227 214 54 235 -61 -188
6929 -188 186 -64 -213 -65 -148 -245 75 144 -92 176 -176 -213 -240 364 128 -108 117 9 280 268 118 -57
6951 -57 -103 -234 166 175 -209 -473 -209 233 -77 136 -511 -576 -27 370 -69 -31 237 -114 22 498 -328 -171
6973 -171 66 -153 249 213 -5 -430 -221 -109 69 -104 -328 -299 285 354 -164 -22 -132 -502 400 183 24
6994 24 273 137 -334 248 587 1 40 106 -262 -116 187 -174 -200 -207 -305 -390 484 -109 -514 43 4 336 372
7017 372 158 -415 140 491 661 -11 -217 -49 357 507 24 -569 -138 -456 -122 348 131 -122 -127 -187 197
7038 197 357 -159 -391 109 408 92 35 -91 50 396 419 417 192 0 -315 -100 2 -97 -37 -391 -415 9
7060 9 116 255 -42 -237 -380 209 441 301 -53 150 49 134 655 -93 -112 129 78 -81 -24 -399 -579 60
7082 60 203 49 -99 -291 -329 202 667 -77 83 95 -281 259 511 64 -90 95 -202 181 10 -130 -256
7103 -256 157 -210 -191 -94 -351 -215 147 -104 -168 59 -81 113 142 283 263 130 277 47 -131 447 131 -75
7125 -75 141 -248 -164 197 -249 -252 -327 -259 -111 81 88 -339 -253 3 110 267 -90 -134 272 295 257 276 78 91 89
7150 89 369 -259 -301 -65 -360 -121 370 -401 147 276 -61 43 218 3 141 176 215 45 133 307 23 372
7172 372 101 -36 48 -69 -50 -164 -15 -221 -144 25 -243 -92 125 95 76 -118 -289 21 304 -80 -110 -21
7194 -21 156 -160 280 87 -213 30 -179 -15 24 -149 36 161 -127 -167 66 97 -301 49 7 -280 172 524
7216 524 181 338 318 -125 349 548 23 -266 -102 -320 8 18 -114 -222 -184 -168 -298 -264 -163 -403 258 178
7238 178 20 53 133 -372 293 298 -81 46 137 -116 -59 184 -188 -42 221 -212 -277 -126 -181 -126 -93 -173 -54 399
7262 399 -55 62 47 -5 352 236 187 -433 290 52 285 -11 -306 -382 169 343 -196 -213 -336 -267 170 382
7284 382 -163 -361 113 231 182 454 -49 -318 146 187 259 342 -108 -248 -261 51 -6 -144 -456 -289 -30 105
7306 105 -308 -239 -57 -220 28 423 218 145 83 224 -143 528 197 -98 -158 -169 41 267 -79 -655 115 75
7328 75 -122 62 -33 -723 -139 372 -46 -66 -68 -354 125 656 117 -81 29 -199 -45 560 196 -413 -151 -21
7350 -21 -21 311 -50 -501 -229 -102 41 -15 65 -357 28 268 -27 309 101 102 161 329 -80 141 -15 -14 65 275
7374 275 91 -408 -260 -442 -77 333 -307 -353 -176 -126 55 230 40 -386 -33 72 265 367 81 -304 112
7395 112 277 -173 464 -222 -487 56 150 -354 -344 -268 -206 106 120 -24 -188 -9 126 -4 486 95 68 333
7417 333 114 -94 191 149 -281 -77 20 -209 176 14 -245 -304 -34 68 -17 93 -299 -16 192 -120 150
7438 150 383 -236 212 307 91 -85 211 81 83 189 -116 -156 89 -249 -128 -34 -105 -538 -49 -229 -61 -36
7460 -36 -102 -228 202 322 144 -72 212 20 -1 164 155 176 38 -129 25 64 -53 -96 171 22 -363 214 39
7483 39 -272 244 -40 -164 164 147 -156 356 -102 -140 243 434 162 -82 241 -219 -245 45 -133 -78 -136 -149
7505 -149 -173 -33 -11 -24 306 116 -170 208 354 -194 250 81 -25 261 70 66 27 85 -121 -96 -46 -411 -161
7528 -161 164 105 -3 -208 18 -68 443 -106 -113 191 9 256 636 164 -360 265 308 134 -31 -130 -248 46
7550 46 269 -95 -205 -235 -663 -157 230 95 -243 -14 -21 110 429 128 -259 298 -168 -46 513 182 -120
7571 -120 183 -90 -154 260 -167 -304 -298 -24 40 -205 -161 -280 37 252 122 49 -151 -237 117 648 89 13 44
7594 44 16 194 387 363 -206 -100 25 -147 132 -145 -404 -107 -206 -13 -29 133 -286 -204 63 64 107 -70 -24
7617 -24 -23 268 141 -106 -33 -398 -153 199 100 37 -50 -203 -218 70 -33 -255 46 3 179 93 133 -301 242 312
7641 312 356 212 -132 -77 -119 499 77 108 35 -425 -64 17 -87 -133 -412 -452 -210 394 144 -69 -332 160 -30
7664 -30 231 126 -147 90 88 78 68 42 -503 -331 178 -164 92 -95 -477 -64 -16 -188 230 -58 -267 -30
7686 -30 424 289 240 372 93 -14 641 210 -227 -2 37 102 249 -134 -439 -93 199 -78 212 64 -441
7707 -441 -2 406 78 220 215 5 194 256 405 194 -13 -347 -56 501 181 -380 -206 -127 -141 142 62 -91
7729 -91 -122 -85 -151 -43 434 -131 -354 325 18 227 383 71 -142 276 252 -8 98 -287 -328 89 314 -214
7751 -214 -94 -305 154 153 -307 17 -13 128 -164 14 -7 -82 252 47 -142 176 293 72 -104 271 -213 -137
7773 -137 122 -241 -166 -162 -135 -366 -375 -200 105 310 -73 -122 339 -82 111 315 274 202 -83 102 -133 -86 131
7796 131 121 86 181 -115 -86 47 -205 -85 72 -268 42 107 -40 -201 37 2 41 257 281 76 56 42 38 133
7820 133 331 -122 -96 24 -59 98 -48 -115 -213 86 130 143 182 17 -4 517 -26 -24 249 -1 112 383 179
7843 179 -436 -162 -97 -180 116 -7 -443 -159 -91 57 -217 -66 -294 -124 350 -19 317 -72 -42 -30 325 104
7865 104 102 112 -106 18 204 63 -194 -21 -409 -11 -79 -118 -60 -399 -154 -169 126 245 -388 -222 -26 26 223
7888 223 202 -35 -32 411 203 114 186 -281 -182 256 -65 -159 -171 -249 -112 363 -122 -75 -14 -214 -54 41 323 -4
7912 -4 -237 21 -49 314 586 -56 19 -35 -76 -127 -77 -385 -417 -136 21 -96 106 -458 -106 -18 221 -1 91 96
7936 96 -189 273 434 -227 36 -23 88 10 63 -123 -512 26 67 333 4 -310 -403 258 -44 63 -87 -343
7958 -343 -167 312 42 33 302 -168 -179 159 156 83 65 -66 -372 69 210 -94 1 -261 -184 11 164 -194 -363
7981 -363 140 -56 198 320 -187 -219 316 191 326 150 -109 -102 217 201 -118 105 -244 -405 103 288 -271
8002 -271 -158 -277 -181 329 202 -241 -135 57 310 67 194 -25 112 212 293 -83 122 -175 -25 -148 -156
8023 -156 -335 66 -40 56 -15 187 -211 36 110 18 55 396 -52 158 379 -86 96 150 70 115 308 2 50
8046 50 217 -491 -225 -27 -99 -148 -12 -118 -130 84 18 -99 -2 -73 -148 245 230 281 60 187 -96 173 209 -243
8070 -243 128 69 -338 -26 131 238 65 -49 17 -48 96 -172 -41 271 204 -134 247 261 -219 -8 -37 90
8092 90 187 -5 -87 120 -34 150 -129 -227 -370 -40 149 3 -61 32 -209 -1 228 336 354 -5 210 -120
8114 -120 115 -52 -177 61 132 67 183 110 16 130 -190 -313 54 106 -230 87 319 322 177 265 143 20 284
8137 284 69 459 117 -202 -141 15 -178 -169 142 -328 -548 -207 -141 -459 -201 -302 93 148 400 -164 -83 126
8159 126 42 439 49 -141 -170 61 34 236 -112 -138 3 -48 -7 80 104 -362 -212 -116 -112 -91 184 -213 -94 231
8183 231 423 47 -159 -29 -93 274 149 -232
8191b32
##END NTUPLES=NMR FID
##END=
