##TITLE=1H_EC-3133(II-2)
 CDCl3, 8 sc, 
 11.2.2019
##JCAMPDX= 6.0         $$ Bruker NMR JCAMP-DX V2.0
##DATA TYPE= NMR FID
##DATA CLASS= NTUPLES
##ORIGIN= UXNMR, Bruker Analytische Messtechnik GmbH
##OWNER= root
$$ XWIN-NMR		Version 3.5
$$ Mon Feb 11 14:18:57 2019 Russian Standard Time (UT+4h)  she@DPX200
##.OBSERVE FREQUENCY= 200.1313
##.OBSERVE NUCLEUS= ^1H
##.DELAY= (6, 6)
##.ACQUISITION MODE= SIMULTANEOUS
##.ACQUISITION SCHEME= undefined
##.AVERAGES= 8
##.DIGITISER RES= 18
##SPECTROMETER/DATA SYSTEM= spect
##.PULSE SEQUENCE= zg30
##.SOLVENT NAME= CDCl3
##.SHIFT REFERENCE= (INTERNAL, CDCl3, 0, 15.7039)
##AUDIT TRAIL= $$ (NUMBER, WHEN, WHO, WHERE, WHAT)
$$ ##TITLE= Audit trail, XWIN-NMR		Version 3.5
$$ ##JCAMPDX= 5.01
$$ ##ORIGIN= Bruker BioSpin GmbH
$$ ##OWNER= she
$$ F:/spectra/data/she/nmr/H-F/1/audita.txt
$$ ##AUDIT TRAIL=  $$ (NUMBER, WHEN, WHO, WHERE, WHAT)
(   1,<2019-02-11 14:18:01.35 +0400>,<she>,<DPX200>,
      <created by zg, POWCHK disabled, PULCHK disabled
       configuration hash MD5:
       00 E9 B6 7A A2 85 ED C7 34 08 36 98 17 FE 4E 26
       data hash MD5: 16K
       B4 92 9A 4B 1B 95 B7 39 01 FB AB C1 39 AE 8E 8D>)
$$ ##END=
$$ 
$$ hash MD5
$$ 8D C5 10 A0 5E A1 EC 52 78 D4 97 98 68 08 E8 4E
##$RELAX= 
##$RELAX= 
##$RELAX= 
##$RELAX= 
##$RELAX= 
##$RELAX= 
$$ Bruker specific parameters
$$ --------------------------
##$DU= <F:/spectra>
##$EXPNO= 1
##$NAME= <H-F>
##$PROCNO= 1
##$TYPE= <nmr>
##$USER= <she>
##$AMP= (0..31)
100 100 100 100 100 100 100 100 100 100 100 100 100 100 100 100 100 100 
100 100 100 100 100 100 100 100 100 100 100 100 100 100 
##$AQSEQ= 0
##$AQ_mod= 1
##$AUNM= <au_zg>
##$AUTOPOS= <>
##$BF1= 200.13
##$BF2= 200.13
##$BF3= 200.13
##$BF4= 200.13
##$BF5= 200.13
##$BF6= 200.13
##$BF7= 200.13
##$BF8= 200.13
##$BYTORDA= 1
##$CFDGTYP= 0
##$CFRGTYP= 5
##$CHEMSTR= <none>
##$CNST= (0..31)
1 1 145 1 1 1 1 1 1 1 1 1 1 1 1 1 1 1 1 1 1 1 1 1 1 1 1 1 1 1 1 1 
##$CPDPRG= <>
##$CPDPRG1= <>
##$CPDPRG2= <>
##$CPDPRG3= <>
##$CPDPRG4= <mlev>
##$CPDPRG5= <mlev>
##$CPDPRG6= <mlev>
##$CPDPRG7= <mlev>
##$CPDPRG8= <mlev>
##$CPDPRGB= <>
##$CPDPRGT= <>
##$D= (0..31)
0 1.2 0 0 0 0 0 0 0 0 0 0.03 0 0 0 0 0 0 0 0 0 0 0 0 0 0 0 0 0 0 0 0 
##$DATE= 1549880280
##$DBL= (0..7)
120 120 120 120 120 120 120 120 
##$DBP= (0..7)
150 150 150 150 150 150 150 150 
##$DBP07= 0
##$DBPNAM0= <>
##$DBPNAM1= <>
##$DBPNAM2= <>
##$DBPNAM3= <>
##$DBPNAM4= <>
##$DBPNAM5= <>
##$DBPNAM6= <>
##$DBPNAM7= <>
##$DBPOAL= (0..7)
0.5 0.5 0.5 0.5 0.5 0.5 0.5 0.5 
##$DBPOFFS= (0..7)
0 0 0 0 0 0 0 0 
##$DE= 6
##$DECBNUC= <off>
##$DECIM= 32
##$DECNUC= <off>
##$DECSTAT= 4
##$DIGMOD= 1
##$DIGTYP= 9
##$DL= (0..7)
0 120 120 120 120 120 120 120 
##$DP= (0..7)
150 150 150 150 150 150 150 150 
##$DP07= 0
##$DPNAME0= <>
##$DPNAME1= <>
##$DPNAME2= <>
##$DPNAME3= <>
##$DPNAME4= <>
##$DPNAME5= <>
##$DPNAME6= <>
##$DPNAME7= <>
##$DPOAL= (0..7)
0.5 0.5 0.5 0.5 0.5 0.5 0.5 0.5 
##$DPOFFS= (0..7)
0 0 0 0 0 0 0 0 
##$DQDMODE= 0
##$DR= 18
##$DS= 0
##$DSLIST= <SSSSSSSSSSSSSSS>
##$DSPFIRM= 0
$$ [...]
##$SUBNAM2= <"">
##$SUBNAM3= <"">
##$SUBNAM4= <"">
##$SUBNAM5= <"">
##$SUBNAM6= <"">
##$SUBNAM7= <"">
##$SUBNAM8= <"">
##$SUBNAM9= <"">
##$SW= 20.0189088683792
##$SWIBOX= (0..15)
0 0 2 0 0 0 0 0 0 0 0 0 0 0 0 0 
##$SW_h= 4006.41025641026
##$TD= 16384
##$TD0= 1
##$TE= 0
##$TE2= 300
##$TE3= 300
##$TEG= 300
##$TL= (0..7)
0 120 120 120 120 120 120 120 
##$TP= (0..7)
150 150 150 150 150 150 150 150 
##$TP07= 0
##$TPNAME0= <>
##$TPNAME1= <>
##$TPNAME2= <>
##$TPNAME3= <>
##$TPNAME4= <>
##$TPNAME5= <>
##$TPNAME6= <>
##$TPNAME7= <>
##$TPOAL= (0..7)
0.5 0.5 0.5 0.5 0.5 0.5 0.5 0.5 
##$TPOFFS= (0..7)
0 0 0 0 0 0 0 0 
##$TUNHIN= 0
##$TUNHOUT= 0
##$TUNXOUT= 0
##$USERA1= <user>
##$USERA2= <user>
##$USERA3= <user>
##$USERA4= <user>
##$USERA5= <user>
##$V9= 5
##$VALIST= <valist>
##$VCLIST= <CCCCCCCCCCCCCCC>
##$VD= 0
##$VDLIST= <DDDDDDDDDDDDDDD>
##$VPLIST= <PPPPPPPPPPPPPPP>
##$VTLIST= <TTTTTTTTTTTTTTT>
##$WBST= 1024
##$WBSW= 4
##$XGAIN= (0..3)
0 0 0 0 
##$XL= 0
##$YL= 0
##$YMAX_a= 139176
##$YMIN_a= -224378
##$ZGOPTNS= <>
##$ZL1= 120
##$ZL2= 120
##$ZL3= 120
##$ZL4= 120
##$ABSF1= 10
##$ABSF2= 0
##$ABSG= 5
##$ABSL= 3
##$ALPHA= 0
##$AQORDER= 0
##$ASSFAC= 0
##$ASSFACI= 0
##$ASSFACX= 0
##$ASSWID= 0
##$AUNMP= <proc_1d>
##$AZFE= 0.1
##$AZFW= 0.1
##$BCFW= 1
##$BC_mod= 2
##$BYTORDP= 1
##$COROFFS= 0
##$CY= 11.3945322036743
##$DATMOD= 1
##$DC= 2
##$DFILT= <>
##$DTYPP= 0
##$F1P= 18.9103706918063
##$F2P= -1.10871071338519
##$FCOR= 0.5
##$FTSIZE= 0
##$FT_mod= 4
##$GAMMA= 1
##$GB= 0.15
##$INTBC= 1
##$INTSCL= 1
##$ISEN= 128
##$LB= 0.24
##$LEV0= 0
##$LPBIN= 0
##$MAXI= 10000
##$MC2= 0
##$MEAN= 0
##$ME_mod= 0
##$MI= 1.114404
##$NCOEF= 0
##$NC_proc= 0
##$NLEV= 6
##$NOISF1= 3.799351
##$NOISF2= 2.8
##$NSP= 1
##$NTH_PI= 0
##$NZP= 0
##$OFFSET= 15.70392
##$PC= 1
##$PHC0= -8682.484
##$PHC1= 18.40018
##$PH_mod= 1
##$PKNL= yes
##$PPARMOD= 0
##$PSCAL= 0
##$PSIGN= 0
##$REVERSE= no
##$SF= 200.130013532006
##$SI= 16384
##$SIGF1= 3
##$SIGF2= 2
##$SINO= 400
##$SIOLD= 16384
##$SREGLST= <1H.CDCl3>
##$SSB= 0
##$STSI= 0
##$STSR= 0
##$SW_p= 3612.71676300578
##$SYMM= 0
##$S_DEV= 0
##$TDeff= 0
##$TDoff= 0
##$TI= <>
##$TILT= no
##$TM1= 0
##$TM2= 0
##$TOPLEV= 0
##$USERP1= <user>
##$USERP2= <user>
##$USERP3= <user>
##$USERP4= <user>
##$USERP5= <user>
##$WDW= 1
##$XDIM= 8192
##$YMAX_p= 0
##$YMIN_p= 0
$$ End of Bruker specific parameters
$$ ---------------------------------
##NTUPLES= NMR FID
##VAR_NAME=  TIME,          FID/REAL,        FID/IMAG
##SYMBOL=    X,             R,               I
##VAR_TYPE=  INDEPENDENT,   DEPENDENT,       DEPENDENT
##VAR_FORM=  AFFN,          ASDF,            ASDF
##VAR_DIM=   8192,          8192,            8192
##UNITS=     SECONDS,       ARBITRARY UNITS, ARBITRARY UNITS
##FACTOR=    0.0002496,     1,               1
##FIRST=     0,             0,               0
##LAST=      2.0444736,     0,               0
##MIN=       0,             -224378,         0
##MAX=       2.0444736,     139176,          0
$$ Real data points
##PAGE= N=1
##DATA TABLE= (X++(R..R)), XYDATA
$$ [...]
2397a443K079J224l100J06K918o47n51J826j671j606J235j229o29L020J04k793
2413a157M15L03K17K496j473m941P35L194J535J239k074m367K390N668m58l094
2429F28k838j955L689N473k716m675L46J328K342K144m353m094K760K514j82J9
2445D30j693j180L990J649l003o66J25r99K352J078k929L90K354j250n55N15j698
2462a090P38J890l164k360K428J940O95P27l213j964M821J652k860j435j017Q51
2478a361M554L05m166n38K206N73P63j416m431Q16L813j94q64l77k031J024L498
2495B174j668k157P90l92K90K463j171j175K688J202k560m95n82m52K898m85m203
2512b835P01K856M55K31j622l147J887L758k322k455N53K53L234K706l351l163
$$ plain form
2397 -1443 636 1860 -1240 -1134 1784 1137 586 2412 741 -865 370 -859 -1488 1532 1636 -1157
2413 -1157 -742 -439 -222 2274 801 -4140 -3405 -211 1324 2563 489 -3878 -1488 4180 3722 628
2429 628 -2210 -4165 -476 4997 2281 -2394 -2048 -720 1622 3766 -587 -4681 -1921 593 411 430
2445 430 -1263 -2443 1547 3196 193 -473 -348 -1347 1005 2083 -846 -456 1898 648 93 608 -1090
2462 -1090 -352 1538 -1626 -3986 -1558 382 1077 1804 -1409 -3373 1448 3100 240 -1195 -2212 -1361
2478 -1361 3193 3498 -668 -1206 1000 1573 2336 920 -3511 -2695 1118 924 60 -317 -2348 -1324 2174
2495 2174 506 -1651 -861 -1253 -963 1500 329 -846 1842 3044 484 -11 -593 -1045 1853 1368 -2835
2512 -2835 -2134 722 1177 1408 -214 -3361 -1474 2284 -38 -2493 -1940 -1687 1547 4253 902 -2261
2528b261J913J546R52P06m020k847L427L128j099n15k335j295L527J167l579r59
2544b544J311L48K503K10l198J106K654j360j146Q11j268K09J872j833q16L265
2560B124m71k234P7j528L83L292r31l481L38J530J292L097j171m704K53L336Q26
2577B028o4j992l624K547N271r85l519j695l28L068K983m055m151J676K578K143
2593A881O86l184k753K993K142j328R5p07j537K286J204j509N37R75k312M45R81
2610H95k081Q9J552j400k81J945p95L46Q85k080j439L455Q86j880r89r60J078
2627g74N021J09n333k044J639K084K256k049n222J407M217L30n78j460l169J796
2643a770L776j201k099j24j61K092L656j970l851Q81J214Q05J413k497l458L119
$$ plain form
2528 -2261 -348 1198 2150 2856 -1164 -4011 -584 2544 1445 930 -1405 -2700 827 1994 -1585 -2544
2544 -2544 -1233 -885 1618 1828 -1370 -264 2390 1030 -116 695 -573 -364 1508 -325 -1141 2124
2560 2124 1653 -581 -504 -2032 -1649 1643 712 -2769 -2431 -901 391 3488 2317 -2387 -2134 1202 2028
2577 2028 1964 -28 -3652 -1105 4166 3181 -338 -2033 -2361 707 3690 -365 -4516 -2840 -262 1881
2593 1881 2567 -617 -3370 -377 1765 437 532 -175 -1712 574 1778 269 806 1781 -531 -86 895
2610 895 -1186 -1097 455 -945 -1226 719 -76 270 1155 -925 -2364 1091 1977 97 -892 -1852 -774
2627 -774 4247 4356 -977 -3021 -1382 702 2958 909 -4313 -2906 1311 1641 1063 -397 -3566 -1770
2643 -1770 2006 805 -1294 -1418 -1579 513 4169 2199 -1652 -771 443 1248 2661 164 -3294 -175
2659a75J465j059L01m91j103J371k98k796J741J992q86r26M54k38K163J100k948
2676c33j446K539L53j64q1k353K0L541M10k176j072j427p6L828K85l902j057R13
2694b198J839L319m19n026k83L436J116l86j506k134K497L573j647k791L17M17
2710A24O47J170k454k153K503M62n91J156n97j372J673n64j388J239O77j419J309
2727D22L82k168J164K060q19j170q70j587J877K849k094k338J282J441J106L47
2743A884l914j017L964J739k215j207n22J075L899Nm231o50J097J1J129m96k316
2760a765M32J988j102L65M75j963L30K412j388j313R59L22J344J434k264j874
2776a608L029P05j984l35j380O08K956j023l361Q25K698J19r50j837k153K581
$$ plain form
2659 -175 1290 231 532 41 -1062 309 11 -2785 -1044 948 62 -864 -410 -648 1515 2615 -333
2676 -333 -1779 760 1113 949 868 -1485 -1465 2076 2486 310 -762 -2189 -2265 1563 1848 -2054 -3111 -2198
2694 -2198 -359 2960 2541 -2485 -2768 668 1784 1398 -108 -2242 255 3828 2181 -610 -293 124
2710 124 771 1941 -513 -2666 -163 299 -292 864 267 -1105 568 4 -1384 -145 532 -887 422
2727 422 804 -1364 -200 1860 1041 -129 -999 -2586 -709 2140 46 -2292 -1010 431 1537 1884
2743 1884 -2030 -3047 917 2656 441 -766 -1288 -213 3686 3691 -540 -1190 -93 -82 1047 551 -1765
2760 -1765 -1333 655 -447 -82 393 -1570 -1240 1172 -216 -1529 -570 -248 1096 2530 266 -1608
2776 -1608 1421 2126 142 -193 -1573 -965 1991 968 -2393 -1568 1130 1249 299 -1538 -3691 -1110
2792a110L237j594j281M03n99J565K247j730j742J000l33J62J944j672k245K464
2808G16J035o50p48j632j207L186Q42l112k63J450L40J284r83k042J462K329k191
2825a84j588J064P47J757O61l458r90L474M10j784k50j524n01L139M83k018L07
2842b55k35j45K638j17l734l35J898J303J637j697l820J297M266k15k017j711
2858a242j223J757K971k266j989J853Q12k70K51j201m75J687m7j924J518P06q63
2875E5J112l88j228J062M27j545m39N51j007J481J562k120j208N68L40J807J011
2892B041l849k300L177K905N54j368k985M0M598P27m036p87K68J210K039p73l552
2909b091O75K451o87N47l54k837J97K230k31M82K64k211M39K730k63j580O25l90
$$ plain form
2792 -1110 2127 533 -748 -345 -944 621 2868 1138 -604 396 63 225 2169 497 -1748 716
2808 716 1751 1101 353 -1279 -2486 700 1542 -1570 -1833 -383 -43 1241 258 -1784 -322 2007 -184
2825 -184 -1772 -708 39 1796 2457 -1001 -1991 1483 1893 109 -141 -1665 -2166 973 1456 -562 -255
2842 -255 -490 -635 2003 1886 -1848 -2183 -285 1018 2655 958 -2862 -1565 2701 2486 469 -1242
2858 -1242 -2465 -708 2263 -3 -1992 -139 673 403 654 -547 -1022 665 618 -1306 212 918 55
2875 55 1167 779 -449 613 1040 -505 -944 -393 -1400 81 1643 -477 -1685 -1117 -777 1030 2041
2892 2041 -1808 -4108 -931 1974 2528 1160 -1825 -1785 2813 3540 -496 -1283 -1015 195 2234 1461 -2091
2909 -2091 -1416 1035 348 895 541 -2296 -2099 131 -100 382 646 -1565 -1126 1604 1341 -239 386 -4
2927dJ6R41j023n49K623p1k838j13O59O87P15j771k730K451L272j532j973l88
2945a628K60K864J402l891j630J917J232J737M10k752j589J751R11K19M5k423
2961a165j795K795J823j269q97p54L58K651L7l615n8K326N86K9p51j373J590J894
2979B412k412r74J411l60n04j61j304P41K929q57k437M20M07l5K044o92k244O04
2997a012J692q3J691o04k888N16K479l63r11j028j788K248K915j872l145L29R28
3014h96J855O15l330j427L055J306q26K82n18nJ450o12j936J219L71j163P62O
3032B08j015R34R30j154o72N02j343O91J897j457q62J466M32P15L75k431j013
3049a797L478O89j903j453o83J652K985j212l637K27J475L32K09j105j954K002
$$ plain form
2927 -4 12 953 -70 -619 2004 1933 -905 -1018 -359 328 1043 -728 -3458 -1007 2265 733 -1240 -1628
2945 -1628 -1368 1496 2898 -993 -2623 -706 526 2263 2673 -79 -1668 83 994 1213 1258 -1165
2961 -1165 -2960 -165 1658 389 -508 -1262 -904 1747 1784 -1831 -1889 437 1023 1052 301 -1072 518 2412
2979 2412 0 -974 437 77 -427 -588 -1892 -1151 1778 921 -1516 -1096 -689 -724 1320 628 -1616 -1012
2997 -1012 680 597 2288 1684 -1204 -688 1791 1428 517 -511 -2299 -51 2864 992 -2153 -1824 -896
3014 -896 959 1574 -1756 -3183 -128 1178 352 634 116 111 1561 949 -987 232 603 -560 202 208
3032 208 -807 127 1057 -97 -769 -267 -1610 -919 978 -479 -1341 125 557 1272 1647 -784 -1797
3049 -1797 1681 2370 467 -986 -1669 -17 2968 1756 -1881 -1654 -179 153 362 -743 -2697 -695
3065f95J708j213l5N32q60R29R54j111n64N53n77P43J608j352j623J424K88j045
3083c36L59q95o14K420n21k360R26K025M46p24j354j964K440K809k267j499P50
3100c59L95J460O60k859p21J930n5p93M10j540n30K520K41j251M8r74j00K321
3118H03Q54k401k98O42O55J915p25k377R97J652j237p76l21K43J296R91l079k42
3136a408J971J85p33o52m74J38K021o77j804J411R71n81Q75q55j896R73J343q98
3154i0N79p33j959J542K284q77j638k75q37K155J511k057j897K252J437j5m92
3171H90k113J13K979K42k087k16K66J09J490o68j550M67P39j453K79O11j216O01
3189e17J155j273n3J133r21P78Q44j544j182K091L17k60J93j545R6K283k86k867
$$ plain form
3065 -695 1013 -200 -235 297 -563 366 1320 209 -355 198 -379 364 1972 620 -1003 421 709 -336
3083 -336 23 -872 -1486 934 413 -1947 -1021 1004 1450 726 -628 -2592 -152 2657 390 -1109 -359
3100 -359 36 1496 2156 -703 -1424 506 451 -342 68 -1472 -2002 518 759 -492 -444 -1418 -1518 803
3118 803 1657 -744 -1042 -400 255 2170 1445 -932 65 1717 480 -296 -617 -374 922 1913 -1166 -1408
3136 -1408 563 748 15 -637 -1111 -973 1048 371 -1433 -22 949 368 1243 388 -1508 -535 808 -90
3154 -90 489 -244 -2203 -661 1623 746 -892 -1167 -2004 151 1662 -395 -2292 -40 1397 1382 890
3171 890 -1223 -1110 1869 2111 24 -192 74 183 1673 1005 -545 -78 661 -792 -513 98 -1118 -517
3189 -517 638 -635 -688 445 -476 302 1146 -398 -1580 511 828 568 761 -784 -688 1595 1309 -1558
3207a558l1O30R43J239j766k277J863K379k39r04r46o58J532J605j481o06R51
3224F76m82P14J111j559j296Q94Q5j44M88j025j381J927R47j311n2n37j35J833
3242G53n22k050J507J533p15n71N29o60J240J127l047r46J650N69J67k05j843
3259a484k63K346j48r60nm92K19J731J82j379J64L28K81J674o78l009Q76J298
3277F81N9q3q11j708J548J955j390j567O83k51N93R33j748k24K404k15r94M95
3295C60l66k58J911j113j445R27J034q36K14o34p26J047O71j233o07r5m38J917
3313C30J229j728j355J190O08J225n4k478r73K975O82j059k35j102K41K447j092
3330H51j960O1P31j64R07o49j102R28Q73q36O49L04j295M43J346j123p9J326r46
$$ plain form
3207 -1558 -1589 -959 -16 1223 -543 -2820 -957 1422 1183 279 -667 -1325 207 1812 331 -275 676
3224 676 194 908 2019 460 -836 58 143 -1 487 -538 -1919 8 955 -356 -408 -945 -1080 753
3242 753 231 -1819 -312 1221 506 -65 464 -196 1044 2171 -876 -1822 -172 397 564 359 -1484
3259 -1484 -1747 599 451 -509 -514 -1006 -787 944 1126 -253 -89 239 520 2194 1516 -1493 -617 681
3277 681 740 657 -154 -1862 -314 1641 251 -1316 -633 -884 -291 642 -1106 -1330 1074 859 -135 360
3295 360 -6 -264 1647 534 -911 16 1050 214 428 -206 -932 115 786 -447 -1054 -1149 -1587 330
3313 330 1559 -169 -1524 -334 274 1499 1445 -1033 -2006 969 1651 592 357 -745 -504 1943 851
3330 851 -1109 -1048 -317 -481 426 -223 -1325 -397 476 -360 289 593 -702 -259 1087 -36 -115 1211 265
3349B65j86R38j245n32J627l01j521K04l53L85J954j003k302R49J293N21p7j268
3367f52j209K071K234j683j205P8k63J820Q14k332j295J295K15O71M39j771q47
3384a620J922L32m34j34q12m64K298O2k021J008L59j17P61n09j574N59J388j092
3402h8k81N41m32N36N58j876k57J835k63q29j25l76L45K299q38j073J47PN05J162
3422A497o46k015R08J085k48j1n82j495J190J587p85j304J43m19J366J275j744
3439a98j071J325L09M4K58j392N9J448k0j259N43J29m78J127o56j570J011Q37
3457D46j062K00j14o59J505Q55j371m11P18m43Q84O02j599p15K156K85m35j38
3475G04j368j60K027n9j881l11K37M52J365q52j632J007J016o68J78m02p38J317
$$ plain form
3349 265 79 1017 -228 -760 867 566 -955 -751 -1104 -719 1235 232 -2070 -1121 172 693 616 -652
3367 -652 -1861 210 2444 761 -444 -366 -629 1191 2005 -327 -1622 -327 -112 559 998 -773 -1620
3384 -1620 302 634 200 66 -746 -1210 1088 1150 -871 137 496 379 1140 631 -943 -384 1004 -88
3402 -88 -369 172 -260 276 834 -1042 -1299 536 273 -556 -681 -1057 -712 1587 749 -324 -177 -170 335 1497
3422 1497 851 -1164 -256 829 581 570 -12 -1507 -317 1270 485 -819 -676 -1095 271 1546 -198
3439 -198 -1269 56 365 409 667 -725 -666 782 762 -497 46 175 -303 824 168 -1402 -391 446
3457 446 -616 -416 -530 -1189 316 1171 -200 -611 107 -336 548 1150 -449 -1164 992 1277 842 704
3475 704 -664 -824 1203 1144 -737 -1048 -811 -359 1006 154 -1478 -471 545 -123 55 -347 -1085 232
3493B32J054j278k20Q19o16M79O50j420m52J478m60m21L44r28L7J639k90j586
3511i39Q2N28K43J051p26j725J314J604n91l66m41r79J218J257j590q60R00l21
3529c41R04K65j672o28J450J80m10J07p00j11J571K55j192L20K02l30J100j64
3547H06j594R53Q97q93L0q6n48Q50O78k221J1J094j80K40L88j180o0K084n60j012
3567c03k4j07M16J345n67j712P01O45K48M13j103j618J093J202o04k89n29j012
3585a805J757J328j109r46M51J39O77O01j538l12J653K07n96J44n09o79J509m89
3603D83j491R97M9k96M92n02p74J266K58j303K04M61l70J105N59j865N9J463j52
3622F43j67p6j408K91J682l65j023L9l43M56J333o30j751L35J100J93L23p18j115
$$ plain form
3493 232 1286 8 -212 607 -9 470 1120 -300 -752 726 266 -155 189 -739 -702 937 647 -939
3511 -939 -857 -329 -86 965 239 -1486 -172 1432 841 475 34 -945 273 1530 -60 -920 -20 -341
3529 -341 563 828 -844 -1472 -22 158 -252 -145 -845 -956 615 870 -322 -2 200 -130 970 806
3547 806 -788 165 1062 169 199 113 -435 415 1093 -1128 -1117 -23 -203 37 425 -755 -815 1269 709 -303
3567 -303 -327 -434 -18 1327 760 -952 -251 394 642 1055 -48 -1666 -573 629 25 -264 -793 -1805
3585 -1805 -48 1280 171 -775 -324 -185 492 1093 -445 -757 896 1103 507 651 142 -537 972 483
3603 483 -1008 -11 38 -258 234 -268 -1042 224 482 -821 -617 -156 -526 579 1138 -727 -668 795 643
3622 643 476 400 -1008 -717 965 600 -423 -384 -727 -271 1062 432 -1319 -984 116 309 632 -86 -1201
3641a201J210J652r39l40k91o16Q37J107j466n59O56L0J24Q24j532o91J353l11
3659a53l34rj18l33J583l12j204J157M26q96M97j86r93J221R33j304l22J46J82
3678a9Q05j3k176r3J679J84n48K16q77K78J875k99j444J62j1L38J548q00j778
3697i73Q37P20O4N7q08j308J109J043p98n91J67n16Q85J020j289n06J160j58Q1
3716A96L84j033l4J309n5q99O45j99m61N36l88j092J298M09q82L16m49n32J046
3735A15N11p52p98O49J04P01K23j296j99J603rl97l88n86q2J640m42j385L70p2
3755d90J24J235r56j182O65P59j45J08j64r49J461O21r33m62Q36p25P30P07j660
3774d20l07J068J27l71O2j134J40J299k46j205N80L1j66J109m13q93P28Q21p06
$$ plain form
3641 -1201 9 1661 722 382 91 -525 312 1419 -47 -606 50 80 204 1028 -504 -1195 158 -153
3659 -153 -487 -496 -614 -947 636 324 -880 277 703 -193 304 118 -875 346 1279 -25 -347 -201 -19
3678 -19 786 773 -1403 -1496 183 367 -181 35 -842 -564 1311 1012 -432 -270 -281 57 1605 805 -973
3697 -973 -136 584 648 705 -103 -1411 -302 741 -57 -648 -481 -997 -112 908 -381 -887 273 115 196
3716 196 580 -453 -487 822 767 -132 513 314 -147 389 1 -1091 207 616 -266 50 -399 -931 115
3735 115 626 -126 -924 -275 -171 530 753 -543 -742 861 852 455 67 -519 -601 1039 597 -788 -418 -490
3755 -490 -366 869 -87 -1269 -604 155 10 118 -46 -995 466 1087 154 -308 528 -197 533 1240 -420
3774 -420 -727 341 468 97 159 -975 -835 464 218 -987 -407 -376 -542 567 154 -739 -11 810 104
3793A04J62j62j009J413P27j198l45O68o79K69P43j565k09J310j42o53K84j94
3811d76PJ422n28j043P55j2k8Q65q50j058J389Q04q85j99j91r27J242M69j622
3830h66l30Q52j15P45M93j541j83J428J19p09k1n21M48J391k74j276O34o4j48
3849F2O91n13q70M26N13l23L41l58j104Q81J001j243R6N10l42K23N81q44M67P87
3869I82l11j136N68J51k39P50p56j076J214P9k90L84p55n94J347N87j399M2J2
3888d40M9J334N18j575n06R33L0M00L2j377m73J764K22o72n49m29J55J240k56
3907D00j469L96K34m1J272m25r51N99L66n93M63M33j035P35J53p20K0O46p59Q0
3927a96K98r17M6J063l76n91N71k51M57P66q26q71J032M76m4M8j057n57J728N83
$$ plain form
3793 104 266 104 -905 508 1235 37 -308 360 -319 -50 693 -872 -1081 229 87 -566 -282 -476
3811 -476 -469 953 425 -618 137 125 97 962 112 -946 443 1247 362 163 -28 -955 287 756 -866
3830 -866 -1196 -344 -459 286 779 -762 -945 483 602 -107 -128 -649 -201 1190 916 -360 274 210 62
3849 62 753 240 -630 -204 309 -14 327 -31 -1135 -254 747 -496 -400 110 -232 -9 572 -272 195 982
3869 982 671 -465 103 254 15 765 9 -1067 147 226 -64 320 -435 -1029 318 905 -494 -452 -440
3888 -440 -391 943 1461 -114 -620 313 343 743 775 -602 -1075 689 911 239 -310 -739 -584 656 400
3907 400 -1069 -673 -439 -480 792 367 -584 15 381 -212 251 684 -351 384 537 -183 -163 483 -276 -196
3927 -196 102 -815 -769 294 -82 -673 -102 -353 104 870 44 -827 205 681 637 685 -372 -929 799 1382
3947A382j237o39J50q6J099oj348m17J061K76o5P3j216N13P03L39n61n3n85M42
3967a75J408n53r68K86K05k24R13r68j190R96Q00q81J62J87l17M86J26j006M21
3986b92P54m03k32M36l88M8J249r91p81Q48p5j9L22p44n52J081J87p48J39N4q35
4007i42J078N46j116p5L73j23Q00M04j364r9J115j5J2m37j096N10J335m75q55
4026d24J40j80J94R15o48j075Q20N82k49M03m20p72J073N35r47J20L12j017O91
4045E3P88q85l77R22n23j87M22n99n41J371l87r31Q72k70K08M88n07o54J101L38
4065G02o94K4q2J56O56j40j130O6O26Q4l25K34j056J43J253l86l85o1m84N52R11
4086F64n0j031k24L48P06Q75r89j240R75P88m87P4o65r28J373M44q96j89L32k29
$$ plain form
3947 1382 145 -494 -344 -430 669 663 -685 -1102 -41 235 170 243 -973 -460 243 582 21 -32 -617 -175
3967 -175 1233 680 -288 -2 203 -21 892 -76 -1266 -270 530 -351 -189 -2 -319 167 293 -713 -292
3986 -292 462 59 -173 263 -125 -77 1172 181 -600 248 173 154 476 -268 -820 261 448 -300 -161 -107 -942
4007 -942 136 682 -434 -509 -136 -259 541 945 -419 -518 597 582 594 157 -939 -429 906 431 -424
4026 -424 -284 -464 -270 645 -3 -1078 -258 324 75 478 58 -714 359 894 -53 67 379 -638 53
4045 53 841 -44 -421 501 -22 -209 213 -386 -927 444 57 -874 -2 -272 -64 424 -83 -737 364 702
4065 702 8 32 -50 106 762 622 -508 -442 184 268 -57 177 -879 -736 517 131 -254 -315 -799 -247 664
4086 664 614 -417 -641 -293 413 1288 299 -941 34 822 335 409 -256 -1184 189 633 -263 -452 -120 -349
4106c49N27O4q29O2P43l27K22n3J41k54P77n09m65O49k46m36N90j14r27P77L93
4127D36q97R5J91p65J342L15j371J05N26L80J90j13j106K51J561l52j245J55r9
4146d01N07R36j067r06Q00K14k03L39o38n29O20M27j16L82l20p48O40R26l96q12
4166c45M78j13M42K32q88j73N99M3m59K44o98K1R67m60p61R08L99n87L61k68j61
4187b19P05m7o70N0O82j83K67p4p96O3Q53q40L1L49j021L92P88j35n25q2q7M92
4209gR85o47j392R41L68N40l8j045l54R67P50j073k71J65j98M68J73q28l5M21
4229a10j23K3N46r36j01N69K92o5M86j174K75P62R2o45L91q3m56M97k58o37R00
4250B45K12p36N2J74o6L37Q6j219N19J204j85p77r3J45M99Q74j165m87J10L72
$$ plain form
4106 -349 178 242 -587 -525 218 -109 113 60 201 -53 724 215 -250 399 153 -283 307 193 -734 43 436
4127 436 -461 -366 -175 -940 402 717 -654 -549 -23 357 547 434 -672 -421 1140 788 -457 -302 -401
4146 -401 106 1042 -25 -931 -131 83 -120 219 -419 -948 -328 99 -17 365 45 -703 -63 863 467 -345
4166 -345 133 20 462 694 -194 -367 232 275 -184 60 -638 -617 350 -110 -871 37 436 -151 210 -58 -219
4187 -219 486 439 -231 -181 501 318 585 511 -285 -222 631 -209 -178 171 -850 -458 330 195 -330 -412 -499 -7
4209 -7 978 331 -1061 -120 248 788 750 -295 -649 318 1068 -5 -276 -111 -309 159 332 -496 -531 -110
4229 -110 -233 -210 336 -600 -701 -132 160 95 581 -593 -318 444 536 -109 282 199 -257 240 -18 -655 245
4250 245 457 -279 -227 -53 -119 218 304 -915 -396 808 623 -154 -247 -102 397 1271 106 -381 -271 101
4270A01K85J38n36p28P90J65k58R4k47q83P29P79n55j88j72K9J030P15j442n61
4290g15Q37K72J09l36q30L60P76P7p77J00j84j84M88l30k91N80O0k53J82L27k93
4311b5O6L73o48K25J33R0l31O92r89J33M64j19j51j85n61N90J290r07j091M19
4331e32O00M60qr51o72J212O78m01l82j95Q6P35K45j021j92M92m22M61J73p00
4351c34l5L54n5K49K02r43j44Q53N16q47L82o17K29R33l08o43M72K83m94J21n37
4372c63j47P72J98j345L99Q95n24j19O8l10M71P33r60j94M75N90m84N05n55m16
4392c11N05j42J23L88n44p34O29N48n87k96m10R4J107M10j287l11K18P63M74j74
4412D63r90L9J111j27l52J38m67n9Q46k05r41J127q60l24P97P5o34k1L93j20N37
$$ plain form
4270 101 386 524 -12 -740 50 215 -43 51 -196 -1079 -350 429 -126 -314 -486 -457 573 1288 -154 -715
4290 -715 122 394 503 167 -663 -303 473 550 -227 -127 -311 -495 -7 -337 -628 -48 12 -241 -59 268 -25
4311 -25 41 414 -234 -9 124 214 -117 575 -414 -281 183 64 -87 -272 -833 -243 1047 140 -951 -532
4331 -532 68 528 520 -431 -1103 109 787 386 4 -191 -105 630 875 -146 -338 154 -268 193 366 -334
4351 -334 -369 -15 -70 179 381 -562 -706 147 663 -184 198 -419 -190 743 435 -208 264 547 53 174 -363
4372 -363 -510 262 460 -885 -486 409 -115 -234 -166 -476 -5 728 -232 -426 49 639 155 660 105 -311
4392 -311 194 52 175 563 19 -715 -86 462 -125 -421 -831 -737 370 780 -507 -818 -600 163 637 463
4412 463 -527 -488 623 496 144 282 -185 -244 602 397 -544 583 -277 -601 196 271 -363 -384 9 -111 426
4433D26k04o21L88N63m67R5K1n40P72m1q79M89O19n47o26K31L43N9O48p37j069
4454a077J027O45m82r5n93oJ014j3o11m6M65j69N79o9r49J69K95j5K95K9j057
4475f64k7Q52K02l22j50p39M23J338m61q65J85L60k9O38q79j10O71J02r60L04
4495a31M55p18R9M67o45P46J65q20r1N21j21o8n5O4k14Q73m88q6L90j41n36P60
4517D26j6n19M40n08n05R14N80j014l90K58O8O04j24r89O4Q69N2M9m57r9O9R71
4539G43j72m25j7q0j29N73k13p17J76K00j36M89l66o63M18O99k15Mo31J45N76
4560B59M23o61j86L63J62j21J60o02L46M77q89j58M87L23n62K94m01l6O21o8o41
4581d10N57k41k7O34j01q12N18J3j32O06q9p48m07R48J71k64m14n97N45J102n26
$$ plain form
4433 426 222 -399 -11 552 85 180 201 -339 433 392 -487 2 621 74 -552 -321 22 81 729 -8 -1077
4454 -1077 -50 595 113 18 -575 -581 433 420 -191 -237 228 59 638 569 -380 -211 84 69 364 393 -664
4475 -664 -691 161 363 41 -109 -848 -425 913 452 -413 -228 132 103 741 -138 -248 423 525 -435 -131
4495 -131 324 -394 -295 172 -473 273 438 -382 -473 48 -73 -141 -196 -132 -346 527 39 -47 343 202 -334 426
4517 426 410 -109 331 -177 -682 232 812 -202 -592 -334 -266 338 214 -775 -711 158 210 259 -198 -297 -228 743
4539 743 571 146 129 49 -80 493 280 -437 -261 -61 -197 292 -74 -737 -319 380 165 169 -462 -317 259
4560 259 682 21 -165 198 360 239 399 -203 143 620 -269 -427 60 383 -179 115 -286 -322 299 231 -410
4581 -410 147 -94 -121 513 412 -400 118 131 -1 605 516 -232 -639 309 480 216 -198 -795 -250 852 326
4602C26o62j72J35L46O07r11l34P67M7N7M74n60n06P57J74n88K53j03p08K66N63
4623B28k88l96L24l21L61N87p29l6O17l38k03O58k16j17N94n91l05J007l68n28
4643f0j96J41J12P10m93j128L25N30K09j43m93l53O05Q23m59o1Ok22L11N80q4
4664F60p59o4J31J14M71l79r89N14N42j34J89o13n90J066M98r02p1L47k41M01
4684A91K55n40M7O66n71l79Q73l76j78K76o85J80O34m21l88M50k28k00O39k1p58
4705e34M24r1p0O49J2p12J72O48j16K70m57q56K52J320n74o33k25L1L15R04r04
4726a75l47N55J73J8r7j97l01P34k1l48N52o90k93M59N22o02Qp5j03L67P9o38
4748d20p4O91k77OJ97k76l17R55m77o12R03j1l23M87l28j78M39j27n24L54L27
$$ plain form
4602 326 -336 -508 -373 -27 580 -331 -665 102 149 206 680 120 -386 371 545 -43 210 107 -601 -335 228
4623 228 -60 -456 -132 -453 -92 495 -234 -270 347 9 -194 464 248 131 725 134 -171 836 468 -60
4643 -60 -256 -115 -3 707 214 -914 -589 -59 150 7 -486 -839 -234 589 130 69 75 -147 164 744 660
4664 660 -99 -163 -32 82 553 174 -815 -301 241 107 296 -317 -907 159 657 -245 -316 31 -210 191
4684 191 446 -94 -47 619 48 -331 542 166 -12 264 -421 -241 393 -28 -416 34 -194 -394 245 224 -534
4705 -534 -110 -201 -271 378 390 -322 -150 498 382 652 195 -661 -409 911 337 -296 -521 -490 -175 729 -175
4726 -175 -522 33 206 224 127 -70 -371 363 342 -6 546 -144 -437 22 544 -58 -50 -125 -228 139 218 -420
4748 -420 -494 197 -80 -74 123 -153 -470 485 8 -604 299 288 -35 452 124 -54 385 258 -266 88 415
4769D15o60K05n8k21nQ54p06k05M32k68J73N61j40o13K07RK00N75n59q63R98K95
4791F26n51K77p78k54J116k00j85m40j15R2N30K86q06j53J046m07n5N10p46L48
4811A41K36l13K42L02q97Q1M56j71n83N21j03l67N74k07m17N62M1m51K05L78n11
4832b81N23j00n67K45O52j60k14k6j34J18K81m60n31N35J91K47k76k68o21R89
4852A43K45m26Ll59j63Q52N95r38k68L80j27N43M79j293j45L35K94J65l2j074
4872g91K59P59j64k97R1j33m2O53j11m75N13m1l70N10K95r58L00K09r72O67L03
4893B05l98O2K12m92L19L05n17J32J35k59N76M54o14p05P62K22k73K16o90n6O95
4914B91J67o26J56m36PO88L21o69n22L18M0N29j7n88q5O79k29L68q5n21l8M21
$$ plain form
4769 415 -245 -40 -98 -319 -324 530 -176 -381 51 -217 -44 517 377 -236 -29 -20 180 755 196 -667 331 626
4791 626 75 352 -426 -680 436 236 51 -389 -504 -412 118 404 -402 -555 491 84 29 539 -207 141
4811 141 377 64 306 608 -289 -208 248 77 -506 15 -88 -455 119 -88 -505 57 98 -353 -148 230 -281
4832 -281 242 142 -425 -180 472 312 98 72 -62 56 337 -123 -654 -119 72 319 43 -225 -846 143
4852 143 388 -38 -35 -394 -557 295 890 -48 -316 64 -63 480 959 -334 -479 -144 150 315 283 -791
4872 -791 -532 227 63 -234 -143 -276 -318 335 224 -251 262 221 -149 361 656 -302 -2 207 -765 -98 205
4893 205 -193 -131 81 -411 -92 213 -304 -172 -37 -296 280 734 120 -585 177 399 126 342 -348 -404 291
4914 291 458 -168 -12 -448 -441 247 568 -101 -623 -305 -265 264 247 -341 -426 253 24 392 307 -214 -252 169
4936A69K65m03M53o94rP77n30l19J94Q2k55J1M92m18J42K48o36K61K08j27J88
4957I9k58P4L63K91n84l24K17NK85J21n72k01K90J64j52K76m12r8O86J29l86j33
4979a20j29l5O84L69q57M6n3O63J87j58j006J23N35j3k09L2k69j36O69n36O7j
5001a47J42j94M60Q2n84K82mk84N65p7m44Q2J79l5j57O02o71J27J50j21o4L14
5023B03o05Q6k3L48l8L91l33m04O24J66l73r2j60l30Q99j79k84p2K81m98M95L83
5045D85j063J28M59k13L53n3l82O5O17Nl34K1k45MO04k16n04L35m9j86M54l06
5067b1j67K38J48k01l7j45kJ4K90j94l60K18qN2K65k71L05O5l02J01J97m8j24
5090A3n6N0m52N68K1l64m3k35J76M91r2k22R2POK02n0l85J67M92N9k03k35l6j42
$$ plain form
4936 169 434 31 484 -210 -219 558 28 -291 -97 -15 -270 -259 233 -185 -43 205 -431 -170 38 -89 99
4957 99 -159 -85 278 569 -15 -339 -122 -117 168 289 -283 -484 -194 -30 -182 94 -318 -416 270 399 13 -120
4979 -120 -249 -284 400 769 -88 -42 -95 568 755 597 -409 -286 249 236 27 59 -210 -346 323 -213 -146 -147
5001 -147 -5 -199 261 343 -241 41 37 -247 318 241 -203 -121 58 23 -134 468 -203 -76 74 -47 -111 203
5023 203 -402 -316 -339 9 -29 362 29 -375 249 415 42 -50 -210 -540 359 180 -104 -176 105 -393 102 485
5045 485 -578 -450 9 -204 149 96 -286 -221 396 401 67 88 -157 -153 451 235 -269 66 17 -169 285 -21
5067 -21 -188 50 198 -3 -40 -185 -187 -173 117 -77 -437 -219 -227 -175 90 -181 124 189 -113 -12 185 137 13
5090 13 -43 7 -445 123 144 -220 -263 -498 -322 169 77 -145 -53 -46 -40 162 112 -273 -106 386 445 242 7 -29 -171
5115a71Q41n63m42L59l66L26N41n84m58M83j69K72K46n04k60O17J44m08J90j40
5135d6N2O2L79m91r0J17j41L63k65n9j4J45n13J62O18j67l0P3m09K6N32k22k64
5158a82J37r3J17O10k54j009N78K56M5P6k78p43N00L66O1k24k84n8P3J136n40
5179B90q37K45KO28M63o51k87J39J14J23K18o39k58M57K37j00k40j53j40N42J91
5200C44l81k41L82m93O44K9k35m09M88k93J38N48m35n8j26q8k1M70k49l09K99
5221Dj60J54J60l0n91j80R65m6k13o4k61J59O12j15r2l80m11L29P01n29k35j9
5243b42J90N1L12n22k50M1O02N7r5j14k90L22L62m65J02q0j16J18O27n24j84L41
5265B43n21L39J06o0k91Q1k37K04J71j53J6Q7m1nL29q7l44K65n6k1j1J69n05K49
$$ plain form
5115 -171 670 107 -335 24 -342 -16 525 -59 -517 -34 -203 69 315 -189 -449 168 312 -96 94 -46
5135 -46 6 68 447 -44 -134 -17 -158 205 -60 -119 -133 12 -501 -339 279 112 82 155 -254 -228 304 82 -182
5158 -182 -45 -138 -21 589 335 -674 -96 160 205 281 3 -740 -240 126 187 -37 -321 -379 -306 830 290
5179 290 -547 -302 -300 328 791 140 -147 -8 106 229 447 -192 -450 7 244 144 -96 -249 -389 153 344
5200 344 -37 -278 104 -389 255 284 49 -360 128 -165 -27 521 86 28 -98 -186 -207 263 14 -295 4
5221 4 -156 -2 158 128 -463 -643 322 276 63 -1 -262 -103 509 394 302 -78 -489 -160 541 12 -223 -242
5243 -242 -52 -1 311 -211 -461 -420 182 239 144 30 -260 62 424 -41 61 -19 -135 -17 610 86 -98 243
5265 243 -278 61 167 107 -184 -103 -340 -136 35 -118 -102 -15 -56 -61 268 181 -163 102 46 25 14 183 -322 -73
5289g3N9j96N12m63m40K49O26j20k90j35K34n2N93k65p11O72j32Q1Q4k11m06N91
5311B07N7r5r0j35k42N52j60m03j56M22j24K21K27q26M68K41k61K38o1l32M61
5332B09k5j0j61J39n2j31K32q8k01M47k25o85L84L88l98K26k61k30J24O22n09
5353b05K38M1k41L57l8j18R1lj19K17K51l14n10J77J09j0K16l18m02O85J25l12
5375h3J48k95J48M49L7n82q6M56N4j79J84k32l54O19j20k93J32j37M1J51j89l7
5397a68K40j92J69J73K40o12J37L31l20nK59l34J45M4o91R40j55j05m05R3Q9L02
5419A75M5n26r3K03L00M1Q7l34qM23K36m89j26j19K16N4K57k75k36J8O3J70M07
5442D89q82j27j14N23M17n0q05J26O25o4k71L41l70J46N43j47m94K63n5k56L22
$$ plain form
5289 -73 -14 -210 302 -161 -601 -352 274 154 -136 -271 -37 -89 504 239 -472 200 68 149 233 22 -384 207
5311 207 264 169 79 -56 -298 254 94 -309 -465 -43 -167 54 281 -545 -77 164 -97 141 80 -252 209
5332 209 184 174 13 152 100 -31 201 113 -88 359 134 -551 -167 221 -177 49 -212 -442 -318 304 -205
5353 -205 33 74 -167 190 152 34 125 122 3 220 471 157 -353 -176 -67 -77 139 -179 -581 104 229 -83
5375 -83 65 -230 -82 367 404 -178 -264 192 246 67 251 19 -335 284 164 -129 3 -134 -93 58 -131 -168
5397 -168 72 -120 49 222 462 -150 -13 318 -2 -7 252 -82 63 107 -584 356 201 96 -309 -216 -127 175
5419 175 220 -306 -399 -196 104 145 232 -102 -110 313 549 60 -66 -185 31 85 342 67 -169 -151 -88 82 489
5442 489 -393 -520 -634 -111 306 256 -549 -423 202 138 -133 208 -162 -16 527 380 -114 149 94 -162 160
5463A60J14l76l7r8k97O40J85l96J9J45l63K73K95l28k38K63J3J23K10l93l10
5484c96M58K75m04N8l91N3O73Q3l13o8m66L4O36J32p14K56k12L28L81m4n40k38
5506d19N16m23M84q1p90M94L26P8m09rN9o4O39k21j54p6j52L6M81m22N8L35j61
5529A25m1n9J85j74p9k1j32J78M63p38P8r2o8M76k0k47k01K79K05j95J3j4R5N42
5553E58j89j35r6j90q3K24L97m01k51j58J48L13n0m37j22N84l1r0o7j36K10K81
5575B79l95N7M15k89J04p7K79k66Pj59K2L15k49j81K46j90mj26N6j42J18L60m54
5598b74L28j02k38K44J16j73l0L40k40j39K60J1j3p3k37k23O35om54M33k60j64
5620b59L78j88k26L99L43n28K88k43l4J85R9j9O6l13k72K00J94ql22J21JK10L12
$$ plain form
5463 160 274 -102 -139 -237 -534 106 291 -105 -86 59 -304 -31 264 -64 -302 -39 -26 97 307 -86 -396
5484 -396 62 337 -67 -9 -400 -347 326 409 96 28 -438 -404 232 364 -350 -94 -306 22 403 359 -181 -419
5506 -419 97 -326 158 77 -713 -219 107 185 -224 -233 -174 -238 401 180 26 -50 -202 -166 315 -107 -49 286 125
5529 125 84 25 210 36 -43 -64 -196 -18 445 -293 -215 -307 -375 101 81 -166 -367 -88 117 -78 -65 -79 16 558
5553 558 369 234 138 -52 -135 89 486 85 -166 -324 -176 137 87 -350 -472 112 81 -9 -76 -212 -2 279
5575 279 -116 -59 356 67 171 94 373 107 114 -45 -23 292 43 -138 108 -82 -86 -212 -156 -298 -180 180 -274
5598 -274 54 -48 -286 -42 74 -99 -129 211 -29 -168 92 103 90 17 -220 -443 192 186 -268 165 -95 -259
5620 -259 119 -69 -295 104 447 -81 207 -36 -70 115 214 195 261 -52 -324 -124 70 62 -260 -139 -138 72 384
5643C84l69k74J60L16l14J36l26M52N2l8k19m8M98l35m9J41Q0k46J95m35J55K38
5665A54l44l25N27pj35L55l77L9P5R0n2K43k88o2K47j90M4L95k97n76K59N73l18
5688C0n1n28J20L87M99n65n28N45q0O02k29l55K19j07j55L88K5J7p09L33K19r1
5710a4K19k06p07Q15K72m04K6M9k45L19K94p76L04O5k35L29p7P0j65J67l39K95
5732E6K58k58j65J80k07J02K46j45n85N87J02j96j37Q5k5j55M80J63m18k46J08
5753a70K42M91l80k49M9L0L0N89o66k71k1M56k46j9J71m98L28K25J08nk53rJ38
5776G0K36n6l01p7k13K63N19l67j94r8p1J67L15j98o28N43J44K3q4L63p09K44
5798a09J71q8L96j27o96L72J22P9J10l47j08K58L07l44k15n9P2K55K73m61k33
$$ plain form
5643 384 15 -259 -99 217 -97 39 -287 165 217 179 -40 -88 410 75 26 167 247 1 196 -239 -84 154
5665 154 -190 -515 12 5 -130 225 -152 -113 -38 52 0 243 -45 -107 140 -50 -6 389 92 -484 -225 348 30
5688 30 -21 -549 -429 -42 457 -108 -636 -91 -171 431 202 -153 66 -41 -196 192 217 234 -475 -142 77 -14
5710 -14 205 -1 -708 107 379 -25 1 50 -195 124 418 -358 -54 11 -224 105 28 98 -67 100 -239 56
5732 56 314 56 -109 71 -136 -34 212 67 -518 69 171 -25 -162 -77 -102 -257 223 386 -32 -278 -170
5753 -170 72 563 183 -66 -17 13 43 632 -34 -305 -326 130 -116 -135 36 -462 -134 91 199 194 -59 -68 70
5776 70 306 250 -51 -128 -341 -78 441 74 -120 -218 -289 -122 193 -5 -633 -90 54 77 -7 356 -353 -109
5798 -109 62 -26 370 243 -453 -81 41 120 230 -117 -225 33 340 -4 -219 -278 -206 49 322 -139 -372
5819c72J75j7M16J93m84m35N94n6K27Q9l85l97M08M47l29j33M8r8P3K09k69j46
5841b42K77K81m50K93j91k8N3j22J60M41k72o3k45L8N2L31k57l40P77o79M17j14
5863A17k19k80M87m21K56J99j02l43K93K49j91j70L1nM27J89m71k39L57J6n6K75
5885C99o16J56L7k38J75Q7r0Q6Q5P1l87J96M8j65J68L36l95L5J93k87J43q5L8
5908a0R0P4j26j11K1O3j41K9P1j29K93r7Q4r7RJ25J08k84k19K06K05l87M9L11
5932A37j14J01K62p14oM41J38k85j08pj22J83P8k98N50k90l67P53l21J56l42L75
5954B00l81N14r3m58k38M80K34J57k50l66J01K23m72K93K83k27kO6qK5j31J69
5976A19k87K86L02k39l1k38r0L13k35k30J58J73k06L79k34l89L47j71O7J32L54
$$ plain form
5819 -372 -197 -214 202 395 -89 -524 70 14 241 330 -55 -452 -44 403 74 -59 -11 -109 -36 173 -96 -242
5841 -242 35 316 -134 159 -32 -60 -7 -129 31 472 200 137 -108 -70 -18 313 56 -284 493 -186 231 117
5863 117 -102 -382 105 -316 -60 139 37 -306 -13 236 45 -125 -94 -99 328 517 46 -193 164 180 124 399
5885 399 -217 -61 -24 -262 -87 0 -90 -4 81 152 -235 -39 9 -156 12 348 -47 -12 181 -106 37 -48 -10
5908 -10 80 154 28 -83 -62 1 -140 -111 -40 -169 124 27 111 14 23 148 256 -28 -247 -41 164 -223 -174 137
5932 137 23 124 386 -328 -334 107 245 -40 -148 -155 -277 -94 -16 -314 236 -54 -421 332 11 167 -175 200
5954 200 -181 333 240 -218 -456 24 258 415 165 -201 -100 123 -349 -56 227 0 -2 64 56 81 -50 119
5976 119 -168 118 420 181 150 -88 -178 135 -100 -330 -172 1 -205 174 -60 -449 -102 -273 -206 -74 280
5997B80n82J05N58j56J05j94m02J63J34K53k60m0k03K32L49j05n64K82j07J07
6017d5L60k2l86j86K76m7M02j65k90Q6L49j92n7k58O7j61L41K38m74K37l01J70
6039e8J72n8j05K48l98J5K15K86m39R7j70M89K76k81m51j7J57J11O3J52o03k0
6061c19K93L3N0o6j35k30M00L29k71j39j50J39M89M2o33J32K14k70L74o8n16M7
6083b55M64j17L9J10m63j65O75k07j99R3l68qO35j20q5o4J60j70L70k46k10q7
6105b18J85j02L90l70P9j58J33k97J17L94k36k05K64L35l55R5l07J46K53R0R2
6126C25j92k88n8N31k94k2j00O2k70M28n0k68K79L5k32L95q1m48J58M1K95k0J29
6149C55o00J37N64m89J03q3j96J74K58l32n7K56j86j4OK63j83l5j45R0Q9K55m19
$$ plain form
5997 280 -302 -197 361 205 310 116 -286 -123 11 264 4 -36 -239 -7 342 237 -327 -45 -152 -45
6017 -45 315 293 -93 -279 -3 -50 352 187 -103 -17 332 140 83 -175 -108 -269 72 310 -164 73 -228 -58
6039 -58 114 56 -49 199 -199 -184 31 317 -122 -25 -195 294 570 289 -162 -179 -22 89 152 304 -299 -319
6061 -319 -26 7 57 -9 -144 -374 26 355 84 -55 -205 -66 423 465 -168 -36 178 -92 282 214 -302 -255
6083 -255 209 92 131 241 -222 -387 288 81 -118 -25 -393 -401 234 114 29 -35 125 -45 325 79 -131 -218
6105 -218 -33 -135 255 -115 -36 -194 -61 -358 -241 153 -83 -288 -24 311 -44 51 -256 -110 143 233 325
6126 325 133 -155 -213 318 24 2 -98 -36 -306 122 72 -196 83 118 -114 281 200 -248 -90 -49 246 226 355
6149 355 -245 -108 456 -33 70 -13 -209 -35 223 -109 -166 90 -96 -110 -104 159 -24 -59 -204 -114 -25 230 -189
6172a89L61r8j29n0L58n04j2J83R9K4r3Q6l01K78J80m7j13Q4l43M51j47m87K02
6195b07P1n6M21m50k0M90N1k71l4J09l00O5m6L49k96K32k9l25M75m57m8L10P1
6218A05K07J19m95l72O27P0jj59k29j76L33K61m18J57J79l13J82J2r9J81k39J13
6240D5l13J62jO4m6o0J81R2j75J08j45Q7J80N8l09k55N84m27L70Q5l77l39J20
6263c11O89l52q0j67o5K38M99m74n8nn2K80K34j22m83K24K78j81L55n95p7J33
6285i2K66l18K41l16l18O38L0l60J38N1j48K50J47j68k49N03l36n1L38k62j01
6306a17L0P2n4J83j09j75K23L4j48K48q3n60M33K41J35j85j02l72L87L59j18m59
6328a37O2j96M29J65l47n14J87M04J40K2k04n08N15k3J40k80J20m51O08J68m27
$$ plain form
6172 -189 172 74 -55 -105 253 -251 -263 -80 19 43 -50 36 -265 13 193 146 33 117 -226 225 78 -409 -207
6195 -207 -136 -192 229 -221 -241 249 300 29 -5 104 -196 -131 -177 172 -124 108 79 -246 229 -228 -276 34 105
6218 105 312 431 -64 -436 191 261 260 101 -128 -304 29 290 -128 29 208 -105 77 89 -10 171 -68 45
6240 45 -268 -106 -107 -43 -89 -149 32 124 -51 57 -88 -1 179 237 -72 -327 257 -170 200 285 -92 -431 -311
6263 -311 378 26 -54 -221 -286 -48 451 -23 -81 -86 -138 142 376 254 -229 -5 273 92 447 -148 -225 -92
6285 -92 174 -144 97 -219 -537 101 131 -229 -91 -40 -188 62 209 41 -208 295 -41 -92 246 -16 -117
6306 -117 -87 -15 -69 114 5 -170 53 87 -61 187 104 -456 -23 218 353 168 66 -306 81 440 322 -137
6328 -137 -75 -271 158 323 -24 -538 -351 53 193 215 11 -497 18 -5 135 -145 -25 -476 132 300 -127
6349a27K16l00K40M1K83j97k36J1n00M75j60k3jJ3J97J18M16m99k10J31K21J6
6371A25L83m29j55j4o7M31P9q3l39j20M32j5j44k53l39M03K26j3k91p7J45K37
6393A22J73k46k40R6o8K40J40j64j90L41J43l03O6k62j35K41K25m92M7K97l0K46
6415B47j7j74j40L3JL4L03l83L9L2j92K16n5K06l53J29j82K32J78j60p0M7L36
6438C07j19oj24m63L45K72j15j90Rk02L6N29k36N4l15nJ20K91l38nJ12l34O7M15
6462A05m72N2M25m8k18O2n8M4J98O8k09L47l67M2L88k51j02j21L74k30N1N4m52
6485c18L26K27l41N7m6P0l9Rl5J07J04l07J00K23L7k42K72R0k62M7n4J3n9J26
6509A05k92J61J05l28K29J71n3n0R6l97j02N43k54ON9MO1J92j07l36nR4l5O1J55
$$ plain form
6349 -127 89 -211 29 70 353 156 -80 -69 -569 -94 -254 -277 -278 -265 -68 50 466 -33 -243 -112 109 125
6371 125 508 79 -76 -90 -157 274 353 270 -69 -189 243 228 84 -169 -508 -105 121 108 -183 -260 -115 122
6393 122 295 49 -191 -95 -163 77 217 53 -137 204 347 44 110 -152 -287 -46 179 -313 -266 31 1 247
6415 247 230 56 -84 -51 -50 -16 287 -96 -57 -25 -217 -1 -56 150 -203 -74 -256 -24 154 -6 -76 -29 307
6438 307 188 182 58 -405 -60 212 97 -93 -84 -286 -250 279 43 97 -218 -223 -103 188 -150 -155 -43 -377 -310 105
6462 105 -367 -315 110 62 -156 -94 -152 -108 90 158 -51 296 -71 -29 359 108 6 -115 259 29 80 134 -318
6485 -318 8 235 -106 -49 -95 -25 -64 -55 -90 17 121 -186 -86 137 174 -68 204 294 32 79 25 38 -21 105
6509 105 -187 -26 79 -249 -20 151 98 48 144 -253 -355 188 -66 -60 -1 3 64 256 149 -187 -192 -98 -133 -72 83
6534H3m42R5L03o0L6l8m47K61M75n6j62k36L69l09L83k13j18N7j28k85M55k5k41
6557b43J33J08j14M7J07m24N8L91l45N22O1m11j32K80k08L28l6k11P7L90j40j62
6579G6p8l88J07L34o5k23k0Pr8L55M43p71J62J40J2K45j60l93L19K11J39j30j07
6602A17k69M1J81j75J99p5j90j35N14q1l84J48n9P5L69j59j36k6L7P0J56n2l39
6625a73p3M25l2m4P4l87L3J12J46o8O3k11R0J22Q1l2j90q3l22J146k91l34p1o
6649b5L1J22K91k69k12j39K13J94k66l16R8L57j53N8L11l70k14O52o9k59J89k97
6671g3o2K78M7R3l00k0kJ41J3k02K91l78L7K4J34M0l33J43n6K40R7p4k38K85J18
6696B43j20J12n98K52K42N3k01k22J63q7L44Q2l52J7j87K22L04J09p28L41K00
$$ plain form
6534 83 -359 -264 39 -21 15 -23 -470 -209 266 210 48 -188 181 -128 255 42 -76 -19 -147 -432 23 -2 -243
6557 -243 -110 -2 -116 -69 38 -386 -328 63 -282 240 301 -110 -242 38 -170 158 122 -89 -12 378 238 76
6579 76 -2 -390 -283 51 -14 -237 -257 -250 -348 7 450 -321 -159 -19 -7 238 78 -315 4 215 354 224 117
6602 117 -152 -111 70 -105 94 19 -171 -306 208 127 -257 -109 -168 -93 276 117 -19 -45 -8 62 218 166 -173
6625 -173 -246 179 147 103 177 -210 -177 -65 81 13 76 -135 -45 77 158 126 -64 -147 -469 677 386 52 -19 -25
6649 -25 6 128 419 150 -62 -201 12 206 -60 -376 -278 79 -74 -16 295 -75 -289 363 294 35 224 -73
6671 -73 -135 143 190 283 -17 -37 -39 102 115 -87 204 -174 -137 -113 21 61 -272 -129 -185 55 152 78 -160 125 243
6696 243 123 235 -363 -111 131 184 -17 -239 -76 -163 181 263 -89 -72 -259 -37 267 376 -352 -11 189
6717A89L7LM2m69j40N52j45M3l75Jp1M17J76l15j37Q6p4J79l72K78M1J50k49R6
6741e7J15k0N6p3J14Kj07J19k29p5J24P6K16k96j62J69j0n1J91k95K7L23k76J70
6765E1r3j47M8M10k59M2K39l67p2k4L8J39M2p0n3J65j45m5P1N9l02l5K30k1K36
6790A37J55m91K04l4J59p7p2q0J33M3L03n19j44L84l28L63p2n7j95o5lK61J97
6813B02j09j65R6l73O20l51j68K36o3n0P6K36l03lJ56K91k14j40j56o0J75K31
6835A64l07M6J50l51L67J70L9m22J91N3j73M23k89j87L9p6M53l08j43Q2J47L0
6857I8k42L78n63K45L52k41J50j77j63R2J47L88l25j45J30j80L0M81o09K71j3
6878A04k0m3O1j99j37K79n6K17l1l88j09K82J10P9j28k19j56O19n4l7k08j39q7
$$ plain form
6717 189 226 229 271 -198 -338 214 69 112 -263 -262 -333 84 260 -55 -192 -106 -180 -1 -373 -95 -54 96 -153 -57
6741 -57 58 38 94 21 135 137 30 149 -80 -155 -31 45 261 -35 -197 -28 -38 -89 102 -193 -166 157 -119 51
6765 51 -42 -189 -141 269 10 52 291 -76 -148 -172 -134 5 47 -23 -76 89 -56 -101 -30 29 -273 -308 -78 -99 137
6790 137 292 -199 5 -29 130 53 -19 -99 34 77 380 -139 -283 101 -227 136 64 7 -188 -253 -256 5 202
6813 202 93 -72 24 -349 271 -80 -248 -12 -75 -125 -49 187 -116 -119 37 328 114 -26 -182 -242 -67 164
6835 164 -143 -97 53 -298 69 239 278 -144 47 100 -73 350 61 -126 -87 -163 290 -18 -161 -79 68 98
6857 98 -144 234 -329 -84 268 27 177 0 -163 -71 76 464 139 -6 124 -56 -26 455 -154 117 104
6878 104 84 41 102 -97 -234 45 -11 206 175 -213 -322 -40 70 149 21 -198 -354 265 211 174 -34 -173 -260
6901b60N11R5n75J12j02J9M3N87o51J31J47j88J85K39m37j67K10J88O9J85m63
6922a22l4K18J13k23m0j68J71J24L45o10n3K37k12m9M02K9j82Q7j64L73j12m20
6944b90LjK35L06k19M2l94K76K27m9J00m38k2N0L48q7O6k55J93m3J32k64l23N10
6968A03j75L39O3k59l14L21j07P7j25j64K04K31k47O5k6q1l8K15k12M11j64n6
6990F1l80L31j2j15K12J71k84P0L42l84j07j38Q8L20j42k29n2Q9j28L29L66m67
7012e9j19Q9L8K02J67k28l32L96j41j7Q7O0l61K86J63k90Q5j30q4K80o7l51M06
7035H0j13J53r5N7O3k28J43J9J1N2k59L2N04m20J04Rk68L61%l37o0N5K61l3p4
7060A7J18k13J06R7m8m39M26rj32J26o8l6K34j87r3o4R7nj24J84o9M1J45k50L76
$$ plain form
6901 -260 251 346 -229 -117 -219 -200 -157 430 -221 -90 57 -131 54 293 -144 -311 -101 87 156 341 -122
6922 -122 -156 62 175 -48 -88 -256 -85 39 384 -226 -279 -42 -254 -303 99 128 -54 33 -131 242 130 -290
6944 -290 -287 -288 -53 253 34 76 -318 -42 185 136 236 -202 -224 -174 174 87 153 -102 91 48 180 -84 -407 103
6968 103 -72 267 330 71 -243 78 -29 48 -77 -241 -37 194 -53 12 -14 -95 -133 82 -130 281 117 61
6990 61 -319 12 0 -115 97 268 -16 54 396 12 -95 -233 -145 175 33 -196 -248 -159 -287 42 408 -59
7012 -59 -178 -89 -51 151 318 90 -242 154 13 -4 83 143 -218 68 231 -59 26 -104 -188 92 25 -326 80
7035 80 -33 120 25 82 145 -83 60 79 90 142 -117 -85 419 -1 103 112 -156 205 205 -132 -192 -137 124 91 17
7060 17 135 -78 28 125 77 -362 64 55 -77 49 -19 -55 179 -8 -101 -165 -68 -73 -197 -13 -82 -41 104 -146 230
7085B30j88q8J34j35k02L76J63k44K5n9j60J40L03j46j36J34m36K09K66j59k58
7106b31J15J35l1K36k21l16R7J76J0K17l39o2M19rJ40n99K38l8J58J03k70J63
7128I1l12J6L93J04k52j00l17J30L42k63K27k24M5J49J88l1J91n19O03m66j04
7149a09L95m62J74lQ5NQ6k83l2k5K64j96K5O7j76J93K71k03l82K76K28k14J4k98
7173c00L90k76%K68l8J49l86O1K04O4j17K53o27K49J63J32j93j45J11K27J02q2
7195B09p8p5m4l19L85K53n98J26K93l19J1L48m23M0L99l01q6K19k85J15L69j80
7217E9P4m1j95J83R0J66l98q9OJ87K06N3o00J12J80r7J91k03n6K26lK03K4k46
7241C2l16K88K13k04j13O9O4l07K52J10m2j41O6J8q9j82O8K31k93L9M28q9l35
$$ plain form
7085 230 42 -46 88 -47 -249 127 290 46 71 12 -148 -8 295 149 13 147 -289 -80 186 27 -231
7106 -231 -116 19 -12 224 3 -313 -216 -40 -30 187 -152 -214 205 196 336 -263 -25 -63 95 198 -72 91
7128 91 -221 -205 188 292 40 -60 -377 -247 95 -168 59 -165 -120 29 217 186 377 -142 461 -5 -109
7149 -109 286 -176 -2 -5 80 85 171 -112 -144 -169 95 -101 -76 -9 -185 8 279 76 -306 -30 198 -16 -2 -300
7173 -300 90 -186 -186 82 44 193 -193 -132 72 136 19 272 -355 -106 57 189 -4 -149 -38 189 291 209
7195 209 131 56 12 -307 78 331 -267 -141 152 -167 -156 192 -231 -191 208 -93 -179 40 -245 -130 239 59
7217 59 133 92 -103 80 170 336 -62 -151 -145 42 248 301 -299 -187 -7 -104 87 -116 -172 54 51 254 278 32
7241 32 -284 4 217 13 -100 -31 33 -274 -22 88 46 -95 -29 -11 -100 -282 -214 17 -276 -237 191 102 -233
7264b33L79J74n74N70j67k15J74j87K11N3J06n15J62J27j57J4k60P1K40J97r2
7285G8l6k06K20j11J82j18j07p1K24JL10L0m17j34L61j80Qm3m9r8K41l7l66J79
7309a39N9j90O28n85K10K95j54m27L34j88N3K74m43K10J92J02m03J92j29J5K58
7330A64r1l51M02L7k46J19J30P3k37J09j5K3n5o5k34L73O8k26J58k78l9L47k32
7353f6J6j0L17m53J23M4j51K10O7m0k76J47M8J24J81n10K04N7j16m6J99k90j18
7376c39M60j77J06l7k37J08J2K64j08j57J57R1L42l56k73L17J35k06j74K77j6
7397A89j85j92J35j0K11l71J69Q9k3m7O2m51M74J42l7l42M30j24j99J39k5n0R6
7420H0j36j5L4O1Q7o07L22J96J18R4n60J71M06q9l61L37m29M33n8k51j59M19k25
$$ plain form
7264 -233 146 320 -254 316 149 -66 108 -79 132 185 291 -224 -62 65 -92 -78 -338 -267 -27 170 78
7285 78 42 -164 56 -55 127 9 -98 -169 55 56 366 396 -21 -155 206 26 34 -9 -58 -156 85 48 -318 -139
7309 -139 -80 -270 358 -227 -17 278 124 -303 31 -157 -104 170 -273 -63 129 231 -172 20 -109 -94 164
7330 164 73 -278 124 161 -85 34 164 237 0 109 94 117 62 -3 -237 136 204 -22 136 -142 -181 166 -66
7353 -66 -50 -60 257 -196 -73 -29 -180 30 97 57 -219 -72 -24 100 281 -229 -25 32 -84 -130 69 -221 -339
7376 -339 121 -56 50 13 -224 -116 -104 160 52 -105 52 143 485 129 -144 173 308 102 -72 205 189
7397 189 4 -188 -53 -63 148 -223 -54 35 12 -35 27 -424 50 192 155 -187 243 119 -80 59 34 -16 80
7420 80 -56 -71 -37 24 111 -496 -174 22 140 234 -326 -155 251 162 -199 138 -291 142 84 -167 -326 93 -132
7443a32j23L69J32l36L6m2j87K43L77m47j29J26P7J54j12l16M47p8k73K97K60
7464C43l41J3J04lJ19p9k05l98N60J00R2J4p51j17O21jj18k4OJ41l80M48q7p8
7488b1K8K09M1j99N9k06J85j67M64k80n03J88k3L93k22q5RJ47k4K27l13J3K83
7511B03k92K04L38m60K39j50J0K9m7j07k32M31j29q8K0p5O0k03J46m0K35l87K38
7534e7J07j26P8L6j36j60L71L45l56j63o9O1O4J20J3k79L68j14k01Q1n3j85J11
7557a44J05P6K6l72L65r5J52j02k0J97n13M71R5j19K2m6k44K77p1j22j36K5k01
7580c74M83J48k46j17K8p5J61J77j89J2J04K8k44Q6J28l51L25O0j99q7O0k16L75
7603G7m8j90J85j33l1K96o7j5jL0k51J30K22l81K50J70n9j99J75m1l21K17L9k93
$$ plain form
7443 -132 -255 114 246 -90 -54 -96 -283 -40 337 -110 -239 -113 -36 118 6 -310 137 59 -214 83 343
7464 343 2 15 119 116 235 156 -49 -447 113 213 305 319 -432 -549 72 71 -47 -71 -65 76 -304 144 57 -21
7488 -21 7 216 257 58 117 -89 96 -71 393 113 -390 -202 -225 168 -54 -139 -130 17 -7 220 -93 -80 203
7511 203 -89 115 453 -7 232 82 92 121 74 -33 -265 166 37 -51 -31 -106 -46 -249 -103 -143 92 -295 -57
7534 -57 50 -76 2 38 -98 -258 113 458 102 -61 -130 -69 -5 115 128 -151 217 103 -98 -17 -70 -255 -144
7557 -144 -39 37 63 -309 56 -39 113 11 -9 188 -325 146 241 122 144 98 -146 131 60 -62 -198 -173 -374
7580 -374 109 257 11 -106 -78 -153 8 185 -4 8 112 140 -104 -18 110 -241 84 144 -55 -142 -82 -298 77
7603 77 29 -161 24 -109 -140 156 89 74 73 103 -148 -18 204 -177 73 243 184 -15 160 119 -202 15 54 -239
7627b39K81r8k93N23l01j0K64R6l7m41M12J2p0k50j6M3M11m55K14l2j76j48L52
7650D2j66k1N4k04j1L25j23J10N7J28l9J30J8m15L86m4k74oM28l03m8j75j30K02
7674g9M36m59MJ40j5L5m8K16l12o3Q3j41M28k14l13L11O3O0k43M7n7q7L33j76
7698e1om5J24M5J26j89N3J40k07k28M13k71m6J83K07k16M3k55p0L03m5O8J26L5
7722B37j71n2K9j32L05j83NL4J16j61L4J05k98p6M49m8kk15j07M57R9k75l83M1
7746a92K24K36j35k02p3N4J14J0o4R2k82M44k89J20j5j52m1J61J47o4r2M0Nj32
7770h6K36k97N9R4K1l3K35j73m06J85J38K9J71n0l89K44J60o4J45k35k65K29P3
7793B1J03lJ05k09o7K4k53P2l9P1J73P3k51J16p8J39M7K35k19k46O6J35L37k69
$$ plain form
7627 -239 42 -56 -349 174 -127 -137 127 223 186 -255 157 169 99 -151 -167 -124 287 -168 46 14 -162 -310 42
7650 42 -124 -145 -91 -295 -306 19 -104 6 63 191 152 282 300 -115 271 227 -47 -53 375 72 24 -151 -281 -79
7674 -79 357 -102 -98 42 27 62 14 230 -82 -145 -62 -203 225 11 -302 9 72 132 -111 -64 -121 -208 125 -51
7698 -51 -57 -102 22 67 193 4 57 197 -10 -238 175 -96 -142 41 248 32 75 -180 -250 53 8 76 202 237
7722 237 66 14 43 -89 216 33 38 72 188 27 61 166 -132 -208 241 193 191 -24 -131 326 425 150 -233 -192
7746 -192 32 268 133 -69 -142 -88 26 36 -28 64 -218 226 -63 57 42 -110 -151 10 157 93 1 41 46 -86
7770 -86 150 -147 -88 6 27 -6 229 56 -350 -165 -27 2 173 123 -266 -22 138 74 219 -16 -281 -52 21
7793 21 124 121 226 17 -50 -26 -279 -207 -246 -175 -2 71 -180 -64 -142 -3 44 279 60 -186 -120 15 352 83
7817H3j9l17K65R9k24j8Pn9N1K87j31j05j2j14L38p7J69l73j6O4R4j35K52o1L7
7842H5K83m29L26l0n67K93j98K1J32N3q6K32j81K63l23L85l28K5J66K0j87j34
7864a79L86L4r0L9l85K05lQ2J16m12J81j40k5J41j44L46j92n8L56l00P6j70M25
7887B89j37k71J25k78K54J36k34L7L24l25K47j60k38J34M7Q2l2J17r6n8J80m14
7909b71L59k37J17l9J49o8m3K36l08L02j23m22K20K74j42J65j52j18J12J87k10
7930a2J30lk6j58R0J32j30K05k43J10j64OJ01r0J8L6q8P4k13R4j03J97j21RK69
7955A20j16q8Q0J03L84l34r7j13L29m15L33k31N7j20O2k0j23J60k87K65K74l79
7977a56J87K0q3M5l8k42L45K11j61k84M50j77n9N6o9K18k29l3j08p4K85o6oj56
$$ plain form
7817 83 64 -253 12 111 -113 -131 -124 -183 -132 155 24 -81 -93 -207 131 54 223 -150 -166 -102 -8 -143 109 48 85
7842 85 368 -61 265 235 -332 -39 -237 -216 -84 -31 -117 115 -66 197 -126 259 -69 -44 122 142 -45 -179
7864 -179 207 241 151 190 -195 10 7 89 205 -207 -26 -166 -191 -50 -194 152 -40 -98 258 -42 34 -136 289
7887 289 152 -119 6 -272 -18 118 -116 -79 245 -80 167 7 -231 -97 -50 32 0 117 21 -37 143 -271
7909 -271 88 -149 -32 -71 78 10 -33 203 -105 197 74 -348 -128 146 4 169 17 -101 11 198 -12
7930 -12 118 115 89 -69 21 153 23 228 -15 95 -69 -63 38 -52 -34 2 -86 -12 -225 -131 -234 -37 -158 -149 120
7955 120 4 -84 -4 99 483 149 52 -61 268 -147 186 -45 12 -108 -46 -66 -189 -29 -316 -51 223 -156
7977 -156 31 51 -32 13 -25 -267 78 289 128 -156 294 117 58 114 45 263 34 1 -107 -181 104 38 32 -124
8001a24k51K87K53n0k57M30n78L44L31l21lKj84M4L06k39J09l07K40k62K75l0
8023A5j36K02q9p1J85j08j90n7M07l29L31j60L5j23m8J25j78L83l36K2L09n0l34
8046a95J85j75lJ49p7p0K71k12P7K91k23NK1J70k92M43k82l98K38k2K33Q9k23
8069@j60j11L20j00k27L77k64j5L56l6J04J1m27L62O2p1j36k45q7L34J65k09Q1
8092H4l7K7J26j2l01Q8k68L29j85K58J78l96Npj16L14r2N2j37J12J44l4J20j85
8116F7j34J82k5q8j2o1qlL06k55q4L17n30L39l8l06K41L65j60j13K52l34N2K82
8140B52N1k03Q8r8k42K93q8l15K12J12j97K48pj1j91q1N25l62J71J64n91M48j89
8163a1LN09m19l95M92m25L74k08L9p4J33k08L91m79L62m4k88L08J56k40LJ17j29
$$ plain form
8001 -124 -375 -88 165 115 -142 288 -290 54 385 64 61 63 -121 -77 229 -10 99 -208 32 -230 45 15
8023 15 -121 81 -8 -79 106 -2 -192 -249 158 -171 160 0 35 -88 -136 -11 -189 194 -142 -120 189 139 -195
8046 -195 -10 -185 -188 -39 -116 -186 85 -127 -50 241 18 23 44 214 -78 365 83 -315 -77 -99 134 223 0
8069 0 -160 -271 49 -51 -278 99 -165 -180 176 140 244 255 -172 190 252 181 45 -200 -287 47 212 3 84
8092 84 47 74 200 188 -113 -25 -293 36 -149 109 287 -109 -104 -111 -227 87 -5 47 -90 22 166 132 252 67
8116 67 -67 115 90 2 -10 -71 -79 -82 224 -31 -115 202 -328 11 -27 -333 -92 273 113 0 252 -82 -30 252
8140 252 303 100 188 90 -152 141 53 -262 -50 62 -135 113 106 95 -96 -177 348 -14 157 321 -270 178 -11
8163 -11 -8 501 82 -313 179 -246 128 -80 -41 -115 18 -190 201 -278 84 40 -248 60 216 -24 -21 96 -33
8186c3J84j92K10r8j59
$$ plain form
8186 -33 151 -41 169 71 -88
8191h8
$$ Imaginary data points
##PAGE= N=2
##DATA TABLE= (X++(I..I)), XYDATA
0@%%%%%%%%%%%%%%%qJ6j6J6j6K4l2L2m0M8n6O4p2Q8j01J14j30J47j66J87k11K37
37A25k66K98l32L68m08M54n03N54o12O76p46Q24r09J001j100J214j341J480j639
56h62J820k027K268k551K889l305L832m519N454o811Q973j2966K2772r3148j46197
71b24378J41229J61116O0893q4263j06697j640J15867N6498m1840o8573l9513
82c1301Q282N3517J1786k8503j2076J84Q79K9540K672n0227m1308m579J7539N1481
96G886L0227l2194l1333Q724K3042M1404K0616n7144p5049j3613L8848O8931M1206
109G1551n3486p6739R785O1232L9018j4583p4400n3537M6494P0831O854k7445
121E575k5174L687N2734L2840m1310n3320j6950J5892N0441L0237m1799m4216
$$ plain form
0 0 0 0 0 0 0 0 0 0 0 0 0 0 0 0 0 -8 8 -8 8 -8 16 -16 16 -24 24 -32 32 -40 48 -53 61 -69 78 -88 99 -112 125
37 125 -141 157 -175 193 -215 239 -264 290 -322 354 -392 432 -477 524 -576 638 -703 777 -862
56 -862 958 -1069 1199 -1352 1537 -1768 2064 -2455 2999 -3812 5161 -7805 14967 -78181 -224378
71 -224378 -83149 77967 138860 54597 -52100 -53740 62127 118625 76785 8212 -31301
82 -31301 -23019 30498 42284 13781 1705 1889 2768 32308 34980 -15247 -56555 -61134 -43595 7886
96 7886 38113 5919 -25414 -16690 6352 47756 68372 11228 -63821 -77434 -38586 30345 71551
109 71551 18065 -58674 -48889 12343 51361 36778 -37622 -91159 -44665 26166 33020 5575
121 5575 -19599 -15912 36822 69662 28352 -24968 -41918 -26026 24415 54652 12853 -31363
133c1363Q196K6919K8373O015m4778l5755J8907J9223N462J8467Q506m096k715
146B1361k4843k0101L0490K6376k1762k6678j3264L835L5714J8163l1718k1171
158b3598N375l402j478l19j5012J1512M0801J4640q302j3015k4455M066M1326
171B8139Q274l3374k4675l813K6617M6601L104l4316n513N107j9983j9149p528
184c0509P688L3528O004m3136j2591M2804L5497k79l8547n0204O049M8885O938
197A2127k4027l511J4118K8375K2968k8736m2910L773K1225R189k710l2176k8814
210e1109L0860N0789J4559j5906l9520l2329K3218L7431q274j9978l516K482J7386
223F093J2614j4190J26J8451j2852k9194o437P175K0992K3367j4256k2816J1550
$$ plain form
133 -31363 -23167 3752 32125 38140 -6638 -42393 -23486 -4263 1199 19666 28172 24076 21361
146 21361 -3482 -23583 6907 33283 11521 -15157 -28421 -24586 11128 29291 -2427 -23598
158 -23598 -18223 -21625 -23103 -23422 -38434 -26922 13879 28519 20217 7202 -17253 -13187 28139
171 28139 36413 3039 -21636 -25449 1168 47769 50873 16557 11044 16151 -3832 -22981 -30509
184 -30509 -22821 10707 16711 -26425 -39016 3788 39285 39006 459 -49745 -43696 5189 12127
197 12127 -11900 -15411 -1293 27082 50050 21314 -21596 -17823 3402 12591 9881 -22295 -51109
210 -51109 -20249 30540 45099 29193 -10327 -42656 -19438 17993 9719 -10259 -13775 -11293 6093
223 6093 18707 4517 4643 23094 10242 -18952 -25389 -18214 2778 26145 11889 -10927 623
236F23J0532j0291n239n961n14K1042M607k4898l782J7290J4286J4036j1109m5072
250b4450j8045K3926K5068J5322o246l0483j876L2903O604k0662j4798q380R367
263a1750J7520j5594j8737K6489L4679M798j5801l3880j9994K4900K2865j2967
275B528j2468j415L673K4542J7083j9144j4298K500m950k990p267k4438K589M0828
289F773K2467q884k0080k2068Q703L5760q51l5662j5163O490J7459K5202M244
302B4390j1995N374k670k4958m985J3643M096q48j2639j8890J8344L6433j556
315B3739k2228j1848l491J5513J4339k3144k2813J7746L0660J9803l027m3534
327h285l5618K5254M4247R954k6840m7960j6767N2851N5000j1790m5758l2088
$$ plain form
236 623 11155 864 -4375 -10336 -10850 10192 14799 -10099 -13881 3409 17695 31731 20622 -24450
250 -24450 -42495 -18569 6499 21821 15575 -14908 -16784 16119 22723 2061 -12737 -21117 -11750
263 -11750 5770 -9824 -28561 -2072 32607 37405 21604 -12276 -32270 -7370 15495 2528
275 2528 -9940 -11355 -7682 16860 33943 14799 501 3001 -1949 -4939 -12206 -36644 -34055 6773
289 6773 29240 20356 276 -21792 -13089 22671 21820 -13842 -29005 -22515 -5056 20146 24390
302 24390 12395 17769 15099 -9859 -14844 -1201 2895 2047 -10592 -29482 -11138 25295 23739
315 23739 1511 -10337 -13828 1685 16024 -7120 -29933 -12187 18473 38276 35249 -8285
327 -8285 -43903 -18649 25598 35552 8712 -39248 -56015 -3164 51836 40046 -5712 -37800
339c7800M285M2183K1239l3040k4905J7026K5027J7185m685l1996j3225J9006
351C00P766n698n475j7144p058K5221K2498M495m268k7760k9458J1160K6723J0487
365A1789m86k0105k3716J9744M2836J6742j2339l5593l6796J2161M2373P530k5574
378a434k1131P53L6956L4568k4224m9665j1130K1509K5399N273l5885l1249K6430
391b3830M6405J8074j1324l7556k9073K1206L4722N25j8229k1228q244K9666L1590
404C2704r257k1439p700l507O048N311j4192l630J8977P262l922M586l233o323
418A685J978p454m571J6208K992k0612n718J1528J7756J7144j5270m1992j1630
431c7956K3988K1842Q889j2239k6348M271L1660J0264j2449j7211j6467Q219K4213
$$ plain form
339 -37800 -33515 8668 29907 -3133 -28038 -11012 14015 31200 26515 -5481 -18706 300
351 300 8066 2368 -3107 -20251 -27309 -2088 20410 24905 20637 -7123 -36581 -25421 1302 11789
365 11789 11303 -8802 -32518 -12774 30062 46804 34465 -1128 -37924 -25763 16610 24140 -1434
378 -1434 -22565 -21812 15144 49712 25488 -24177 -35307 -13798 11601 16874 -19011 -50260 -23830
391 -23830 22575 40649 29325 -8231 -37304 -16098 18624 19149 920 -20308 -28552 1114 32704
404 32704 23447 2008 -5692 -9199 -3151 2160 -12032 -15662 3315 10577 6655 11241 8008 1685
418 1685 3663 -3791 -8362 7846 10838 -9774 -15492 -3964 13792 30936 15666 -26326 -37956
431 -37956 -13968 7874 16763 4524 -21824 -17553 14107 24371 11922 -5289 -21756 -13537 10676
444A0676m963k1109K740J7271J9059O919k8683l1529J1601K5151J643j0726j4650
457a6600j069K8419J9379j4974j1950J763k378j277o327j4007J0015K4995N07
470A6496j1189m139l112O958J1520j4928k2335O65O816P662J2774k151p518J1118
484H637N272j3900r938n046L61J6855N081j8764m623J6454J1944O400q584k4027
498a3878l758J7061J573m820L783L579Q696Q623j4037j4528J0122Q494n011p751
512a852j3643l446K4735J6786j1250j2370o967j676J3090J928j9749l314J8046
525C18J1486K995j0194j8458P761K5013k768k4640j7354k873K2242K8562n608
538A6482k3944k464Q231O763L106j5598j6622J2037J7493J851Q02k902l561J3074
$$ plain form
444 10676 5713 -15396 -12656 4615 23674 30593 1910 -29619 -18018 7133 8776 -1950 -16600
457 -16600 -17669 10750 30129 15155 3205 4968 2590 1313 -5014 -19021 -9006 15989 16496
470 16496 5307 1168 -1944 5014 16534 1606 -20729 -20064 -13248 -5586 7188 5037 -2481 8637
484 8637 13909 9 -9929 -14975 -14614 2241 7322 -11442 -16065 389 12333 18733 10149 -13878
498 -13878 -17636 -575 998 -3822 -39 3540 12236 20859 6822 -7706 2416 10910 5899 -1852
512 -1852 -15495 -18941 5794 22580 11330 -1040 -8007 -9683 3407 5335 -14414 -17728 318
525 318 11804 14799 4605 -13853 -6092 18921 16153 -8487 -25841 -28714 -6472 22090 16482
538 16482 -7462 -9926 -1695 5068 8174 -7424 -24046 -12009 5484 7335 8137 5235 1674 14748
552A4748P217j7511j2942p86L22R897R053p989k181R691l351o462J643l627l268
567e546j160j2867l597K5246J9443m807j3094j4060J879K3296L680k7981j5402
580b4970J0724J9682J7205r397k8540q33K5185R203j2919k4038j8298J8744L7819
593A9567N531k1824j5799j238K1065K3809j3380l2582o668J3809J7769J2989j2229
606A0819k0399O670J3782l565p767j1545q550J2310J3642m223m57L791n423J098
620A83P417l575l576k287j3784j344K2993J4811l189j2970j9751k271K4414Q928
634A5999k0045j9049m573J7395L2393N671k8939j5160J1717J8130R665j7511l3046
647b7353M5L4118K0997m792k1332k1568J1559L0780k60k7935k1913l895K1390
$$ plain form
552 14748 21965 4454 -8488 -9274 -8952 945 9998 2009 -172 9519 6168 -294 1349 -2278 -5546
567 -5546 -6706 -19573 -23170 2076 21519 16712 3618 -10442 -8563 14733 18413 -9568 -24970
580 -24970 -14246 5436 22641 13244 -15296 -16129 9056 18259 5340 -18698 -36996 -18252 19567
593 19567 25098 3274 -12525 -13763 7302 31111 17731 -14851 -21519 -7710 10059 23048 10819
606 10819 -9580 -2910 10872 7307 -460 -12005 -20555 -8245 5397 1174 717 4508 -915 183
620 183 7600 4025 449 -1838 -15622 -16966 6027 20838 17649 4679 -15072 -17343 7071 15999
634 15999 -4046 -23095 -27668 -10273 22120 27791 -1148 -16308 -4591 13539 23204 5693 -27353
647 -27353 -27308 6810 27807 23015 1683 -19885 -8326 22454 22194 -5741 -27654 -31549 -10159
660a0159L0329j899k3035o438O817J0268R399j1553k0795J884J2827N057O577
673I279J114q341J756M101o760J00K373j1935o295Q600P857J0009K804j9432j3879
688a8649J4909J4765j331j3339k1218K48L2543K0763j2606j9793j0931P875K4757
701A7993J769k8167j5017J1054J9329J5926p154k6919n235J9497R141o799j5120
714i702j5768R389K7193N872j1625n991k624N216R796q242j5002K982O455k7M948
729B870J255j394P255j554j6584l190P315K02O31k352n785J2426J8133m409j3683
744A136m703j086P925P465j4862j2861J0957J4263O076l12j5234j0071J2092O381
758G166j0140p910l341L106J6646O632j1938k497O046n97l60m874j1166N399J6107
$$ plain form
660 -10159 20170 18271 -4764 -11202 -4385 5883 15282 3729 -17066 -15182 -2355 2702 9279
673 9279 10393 2052 3808 7909 1149 1249 3622 -8313 -14608 -6008 1849 11858 14662 -4770 -18649
688 -18649 -3740 11025 9694 -3645 -24863 -24615 7928 28691 16085 -3708 -14639 -6764 17993
701 17993 19762 -8405 -23422 -12368 6961 22887 15733 -11186 -16421 3076 12217 5418 -9702
714 -9702 -25470 -16081 11112 16984 5359 -632 -3256 1960 11756 3514 -11488 -8506 -2051 -2078 2870
729 2870 4125 2731 9986 8432 -8152 -11342 -4027 -3825 -3194 -5546 -11331 1095 19228 14819 1136
744 1136 -3567 -4653 3272 10737 -4125 -16986 -6029 8234 14310 13998 -1236 -11307 785 7166
758 7166 -2974 -10884 -14225 -11119 5527 12159 221 -2276 3770 3173 2813 -2061 -13227 -7828 8279
773H279j48p193l71O50Q062P020j5355j7124N465J0550N190J4j1805n455J7970
788E749J2074j2362j4524p716L896J9337O097j6682o298J0574R905O639o643j9814
802i768l170J3678K193m045r58m000N329J2438m016r467J600k549m691L106n45
817d865L57J1412K875q996J505M662j576m5q472j4841N369J6609K921l709o147
832b941o225J1145J4130j0914j9158l988P157J5721J0781j4198j3739J2891J6957
845A7619K846r287k1260r562J8424J4231q889r810k357N927J5220L13k0352q785
859a5722O823M731L906k373r956N184J6344K196n832k980o699L57R145k928o159
874c963O145K303m55N166k148o270K055l514r939L072O130k44K955j085p170P159
$$ plain form
773 8279 8131 938 567 1217 9279 16299 944 -16180 -10715 -165 5025 5039 -6766 -12221 5749
788 5749 17823 5461 -9063 -16779 -12883 6454 12551 -4131 -10429 145 10050 16689 10046 -9768
802 -9768 -12938 740 2933 -1112 -2070 -6070 -741 11697 7681 -1786 -186 -2735 -7426 -4320 -4865
817 -4865 -4508 6904 9779 783 2288 6950 5374 5329 -3143 -17984 -12615 3994 6915 3206 -2941
832 -2941 -9166 1979 16109 5195 -13963 -17951 -10794 4927 15708 1510 -12229 662 17619
845 17619 20465 11178 -10082 -19644 -1220 13011 4122 -5688 -8045 -2118 13102 13415 -6937 -15722
859 -15722 -8899 -4168 -262 -2635 -12591 -7407 8937 11133 5301 2321 -4378 -4021 5124 2196 -3963
874 -3963 2182 4485 4030 9196 7048 778 2833 -681 -10620 -7548 -1418 -1662 1293 208 -6962 197
890A97R139p361j0560l523K78J3312J1505j1856j1336Q540J3486Q084n656k4971
904a0722j3237J8947J9470j341j2498j5419K625K6631J1328j9657k0352m817R655
917i387J9432J505k0142o514J4104J2752N218q602k1261m662J4368O191j450k720
931a168q792J299J5762N952m400l885j1056p384J0250R230jR89o144p141J0686
946D197J2147m804j0640j2372q359J4994J7453o887j5134m780O683J9712R705
959B1915k3542k4441N512K0594J7069j259k4421j2673K2023K3615m14j6087k1993
972a4102n456K2168J5181j0002j1927m511L547J4878M434j7389j1318K172K822
985i503P199M235q176j775R319K982M04K362q103o886M221K643L981R981k512
$$ plain form
890 197 9336 1975 -8585 -12108 -11830 1482 12987 1131 -10205 -1665 11821 19905 14249 -10722
904 -10722 -23959 -5012 14458 13117 619 -14800 -12175 14456 25784 6127 -14225 -19042 -9387
917 -9387 10045 11550 -8592 -15106 -1002 11750 16968 8366 -12895 -17557 -3189 3002 1552 -1168
931 -1168 -9960 -8661 7101 13053 8653 4768 -6288 -13672 -3422 5808 5807 6796 652 -6489 4197
946 4197 16344 11540 900 -11472 -19831 -4837 12616 5729 -9405 -14185 -7502 12210 21915
959 21915 -1627 -26068 -20556 38 17107 15848 -8573 -21246 777 24392 23978 7891 -14102
972 -14102 -19558 2610 17791 7789 -4138 -8649 -5102 9776 14210 -3179 -14497 -12325 -9503
985 -9503 -2304 1931 -6245 -8020 1299 4281 4685 7047 -1056 -7942 -3721 -1078 2903 12884 10372
1000A0372j1777O63O500N021M066j2772k0524J523J6015Q933N70r807j2687R409
1014d495J6823m069j3757r087j384J4494J4948r769j3561M653J0852R022j03j9148
1028d581j4053J0554J2608O4k229o441j461J2416M607j0809k997K048k299R12
1042a661o60m768Q005J1729n035p864k066k211L997M809r167o998P235N567K882
1057C794K177p163m121R881L063r259n272j719M613J6062L358j3932n596M803
1071F89L855L602n977j3810J284J1038l63k614K628k25K809J275j1912o081J0343
1086c459N529k626j118l478L358J4141J235j1699l380J195J070M035l936j0062
1100i195O499J3709J400m676j1269j1416Q283J6093m800j4035o727K721J6273
$$ plain form
1000 10372 -1405 -742 5758 10779 14845 2073 -18451 -16928 -913 8020 8590 -1217 -13904 -4495
1014 -4495 12328 8259 -5498 -14585 -15969 -1475 13473 3704 -9857 -5204 5648 14670 14567 -4581
1028 -4581 -18634 -8080 4528 4592 2363 -4078 -5539 6877 11484 675 -2322 -274 -2573 -1661
1042 -1661 -2321 -7089 916 12645 7610 -254 -2320 -4531 -534 4275 -4892 -11890 -4655 912 3794
1057 3794 5971 -1192 -5313 4568 7631 -1628 -6900 -8619 -4006 12056 15414 1482 -4114 689
1071 689 4544 8146 2169 -11641 -10357 681 318 -2296 332 107 2916 4191 -7721 -13802 -3459
1086 -3459 2070 -556 -1674 -5152 -1794 12347 13582 1883 -1497 -302 768 4803 867 -9195
1100 -9195 -2696 11013 12413 7737 -3532 -14948 -6665 9428 4628 -9407 -16134 -13413 2860
1113B860J5170r944j5963J149O729M655M12j1049n940J3659J0049m347l907m692
1127a159j904Q673J787j1095m641J416L95P991O489m842k068Q74o644m97O650
1142A425k15j209j63p226J735J4865N148q865q675p370L931J4467j818j5982j234
1157a1186J0817J0128M429j2846j7394O714J8643J832j0097j2540n718J7245K1634
1170B1661l948j6969j0209j648J1930J2754r815j5547M75Q629R607M810j1165
1183E65j1217P416P249m758l853m038K47J1913P040n538j233J081o234qM546n14
1199B664P64l099j0952J934J7646N928o932j1269j2021K886J6751K764j1309n768
1213a0013Q97Q667J4967j798j6429m209O547O917M922j0136j6793O865K1348O838
$$ plain form
1113 2860 18030 8086 -7877 -6728 1 4656 5068 -5981 -11921 1738 11787 7440 3533 -1159
1127 -1159 -3063 5610 7397 -3698 -8339 -6923 -6528 1463 7952 3110 1042 1916 -4728 -5225 1425
1142 1425 1210 1 -162 -7388 -5653 9212 14360 5495 -3180 -10550 -6619 7848 6030 -9952 -11186
1157 -11186 -369 9759 14188 1342 -16052 -9338 9305 11137 1040 -11500 -17218 27 21661
1170 21661 17713 744 -9465 -11113 817 13571 3756 -11791 -11316 -2687 6920 11730 565
1183 565 -10652 -3236 4013 -745 -4598 -8636 -8389 3524 10564 5026 3793 4874 -1360 -1368 3178 2664
1199 2664 3428 329 -10623 -8689 8957 14885 7953 -3316 -15337 -12451 4300 7064 -4245 -10013
1213 -10013 -9116 -449 14518 12720 -3709 -7918 -1371 5546 10468 332 -16461 -9596 11752 18590
1227A8590q975j6694j1673J2404J8952m678j6105o590L349J3629J2184p456j0248
1240c311K084K201p30K688l098l374O081K766l313K018r61n596J853J412n940
1255e220k05J740m228L131P159J127K569k22j1934n023J0767P545R92n247j1730
1270h779J435J8148O432j1632j0634m558M605J0294m062j3469K347J1597N536
1283G260K86q488j0943O639J2802r77o355n945l850J1342J5124k920j1054m866
1297a945j391M053N368q565p426P521N249k524k153k936J411R120k207j2661j538
1312a0624O058L663M925K68l959M294L646q535l785M762J085O80j724q300R11
1327f635J1590L532k607l895q549k821J0468M089m844j827j014K953J0091q18
$$ plain form
1227 18590 9615 -7079 -18752 -6348 12604 7926 -8179 -14769 -11420 2209 14393 6937 -3311
1240 -3311 -1227 974 244 2932 -166 -3540 2541 5307 1994 4012 3051 -2545 -692 720 -5220
1255 -5220 -5425 -3685 -7913 -4782 2377 3504 6073 5851 -6083 -11106 -339 7206 8198 2951 -8779
1270 -8779 -7344 10804 17236 5604 -5030 -9588 -4983 5311 1249 -12220 -9873 1724 7260
1283 7260 7546 -942 -11885 -5246 7556 6579 224 -5721 -9571 1771 16895 13975 2921 -1945
1297 -1945 -3336 717 6085 -2480 -9906 -2385 2864 340 -1813 -4749 -3338 5782 3575 -9086 -10624
1312 -10624 -4566 -903 4022 4290 331 4625 8271 -264 -4049 713 1798 2478 754 -7546 -6635
1327 -6635 4955 8487 5880 1985 -6564 -9385 1083 5172 328 -1499 -2513 440 10531 9713
1341I713j2234j047O373K170k265r181q171J1467J4941l620j0702n602o06P349
1355a415N683q120n431O480K210Q58L233j615r6N853l425q779k5J422K144Q202
1371G179j1r163j025M158J039K315m320r839L787R116j991l698J585K915P727
1386I774K413j3845r024P899O994J257j978q333k083J0218K944m827o79l186m933
1401g389J455K48j137O574M043m239o04O01l145L912M329o738l623K323K495N950
1417E055L196q181k983R484L385p213q992o320Q273J8234m02j7432p625O466J2307
1432G252R000j0243j8701j235J1654O456L914l733r726K043Q417k96l121l957
1446b276o518K604R807j125o372L6P14M341O245n918q883P43J092R13Q000M408
$$ plain form
1341 9713 -2521 -3568 2805 4975 2710 -6471 -14642 -3175 11766 8146 -2556 -8158 -8764 -1415
1355 -1415 4268 -3852 -9283 -2803 -593 265 3498 1883 1787 7640 4215 -4564 -4589 -3167 -1023 7179
1371 7179 7168 -1995 -3020 1138 2177 4492 172 -9667 -5880 3236 1245 -2453 -868 2047 9774
1386 9774 12187 -1658 -10682 -2783 4211 5468 3490 -4843 -6926 3292 6236 1409 730 -2456 -7389
1401 -7389 -5934 -5686 -6823 -249 3794 -445 -1049 -448 -3593 319 4648 -2090 -5713 -3390 -895 5055
1417 5055 8251 70 -2913 6571 9956 2743 -6249 -12569 -4296 13938 13536 -3896 -11521 -5055 7252
1432 7252 16252 6009 -12692 -13927 -2273 4183 8097 4364 -5362 -3319 5098 4802 1681 -2276
1446 -2276 -8794 -6190 3617 2492 -3880 -3844 -3130 1211 7456 1538 -7345 -6602 -5510 -4597 3403 7811
1462G811m130l672m788Q7J2967O916j3031j2877j145R687J5146K551j6378r011
1476i867Q491P697J523n969j3109j399J4208P546l947o197p890K199J5910M625
1490A3821j3385j2389l259R812J8122K053j6790q430N649P985N845m837j2479
1503h282r58P142R64J317L621j975j720J926l027M7L875m656m344O073N048K20
1519E271j86o514l485Q230M835n647o035o221j610J2193J1256m193j0058o610
1533h774N77J3242Q131j1992j3110K489R976R640n4j2869m684J1442M809o687
1547B136p921m897L939J2266J086q475k969J439K182N975J94q046k316J922P89
1562b696N423L987m099J71K127m398k833K162j89J013J046o510r10Q151K937m910
$$ plain form
1462 7811 3681 9 -4779 -4692 8275 15191 2160 -10717 -11862 -2175 12971 15522 -856 -9867
1476 -9867 -1376 6321 7844 1875 -11234 -12633 1575 9121 5174 -1023 -8913 -6714 9196 13821
1490 13821 436 -11953 -15212 -5400 12722 14775 -2015 -10445 -4796 3189 9034 4197 -8282
1503 -8282 -9240 -2098 -1134 183 3804 1829 109 2035 -992 -945 2930 -1726 -6070 3 5051 5271
1519 5271 5085 -1429 -4914 3316 8151 2504 -3531 -9752 -11362 831 12087 7894 -2164 -8774
1533 -8774 -8197 5045 13176 1184 -11926 -9437 539 10179 10125 -2744 -7428 4014 8823 2136
1547 2136 -5785 -10682 -6743 5523 6609 -1866 -4835 -3396 -1214 4761 4955 -3091 -5407 -3485 -2696
1562 -2696 2727 6714 2615 2786 4913 515 -2318 -156 -345 668 1714 -4796 -5706 2445 5382 472
1578D72k526j327J353M649n575p036P231J0187M30m303o922k647R371O524p908
1593A973p153n13R87O517N202m708l691J457j160j16J840m514k169P190K748k925
1609I65j963j959K960Q727k184j1897l540M594N537L972l341o329M247O418m563
1624A644m942j38J691L967O70p596j302Q263L882m30j590o520l041N293J278j912
1640g83J004j295n55N709k60n720M98K422l70j42m299n391P038R347j498n389
1656C16k172n78M208K503p044k656O126J587k097p50r93M156O067n162r226k46
1672e961L550L536L941l210o189L233M722l69o32l710n905M705N914m056m708
1687e139M59L832Q240K020j2672p813P018P974K160l883q741K63J1061L306m870
$$ plain form
1578 472 -2054 -3381 -2028 2621 -2954 -9990 -2759 7428 7858 3555 -3367 -6014 3357 9881 1973
1593 1973 -5180 -5693 -4706 1811 7013 2305 -1386 71 -1089 -1205 635 -3879 -6048 1142 3890 965
1609 965 -998 -2957 3 8730 6546 -5351 -8891 -4297 1240 5212 1871 -4458 -211 6207 1644
1624 1644 -3298 -3436 -1745 2222 2892 -4704 -6006 2257 6139 5709 4119 -2401 -5442 -149 1129 -783
1640 -783 221 -1074 -1629 4080 3820 -1900 -1402 1020 650 508 -3791 -9182 -2144 7203 5705 316
1656 316 -1856 -2434 1774 4277 -2767 -5423 703 2290 193 -557 -1550 2606 8673 3511 -5715 -5961
1672 -5961 -2411 1125 5066 1856 -4333 -1100 3622 3253 2621 -1089 -6994 -2289 3625 -431 -5139
1687 -5139 -4680 -848 7392 9412 -3260 -11073 -4055 3919 6079 2196 -6545 -6282 4779 8085 3215
1702C215k867k066p04L383j747l922L915L062j763J171N80l728L51J610j876J184
1718b02K103m262J32M256l62J306L621m221o024j809l45M678Q135m540j0463L2
1734g965P710P051J251j0317j0179O757J0950k95n271m362J031J0137N298r530
1748B266q288M77L649N956J549r127n771N572O551M629m66j0105n841O425O195
1763C671q5r50l396j069O710J799m921m65N00l307m07m4j544K265J039m103J010
1780c297N336q18m341l347k451N948Q570k314p649m13M018P473N734o811j1194
1795e556n07O429O081K825p268r254M299R738P82n618q394l107Q938Q222o674
1810I36q086J072O598P770O30j0457o344N458L956L97L34m099j913L817O48q63
$$ plain form
1702 3215 348 -1718 -2422 961 -786 -4708 -793 2269 506 1677 2257 -1471 -1120 490 -1386 -202
1718 -202 1901 -2361 -2229 2027 1665 2971 6592 2371 -3653 -5462 -5807 -1129 7006 2466 -7997 -7965
1734 -7965 -255 6796 8047 -2270 -12449 -5692 5258 4963 -308 -4670 -3639 6498 11796 2266
1748 2266 -6022 -5545 -1896 4060 5609 -3518 -9289 -3717 2834 7463 6997 -3108 -8949 -2524 3671
1763 3671 3586 2636 -760 -1829 4881 6680 1759 1294 1794 -1513 -1920 -1964 -3508 -1243 -204 -4307 -3297
1780 -3297 2039 1221 -3120 -6467 -8918 -2970 5600 3286 -4363 -4776 -758 6715 12449 5638 -5556
1795 -5556 -6063 366 6447 9272 2004 -7250 -2951 6787 7569 1951 -6443 -9550 -612 7610 936
1810 936 -7150 -6078 520 8290 8920 -1537 -7881 -2423 1533 1930 2264 -1835 -3748 69 717 -146
1826a46K099j616n458L01J201N28M026J251l632J273K780o27P09K78n580m97N063
1843A953J194p21j900m511K838R104j329r535n211O30P394P990m570r784J634
1858d824P460L968K83o363o119M031N573k093j959q66p07L960L171n827n292N52
1874e052M49K984K198m767k720N222L145J61N30k641j537L633p83l195L785L973
1890E385m59q87l253k251N400L008o184m350J27J050M406J442n238j457M453J00
1906A292j718j380l899J304O574N30l709r25L53K411N648k557p822m64K985J779
1922D02J887k068l564M078M538m382l659J74R32L555l4o284m60P098K484j277
1938C420j896m036Q13N125j709m945O73J931K252L448l512n328K680L722m95j641
$$ plain form
1826 -146 1953 337 -5121 -4820 -3619 -3091 935 2186 -1446 -173 2607 1980 2689 2967 -2613 -3110 1953
1843 1953 3147 2426 526 -3985 -1147 7957 6628 -2907 -8118 -7488 -94 7896 3326 -6458 -4824
1858 -4824 2636 6604 6887 524 -5595 -1564 4009 1916 -43 -909 -1616 2344 5515 -312 -5604 -5052
1874 -5052 -4603 -1619 579 -4188 -6908 -1686 1459 1620 2150 -491 -2028 1605 822 -2373 1412 5385
1890 5385 4926 4039 786 -1465 3935 6943 759 -3591 -3464 -2414 1992 3434 -1804 -3261 1192 1292
1906 1292 -426 -1806 -5705 -4401 2173 2703 -1006 -1931 -1578 833 6481 3924 -3898 -4362 -1377 402
1922 402 2289 221 -3343 735 5273 891 -2768 -2594 -1662 1893 1859 -4425 -4885 2213 4697 3420
1938 3420 1524 -2512 -1699 3426 1717 -3228 -2555 -624 1628 5076 1564 -3764 -1084 2638 2143 502
1954E02l942l663N679O871j343l538j960r87M404K714n372l681L046J315P99O66
1970A510l012O7M292j238m816M97M40j47K526q46j561M261J777l782l98J073j89
1987D54K933m72n822m15N541K472J357k599p566r07O832J420l580l785l808M131
2003c814Q936m53p495j948J785M762L761n052p680L231P525K835k22n023n445
2018d297L708N879j892l229k810k977L649N555k195k364K24j754L24K780j646
2033a045j740K577p38p68M455J401j810q22k407j232M570J750o096k687J213L627
2049B48N750q63r843l059O142M810Q28m109p529J507J0436L872l293n062m537
2064d702K668P885n37p658l194J728M304N751l228q369k2M571K332J72l174n198
$$ plain form
1954 502 -3440 -7103 -1424 5447 4104 566 -1394 -2381 2023 4737 -635 -4316 -1270 45 844 1510
1970 1510 -1502 -1435 2857 1619 -3197 -2700 -2260 -2407 119 -727 -2288 1973 3750 -32 -430 643 454
1987 454 3387 2915 -2907 -3322 2219 4691 6048 3449 -4117 -5024 1808 3228 -352 -4137 -7945 -3814
2003 -3814 5122 4669 -2826 -4774 -2989 1773 5534 482 -7198 -3967 3558 6393 6171 1148 -4297
2018 -4297 -589 5290 3398 169 -2641 -5618 -1969 3586 1391 -973 -749 -2503 -2179 601 -1045
2033 -1045 -2785 -208 -946 -1714 2741 4142 2332 1510 -897 -2129 2441 4191 -1905 -4592 -3379 248
2049 248 5998 5135 -4708 -7767 -1625 3185 4013 -96 -7625 -6118 4318 8190 4897 -165 -4702
2064 -4702 -2034 5851 5314 -2344 -5538 -3810 494 6245 3017 -5352 -5374 -803 1529 1701 -1473 -6671
2080f671L391O170J70l62k15l148Q87K092j716lJ513l136j919L118K149J8M64
2097B802n274l685M902K947j919j383k727K60P185L536n480l856J5K185N685M11
2113E604q251l262N019M783K649k776q147j904O660K724k902k756l191K367P072
2128C689N47m963q76M04J012L075j440m286K017K939l16O65n4k902Q66J410l611
2145a824n99J910q51r9J059j488J372M113j693m345L55M82K046L464l146m203
2161c447L073L781K14o75l873l391L600L512l739k030J0J004M398J433n409k349
2177c888K971J404Q36m56l599M30N901M56k409q09p49N04K682l041m214K263K958
2194A240l60L45k451k131L824K385l891k489P1J091L787J404m530q00M452P77
$$ plain form
2080 -6671 -3280 2890 3060 2698 2483 -665 222 2314 598 595 2108 -1028 -2947 171 2320 2338 2802
2097 2802 -2472 -6157 -1255 1692 -227 -1610 -4337 -4077 3108 6644 1164 -2692 -2677 -492 5193 5604
2113 5604 -2647 -5909 -890 3893 6542 3766 -4381 -6285 375 3099 197 -2559 -5750 -3383 3689
2128 3689 4236 -727 -1603 -1199 -187 2888 1448 -2838 -821 2118 1802 2467 2413 -489 377 1787 -1824
2145 -1824 -2423 -513 -1364 -1463 -404 -1892 -520 3593 1900 -2445 -2090 -1608 438 3902 756 -3447
2161 -3447 -374 3407 3621 2946 -927 -4318 -718 2794 -945 -2975 -2965 -1961 2437 3870 -1539 -3888
2177 -3888 -917 487 1323 867 -2732 -2302 3599 4055 1646 837 88 592 3274 233 -3981 -1718 1240
2194 1240 880 1225 -1226 -3357 467 2852 -1039 -3528 -3457 -2366 1421 2825 -1705 -2505 1947 2724
2210B724p35j336l752L93N215j48l109Q4J4J487L105k284m791J158K001j87R87
2227H26j383k137L458L135l114j545M51m23J742P48m025j0M460N4j189j11k877
2244a940J162L549k837l849Q33K008J653K251l463l185L627L423j813j961k043
2259b585j015N235L143m264k383J367J487K561j26o669j552M467J588K73r06l570
2275b949N04N654P9l788j261o96J448L899q22m164J781K486q77J169j850l095
2291b482J508J877k538J66J792j343J070O53k720P32L221k253k305N14K82K428
2307F02L847l193l894K627K808O21p48n106k632N441M338k629k576k592M46N763
2323C123K152o849m041J826L066M125P6n928j905N303K557l13j554m946o00N890
$$ plain form
2210 2724 1989 653 -3099 -2706 2509 2361 -748 -664 -650 837 3942 1658 -3133 -1975 26 -161 826
2227 826 -557 -2694 764 3899 785 -760 -309 -732 1010 1758 -2267 -2277 2183 2237 1048 937 -1940
2244 -1940 -778 2771 -66 -3915 -3082 -1074 579 2830 -633 -3818 -191 3232 1419 -542 -2585
2259 -2585 -3600 1635 4778 514 -1869 -502 985 3546 3420 -3249 -4801 -334 1254 1527 621 -2949
2275 -2949 -2445 3209 3288 -500 -1761 -2457 -1009 2890 2068 -2096 -315 2171 1294 2463 613 -2482
2291 -2482 -974 903 -1635 -1469 323 -1020 50 703 -2017 -1285 1936 -317 -2622 -2108 -1826 602
2307 602 4449 1256 -2638 -11 2797 3418 2670 -2436 -5068 373 4711 2082 -494 -3086 -2640 3123
2323 3123 5275 -1574 -5615 -3789 -723 3402 3478 -2450 -4355 948 3505 3192 1638 -3308 -3908 1982
2339A982R62k557n91j051J95L501n48m035O31K96j390K175J279j477R62Q91k745
2356a520J310L256j738k013r24r01L074M983k891m325j77J111L264K285n808n421
2372f435K885M380J873j46m645l025N261M512k270l289k765j63O195L640m944
2387A064l455Q13K043K966M59o037k788L450J788M71O98k861j102L319Q0j874
2403i66J554o06j927J869J60o15K819K84l102K94J189l23Q53p21m667J079M939
2420B113M24j384j784l299K252N532j635m675j364P34L978M452l244n120J507
2435a513L209Q05K49l829l446L955L490k118q39p57j344L288J378m163j231J697
2451a169l20J888J423k749L13K704p63j635J158r18l2J934k073k343L179K095
$$ plain form
2339 1982 2944 387 -204 -1255 -1060 2441 1893 -2142 -1511 -1215 -2605 -430 849 -628 334 1225 -1520
2356 -1520 -210 3046 1308 -705 -1629 -2530 544 5527 2636 -1689 -1866 -755 2509 4794 -1014 -6435
2372 -6435 -3550 830 2703 2557 -2088 -5113 148 4660 2390 -899 -3664 -3827 2368 6008 1064
2387 1064 -2391 -1578 465 3431 3890 -2147 -4935 -1485 303 774 1472 -1389 -2491 828 908 -966
2403 -966 588 -18 -1945 -76 84 -531 2288 2572 -530 -236 953 630 1483 762 -3905 -2826 2113
2420 2113 2537 1153 -631 -3930 -1678 3854 2219 -2456 -3820 -3086 892 5344 2100 -3020 -1513
2435 -1513 1696 2501 2750 -1079 -4525 -570 2920 802 -37 -794 -2138 1150 2528 -1635 -2866 -1169
2451 -1169 -1489 399 1822 -927 -614 2090 1327 -308 850 -68 -100 1834 -239 -2582 597 2692
2467B692j310o11k712j771M035J938l851j763J144J616L160Nm666j98L649K22
2483A579l29j012k949J247N013o11k626Q2j426M26K633j462l473J400P51j28J639
2500G54l69j913K476J044k899m91J130J6J881M04l596O74L577m35j467j360j741
2517b315J771L236k345l263J512J235J708J363l494l672L352K622j055q8k166
2532a599j734M541L096k206j964p69q90K408J465l816j329K663O74K62L29k764
2548a633j07L035j054j860J050j49N11J776j042r15K768j92k984N2N01k70K449
2565A936n72l878N37K701N07L56j203m113M15M594L8j282r78j743K590M698j868
2582B735m521m54J670K341K117l907m213L275L840o50q15k936k290L240K273k340
$$ plain form
2467 2692 1382 771 -1941 -3712 323 2261 -1590 -3353 -2209 -593 2567 2572 -2094 -2292 1357 1579
2483 1579 1250 238 -2711 -1464 3549 2938 312 394 -1032 -606 2027 565 -2908 -1508 -757 -885 754
2500 754 385 -1528 948 1992 -907 -1398 -268 -252 1629 2033 -1563 -889 2688 2253 786 -574 -2315
2517 -2315 -544 2692 347 -2916 -1404 -169 1539 2902 -592 -4264 -912 1710 655 567 -1599
2532 -1599 -3333 1208 4304 2098 134 -635 -1525 883 2348 -1468 -2797 -134 540 802 1131 -1633
2548 -1633 -1740 1295 241 -1619 -569 -718 -207 1569 527 -388 2380 2188 -796 -744 -243 -513 1936
2565 1936 1364 -2514 -1977 724 1231 1587 384 -3729 -3314 1280 1318 36 -942 -2685 -95 4603 2735
2582 2735 -1786 -2240 -570 1771 3888 -19 -4232 -957 2883 2233 1418 -1518 -3808 -568 1705 -635
2598f35p42M02p88J678J933j592n29J512j992o5J932j490k76K137j065q74J771
2615A317l30j521O33j131j509L348R14k779m86J41J397L629o35n904p63L815J982
2632B118Q84k276l975J956M965p73k643j389j644J620L389j634l610J090J212
2647g10J195K317k449l729J423K647J31R71j951k391L331K680k087p35R1j205
2663d71R12K02k023O17K604j655j822J237J87L86J070l048j680L758J156j281
2679A49P1p96K33L249J56l403p15K13M95K743n6l934j038K491J212J111j379m928
2697d126K16M513O09j579j212q04K325L801k240l925J133K215qQ76k065j739K919
2714I09J482k010N32j8k043P97N41j645J077J317j341J24R12r57K29K100j510
$$ plain form
2598 -635 -1377 -975 -1763 -85 1848 256 -273 1239 -753 -818 1114 -376 -652 1485 420 -454 1317
2615 1317 987 -534 99 -1032 -2541 807 1721 -1058 -1544 -1403 -6 3623 2988 -2916 -3679 136 2118
2632 2118 3002 726 -3249 -1293 3672 2899 256 -1133 -2777 -1157 2232 598 -3012 -1922 -710
2647 -710 485 2802 353 -3376 -1953 694 825 1796 -155 -2546 785 3465 1378 643 734 -471
2663 -471 441 643 -1380 -763 1841 186 -1636 -399 -212 174 1244 -1804 -3484 274 1430 149
2679 149 220 -576 -343 2906 3062 -341 -1056 -843 -348 2395 2339 -1595 -2633 -142 1070 2181 802 -4126
2697 -4126 -3910 603 1212 -367 -1579 -2383 -58 3743 1503 -2422 -1289 926 918 1794 -271 -2010 909
2714 909 2391 381 913 895 -1148 -351 190 -1455 -378 939 -402 -278 634 -323 -94 2006 496
2731D96j926N62k43J465K370k127k913J990J483l78l90l041q45M101J722l268
2747i42j333Q49J515K767m95m362r9K701P3L64N39k131L57K225r18j239P04j586
2765a011r1K105j223j974J683N74O4J136j750j949K720J709k181q61R00N81K232
2782B664n04l649R14L201p69k069j335j355K564K956k404k691R57N16N30J663
2798A189j872j857J376J089O5J599j142j782K572J600j839r77m78o17K565J089
2814B580l260j055K340J51l8o33k003P66K271j929j865K420J120K11m5k565o43
2831b177L665J015l033k98l81O38K119L00k517j16Q73n09J274J33l672nL426Q31
2849A566k44j259k881J704M185p01l410p17J97K467K258k424k986K189J091j019
$$ plain form
2731 496 -1430 -868 -1111 354 2724 597 -2316 -326 1157 779 389 -2652 -3497 604 2326 -942
2747 -942 -2275 -1426 89 2856 2361 -2001 -2100 601 674 1038 1577 -554 -197 2028 1110 -129 575 -1011
2765 -1011 -1102 1003 -220 -2194 -511 63 127 1263 -487 -2436 284 1993 -188 -1049 -149 432 2664
2782 2664 2160 -1489 -575 2626 1857 -212 -1547 -2902 -338 2618 214 -2477 -1520 -1004 -474 1189
2798 1189 -683 -2540 -1164 -75 -10 1589 447 -1335 1237 2837 998 21 -457 -1074 1491 2580
2814 2580 -680 -1735 605 756 718 85 -1918 -1152 1119 -810 -2675 -255 865 1076 1031 -1534 -2177
2831 -2177 1488 2503 -530 -828 -1209 -571 1548 1848 -669 -785 88 -421 853 986 -2686 -2691 735 1566
2849 1566 1322 63 -2818 -1114 3071 2370 -1040 -1757 -1560 907 3165 741 -2245 -56 1035 16
2865A6j20n52r02J862L17k077J036J725j356J96N83j399P56J112j531l59J404
2882G11j17K9J678j911k161J627O38K74J42l179j831L908K996j679k125j641M57
2899b184M194O77m377p82K181J218J192q17l086Q79K874l70j093k74k039O93K322
2916A208kj091m1j578P5K550n40k195R03M62m97J104q9n37J949K9k771j26K012
2935H25L74j83j063k072K312K916k225k671j02J348J772L11l609j655L314J809
2951A401l00J48k201j464K983J187p88m95j177j059K837J854k112j686j26O49
2967c49J475m8l373P8L012K89j008l23q57J096K070j860j963K093P87j187O22
2984E54o03j07K471r60k974K09J488j99R53j060k009J003J789j10M94p56k331
$$ plain form
2865 16 -104 -656 -1558 304 621 -1456 -420 1305 -51 145 728 -671 85 1197 -334 -693 711
2882 711 594 623 2301 390 -1771 -144 494 768 910 -2269 -4100 -192 2804 1125 -1000 -2641 -2184
2899 -2184 2010 2687 -1690 -2472 -291 927 2119 1302 -1784 -905 1969 1599 506 232 -1807 -1114 1208
2916 1208 1206 115 74 -1504 -1429 1121 581 -1614 -711 -249 -746 358 269 -268 1681 1710 -1061 -1187 825
2935 825 1199 1016 -47 -2119 193 3109 884 -1787 -1889 -541 1231 1542 -2067 -3722 -408 1401
2951 1401 1101 1249 -952 -2416 567 1754 966 471 -706 -1765 1072 2926 814 -872 -998 -349
2967 -349 1126 1078 -2295 -2217 795 1084 76 -247 -1104 -8 2062 202 -1761 332 1119 -68 554
2984 554 -49 -156 2315 1355 -1619 -1410 78 -121 832 -228 -2237 -1234 555 445 939 183 -2148
3001b148M67L137l04j286l51o79K224K632k678l003J127J638O68l05l029j047
3017b937L467J394k183n68L66l01Q16K47j865J086J773j195j41P56o57N06J162
3034A726j428q73Q62q78K8J849j528j559J641Q34o88j40j806l04L399Q77k903
3051h91r12J162J645K125j063l979L68K827Nr75m07j354J012J769j320j319Q35
3068d72n70O7J106r74n88J179K35K34J411j026j570J304J116j404N53m22o89J695
3086A185r3k525N42K186o02j568p53j001K653K421k451k226J624J492M06L8k188
3103h60o97K720M67j390J55n42p23K435K84k507l38j17l22K191J28k466n44J662
3121d64O93N62n30k132R02K323q86j447J009M77O93P86k219o19K012L08k085j5
$$ plain form
3001 -2148 -1681 1456 1152 -134 -485 -1164 1060 3692 1014 -1989 -862 776 1444 1139 -1890 -2937
3017 -2937 530 1924 -259 -827 -461 -762 54 301 -1564 -478 1295 100 -41 715 58 564 1726
3034 1726 298 -575 287 -591 -563 1286 -242 -1801 -160 674 -14 -154 -1960 -2264 1135 2012 -891
3051 -891 -1803 -641 1004 3129 2066 -1913 -1545 1282 1287 312 -95 -1449 -437 1332 12 -1307 -472
3068 -472 -1042 -975 131 -843 -1431 -252 -17 217 1628 602 -968 336 1452 48 601 179 -510 1185
3086 1185 1092 -1433 -891 1295 693 -875 -1628 -2629 24 2445 -6 -2232 -608 884 1290 1328 -860
3103 -860 -1557 1163 1630 240 395 -147 -870 1565 1849 -658 -996 -1113 -1435 756 884 -1582 -2126 -464
3121 -464 229 791 261 -1871 -969 1354 468 -979 30 507 1200 1986 -233 -852 1160 1468 -617 -632
3139f32kJ63J666n36j971J106J222q85j03l06r20J021J605o31n78oq82R48K209
3158B488j651k203Q9M72J305R35k040j972K362J482j255p89j204J86L142R8k796
3175a351M48J566j42J026n16j803N88J290j064j35R07q90R2J135j395m82J166
3192D40m98l87J043j324j113K049J044p66l44m10l05K097j45k852N3J862P42J7
3210A203j439j864J530K291j013j999m25j35J701J430j655j444J614N78j71J085
3226A287j166j114J305Q75j096R12q18r37J861M38j553p41M69j94J087k45k075
3243a705J012J842r37r95M27J82Q16Q22k438p39K436J032j203k72r45j40J976
3260A171l50j589j55J33LJ532p6k169M72J218j57O60j74k665R32K615J35o21r58
$$ plain form
3139 -632 -634 -471 1195 659 -1312 -206 1016 131 28 -278 -1198 -177 1428 797 219 213 -669 279 2488
3158 2488 837 -1366 -1277 -805 500 1435 -605 -2577 -215 1267 12 -777 -1981 -1795 1347 1445 -1351
3175 -1351 -903 663 521 1547 1031 -772 -184 1106 42 -93 814 -76 16 1151 -244 -726 440
3192 440 -58 -445 598 -726 -1839 210 1254 488 144 -266 -571 1526 1381 -1471 -1418 444 1186 1203
3210 1203 -236 -2100 -570 1721 708 -1291 -1716 -1851 -150 1280 -375 -1819 -205 373 202 1287
3226 1287 121 -993 312 1187 91 1003 185 -752 1109 1547 -6 -747 -278 -472 615 370 -1705
3243 -1705 -693 1149 212 -783 -356 -174 642 1464 -974 -1713 723 1755 552 280 -665 -805 1171
3260 1171 821 -768 -923 -790 -787 745 669 -1500 -1028 190 33 693 519 -2146 -1214 1401 1536 915 -43
3279d3q01J233K074j777k074J078M30l35R21j422l06J461K63j769K92O85k35O35
3297C10m47j154J182J342p50j86K31q84P58J040j535q23Q52m3O60R52k264j120
3315a879J370J108j89k89j604p09K944J070j932m79L29K27J723m60k447O2K043
3332H88m42l1k91j078P31J076r08m15L32r09L25J288m27p28J039j6p93J077l77
3351C41o63J495p7j566L21O87M8Q98r69k194O51J872o52r11m75p43K036J824j996
3370g3j716R29Q44O70P32j927j337K237Q37l59Q5j339p57J813N94j472k08j15
3388e62m32J739J43j918J57J120M7p1j66r81P18J601r56q58J016L46m76M68j222
3407b87o83J906K3j545n4n5r3K036p92k076N38R88k38J116n22j824R01K033p58
$$ plain form
3279 -43 -844 389 2463 686 -1388 -310 120 -215 706 -716 -1022 439 702 -1067 -775 -90 -325 310
3297 310 -137 -1291 -109 1233 483 297 528 -356 402 1442 -93 -916 -64 -107 553 1505 -759 -1879
3315 -1879 -509 599 410 121 -1483 -2192 752 1822 -110 -589 -260 -33 1690 1230 -1217 -1155 888
3332 888 446 415 124 -954 -223 853 -55 -470 -138 -1047 -722 566 139 -589 450 434 -359 718 341
3351 341 -322 1173 1096 -470 -149 538 586 1484 515 -1679 -1028 844 192 -719 -1194 -1937 99 1923 -73
3370 -73 -1789 -860 -16 654 1386 -541 -1878 359 1196 837 922 -417 -1174 639 1233 -239 -447 -562
3388 -562 -994 745 888 -1030 -873 247 294 223 57 -924 -206 1395 439 -419 597 943 467 935 -287
3407 -287 -970 936 959 -586 -640 -695 -788 1248 456 -1620 -1082 -94 -332 784 262 -1562 -661 1372 614
3426F14j22k01j221P88J910j268j259L33J65J049N94j787j495J807O23n66j52
3443a88m45n04K187j78j535L88P70n62P79l16j330O22J805j215p12O61q99N85
3461h7J010j110j127J091k14M39N86j518o74K329O00j114l13o19L71J893j80k181
3479h18K47Q84L28N89o14j812R20J290r31r31O51r39Q58J265j255n11Q48J19j18
3498G0L57o97n09J485J26r61P59k65o96J376k45j797N7J184k90M16l54j488J092
3517c80J611p85j019K44r00J597J219j548r97J435L03Q9J76j381r08J914J66j179
3535c43K34l39m38J271L25j716L05O13o02O92J51j313J058J066p38o72Q83j14
3553C23K23M64j224o69J248L33m84J61j243J66J393J31j710K36M86M0R69l97j789
$$ plain form
3426 614 492 291 -930 -142 1768 500 -759 -426 -261 788 1382 -405 -1900 -93 530 -36 -188
3443 -188 -633 -1137 1050 872 -663 -275 495 -67 712 396 -934 -312 1493 278 -434 227 -672 -87
3461 -87 923 -187 -1314 -223 -437 2 588 -930 -1604 725 1325 211 -102 -721 -350 1543 1363 -818
3479 -818 -571 313 641 1230 616 -1196 -276 1014 83 -848 -197 -1136 -278 987 -268 -779 69 188 70
3498 70 427 -270 -779 706 832 -129 630 365 -331 1045 800 -997 -940 244 -46 370 16 -1472 -380
3517 -380 1231 446 -573 -329 -1229 368 1587 39 -958 477 780 869 1045 -336 -1244 670 836 -343
3535 -343 -109 -448 -886 385 710 -1006 -701 -88 -690 2 153 -1160 -102 964 226 -446 437 323
3553 323 546 1010 -214 -883 365 698 214 375 -868 -702 691 822 -888 -652 -166 -126 843 446 -1343
3572a343R75J450m40K27r83j279J284J704r41j064L47o24R22J014j664j157R88
3589e84K51P3M06j106l30J721M44j139L82M0n05Q38L54j306N56Q66o60j03M27
3608F25j181Q12P68j743j86J039m29L28O18j592M3J481l5n50j81q22L75K066k19
3627A217j645K08L48lJ041p03j997N24J667m58N5l43j884J612J845j409j052N29
3645d48k08P87J233j075q10J146J0j04K54q91m73J098O3r72L95n7l12N09K73j261
3665h43K62J138q96k5M50n94R26P41j178q11J222J32J92R2j384n73J934J14j288
3684c89L35r77M99J219k38j884M90Q24k61R72j81j589P18J344j93l20r9j124R76
3703A22J245j101p73N17j80N27M33j165q09J267j27m87M18o57k27J606J17j360
$$ plain form
3572 -1343 -368 1082 642 869 -114 -1393 -109 1595 654 -410 -63 -687 235 1249 -415 -1572 -584
3589 -584 -333 -260 146 -960 -1290 431 875 -264 118 158 -347 491 845 -461 95 961 301 198 625
3608 625 -556 256 1024 -719 -905 134 -295 33 651 -941 -898 583 548 -2 -183 -1005 -630 1436 1217
3627 1217 -428 -220 128 125 1166 463 -1534 -1010 657 199 254 -89 -1973 -361 1484 75 -977 -448
3645 -448 -656 131 1364 289 -521 625 635 531 785 -106 -579 519 582 -390 5 -52 -364 145 418 -843
3665 -843 -581 557 -339 -364 86 -508 418 1159 -19 -830 392 524 716 808 -576 -1149 785 899 -389
3684 -389 -54 -1031 -532 687 449 -1435 -945 -121 -382 590 409 -1180 -462 882 689 369 270 -854 122
3703 122 1367 266 -507 10 -170 357 790 -375 -1184 83 -44 -531 -113 -770 -997 609 726 -634
3721f34N36L91l40O48k1j352P11J048q16l65L68o03L38P45j231o47J420k01r4
3740i9P89j517l41J624K66r26l43J50K0J581m60j535L63J217m32L47o29j404R02
3759d27J315p96n32K95q33J208N83j285p55J185M8M50N55j445m41J840j28o70
3777A67K11l97n08J202j72j225L60M22j99M60k37j052L06J187r58j90M45m03Q81
3796C00O98j047o44J392l05j01M25q41n91J381j38j052N50k76k75Q61n1j603P89
3815e28R07l27P0k69o35J036R93j127k95J55o7P26O50j649o42J138N15l59o8j126
3835i02k05J501o7p61O5l97K83J359m98j074J64P15J43L66j34j517P29J271o64
3854C77N7k01p87M92Q17r84n04J030p49J95M90p91L00P91j38r89O47M70l91Q18
$$ plain form
3721 -634 -98 293 -47 601 580 -772 -61 987 171 -194 174 -429 -91 654 -577 -1224 196 -5 -99
3740 -99 690 -827 -1168 456 722 -204 -547 -397 -377 1204 744 -791 -428 789 357 704 75 -1329 -427
3759 -427 888 92 -440 -145 -978 230 813 -472 -1227 -42 6 456 1011 -434 -875 965 837 167
3777 167 378 -19 -527 675 503 -722 -362 60 -139 321 84 -968 -662 525 -433 -623 -178 -581 300
3796 300 998 -49 -693 699 394 293 718 -123 -714 667 529 -523 27 -249 -524 337 286 -1317 -528
3815 -528 379 52 122 -147 -782 254 1247 120 -175 -20 -87 639 1289 -360 -1002 136 651 292 224 -902
3835 -902 -1107 394 327 -434 -369 -766 -483 876 378 -696 -532 183 326 692 558 -959 -230 1041 377
3854 377 434 233 -554 -62 755 -229 -733 297 -452 -257 233 -558 -258 533 395 -594 53 523 132 950
3874I50m92j168J196Q61j239O1j06p23P80O48j152q26J121J7L31O01j419p54J603
3893B90K11j8l92p54j41K024p7j032j60l52N22J182p12j591O01N08p4L37j93q98
3913g19K14J094j313N21K19m68L12N85n64q9Q66l92n19N56k23m74J079l76j009
3932g00O66L54l43K67n16r79J101J004j138p3N7m23J362O66j615l08P21K61N54
3951I18k20j200o40J876o6n88J18q53k80J276q8j060K20J87j40J222k16j269L28
3970d75J327p38M40q6r85N69J027j164j8L03l76R5M79p65l32J146k54m95lJ15
3990a90j24J049q05q78Q34O67m52L14k86o01R86O39j107J56n9r90J043O57j361
4009e08l92Q02j84N26J38j108k6J335N8q25K7m45K90J453k41j558M38M31k7M72
$$ plain form
3874 950 458 -710 486 1347 108 169 63 -660 120 768 -384 -1210 -89 -72 259 860 -559 -1313 290
3893 290 501 483 91 -663 -804 1220 1143 111 -49 -401 121 1303 591 -1000 -399 109 35 372 179 -719
3913 -719 -505 589 -724 -203 16 -452 -140 445 -119 -208 658 266 -253 303 80 -394 685 309 -700
3932 -700 -34 320 -23 244 -272 -1251 -150 854 -284 -357 -300 -723 639 1305 -310 -618 103 364 918
3951 918 698 -502 -1142 734 668 80 198 -655 -935 341 253 -807 -587 -400 -540 682 466 -803 -475
3970 -475 852 114 554 468 -517 52 1079 -85 -103 200 -176 -81 398 -367 -699 447 193 -302 -305 -190
3990 -190 -314 735 -70 -948 -114 553 101 415 129 -472 514 1153 46 202 143 -847 196 853 -508
4009 -508 -900 -98 -282 244 382 -726 -752 583 641 -184 -157 -602 -312 1141 900 -658 -220 211 184 656
4029F56o62j006J016M14n20j62K10o84N96P19j143q6P47m34L30O25o26o52J261
4048E99j54l93K01l95j29R71m06p35L81M58k80K6n58o41R78M82r48n3N54j63P98
4069E93L12j507J55J171o8j84j30p67J93J064r4j194K72m15J53J208k56j397M50
4088d41N01K68K76p53q99P60J025l37k19n20k24J094O66j131l20N03j01j50J76
4107A74o08k30R03m95l83O99m8n38O14K8n16M72L45o04L72R6l03K75M63p45p2
4128a01J49j95L76N01j171o78J134L37k29k05q01J14J922n09j438N77L7N08O16
4147I44m78j325J044P71p40K14o40l62P48O19q75m4K35j001O57R35r34n69O56
4166a45K72J55L77q67n35J360J20p51O2m1q9K41Q2p41Q74M0o54j98J93l54P62
$$ plain form
4029 656 -6 -1012 4 418 -102 -264 -54 -738 -142 577 -566 -652 95 -339 -9 616 -10 -662 599
4048 599 445 52 253 -142 -271 700 294 -441 -60 398 118 144 -414 -1055 -77 405 -543 -596 -42 -205 593
4069 593 905 -602 -447 724 656 472 342 -425 -232 832 738 -456 -184 -599 -446 762 506 -891 -441
4088 -441 60 328 604 -149 -1048 -288 737 400 181 -339 -563 531 1197 66 -254 249 148 -2 174
4107 174 -434 -664 239 -256 -639 60 12 -526 88 116 -400 72 417 -187 185 281 -22 253 716 -29 -101
4128 -101 48 -147 229 730 -441 -1119 15 352 123 -82 -883 -769 1153 644 -794 -217 -180 328 944
4147 944 466 -859 185 956 216 430 -210 -572 176 795 -80 -124 111 -890 -233 702 -232 -801 -145
4166 -145 127 282 659 -208 -743 617 737 -14 48 7 -82 159 241 -500 374 414 -240 -438 -245 -599 163
4187A63Q0j081M08P28p4J7L4o51L38O77m69j17P7l75NP58j78q39j13N00O8M67
4209D23k98j392Q38R37l27o9n71k97J254O27j092n52M53K08N21J75q88l89P41
4228C02k06m02P75p44l61O67j90k87K76p6l15O77K69p92N59j38j7Q7K44m67M83
4249C44N63j381n6Q18k29k4R4j119K69J294l54q67K82l0L51O60p48p57N40Q18
4269D68l49L12l72n81Q57L75n89o6J37r50R16M94l96q89J86J7P34K19j042m24
4289i43J145J54k05q6l88J92R72j99j058N57o0J64q9k23k49K34M80q02K61O81
4309E38q06l4J63l48L99N91m82r5O98p61m90J190k47k57K95k37o7O25n32q86K05
4330e38O07L4J03r05l90J100R15j102l38J84J04P85m9r92n8R10Q1k05J68n33l48
$$ plain form
4187 163 243 -838 -430 298 224 241 275 -376 -38 639 170 53 130 -245 -240 518 340 -499 -612 -112 -44 423
4209 423 125 -1267 -429 508 181 112 -459 -756 498 1125 33 -519 -66 142 663 838 -50 -439 302
4228 302 96 -306 469 -275 -636 31 -159 -446 -170 -246 -561 116 385 -407 152 14 -3 84 328 -139 344
4249 344 907 -474 -530 288 59 35 129 -990 -721 573 219 -648 -366 -396 -45 615 -133 -890 -350 468
4269 468 119 431 59 -522 335 710 121 55 192 -758 158 652 256 -633 -447 -430 304 523 -519 -943
4289 -943 202 356 151 65 -323 -131 841 642 -416 141 81 245 156 -67 -316 -82 398 -404 -143 538
4309 538 -268 -302 -139 -487 -88 503 21 -74 624 -137 -627 563 316 59 354 117 50 675 143 -743 -538
4330 -538 69 103 206 -699 -1089 11 926 -176 -514 -330 -226 559 510 -482 -540 370 451 246 414 -119 -467
4351d67Q54R5k38k26o85k75J211o1n16J16j45R9O91J7j208Q00J86k40k9O2k14
4372a73N70K41r01r4O02k05n40M1K02L74K02l13o35Q55K6m07Q7k42n38P90N61
4393E03p02N88j95o15O64N31p41l53J30k91Q98M10j609p0O92L18k7j77j041M14
4413f73J500k20j047M20P2J73N17n43k45L23M1o53M77N03j007Q7K69k07L16qr42
4434h47N04P41l22l15N4j22O09K8k73k17Q11m92o62M59K17K01P4o73n55Q98M00
4455E18n41n72J24j16Q66L71j212L37N24l22J90J77q49N9P38L19k85P5q23j06
4475e28J169m5o69m12K21K1R94o40r85M93P51l25j7j58k48N69M62o24l16P72l49
4496A36MP5k72q4M88l02k87M39k12l56J74j52k60N80K04o17L81J30n74L61O17
$$ plain form
4351 -467 387 482 244 18 -667 -942 269 208 -308 -192 -337 -238 453 470 -738 62 248 8 -21 41 -173
4372 -173 397 638 -263 -357 245 40 -500 -459 -257 117 319 6 -629 226 252 -155 -68 -310 -848 -58 503
4393 503 -199 389 194 -421 243 774 33 -320 -190 -481 417 827 -782 -852 -160 158 131 -46 -1087 -673
4413 -673 827 607 -440 -20 52 225 742 199 -46 277 318 -335 142 645 -362 -275 -6 -213 103 95 -847
4434 -847 -343 398 76 -239 -185 -307 302 330 57 -160 651 159 -503 -44 173 374 448 -225 -780 118 518
4455 518 -23 -595 -471 -587 279 650 -562 -225 299 -23 167 344 -505 -446 292 611 326 401 -422 -528
4475 -528 641 596 -73 -485 -264 -243 751 111 -874 -381 370 45 28 -130 -378 191 653 29 -287 485 136
4496 136 140 215 -57 -141 347 45 -242 197 -15 -371 -197 -349 -609 -29 175 -442 -61 69 -505 -144 473
4517D73k49jm92kQ04M50j095m05M87L52K35l82r47K73J225j96p55Q4p07M97Q73
4538E22n77m91M85j24K40M52j45r46O57L6n8J09J88j025N70Q19j003p7j18l2N37
4559A9M57o66m87P76k25J37P3n9L0M38l17n55O58O2m72R6o2m6P24l46q94K72M76
4582H9p8JM5n21L56O12o20J90K52q06M0J142j34l70k06o12N76J173p98p87J21
4603c35L41J67K47n36r38R63M97m65j01p1l7L82L40m01j44N37r25O70N42n86n80
4624d33M61r0q4N07l70n62M74M3o9J16J98m06M55m32l02Q35L11o55k34N77k21
4645A19M82l32j004L24J086l35m16j71j91J06Q76j57j026L21m9K07P78m56r09
4664g47O29M09k13N28k68q95P76J80L7m77j23k86P81J67p07m65N44K65p2K00o21
$$ plain form
4517 473 224 223 -269 -271 533 983 -112 -517 -30 322 557 175 -772 -499 726 530 -225 -141 -848 -351 522
4538 522 -55 -546 -61 -185 55 507 362 -584 73 109 51 160 348 -677 -107 712 -291 -368 -486 -518 19
4559 19 476 -190 -677 99 -126 11 84 25 55 493 176 -379 279 341 -131 -35 -97 -143 581 235 -659 -387 89
4582 89 11 12 57 -464 -108 504 -116 74 326 -480 -440 702 568 198 -8 -620 -44 1129 331 -456 -335
4603 -335 6 173 420 -116 -1054 -91 406 -59 -160 -231 -268 114 454 53 -91 446 -479 191 733 147 -433
4624 -433 28 -62 -146 361 -9 -571 -97 -54 -123 -7 191 -215 240 -192 -494 341 652 -3 -237 340 119
4645 119 601 269 -735 -411 675 340 -76 -247 -438 -332 544 387 -639 -318 -367 -160 618 162 -747
4664 -747 -118 291 78 606 338 -557 219 399 436 -41 -164 -450 331 498 -209 -674 -130 135 63 263 -358
4685c58J5Q14n00j99O22m32%lJ72k19O80m35n10J72L52l28L31J3q21N68Q4l59
4707c41K41L10n26n9N80j33j91J07n58M62Q33l23o02M4L13O7L00n18o02O85K80
4728C69k21o4k82m57R75K00n83J52j66j24M66N06p28Mn3p3L93L94j004j12O27
4749B19m8j53l4l29J61K83k00m12M44Q4m60N08k52m1M03J50n75J0P43k27k06L57
4771D25n26N0N44k96o32N41m78K51M90l57l47J67M1L4N72o23k73M77M47k84k3
$$ plain form
4685 -358 -343 471 -29 -228 394 -38 -38 -41 131 -88 592 157 -353 -181 171 -157 174 187 -634 -66 18 -341
4707 -341 -100 210 -316 -375 205 72 -119 -12 -570 -108 725 402 -200 -156 157 224 524 6 -596 89 369
4728 369 148 84 -198 -655 320 520 -63 89 -77 -201 265 771 43 47 -6 -79 314 708 -296 -408 219
4749 219 171 18 -16 -345 -184 99 -101 -513 -69 15 -445 63 -189 -230 173 323 -252 -242 501 274 68 425
4771 425 -101 -51 493 197 -435 106 -372 -121 369 12 -335 -168 -127 -93 479 -144 -417 60 507 223 200
$$ [...]
8191G8
##END NTUPLES=NMR FID
##END=
