##TITLE=1H_EC-3133(II-1)
 CDCl3, 8 sc, 
 11.2.2019
##JCAMPDX= 6.0         $$ Bruker NMR JCAMP-DX V2.0
##DATA TYPE= NMR FID
##DATA CLASS= NTUPLES
##ORIGIN= UXNMR, Bruker Analytische Messtechnik GmbH
##OWNER= root
$$ XWIN-NMR		Version 3.5
$$ Mon Feb 11 14:26:39 2019 Russian Standard Time (UT+4h)  she@DPX200
##.OBSERVE FREQUENCY= 200.1313
##.OBSERVE NUCLEUS= ^1H
##.DELAY= (6, 6)
##.ACQUISITION MODE= SIMULTANEOUS
##.ACQUISITION SCHEME= undefined
##.AVERAGES= 8
##.DIGITISER RES= 18
##SPECTROMETER/DATA SYSTEM= spect
##.PULSE SEQUENCE= zg30
##.SOLVENT NAME= CDCl3
##.SHIFT REFERENCE= (INTERNAL, CDCl3, 0, 15.7039)
##AUDIT TRAIL= $$ (NUMBER, WHEN, WHO, WHERE, WHAT)
$$ ##TITLE= Audit trail, XWIN-NMR		Version 3.5
$$ ##JCAMPDX= 5.01
$$ ##ORIGIN= Bruker BioSpin GmbH
$$ ##OWNER= she
$$ F:/spectra/data/she/nmr/H-F/1/audita.txt
$$ ##AUDIT TRAIL=  $$ (NUMBER, WHEN, WHO, WHERE, WHAT)
(   1,<2019-02-11 14:25:37.43 +0400>,<she>,<DPX200>,
      <created by zg, POWCHK disabled, PULCHK disabled
       configuration hash MD5:
       00 E9 B6 7A A2 85 ED C7 34 08 36 98 17 FE 4E 26
       data hash MD5: 16K
       9B 35 3E 04 1F AE 72 D0 0C 35 0F 3F 05 7E 3A A9>)
$$ ##END=
$$ 
$$ hash MD5
$$ 4A FE DA 02 07 BD 16 28 F5 99 54 94 F7 57 E1 1F
##$RELAX= 
##$RELAX= 
##$RELAX= 
##$RELAX= 
##$RELAX= 
##$RELAX= 
$$ Bruker specific parameters
$$ --------------------------
##$DU= <F:/spectra>
##$EXPNO= 1
##$NAME= <H-F>
##$PROCNO= 1
##$TYPE= <nmr>
##$USER= <she>
##$AMP= (0..31)
100 100 100 100 100 100 100 100 100 100 100 100 100 100 100 100 100 100 
100 100 100 100 100 100 100 100 100 100 100 100 100 100 
##$AQSEQ= 0
##$AQ_mod= 1
##$AUNM= <au_zg>
##$AUTOPOS= <>
##$BF1= 200.13
##$BF2= 200.13
##$BF3= 200.13
##$BF4= 200.13
##$BF5= 200.13
##$BF6= 200.13
##$BF7= 200.13
##$BF8= 200.13
##$BYTORDA= 1
##$CFDGTYP= 0
##$CFRGTYP= 5
##$CHEMSTR= <none>
##$CNST= (0..31)
1 1 145 1 1 1 1 1 1 1 1 1 1 1 1 1 1 1 1 1 1 1 1 1 1 1 1 1 1 1 1 1 
##$CPDPRG= <>
##$CPDPRG1= <>
##$CPDPRG2= <>
##$CPDPRG3= <>
##$CPDPRG4= <mlev>
##$CPDPRG5= <mlev>
##$CPDPRG6= <mlev>
##$CPDPRG7= <mlev>
##$CPDPRG8= <mlev>
##$CPDPRGB= <>
##$CPDPRGT= <>
##$D= (0..31)
0 1.2 0 0 0 0 0 0 0 0 0 0.03 0 0 0 0 0 0 0 0 0 0 0 0 0 0 0 0 0 0 0 0 
##$DATE= 1549880736
##$DBL= (0..7)
120 120 120 120 120 120 120 120 
##$DBP= (0..7)
150 150 150 150 150 150 150 150 
##$DBP07= 0
##$DBPNAM0= <>
##$DBPNAM1= <>
##$DBPNAM2= <>
##$DBPNAM3= <>
##$DBPNAM4= <>
##$DBPNAM5= <>
##$DBPNAM6= <>
##$DBPNAM7= <>
##$DBPOAL= (0..7)
0.5 0.5 0.5 0.5 0.5 0.5 0.5 0.5 
##$DBPOFFS= (0..7)
0 0 0 0 0 0 0 0 
##$DE= 6
##$DECBNUC= <off>
##$DECIM= 32
##$DECNUC= <off>
##$DECSTAT= 4
##$DIGMOD= 1
##$DIGTYP= 9
##$DL= (0..7)
0 120 120 120 120 120 120 120 
##$DP= (0..7)
150 150 150 150 150 150 150 150 
##$DP07= 0
##$DPNAME0= <>
##$DPNAME1= <>
##$DPNAME2= <>
##$DPNAME3= <>
##$DPNAME4= <>
##$DPNAME5= <>
##$DPNAME6= <>
##$DPNAME7= <>
##$DPOAL= (0..7)
0.5 0.5 0.5 0.5 0.5 0.5 0.5 0.5 
##$DPOFFS= (0..7)
0 0 0 0 0 0 0 0 
##$DQDMODE= 0
##$DR= 18
##$DS= 0
##$DSLIST= <SSSSSSSSSSSSSSS>
##$DSPFIRM= 0
$$ [...]
##$SUBNAM2= <"">
##$SUBNAM3= <"">
##$SUBNAM4= <"">
##$SUBNAM5= <"">
##$SUBNAM6= <"">
##$SUBNAM7= <"">
##$SUBNAM8= <"">
##$SUBNAM9= <"">
##$SW= 20.0189088683792
##$SWIBOX= (0..15)
0 0 2 0 0 0 0 0 0 0 0 0 0 0 0 0 
##$SW_h= 4006.41025641026
##$TD= 16384
##$TD0= 1
##$TE= 0
##$TE2= 300
##$TE3= 300
##$TEG= 300
##$TL= (0..7)
0 120 120 120 120 120 120 120 
##$TP= (0..7)
150 150 150 150 150 150 150 150 
##$TP07= 0
##$TPNAME0= <>
##$TPNAME1= <>
##$TPNAME2= <>
##$TPNAME3= <>
##$TPNAME4= <>
##$TPNAME5= <>
##$TPNAME6= <>
##$TPNAME7= <>
##$TPOAL= (0..7)
0.5 0.5 0.5 0.5 0.5 0.5 0.5 0.5 
##$TPOFFS= (0..7)
0 0 0 0 0 0 0 0 
##$TUNHIN= 0
##$TUNHOUT= 0
##$TUNXOUT= 0
##$USERA1= <user>
##$USERA2= <user>
##$USERA3= <user>
##$USERA4= <user>
##$USERA5= <user>
##$V9= 5
##$VALIST= <valist>
##$VCLIST= <CCCCCCCCCCCCCCC>
##$VD= 0
##$VDLIST= <DDDDDDDDDDDDDDD>
##$VPLIST= <PPPPPPPPPPPPPPP>
##$VTLIST= <TTTTTTTTTTTTTTT>
##$WBST= 1024
##$WBSW= 4
##$XGAIN= (0..3)
0 0 0 0 
##$XL= 0
##$YL= 0
##$YMAX_a= 110372
##$YMIN_a= -203239
##$ZGOPTNS= <>
##$ZL1= 120
##$ZL2= 120
##$ZL3= 120
##$ZL4= 120
##$ABSF1= 10
##$ABSF2= 0
##$ABSG= 5
##$ABSL= 3
##$ALPHA= 0
##$AQORDER= 0
##$ASSFAC= 0
##$ASSFACI= 0
##$ASSFACX= 0
##$ASSWID= 0
##$AUNMP= <proc_1d>
##$AZFE= 0.1
##$AZFW= 0.1
##$BCFW= 1
##$BC_mod= 2
##$BYTORDP= 1
##$COROFFS= 0
##$CY= 11.3945322036743
##$DATMOD= 1
##$DC= 2
##$DFILT= <>
##$DTYPP= 0
##$F1P= 18.9103706918063
##$F2P= -1.10871071338519
##$FCOR= 0.5
##$FTSIZE= 0
##$FT_mod= 4
##$GAMMA= 1
##$GB= 0.15
##$INTBC= 1
##$INTSCL= 1
##$ISEN= 128
##$LB= 0.24
##$LEV0= 0
##$LPBIN= 0
##$MAXI= 10000
##$MC2= 0
##$MEAN= 0
##$ME_mod= 0
##$MI= 1.114404
##$NCOEF= 0
##$NC_proc= 0
##$NLEV= 6
##$NOISF1= 3.799351
##$NOISF2= 2.8
##$NSP= 1
##$NTH_PI= 0
##$NZP= 0
##$OFFSET= 15.70392
##$PC= 1
##$PHC0= -8681.294
##$PHC1= 14.40018
##$PH_mod= 1
##$PKNL= yes
##$PPARMOD= 0
##$PSCAL= 0
##$PSIGN= 0
##$REVERSE= no
##$SF= 200.130013532006
##$SI= 16384
##$SIGF1= 3
##$SIGF2= 2
##$SINO= 400
##$SIOLD= 16384
##$SREGLST= <1H.CDCl3>
##$SSB= 0
##$STSI= 0
##$STSR= 0
##$SW_p= 3612.71676300578
##$SYMM= 0
##$S_DEV= 0
##$TDeff= 0
##$TDoff= 0
##$TI= <>
##$TILT= no
##$TM1= 0
##$TM2= 0
##$TOPLEV= 0
##$USERP1= <user>
##$USERP2= <user>
##$USERP3= <user>
##$USERP4= <user>
##$USERP5= <user>
##$WDW= 1
##$XDIM= 8192
##$YMAX_p= 0
##$YMIN_p= 0
$$ End of Bruker specific parameters
$$ ---------------------------------
##NTUPLES= NMR FID
##VAR_NAME=  TIME,          FID/REAL,        FID/IMAG
##SYMBOL=    X,             R,               I
##VAR_TYPE=  INDEPENDENT,   DEPENDENT,       DEPENDENT
##VAR_FORM=  AFFN,          ASDF,            ASDF
##VAR_DIM=   8192,          8192,            8192
##UNITS=     SECONDS,       ARBITRARY UNITS, ARBITRARY UNITS
##FACTOR=    0.0002496,     1,               1
##FIRST=     0,             0,               0
##LAST=      2.0444736,     0,               0
##MIN=       0,             -203239,         0
##MAX=       2.0444736,     110372,          0
$$ Real data points
##PAGE= N=1
##DATA TABLE= (X++(R..R)), XYDATA
0 0 0 0 0 0 0 0 0 0 0 0 0 0 0 8 -8 8 -8 10 -16 16 -24 24 -32 34 -40 48 -56 65 -74 87 -98 113 -128 145 -163
35 -163 184 -207 231 -259 289 -323 357 -396 439 -485 537 -593 652 -720 793 -873 963 -1062
53 -1062 1172 -1295 1433 -1591 1771 -1981 2230 -2527 2891 -3350 3948 -4766 5954 -7850 11365
68 11365 -20132 94184 87566 -79457 -40456 37970 110372 64466 -21897 -50017 10843 29117
80 29117 13212 -9280 -22429 -27737 -24795 -63032 -83313 -47410 -9032 -1223 14727 16542 13003
93 13003 21783 10490 -23823 -16748 9282 13827 6180 -19154 -49403 -14372 52254 60361 11872
106 11872 -46573 -75950 -27043 46136 42000 -11548 -31353 -11315 35809 71624 38772 -17651
118 -17651 -22626 -3036 12409 30444 17328 -17884 -18257 3880 17895 24584 -4516 -55018 -48113
131 -48113 1243 19485 10429 -8718 -25679 -307 36321 21597 -5807 -6019 -11824 -19100 -5858
144 -5858 9712 32826 48121 6469 -46426 -31426 13827 25081 -4109 -60787 -83220 -22877
156 -22877 40479 33851 1402 -14254 -5532 27519 31145 -20072 -45300 -8743 38567 63776 45932
169 45932 -10226 -23875 29334 64638 41403 -12778 -67663 -70646 -19538 9019 3240 11208 15364
182 15364 -4862 -21913 -30027 -16482 26030 29745 -28704 -61704 -27116 31289 70794 52228
194 52228 -7204 -21225 11585 14462 -12294 -31162 -33101 -2958 34154 20256 -17073 -20225 -3665
207 -3665 18310 34490 3742 -47012 -49732 -14889 20373 42707 23421 -16984 -14165 12399 12632
220 12632 2743 -6185 -15787 -3691 9851 -2164 208 24626 21679 1068 -10000 -16420 -4876
233 -4876 13298 -2082 -23813 -7092 15960 20117 12718 -13757 -33790 -10932 13824 6635 -6189
246 -6189 -19178 -21523 14350 47038 25977 -13743 -35518 -31225 6381 31273 1558 -28709 -13821
259 -13821 13325 30909 28276 -1673 -15750 3101 2131 -19675 -18091 -2441 16005 34064 21527
272 21527 -6284 -4527 4330 -4770 -9676 -14549 -25464 -16876 -4557 -10529 -2206 21617 28178 20951
286 20951 -2530 -44924 -50095 -1811 35997 33066 2853 -30680 -15978 44428 64816 22929
298 22929 -20063 -33710 -18251 6891 -867 -22824 -2964 30491 26700 1627 -20577 -25013 2574
311 2574 19603 -8342 -30792 -20026 -3535 13259 21838 9942 5503 14616 -271 -24701 -25769
324 -25769 -14992 3580 23212 7645 -22973 -17230 9162 23997 22007 -7971 -36785 -16051
336 -16051 21745 23722 8428 -2514 -1037 23358 32967 -371 -26583 -16140 -338 9677 8374
349 8374 -12010 -17840 1812 6309 -2191 -2936 -11916 -21726 -11023 -1695 1511 16061 18847 7135
363 7135 8593 8978 -2884 -859 5348 -4119 -9732 -10006 -9198 13225 33518 13146 -17523 -22872 -15444
378 -15444 -2268 1721 -19967 -27462 3628 24610 16812 3559 -6183 1764 25014 14666 -26103
391 -26103 -39399 -18044 13811 40130 30199 -6251 -13596 6005 13085 8241 -5321 -23272 -16100
404 -16100 2361 -3284 -8275 12657 30151 29605 8465 -29832 -38199 -706 20883 3714 -15781
417 -15781 -18608 504 28613 19810 -13823 -15040 5367 5513 -11569 -32294 -34547 3155 37616
430 37616 23085 -6923 -16502 -10548 8964 19221 -1998 -18023 -6313 4951 9758 15285 7306
443 7306 2430 13307 10444 -7786 -12820 -9483 -2677 13548 13656 -2798 -893 9964 6070 638
457 638 -6905 -15810 -4522 9694 -1608 -10885 -2383 4949 11705 10301 -13477 -28324 -14516 -2168
471 -2168 1312 3987 -5772 -10914 7681 18705 9029 -1930 -15746 -21183 -3278 7495 -4374
484 -4374 -6006 6691 15760 21048 10944 -12374 -9800 12836 12154 -3950 -11946 -7780 17140 39611
498 39611 24471 -1484 -3151 -111 -4008 -10641 -23209 -22469 2277 10185 -9324 -18485 -9103 6877
512 6877 20729 5009 -32323 -38460 -11377 11423 20914 13052 -3389 3947 23669 15023 -5494
525 -5494 -11654 -8206 2726 6549 -14195 -25089 1366 26882 24845 7197 -16330 -20796 2437
538 2437 12255 -3036 -6776 4050 13299 20691 11348 -7348 -1282 14805 6553 -10727 -20332 -21747
552 -21747 -3764 16130 6453 -9649 -8619 -6255 -2512 254 -13127 -20760 -2751 11763 9618
565 9618 6444 -18 -402 16078 19034 -1750 -12955 -9447 -2007 11120 12911 -2180 -3226 7386
579 7386 3634 -4124 -9367 -17403 -11380 3136 625 -5464 2607 8629 13428 17324 2071 -13831
593 -13831 -6221 4170 4379 4189 -2612 -5897 11013 21785 6193 -8640 -13365 -13451 -4372 -4778 -21128
608 -21128 -16691 8603 19481 13587 -383 -13850 -4166 17476 9800 -14171 -19478 -9111 9459
621 9459 24259 13310 -3507 3023 9480 -829 -11708 -18861 -14930 7249 15498 -3058 -11208
634 -11208 1529 14678 21882 10215 -17294 -21010 -781 6196 405 -2813 -2996 9285 21396
647 21396 4522 -19228 -15957 -2262 5005 2064 -15202 -22632 1295 21771 15306 2893 -6441
660 -6441 -8197 4595 7627 -8317 -10397 4131 12832 15563 9585 -5578 -4839 7846 3591 -8375
674 -8375 -10896 -11740 -3703 9294 3991 -6437 120 5366 1730 -2986 -12718 -17558 575 14031
688 14031 7995 2709 1478 2233 13303 14437 -5242 -15618 -8572 -2534 4777 5915 -5802 -5838 8765
703 8765 10560 307 -8808 -18270 -14401 2818 3980 -5872 -2385 6359 12761 17666 5640 -11662
717 -11662 -6404 4331 1671 -3040 -5431 -4251 11435 19760 4424 -6527 -1239 835 -818 -8573
731 -8573 -21344 -12862 13775 18962 4009 -6218 -8023 3774 17941 3867 -21444 -20162 -3332
744 -3332 8339 11755 -644 -11027 3486 15838 3216 -13087 -19351 -14396 4146 12946 -1856
757 -1856 -8113 4875 13421 14323 8101 -5958 -6399 7094 5163 -4516 -1010 6715 13888 17837 1902
772 1902 -15594 -8308 2430 -1898 -9646 -17282 -16306 4384 15579 1335 -10563 -8252 -1692 7684
786 7684 5537 -13941 -17397 2098 15467 17375 12037 -2357 -5062 7159 6866 -4549 -8154 -9217
800 -9217 -4885 7554 7265 -2362 698 4820 884 605 -4674 -12905 -5387 4325 1836 2886 8757
815 8757 7446 8533 6450 -8708 -13421 -1636 1940 -1676 -4836 -11414 -4270 16083 16160 -1707 -11800
830 -11800 -12775 -4213 9548 3550 -13698 -7269 11405 20365 17124 1063 -15217 -5477 10903 4328
844 4328 -9066 -13640 -10668 4806 15017 2139 -8791 -2663 -767 -4731 -7418 -13294 -7084 10590
858 10590 11357 -156 1631 9232 13521 13807 -1163 -16710 -5163 11586 9378 -29 -7295 -7118
872 -7118 10649 18997 -2588 -22566 -21228 -9853 3510 5250 -11503 -15126 4597 16376 12447
885 12447 2856 -9552 -9072 7563 10366 -566 -815 4009 7793 14662 10326 -2028 -1702 219 -9184
900 -9184 -12571 -8938 -6449 3015 7034 -4732 -9219 -409 3063 1688 -2345 -14315 -12894 4716
914 4716 11568 5961 3816 1348 4979 15720 8581 -11063 -15049 -6151 4078 13934 7316 -8962
928 -8962 -6320 7207 10284 7005 -3189 -16341 -11012 3406 2879 -340 2126 2118 5265 7919 -4688
943 -4688 -13595 -5797 -666 -2845 -3036 -6109 -3915 10600 11494 -1947 -3739 1000 2969 3979 -4184
958 -4184 -13572 540 20711 17683 2987 -7787 -9979 4822 14737 -3097 -21119 -16078 -2248
971 -2248 9640 11198 -5267 -13200 239 7443 -755 -7538 -12754 -7469 9891 13699 2355 2196
985 2196 9034 11143 10861 2354 -10459 -5348 5989 2449 -2525 -1096 983 8075 9281 -7958 -17711
1000 -17711 -7670 -1514 -3887 -8959 -16745 -10488 11619 17240 3334 -5582 -7547 -3338 7976 5586
1014 5586 -7611 -4950 5997 9863 12999 8791 -1792 993 8378 1564 -6373 -8271 -9517 15
1028 15 12101 6782 -2606 -1836 -1882 -2290 1036 -5499 -10310 -1617 1609 -3270 -914 2563 5264 11205
1044 11205 4841 -12026 -12698 -1797 4132 7654 3935 -6202 -1393 10637 8096 229 -4413 -7709
1058 -7709 -2121 6003 -2844 -11671 -2376 8206 12266 8314 -8680 -18232 -3760 8298 3134 -3677
1072 -3677 -7455 -3410 11149 13173 -1538 -4821 2968 3109 -659 -6502 -11944 917 17312 10726
1086 10726 -1998 -3476 -1100 5212 7592 -6944 -16452 -5929 3390 3578 3015 -2721 -3532 7308
1100 7308 7290 -7792 -14312 -11073 -4034 7725 6620 -6560 -4756 9570 13636 10023 531 -11011
1114 -11011 -6009 6629 2795 -4215 -210 4509 9171 9758 -3353 -11352 -2693 1890 -3863 -7433
1128 -7433 -11361 -8831 5457 10959 3298 1411 1386 -2104 781 851 -5845 -1889 7723 7132 4930 2611
1144 2611 -3312 1769 11926 4004 -9592 -13244 -10762 -870 10225 3498 -6869 -1451 3465 642
1158 642 -1785 -6386 -6644 5583 8296 -3313 -6303 560 6175 12181 7349 -9540 -13326 -4663 76
1173 76 3176 3504 -4289 -2912 6505 4081 -2969 -2624 -1514 2284 6941 -1723 -9964 2492 15197
1188 15197 14215 6353 -6897 -12325 183 6230 -5280 -10634 -4756 1338 6988 3505 -8622 -5261
1202 -5261 7018 3922 -6120 -11213 -11214 923 15214 10528 -715 -375 2395 4874 6848 -2875 -13011
1217 -13011 -6281 2321 1578 1809 -686 -1044 9551 11186 -4318 -12677 -8477 -2072 5245 3727 -7946
1232 -7946 -4609 10173 10736 3350 -1216 -4753 -1146 3152 -6387 -12607 -698 9500 9513 5797 -3733
1247 -3733 -8234 2069 6850 -626 -4850 -6874 -7418 2024 8931 3356 882 2351 -133 903 -225
1262 -225 -8786 -7289 5412 8518 2659 -2669 -8060 -2203 10575 7016 -5880 -8355 -6388 -2579
1276 -2579 5017 3588 -429 4684 5142 -3948 -6281 -3659 -1633 5365 6228 -4571 -6967 202 4188
1291 4188 8229 5996 -7134 -11849 -2199 2298 1431 623 -2614 2755 13854 7212 -8891 -9616 -117
1306 -117 7286 7454 -6409 -16310 -1559 15699 13491 3898 -4561 -7011 1365 4013 -6660 -8169
1320 -8169 1391 4642 3472 1232 -3926 -206 7318 103 -11314 -12671 -10748 -4636 4108 1363 -5115
1335 -5115 1061 7906 6453 3673 -3640 -7636 3885 11805 3097 -4336 -1329 6569 18364 16183
1349 16183 -4307 -13654 -5181 718 1430 -1490 -8395 -6006 4244 3344 -626 2806 2124 -1422 -743
1364 -743 -4036 -6664 -64 3926 1832 4440 2312 -6079 -6031 -1644 -3065 -2595 -3598 -8598 -4264 2415
1380 2415 -1752 -2621 5809 8351 4666 -2290 -10251 -3335 15735 18025 4072 -4534 -5145 3148 13645
1395 13645 6907 -8063 -8294 -2337 64 2325 -451 -4813 1444 6867 -594 -6849 -8278 -7846 1387
1410 1387 8813 1413 -5113 -694 3198 6233 5645 -4620 -8221 -830 -1955 -9283 -7023 673 8041
1425 8041 10373 -2159 -14421 -5155 8425 6076 -3326 -10720 -8738 7274 16578 7432 959 4428
1439 4428 5991 6307 2742 -7723 -8937 478 3533 2417 1899 -3493 -4931 3823 5352 -1924 -6510
1454 -6510 -10386 -9219 1900 5156 375 2690 6939 3891 1514 -1676 -3795 2667 4985 -5875
1468 -5875 -11864 -4304 3051 7540 5160 -6431 -8696 -172 695 -3136 -2890 -2747 238 7661 6110
1483 6110 -1030 400 3614 5362 9439 3584 -8903 -7989 2784 9023 9786 813 -11453 -7537 3324
1498 3324 1834 -3727 -3801 -3616 553 2285 -4695 -4907 6476 7833 -1127 -7176 -8368 -1899 8944
1513 8944 7231 -1722 -468 3382 1587 1138 -2665 -6912 -1716 2484 -2085 -3802 -2625 -1919 5698
1528 5698 12057 2851 -8165 -9498 -5182 4482 9768 -124 -6793 1535 9484 9025 4505 -3240 -4657
1543 -4657 2507 245 -9777 -8444 44 4963 6823 977 -6245 -1810 4122 -951 -5162 -4548 -4328
1558 -4328 77 4873 718 406 6919 7374 4516 1181 -7480 -9823 930 6336 2134 -2752 -6977
1573 -6977 -3226 8938 9169 -3949 -9352 -5201 -865 2467 -1406 -6921 1604 11499 6726 -1523 -3198
1588 -3198 -1143 5346 7444 -2091 -7351 -1584 919 795 2906 86 -3184 -1415 -4459 -7117 -1914
1603 -1914 1200 656 4253 2600 -3515 -1854 4182 6465 7684 2387 -7783 -4591 6752 8011 3081
1618 3081 -2250 -6767 -2982 1711 -5700 -10973 -4366 1731 2672 1420 -4374 -4321 6424 9324 3004
1633 3004 -1038 -4061 -4147 4170 8286 3924 2698 2612 112 1342 -386 -7903 -6931 -332 -1631 -5286
1649 -5286 -5925 -3981 5810 13488 3830 -7493 -4991 1836 4089 1730 -5602 -5055 7719 11109 1148
1664 1148 -3949 -1792 2261 5891 -1738 -13599 -10769 432 4075 3894 1774 -2346 1066 6079 2237
1679 2237 -1558 -516 -1569 -52 3587 704 -1896 4145 6567 4158 668 -6655 -9383 -1273 2774
1694 2774 -3468 -6189 -5139 -1971 3193 1881 -4947 -2672 3548 1409 -1919 -2589 -1994 5392 11037
1709 11037 4668 -2096 -897 -354 1969 5937 1587 -4551 -3196 -1837 257 4129 776 -5383 -1886
1724 -1886 1289 -1773 -2737 -1694 1211 8189 7536 -4004 -6813 17 4271 2988 -2794 -10293 -5624
1739 -5624 4028 2753 -3117 -1602 175 1579 855 -6623 -9463 -223 6371 4330 2225 -470 -185
1754 -185 7282 9526 1872 -2938 -4138 -4239 400 2656 -2831 -1824 4895 5882 3173 -1405 -6772 -2758
1770 -2758 5572 1883 -6512 -5542 -397 5862 9070 1832 -4970 -343 2362 -2717 -5725 -6470 -4055
1785 -4055 3294 3816 -3385 -3217 1830 2601 3239 -203 -6728 -6367 -242 1075 1909 2739 -717 323 5539
1802 5539 3118 -1835 -1175 286 2436 4720 -458 -4681 2597 9238 6486 1352 -4294 -5685 2054
1817 2054 4912 -2268 -5124 -2100 -854 -40 -1185 -6199 -3777 2362 -125 -4091 -3526 -3035 1508 7591
1833 7591 4417 -1748 -2056 -1175 971 5635 2649 -3411 -192 3824 2248 1148 -1628 -3744 980
1848 980 1996 -6235 -9106 -3436 2063 6356 4228 -4120 -3893 4135 4252 -19 -1886 -2908 270 5789
1864 5789 3554 -226 3792 6052 4767 2905 -3068 -8111 -3658 1535 -228 -1609 -3233 -4233 2004
1879 2004 5628 -619 -5470 -4166 -2658 -471 -1121 -6779 -4235 5754 7442 1897 -2377 -4063 -50
1894 -50 5399 727 -7044 -3980 1432 4244 5292 2098 -156 4879 6865 902 -2009 -1355 146 4664
1910 4664 5185 -1408 -2828 1307 2384 1481 -514 -7397 -8075 -1855 -1077 -3939 -3624 -3585 -1239 3552 5
1927 5 -5843 -2330 2966 4210 3713 -310 -3421 3547 8811 4403 884 -431 -1865 1113 3312 -1392
1943 -1392 -2025 1624 462 -684 -787 -4512 -4315 1268 308 -2920 -2579 -2376 803 7144 5677 -1661
1959 -1661 -1913 144 952 2216 -716 -4648 422 5834 2479 -1939 -2408 -1528 2853 2643 -6155 -9561
1975 -9561 -3006 1693 3468 2814 -1870 -1339 4857 4234 -1564 -2756 -2612 -753 3346 1221 -3475 215
1991 215 4865 4830 3157 -1710 -6522 -2206 2694 -978 -3637 -1830 79 4608 5394 -1519 -4144 1462
2007 1462 2955 -330 -3114 -6243 -2723 5569 5057 -1408 -2372 -1140 724 3284 -286 -6213 -3105
2022 -3105 1315 619 1109 171 -1555 2127 4913 218 -2394 -1199 -639 2539 4759 -311 -2699 1624
2038 1624 2526 1576 612 -3776 -4422 1141 787 -3546 -2606 -837 472 2574 -939 -6372 -2282 3660
2054 3660 3120 1830 -355 -1988 3120 8148 3499 -793 -1126 -1606 688 2177 -2586 -4297 631 2711
2070 2711 751 -1277 -5239 -5332 901 1418 -3204 -3848 -1681 1272 6209 4900 -1036 194 3579 1340
2086 1340 -949 -2423 -3739 1112 4884 0 -3052 -281 1456 2772 1476 -4999 -6705 -198 2555
2101 2555 676 525 -503 988 6698 5856 -1298 -2746 -1190 131 2519 -422 -5966 -3130 2694
2116 2694 2567 340 -2342 -5899 -2934 1454 -2149 -4620 -1743 680 2951 4527 523 -1007 4516
2131 4516 5139 1232 2 -884 296 4990 3872 -1577 -1321 1141 528 559 -2487 -6919 -3548 1633
2147 1633 -70 -2650 -2386 -2539 2043 5461 400 -3873 -1201 1504 3982 4877 -235 -3146 2132 3676
2163 3676 331 -1382 -3726 -4347 403 778 -3182 -2303 661 937 2061 834 -3317 -1073 3553 1621
2179 1621 513 1266 575 3403 5776 1266 -2142 -178 -412 -683 -1018 -4945 -5709 903 3456 -252
2195 -252 -1946 -3363 -2377 3166 2562 -3702 -4416 -211 2337 4776 3614 -2255 -184 4395 2664 -1013
2211 -1013 -3206 -5053 -1447 2959 -104 -3388 -685 1105 1372 1509 -2377 -4087 758 2391 -655
2226 -655 -584 819 2141 6490 4677 -2155 -1980 2043 1855 897 -1843 -5352 -1469 4336 1497 -2905
2242 -2905 -3516 -3425 -48 2076 -2490 -6479 -2166 1301 2269 2578 -722 -2493 2516 4210 270 -386
2258 -386 -522 -598 3382 3389 -1125 -1013 1361 92 -117 -730 -3720 -1984 1780 31 -1712 78 87 1608
2276 1608 3205 -608 -4084 234 2337 1483 1481 -1291 -2172 2831 4555 -517 -3051 -3486 -2724 1350 1310
2293 1310 -3845 -3808 802 2202 2616 873 -3839 -2484 3084 2332 -869 -498 -836 1636 6039 2598
2309 2598 -1934 83 965 -108 -297 -2842 -4142 996 2929 -1286 -1906 -403 217 2381 988 -4819
2325 -4819 -3797 2068 2711 1646 360 -1952 1133 6155 2493 -2661 -2754 -1699 331 2607 -1207 -4927
2341 -4927 -584 2653 1402 349 -2677 -4433 368 3063 -970 -2128 -359 706 3592 3856 -862
2356 -862 -1128 2291 1325 -535 -546 -2151 22 3751 992 -2361 -1209 -158 205 1490 -1946 -4762
2372 -4762 130 2876 1116 932 -223 -1175 2680 3633 -1628 -3190 -1213 -479 2525 2559 -2935 -3299 1202
2389 1202 1420 163 -1542 -4653 -3124 2086 1304 -1535 -180 757 1783 3853 558 -3305 -22 2559
2405 2559 697 606 -250 -1287 2526 3930 -782 -2311 -854 -1570 -216 -332 -3830 -3467 2058 2538 278
2422 278 -493 -2388 -521 4121 1880 -3029 -2243 221 2428 4566 906 -3447 -245 2726 614 -1458
2438 -1458 -3075 -3972 202 2884 -1680 -2624 -208 772 1675 1282 -3072 -2981 1903 2132 959 1127 -37
2455 -37 850 4328 1858 -2139 -1065 465 181 1071 -1586 -4145 208 3801 924 -1440 -2714 -3184
2471 -3184 771 2726 -1857 -3284 244 1814 3043 2235 -1790 -1326 2761 2058 -1657 -1864 -2357 -845
2487 -845 3301 1590 -2566 -1344 98 -592 785 -515 -3533 -515 2243 548 519 1436 51 2697
2503 2697 3745 -1073 -3030 -223 1024 1473 1228 -2754 -2685 2238 1862 -1913 -2301 -3080 -1530 1970 -331
2520 -331 -3737 -834 2629 2614 2847 453 -2509 990 3513 1506 2 -140 -1243 1368 3616 -159
2536 -159 -2399 -1178 -1131 -714 -344 -3857 -3916 1204 2247 -712 -1298 -1749 -396 3859 1688 -3166 -1509
2553 -1509 1941 2512 2620 821 -1796 1713 3919 -204 -2876 -1777 -1287 1030 2224 -2131 -3138 890
2569 890 1456 1187 573 -2649 -3272 1259 2455 -234 258 -122 776 3782 1698 -3029 -2104 716 71
2586 71 -85 -1887 -4468 -142 3651 745 -1781 -1131 -1280 452 1538 -1972 -2153 2416 2601 1050 1209
2603 1209 -188 -16 3547 1826 -2158 -1675 -1536 -1208 1755 1452 -2458 -1569 61 -470 105 -1170 -3491
2620 -3491 -1215 2573 318 -1242 -344 498 3077 4400 -548 -3191 857 2074 1264 764 -1607 -1526
2636 -1526 2200 1765 -1733 -1585 -1042 -1452 267 -613 -3656 -1070 1510 1175 911 165 -2297 -565 3333
2653 3333 1160 -564 22 -26 2176 3761 -143 -2674 797 1873 391 -1116 -3699 -2369 3313 3179
2669 3179 -1852 -2708 -860 755 2181 139 -3845 -1113 2140 902 387 542 -323 1438 2743 -829
2685 -829 -2929 -880 -1027 -162 1607 -725 -2820 454 1354 664 964 -1630 -2666 1282 1905 -1756 -1035
2702 -1035 1178 2200 3435 1078 -3471 -1336 2548 957 -1543 -2383 -3054 254 2952 161 -1775
2717 -1775 314 315 49 895 -1352 -2021 1480 2426 813 1611 240 -650 2566 2956 -761 -1620 -1782 -1704
2735 -1704 1091 810 -3379 -2141 903 123 -987 -1900 -3055 66 3192 -374 -3110 -238 2192 2972
2751 2972 2585 -918 -1928 2317 2677 -217 -85 179 -658 1758 861 -2438 -1949 -191 -690 519 379
2768 379 -3139 -1878 1628 1764 1227 -281 -2651 -777 3286 859 -1896 -509 944 1694 2056 -1643
2784 -1643 -2832 1323 2172 -1442 -2734 -2285 -1040 2409 1846 -1871 -790 1709 616 417 579 -1931
2800 -1931 -416 2056 427 92 762 -49 977 3046 492 -3094 -2342 -1319 236 1580 -1267 -3689
2816 -3689 441 3300 1123 -313 -1098 -899 2338 2077 -2917 -2319 1878 2285 1797 350 -2282 -265
2832 -265 2717 -184 -1904 -1392 -1562 -739 894 -572 -1277 1103 1173 1 1065 -550 -1840 1186 2821
2849 2821 1014 82 -689 -627 2794 3010 -1475 -2837 -375 327 699 -773 -3453 -1219 2532 456 -2403
2866 -2403 -1895 -545 779 2578 -275 -1904 775 1680 979 1582 408 -1024 923 1307 -192 320
2882 320 544 -706 1232 1614 -1904 -2919 -695 -597 726 -279 -3814 -2452 2631 2691 -592 -1305 -1145
2899 -1145 862 3047 -743 -3231 190 3282 2180 903 -1223 -1197 2314 2585 -1828 -2735 -1498 -1378
2915 -1378 502 895 -1192 -650 1494 447 535 985 -1184 -1023 1824 1120 -821 -16 -210 1364 3404
2932 3404 484 -3447 -1438 451 -337 -809 -2534 -2973 1025 2257 -1424 -2123 330 1287 1574 532
2948 532 -2779 -984 2562 1911 712 1439 -14 -66 1947 658 -653 -222 -1276 -1638 1059 562 -2290
2965 -2290 -1240 484 684 1122 -1118 -3308 448 3281 482 -1110 -875 -54 2281 1795 -1815 -1715
2981 -1715 1937 1727 -613 -1145 -1582 51 2125 -348 -3432 -1620 73 -38 1392 175 -1374 873
2997 873 2319 1333 1710 538 -1417 748 2396 32 -1322 -455 -116 1862 1938 -3045 -4010 -233 682
3014 682 -949 -2282 -3267 -1174 2483 1166 -1657 580 1822 1037 760 -734 -1516 1443 2622 23
3030 23 -183 580 48 841 1573 -962 -1407 -1202 -1930 -620 1060 -843 -1387 1217 1768 1032 336 -1890
3048 -1890 -1100 2557 1754 -2243 -1955 110 1477 2813 135 -2878 -674 1437 -722 -1698 -1520 -1250
3064 -1250 926 1078 -1385 -989 1297 1327 943 1406 -864 -618 1694 1308 512 1082 -421 -747 1596 962
3082 962 -1441 -1400 -10 226 1252 -960 -3639 -988 2366 487 -1447 -2019 -1562 1615 2985 -600
3098 -600 -2041 686 1426 642 330 -1681 -917 1729 652 -1202 -143 51 -483 1280 400 -1646 -948
3115 -948 -700 -977 749 1055 -1038 206 2341 1443 866 -170 -1133 923 2377 -1158 -2959 -216 1410
3132 1410 1833 552 -2428 -2137 1462 1124 -1974 -1852 -1627 -490 1716 659 -1562 519 2370 883
3148 883 1134 -54 -1956 -394 1346 8 -294 -146 -1362 214 1997 -97 -2057 -1211 -616 -175 164
3165 164 -2103 -1879 2053 2479 -335 -733 -206 1479 3120 944 -2511 -247 1774 929 198 -307 -1041
3182 -1041 803 1376 -1336 -1732 -177 -598 -201 799 -882 -1479 137 145 178 1298 -616 -1765 1044
3199 1044 1749 97 -74 -1061 -1166 1586 1034 -2561 -1590 828 544 274 -710 -2331 71 2297 76
3216 76 -1429 -220 257 1231 2355 96 -229 2399 1967 665 574 -987 -1525 947 715 -1428 -1255 -1392
3234 -1392 -846 1103 748 -2585 -2567 -526 -312 249 -1043 -2487 118 3200 903 -735 -57 956 1957
3251 1957 1717 -1467 -2400 998 1507 353 155 -347 -343 1739 545 -1955 -1023 47 -622 217 -14 -1236
3269 -1236 546 1748 827 773 461 -1320 -327 1391 210 -1535 -1055 -921 5 1333 -580 -2719 -161
3286 -161 773 -671 -542 -1849 -1215 1759 2084 -985 -461 871 686 1678 1448 -1080 -1 1455 181
3303 181 -4 -56 -1553 -607 871 -659 -1290 -541 -860 16 1637 -573 -2611 -261 1011 552 407 -1162
3321 -1162 -1107 2603 2617 -592 -776 644 1036 1480 -37 -2830 -1071 2100 576 -674 -447 -1133 486
3338 486 1500 -730 -1872 -456 34 -313 666 -409 -660 1451 1639 482 644 -357 -1369 1059 869
3355 869 -1195 -1421 -271 -86 990 793 -1836 -1467 805 85 -1152 -1042 -1211 590 2229 258 -1099
3372 -1099 1047 1479 1126 1594 -184 -1655 530 833 -417 198 2 -1214 814 1093 -1420 -1209 -312
3389 -312 -413 472 432 -1898 -1196 1565 1251 75 46 -1101 -92 2251 223 -1944 -479 533 421
3406 421 763 -1339 -2068 973 1456 -776 -1038 -808 -375 1548 1349 -1299 -619 1172 844 954 1286 -722
3424 -722 177 2251 998 -383 -141 -777 -536 1063 -571 -2275 -934 -250 -133 476 -809 -2000 29
3441 29 837 -911 -778 -540 -566 1510 1654 -720 -227 1785 1019 430 486 -1347 -1020 1232 -46 -835 -189
3460 -189 -687 -112 1531 276 -1535 -568 218 -202 858 -218 -1816 867 2602 776 80 -533 -784
3477 -784 1130 1148 -1815 -2256 -11 364 -42 -58 -1623 -734 1898 233 -1185 -603 -341 458 1802 94
3495 94 -1160 904 1820 922 1034 -46 -1092 621 1572 -1269 -838 -344 -715 609 795 -1664 -1624 726
3513 726 222 198 -83 -1469 -644 1900 860 -707 69 210 400 1457 80 -1572 626 700 -236 -192
3531 -192 -831 -1656 113 631 -961 -729 70 -549 686 1608 -634 -871 645 328 556 1213 -945 -416
3549 -416 2280 1407 -549 -320 -369 -384 1011 -648 -2898 -1290 365 16 114 -822 -1579 1042 1619 -516
3567 -516 -1343 -200 -163 1238 1639 -1129 -933 1409 1208 441 425 -1218 -1058 1180 269 -1575 -780 -160
3585 -160 1 1440 145 -1539 229 1548 155 166 -244 -755 1127 2163 -39 -750 681 310 637
3602 637 719 -1654 -1852 182 -75 -1213 -651 -1321 -950 1160 -17 -1301 -359 277 -239 1342 522 -1038
3620 -1038 578 1699 825 814 858 -1029 605 1567 -221 -949 -99 -474 227 609 -1347 -1716 337 334 -220
3639 -220 121 -788 -601 2035 991 -907 -229 329 213 1285 221 -1678 364 1522 79 -496 -874
3656 -874 -1828 -233 880 -1121 -1721 42 -5 522 989 -778 -990 1439 824 -152 90 -601 -198 2076
3674 2076 1196 -787 112 695 100 532 -738 -2016 -625 688 -697 -737 -11 -651 574 1594 -493
3691 -493 -555 566 562 608 974 -319 -911 1480 1035 65 8 -797 -789 640 -86 -2089 -1150 6 -319 478
3711 478 -126 -1539 -230 1467 98 -315 -190 -477 959 2057 155 -562 782 726 681 976 -1098 -1289
3729 -1289 837 603 -946 -522 -1060 -803 572 373 -1433 -674 714 172 721 444 -1220 432 2101
3746 2101 473 -215 91 -324 552 1577 -535 -1274 120 236 -204 11 -1735 -1696 693 437 -1032 -375
3764 -375 -450 0 1497 1162 -768 -173 957 57 547 208 -1134 -33 1290 -44 -406 -54 -786 -162
3782 -162 668 -1270 -1375 134 123 56 751 -673 -783 1314 1327 -566 59 -48 -123 1573 1002 -1077 -92
3801 -92 1148 234 115 -140 -1775 -853 822 -306 -872 -681 -989 293 1128 -350 -1308 569 668 228
3819 228 686 -511 -813 1405 1432 -317 -324 -80 -397 829 308 -1780 -1064 445 -67 -244 -57 -1227 72
3838 72 1657 -25 -726 198 464 710 1482 -3 -786 944 753 -24 344 -573 -1132 625 588 -1094 -820
3857 -820 -595 -608 351 213 -1631 -696 761 54 322 265 -788 263 1928 464 -389 198 -183 114 1206
3876 1206 -177 -1165 554 496 -533 -117 -725 -1218 458 725 -891 -586 -22 -44 1328 1147 -739 -436
3894 -436 1047 651 333 302 -1049 -295 1323 -128 -1193 -443 -635 -165 682 -1205 -2275 -108 616 -78
3912 -78 51 -314 -443 1378 1519 -430 -104 764 187 450 533 -893 -406 1212 42 -520 -76 -1153 -621
3931 -621 841 -548 -1306 -340 -72 198 1124 -261 -1216 1011 1106 208 401 -193 -254 1144 1512 -810 -663
3950 -663 110 32 425 -131 -1648 -935 788 -443 -581 42 -656 -282 998 -66 -742 314 445 223
3968 223 1402 404 -1131 309 713 -45 181 -415 -1427 402 558 -1128 -1287 -162 -166 340 484 -1652
3986 -1652 -507 1325 660 -221 240 -299 401 1904 307 -579 249 765 92 435 -321 -1174 280 735
4004 735 -834 -400 -466 -1396 372 668 -835 -890 323 -47 781 997 -855 -171 1575 875 -419 -112
4022 -112 -342 266 1165 -197 -1522 -79 307 -147 205 -962 -1473 367 779 -859 -285 135 -236 589
4040 589 801 -509 -41 562 725 575 727 -537 -689 815 482 -195 -503 -1300 -884 714 2 -1304
4058 -1304 -478 254 329 473 -332 -1088 895 1809 -79 -115 188 248 1105 950 -680 -367 592 302 -295 -273
4078 -273 -1347 -690 413 -203 -930 -130 -427 -117 984 386 -976 5 573 521 1476 -88 -962 665
4096 665 1531 263 -434 -185 -524 598 813 -1207 -1299 393 52 -331 0 -1026 -584 1086 442 -544
4114 -544 183 225 205 870 295 -378 378 509 -104 332 -10 -872 -84 752 -246 -728 -841 -716 522 685
4134 685 -750 -1277 416 840 500 613 -680 -196 1843 575 -719 -223 313 455 1072 -332 -1255 -127
4152 -127 493 -497 -316 -234 -1151 -52 462 -742 -469 406 -160 604 1159 -101 -273 710 541 512 448 -938
4172 -938 -366 1084 638 -813 -369 -524 -312 473 -533 -1600 -83 879 17 -400 -259 -325 743 1291
4190 1291 -339 -131 610 247 211 975 59 -115 539 -41 -329 424 -584 -1009 116 151 -843 -452 -199
4209 -199 -129 1092 474 -1154 -34 1088 515 547 209 -644 849 1490 -463 -864 -27 259 21 0 -1274
4228 -1274 -1043 479 -42 -759 -34 -446 -739 497 509 -374 264 276 5 929 648 -560 55 710 59
4247 59 283 -410 -1431 199 1106 -435 -1169 -252 -176 206 310 -1161 -894 1084 541 -254 48 -13 370
4266 370 1368 399 -777 114 591 -169 149 -121 -755 -104 350 -319 -77 -82 -1291 -602 814 -257 -650
4285 -650 192 242 691 1303 -212 -545 745 1085 141 12 -478 -280 1210 289 -1288 -374 234 4 -329
4304 -329 -358 -1154 171 637 -334 -351 567 -16 421 1025 -22 -115 548 124 161 909 -135 -763 359 608
4324 608 -71 82 -999 -813 891 854 -1300 -1188 124 342 764 -48 -1071 202 1445 238 -260 136
4342 136 -5 462 546 -701 -796 647 -117 -422 -90 -558 -856 53 -223 -542 232 -19 -929 363 854 -271
4362 -271 -58 699 458 1254 651 -666 61 1300 463 -328 -469 -484 325 1052 -606 -1008 138 382 -132
4381 -132 -478 -619 -672 956 265 -503 370 688 47 555 992 -287 -248 186 -130 390 557 -713 -345 663
4401 663 122 -279 -474 -1108 139 1107 -390 -1540 -55 939 546 500 -337 -355 1472 1216 -685 -476 240
4420 240 308 421 -124 -948 -59 493 -450 -821 -70 -580 -426 335 -439 -82 287 -217 -17 1045 437 -175
4440 -175 343 387 352 748 -250 -1006 736 877 -527 -830 -339 -515 507 -142 -1367 -449 640 -191 -44
4459 -44 -181 -439 191 907 -63 -563 810 317 25 477 107 -511 -204 -155 -549 392 -453 -1329 -25 786
4479 786 -89 -425 -366 -292 707 903 -841 -487 1208 672 432 124 -487 379 1604 14 -858 168 154
4498 154 102 291 -583 -912 555 181 -848 -74 -293 -399 484 467 -342 41 267 -69 663 1217 -262 -459
4518 -459 600 135 254 102 -1058 -264 958 -83 -540 -182 139 352 581 -387 -969 677 821 156
4536 156 189 396 33 818 399 -215 -180 666 -460 -477 -38 -527 -760 139 -302 -405 58 -1055 -986 586
4556 586 510 -651 -317 -189 608 1298 202 -676 611 1299 484 304 8 -339 683 1006 -935 -544 290
4575 290 -357 -127 -293 -931 -471 278 -137 -684 220 -338 -223 751 131 -261 523 502 -122 940 381 -862
4595 -862 300 575 -6 3 -372 -562 252 629 -736 -670 302 279 57 241 -896 59 1200 293 -379 265
4615 265 301 414 523 373 -704 426 172 -867 -189 -72 -625 -10 263 -239 195 99 -942 133 893
4634 893 -77 -341 254 246 899 994 -567 -545 1048 696 -542 -306 -526 -292 556 -544 -1373 -37 357 -74
4654 -74 151 -349 -734 466 507 -174 -37 506 -35 407 657 28 -35 435 81 3 425 -880 -1054 284
4674 284 -5 -331 -240 -652 -484 628 186 -1104 -176 454 -52 351 -149 -225 1103 1273 -182 -95 312 415
4694 415 687 166 -679 -521 -19 -440 -484 -147 -546 -603 163 -218 -231 121 -387 -493 593 557 -388 109 312
4715 312 330 927 297 -716 5 880 -99 -549 -458 -507 324 122 -707 -535 607 382 9 270 -312 -379 769
4736 769 441 -126 374 396 13 706 420 -614 -15 -290 -209 158 -258 -885 -210 585 -93 -647 -89 -130 498
4757 498 1067 -626 -654 664 621 -43 421 -192 -47 855 185 -798 -129 446 -365 101 -108 -920 48 220
4777 220 -329 87 514 -207 -92 543 -168 218 516 -351 43 884 49 -387 458 500 434 113 -500 -819 342
4798 342 382 -910 -435 -213 -258 399 155 -966 -34 847 -54 57 151 -477 292 864 -169 -223 271 -134
4818 -134 195 519 -508 -382 -100 167 -432 -56 -384 -502 731 449 -471 101 -28 227 560 274 -782
4837 -782 -48 1047 266 267 -167 -447 297 515 -727 -1161 -204 -22 -388 -332 -735 -673 611 16 -115 439
4857 439 71 -412 324 352 -25 98 391 -156 590 866 -380 -109 431 50 -168 -358 -927 -252 503 -436
4877 -436 -764 -194 90 193 518 -106 -403 818 407 52 102 127 -362 719 591 -636 107 71 -285 94
4897 94 292 -1038 -443 324 -131 -427 190 -441 159 755 83 -145 267 290 180 691 -92 -449 598 677
4917 677 -329 -382 -246 -166 319 7 -1051 -634 -1 -295 -127 -198 -580 90 788 57 -238 418 149 120 561
4938 561 -87 -82 271 151 30 507 -193 -999 179 -45 -429 -381 -320 -617 249 476 -688 10 445 192 463
4959 463 550 -145 184 830 -24 -251 241 -76 -70 283 -341 -560 -82 -254 -530 153 -242 -535 412 445 -101
4980 -101 221 165 -244 804 616 -546 -78 487 114 217 -112 -500 -203 683 -91 -669 -30 -288 -109 532
5000 532 -602 -903 231 486 -117 173 102 -287 762 430 -230 -31 482 -148 294 -216 -550 -64 440
5019 440 -106 86 35 -564 -344 630 -260 -555 353 -79 139 461 -375 -465 513 325 -282 431 16 -678 145
5040 145 485 -482 -82 112 -619 134 298 -688 -381 32 -374 -95 362 -460 -154 489 339 73 271 -146
5060 -146 -120 611 394 -568 177 623 29 494 -297 -644 384 358 -751 -352 -350 -393 278 109 -636 -324 673
5081 673 -10 -27 483 -72 -117 722 328 -518 14 20 198 392 1 -213 -101 284 -490 242 21 -595 385
5102 385 327 -453 -226 297 -53 403 506 -320 -18 483 157 262 128 -241 -13 485 -19 -569 -260 96
5122 96 -328 140 -213 -447 -106 31 -208 18 299 -348 408 461 -48 232 627 -179 196 251 -371 -315 384
5143 384 83 -160 -161 -264 -485 388 31 -494 -69 -4 75 443 50 -769 499 959 -60 151 254 -349 219
5164 219 596 -430 -375 189 -444 -270 269 -637 -829 280 -143 -380 159 -298 -100 561 56 -517 234 188
5184 188 191 660 229 -402 445 359 -208 42 240 -338 180 495 -546 -185 -173 -392 -118 50 -787 -446 229
5205 229 82 -323 216 53 -99 433 30 -421 -31 58 12 431 -25 -857 -121 310 -369 -263 -281 -430 168
5226 168 130 -294 -433 273 -59 400 428 -73 -57 488 195 -132 -179 -85 -265 422 -13 -604 -103 323 -181 80
5248 80 -228 -534 27 324 -337 -203 151 -346 439 870 -126 -243 391 49 89 -132 -274 -263 470 -94 -662
5269 -662 -157 -150 -325 159 -181 -596 68 108 -184 122 -98 -401 362 473 9 -24 488 -81 284 553 -233
5290 -233 -271 -31 145 -299 149 -444 -423 579 0 -290 -177 -275 -120 523 -79 -406 126 437 130 364 -51
5311 -51 -440 143 256 -216 -277 -288 -230 61 59 -598 -377 -89 -35 -17 116 -185 -356 623 383 -26 257 247 17
5334 17 417 407 -441 145 458 46 210 37 -316 32 289 -539 -578 -37 -425 -64 154 -409 -263 288 288 -270
5356 -270 210 -80 -59 413 447 -261 346 288 -236 137 184 -517 -245 -156 -328 54 -213 -514 -260 384 -446 -270
5378 -270 72 -146 266 417 78 105 909 145 39 195 -34 -142 302 -52 -473 -86 -277 -263 -43 -16 -600
5399 -600 -95 343 46 -307 -221 -277 53 572 -28 228 416 72 93 671 -99 -404 -57 -39 -304 48 -158
5420 -158 -390 516 212 -523 -171 -317 0 -18 117 -178 106 627 6 209 72 -406 -47 -16 -267 -194 231
5441 231 -352 -96 -87 -131 -305 33 252 -230 410 25 -66 506 378 -324 33 328 -93 387 24 -316 85
5462 85 258 90 -345 -145 -422 -172 106 -486 -483 216 -51 83 58 -183 -127 -50 167 -141 432 105 -83 395
5484 395 474 197 -16 278 -212 280 166 -782 -297 280 -401 -361 -117 -431 -71 288 -287 -444 255 478 -81
5505 -81 150 4 61 536 385 -145 128 212 -213 409 98 -286 -366 -182 -389 53 19 -517 -555 113 -52 -172
5527 -172 47 -48 6 676 68 -294 222 355 233 234 -29 -226 275 443 -428 -52 -128 -232 0 -57 -540 -93
5549 -93 37 -181 -152 363 58 -213 530 170 126 291 -450 -85 577 -134 -301 110 45 55 391 -21 -173 199
5571 199 300 93 -149 -195 140 449 343 -251 -245 408 272 -57 -28 -396 117 514 -278 -325 32 -173 -353 156
5593 156 -526 -416 141 -126 -236 102 80 -366 187 430 110 195 -189 -54 595 585 -272 -104 139 72 279
5614 279 403 -565 -334 164 -166 -421 -60 -335 -281 270 48 -36 331 382 -178 141 397 -19 95 252 151
5635 151 118 61 -294 -168 258 -369 -186 -208 -240 30 -125 -464 -260 374 81 -204 -36 -56 11 717 10 -235
5657 -235 551 412 8 80 176 -83 407 135 -674 -190 141 -306 104 37 -338 -98 186 2 108 474 -267
5678 -267 -96 198 274 91 275 56 -51 476 45 -703 223 -49 -224 -165 -166 -468 110 66 -210 -96 -145 -70
5700 -70 149 290 -16 138 290 102 -203 464 -139 -37 262 -40 -225 -143 -99 -337 345 -105 -408 -300 -45
5721 -45 -30 487 14 -392 371 591 -79 64 -28 22 187 258 -379 130 440 -156 -471 -210 -82 -374 -94 -206
5743 -206 -473 188 -151 -25 118 173 -172 9 270 -20 277 176 -275 246 456 193 200 66 -137 88 50
5764 50 -373 -232 398 -14 -447 -103 -173 -48 339 36 -235 53 362 -85 234 209 -167 140 374 -194 175
5785 175 171 -229 -193 307 -163 21 -254 -524 -65 172 -286 -185 -123 248 50 73 -191 -100 609 181 -28 121
5807 121 224 -50 87 -101 -501 225 341 -180 -422 -165 -438 -73 -233 -200 -167 161 -146 -128 93 0 -70 150
5829 150 160 171 155 -25 -294 206 71 -166 -171 -427 -309 245 -143 -433 -272 357 -11 -456 -98 64 -102 268
5851 268 -324 -320 684 -58 198 299 -257 -9 387 -210 -375 273 -131 -484 -120 -43 -519 71 117 -181 114
5872 114 402 -469 -181 452 247 242 -174 -411 64 396 -107 -379 373 212 332 44 -276 -411 155 -87 -127
5893 -127 -152 35 -280 84 -84 -130 385 142 -57 35 392 140 31 234 113 63 313 -453 -15 200 -74
5914 -74 -372 -172 -111 -64 298 -174 -186 453 404 -378 1 224 91 583 198 -479 -3 322 166 3 149 -306
5936 -306 -54 -151 -65 -323 8 -380 -271 -245 -240 -155 6 -97 -32 68 202 69 143 284 -15 53 -144 18 563
5959 563 205 -154 -105 311 60 -209 -67 -134 -139 263 -230 -455 -58 -18 42 -25 -125 43 468 184 -137 47
5981 47 59 59 83 69 46 106 -23 -272 130 64 -466 -342 86 -245 134 95 -371 93 707 215 -324 -10 147
6004 147 243 401 154 -126 333 226 105 -24 135 -89 -83 -62 -207 -70 145 -222 -38 218 -102 -35 410 -125
6026 -125 193 303 -91 -127 393 47 -128 45 -19 -67 204 -126 -614 -33 -58 -135 -32 -249 -137 193 445 -92
6048 -92 -229 356 266 145 150 -39 200 122 -270 -180 201 -76 -486 161 -109 -186 -250 -3 -368 198 -143 -169 94
6071 94 101 -85 62 -51 -178 377 275 -49 -14 286 68 353 -125 -139 96 280 -36 -239 -270 -122 25 319
6093 319 -224 -474 296 57 -285 461 262 8 333 368 1 113 92 34 -81 323 -105 58 -59 -209 218
6114 218 72 -205 -183 247 -13 -19 6 -211 -166 360 55 -131 74 141 68 39 55 -378 231 114 52 227 -32
6137 -32 -331 -92 64 -282 -276 -256 98 -96 183 12 -265 597 45 52 70 -47 157 320 -64 -321 290 147
6159 147 -35 92 -199 -438 135 371 -244 59 314 -184 20 157 -483 147 476 50 90 353 118 10
6179 10 226 143 108 47 -302 -264 229 -153 -411 61 86 -359 80 -78 -331 -111 191 -102 -83 48 -59 495
6201 495 -9 -343 23 218 -48 -75 159 -75 -302 120 80 -408 205 -372 89 -38 -234 -295 136 1 197
6222 197 -85 65 -282 123 484 27 39 -12 243 162 418 -263 -310 48 -84 265 -134 -297 -140 -10 -79 -307
6244 -307 25 115 -59 533 288 -151 57 218 -26 203 240 20 88 -6 -62 90 143 -703 19 147 -246 -569
6266 -569 123 49 20 37 -332 -81 236 93 -216 135 181 294 272 100 -287 -64 -34 -306 -138 138 -287 -156
6288 -156 -382 -231 160 -85 -273 40 -2 -125 -104 209 -63 281 371 218 28 423 93 -178 -144 60 -168
6309 -168 332 -14 -561 -172 112 -198 -163 -35 -264 284 131 -337 17 9 179 106 360 27 -232 55 66 84
6331 84 150 -357 -200 184 -205 -246 105 57 -54 115 -96 -78 -64 240 3 276 -109 -288 165 298 -104 -241
6353 -241 198 166 -98 128 -105 -176 230 -143 -35 205 -159 124 -34 101 -207 -28 80 -175 190 124 -177
6374 -177 162 -16 -148 129 -30 -320 -58 358 -232 -525 -46 -151 -26 75 -210 -262 209 150 -212 477 191
6395 191 153 284 22 -425 -114 190 3 48 172 -132 59 82 -381 -140 -156 -430 -99 0 80 153 0 14 4
6418 4 88 57 14 373 577 127 -5 177 -96 281 64 -235 65 68 -242 32 -180 -423 72 266 -211 -112 3
6441 3 -145 -135 -93 -140 44 92 201 111 367 -66 228 564 18 169 231 19 -151 -93 125 -98 45 144 -122
6464 -122 3 1 -278 -82 13 -52 -71 -23 50 25 173 101 -208 363 155 102 247 -55 77 -75 -145 -404 -188 20
6488 20 -109 -129 434 -149 -296 27 -230 63 -47 -52 -278 -149 150 -21 293 -92 -48 264 -225 -126 81 108
6510 108 153 174 -221 -251 162 -84 -238 0 22 -53 190 172 -40 49 127 -284 14 483 14 -98 261 -344 -279
6533 -279 -65 -127 -24 -25 -162 -251 171 75 -17 -64 192 -133 63 32 178 166 517 -190 371 40 -49 33 140 -180
6557 -180 -37 -44 -159 -57 94 66 -187 79 -91 -175 148 -59 -296 191 -43 85 314 -17 -197 -1 147
6578 147 -212 -69 -170 -542 195 -182 -308 -252 204 -12 17 265 -235 -256 243 -97 -51 -97 56 116 276 36
6600 36 -137 108 61 -118 71 38 -198 274 0 -142 9 -103 -116 233 192 22 -212 87 40 -350 80 196
6622 196 -284 347 234 -407 315 43 -21 103 72 -214 111 -88 -140 140 109 -165 12 399 -28 -234 115
6643 115 -182 187 336 -199 -132 467 -11 -212 94 -258 -87 210 -367 -119 -143 4 -111 17 17 -177 -184 -23
6665 -23 67 -159 -69 -363 256 -165 -223 -158 345 -341 -123 168 96 -37 99 63 -210 18 -87 -233 -8 80 -43
6688 -43 -88 52 70 -146 224 -80 273 -8 -389 128 261 -29 224 244 -264 29 361 -208 136 -58 -192
6709 -192 -364 92 153 -47 121 -141 161 120 28 -13 96 -198 12 330 108 170 -31 188 -95 199 131 -238
6731 -238 -133 75 -183 -198 -42 -257 119 123 -313 -109 198 106 141 -117 40 94 219 95 -235 181 31 -190
6753 -190 327 64 -197 -111 -221 -184 -169 11 -215 116 68 14 -122 22 -47 -77 114 121 209 98 -192 -120 254 -5
6777 -5 110 142 37 -101 -150 -33 2 85 -194 -201 -144 130 6 -126 62 48 -44 36 32 1 221 -1 63 43 -184 -54
6803 -54 -155 185 -220 -62 -60 -166 65 72 38 121 272 90 3 173 -258 9 358 271 299 75 -23 -101 110 -10
6827 -10 9 -100 -213 -116 40 -68 -287 -59 -98 -210 -140 255 193 46 182 -374 -84 10 3 39 294 -14 116
6850 116 371 -40 -106 -85 56 22 -279 -8 -442 -212 -6 -272 169 -158 -178 -52 229 -322 -15 -135 -34
6871 -34 -40 178 -97 -113 21 -92 224 107 -81 -163 114 111 -259 89 -12 -8 31 -139 -299 -4 58 369 49 -54
6895 -54 -229 52 12 9 28 -81 118 104 -61 -429 157 168 -245 -255 -126 -73 -36 49 70 36 159 37 65 424 -85
6920 -85 191 193 -79 99 -21 108 -279 56 -13 -67 -106 100 -131 -171 44 -387 -97 345 -107 -185 -35 35 -105
6943 -105 349 92 292 308 0 29 79 136 -18 13 -48 85 308 -68 -83 110 135 -165 -4 -122 -277 -1 41
6966 41 -178 330 203 -64 161 64 107 111 212 -13 35 -22 97 -270 -20 -92 -32 40 -6 -366 7 274 66 -19
6990 -19 81 -154 47 -49 33 101 118 113 -34 76 -188 181 -112 -20 -63 -187 56 -167 62 -251 -43 -11 -145
7013 -145 129 173 249 -4 320 -194 158 139 -86 -317 146 348 -54 116 32 10 -178 68 -102 -50 279 -161
7035 -161 164 222 -5 63 -181 90 100 -32 -9 71 115 112 42 -210 -133 -112 183 71 -290 -92 66 -105 -16 -138
7059 -138 -177 132 -85 -126 -323 144 63 207 205 126 -301 523 -104 114 122 -50 -159 288 25 -98 90 -9 -131
7082 -131 361 141 -134 -200 250 -80 -213 -78 -17 -84 424 26 -54 185 -248 -58 -65 53 -222 116 -194 -282
7104 -282 -7 196 -314 -6 184 -236 118 -165 -47 132 258 -54 101 -15 286 119 52 -212 103 298
7124 298 -52 111 -111 -125 105 -23 -252 -351 46 275 -173 101 -190 8 -41 389 -173 138 63 66 44 227
7146 227 217 55 29 164 233 249 -36 -135 292 -146 47 37 -18 64 49 -93 -99 228 232 -340 114 357 102 221
7170 221 228 -177 -7 -75 97 -91 -21 -257 -19 -13 28 -30 232 -140 -120 -45 -127 -33 149 301 -256 237 -64 25
7194 25 49 -96 295 -77 -15 -17 -40 -153 -180 -43 36 -105 -40 180 -319 37 363 -110 295 80 1 264 26
7217 26 66 -66 -147 -31 -440 -7 -214 -348 29 205 -21 -294 -185 -338 73 -18 95 -18 -44 -39 33 46 29
7240 29 175 359 112 -87 96 -102 47 186 11 -228 5 -54 91 -98 -141 -108 -57 -190 -340 -170 181 -24
7262 -24 117 317 148 -50 291 154 87 305 24 115 99 -199 -212 160 -225 -274 73 52 -255 -191 -56 -155 23
7285 23 -116 -26 -44 119 47 -195 -94 191 53 -102 74 161 150 -208 48 108 -6 -230 22 -456 19 142
7307 142 -210 -123 39 -29 -168 -104 -43 234 -38 170 -151 101 127 -122 -139 209 -209 319 112 -175 38 10
7329 10 -212 -281 352 -133 21 35 -46 -70 39 -25 43 278 80 208 195 -175 -164 258 39 -208 -328 240 39
7352 39 -156 -268 -313 -156 30 15 -200 -38 117 112 -14 -173 99 217 -181 32 161 134 -34 -250 113 -87
7374 -87 -94 5 87 234 -186 80 -263 -215 270 -22 -53 148 -187 99 162 -187 202 111 53 320 -169 -6 268
7397 268 164 -243 -39 -110 -93 314 -43 -297 -88 227 85 -252 152 -78 123 -8 -18 74 171 177 -94 78
7419 78 -32 -21 -118 -76 -66 -126 -94 -71 121 145 -89 -51 -280 -197 157 -195 -186 -7 53 -80 300 28 92 202 284
7444 284 108 -196 154 85 -197 -3 -391 -43 187 -242 -323 -127 -32 36 27 251 -196 132 -38 -278 110 105 112
7467 112 -32 242 19 -102 33 -61 17 -10 -89 -258 -92 -79 131 -13 -193 -204 5 25 -42 148 71 88 333
7490 333 301 169 278 165 14 -1 -66 116 -88 213 -149 204 -33 -263 -78 -17 26 -63 -39 82 31 -13 -90
7513 -90 -59 200 240 -52 -55 -27 -217 156 45 10 -43 36 53 -112 -219 88 -35 -144 -82 157 -129 -59 -117 -4
7537 -4 -18 -51 110 -216 -73 110 1 -218 -20 -54 95 -101 -44 158 -101 83 132 -216 -62 -6 -72 145 -28
7560 -28 20 -167 -97 -73 270 100 -149 -230 295 -383 120 -120 -84 10 51 -93 -61 159 -130 -9 -27 -274 4
7583 4 -222 243 119 -214 58 63 124 73 -114 -188 161 -4 -163 -2 41 111 31 -46 26 -121 -77 52 -3 54 164
7608 164 66 49 -124 189 -78 0 -116 271 -102 -191 -63 11 55 -71 -207 119 148 -167 -28 -85 35 312 -157
7631 -157 -39 129 260 -105 15 14 -124 15 41 -123 336 95 -52 287 46 -7 -230 -139 -149 -56 -136 141 134
7654 134 341 -197 -198 206 -98 -214 206 94 -230 319 -26 124 245 308 -360 146 66 -135 185 161 -47 -196
7676 -196 -17 -261 168 -53 -126 164 101 -149 338 -86 -161 228 232 229 -136 -108 107 106 236 -84 -297 -17 -122
7699 -122 -122 -133 223 65 48 -124 -172 120 233 -220 -94 148 -140 -88 -28 250 15 59 294 94 95 -421 -153
7722 -153 -14 55 -68 23 -72 -166 -74 77 -166 21 127 -43 39 -230 124 52 32 -90 101 -98 43 -66 -2
7745 -2 -99 -153 60 -42 -302 -8 -220 72 -23 -167 -53 67 -176 -157 304 173 -28 95 -133 -49 76 42 19
7768 19 100 172 -273 -122 24 -164 66 80 75 -265 2 66 91 50 -171 -247 345 146 170 158 -133 21 345 395
7792 395 248 179 -9 -174 192 194 -122 -90 -27 94 -13 -127 -454 2 206 -66 -181 86 114 -8 -169 253
7814 253 145 160 -117 -43 159 -171 119 -214 271 -379 7 124 -49 -206 -48 -229 -63 401 158 -381 314
7835 314 115 -77 73 -18 101 131 -52 -189 185 256 -163 -250 0 -129 -136 -101 -35 148 -12 -187 -215 322 -58
7858 -58 -57 12 165 140 7 -16 -55 53 10 10 86 -39 333 -134 -279 110 -100 -105 -63 89 -201 -315 86 135 -292
7883 -292 -174 102 -87 52 15 -10 -77 -40 -158 66 -61 236 -230 -6 -97 -93 -133 -108 5 -334 -20 -55 24 -116
7907 -116 20 -2 375 64 -134 -251 -8 -73 72 -221 14 -209 -42 -199 -148 55 -80 219 -151 -117 -113 168
7929 168 27 64 79 28 20 276 139 275 243 162 -52 69 107 -80 54 -224 82 68 -60 78 -26 21 77 -54
7953 -54 -246 -26 41 167 50 -117 195 -133 120 67 114 4 114 -37 -55 -141 -31 105 90 -98 -14 161 -67
7976 -67 -23 202 -43 -59 227 115 26 119 -152 97 149 54 -23 74 227 -32 187 90 -265 -92 39 -365 -72
7999 -72 90 -63 -171 -53 175 63 -17 -139 -167 -234 -174 331 -30 -60 -185 144 178 157 23 -179 -246 -99 -165
8022 -165 -212 -48 -134 -40 -98 -50 28 -105 -38 5 180 -186 102 186 174 -245 51 207 119 -7 314 66 69 -123
8046 -123 -100 -5 -48 -7 -162 308 -5 -136 92 80 -56 -82 129 -164 18 -88 31 118 208 49 -134 61 219
8069 219 -56 -21 -37 -93 162 89 -166 27 179 -7 0 -125 -364 -174 232 -30 55 344 -18 57 48 -116 147
8092 147 201 18 86 -172 -251 65 229 -28 -158 -49 35 -125 79 -37 51 -7 70 172 322 122 -24 9 212
8115 212 -104 35 83 -113 -23 -175 -140 -88 -23 22 -138 10 -67 -22 254 -47 171 137 64 29 -202 37 193 -7
8139 -7 129 -307 119 21 172 -82 122 -151 169 -26 -48 124 -38 65 110 -158 -75 -199 -236 187 -182 346
8161 346 33 -30 -16 -23 129 -102 -62 85 -275 -25 -10 7 105 177 298 265 -11 68 112 105 36 305 -104 123 76
8186 76 194 161 199 93 92
8191I2
$$ Imaginary data points
##PAGE= N=2
##DATA TABLE= (X++(I..I)), XYDATA
0 0 0 0 0 0 0 0 0 0 0 0 0 0 0 0 0 -8 8 -8 8 -8 15 -16 16 -22 24 -25 32 -39 41 -48 56 -64 72 -81 92 -104 116
37 116 -128 144 -160 179 -199 220 -244 269 -297 328 -362 398 -439 484 -532 588 -647 716 -795
56 -795 883 -985 1105 -1248 1419 -1631 1902 -2260 2759 -3507 4746 -7163 13702 -71197 -203239
71 -203239 -84336 46287 99596 43671 -24842 -16675 70332 95438 57327 25532 15867 8799
83 8799 10257 -14623 -27637 10776 43324 26253 12449 2610 -14030 -15054 -18773 -39815 -24296
96 -24296 12774 14928 -482 -12220 -20841 13649 62485 39629 -32153 -73976 -66265 -7008 51082
109 51082 24087 -43692 -51435 -11218 26727 37601 -5246 -55389 -38382 7759 25646 30483
121 30483 17136 -11350 -3669 27344 32476 20055 -6011 -38552 -19112 35760 42406 10359 -12058
134 -12058 -19357 1671 29435 6603 -29470 -22100 -9121 -7030 11749 29068 33469 29569 -8974
147 -8974 -47315 -17277 33488 28347 -13637 -50147 -46129 18158 64709 26171 -30813 -42733 -27651
160 -27651 -5064 -6658 -48096 -55684 617 47417 46692 15130 -26204 -21876 38531 63831 19314
173 19314 -31463 -49879 -20571 42399 64812 33729 15724 9481 -16340 -32863 -27376 -12296
185 -12296 13155 7227 -45092 -58441 -796 53763 59026 16893 -40241 -43256 4241 14427 -13721
198 -13721 -20610 -4369 22882 44345 19264 -24179 -21574 5168 16025 12670 -17962 -53878 -34764
211 -34764 17868 42600 37791 7271 -30415 -21590 13209 12346 -5976 -10618 -10304 2098 16928
224 16928 6201 544 18101 11677 -14838 -19687 -12159 141 15151 2890 -17283 717 23479
237 23479 13926 -4730 -23473 -30674 -2855 22919 8129 -10799 -11298 -3922 23114 40818 6419
250 6419 -35016 -35993 -10188 23803 37630 2564 -27175 -3555 25743 24895 6590 -22529 -32417
263 -32417 -8038 483 -17230 -10696 13357 23877 25042 6947 -20644 -15582 3100 -2330 -8654
276 -8654 -4704 -6302 3005 18168 11652 9249 22263 14528 -10067 -30958 -49667 -35783 18106
289 18106 45027 18272 -17373 -32349 -7274 44009 46285 -11500 -47350 -33329 -61 26441
301 26441 20618 -1459 12684 38956 20970 -14764 -28557 -20826 4085 15424 -13904 -34507
313 -34507 -11956 11788 17747 15864 -517 -10586 -1541 -7521 -23548 -11193 12233 24847 30059
326 30059 10535 -18623 -9105 19674 20305 1773 -24579 -39978 -12127 25407 17460 -9773 -16432
339 -16432 -8243 9940 14887 -15519 -32803 -6720 18697 20845 13499 -3554 -7903 11739 15463
352 15463 -2013 -7276 -9566 -14735 -2716 9725 7506 10260 9013 -6873 -8955 -2913 -9665 -7519
366 -7519 4354 -129 -3813 4466 9498 20904 28920 1915 -29261 -22906 -3566 6932 7609 -8810
380 -8810 -13176 15151 29645 7562 -12558 -15897 -8217 7074 -3686 -37055 -34727 3735 31739
393 31739 35393 11957 -25166 -26690 2404 10417 -1287 -10695 -16420 -3646 20049 16781 7150
406 7150 21494 29450 12046 -12826 -34898 -27651 14721 32791 5620 -15319 -8213 11654 27103
419 27103 10723 -23919 -22181 4455 4063 -14233 -22126 -11253 22162 42269 11563 -26113 -26389
432 -26389 -8829 7061 10371 -10899 -24388 -5636 10692 8712 6609 -651 -7992 598 664 -14925
446 -14925 -13843 144 8729 18083 15072 -2586 -2181 11358 7739 -1065 -1927 -2963 7839 21046
460 21046 9497 -3010 6359 12409 7701 -111 -19444 -28635 -8006 7732 3163 -1384 -8428 -12909
474 -12909 2159 10297 -5719 -17607 -18625 -13819 6360 18539 4762 -886 11870 14812 7472
487 7472 -5099 -22886 -17233 6968 6011 -12573 -13218 892 20446 31662 9716 -18272 -12973
500 -12973 2701 2189 258 -1309 3930 24088 26775 724 -10615 1371 9823 8020 -12498 -41799
514 -41799 -35273 2682 22084 16092 1242 -13167 -5602 13288 5041 -15722 -12724 931 10282
527 10282 12099 -3184 -10102 14169 31119 11427 -15594 -30578 -26210 -293 9849 -8484 -12943
540 -12943 2442 10422 9404 514 -12562 -4102 14524 7590 -8996 -7343 2906 18995 30684
553 30684 14025 -7980 -6168 1416 408 -540 -10009 -14950 2242 14477 3276 -6294 -8912 -8168
567 -8168 4089 5727 -13830 -19899 -4039 8037 15516 13930 -1789 -4850 6398 2886 -8537
580 -8537 -9966 -10358 -4040 8951 5041 -5659 -297 5639 2079 -354 -11267 -21262 -6613 10942
594 10942 9813 7249 5713 4908 17468 23511 3349 -12681 -9180 -3472 3768 4248 -8803 -5546
608 -5546 15895 16829 -2972 -18088 -23655 -11646 7652 -196 -22097 -17489 4125 20361 25312
621 25312 8974 -9988 -3244 7330 -2799 -11962 -9498 -664 15749 18267 -4165 -13774 1773
634 1773 10979 6606 -7602 -26366 -21249 6686 15880 5332 2397 5476 12586 17754 390 -19950
648 -19950 -9968 9733 11753 2895 -10047 -13236 8375 22561 4553 -15404 -19448 -15316 -2883
661 -2883 1847 -11301 -11665 7062 13669 7981 841 -9171 -5918 9789 7562 -4811 -2558 4259
675 4259 10166 18256 10095 -4576 -557 5029 -3343 -9184 -12429 -11481 4587 15375 2864 -7472
689 -7472 -4805 -2149 3893 3995 -12398 -17485 -840 9645 11859 10518 -70 -2067 10818 8879
703 8879 -7172 -13606 -13887 -7293 8368 8352 -5660 -4105 4998 5537 2162 -8630 -20744 -10387 6884
718 6884 4806 -505 2499 7090 16950 20619 2164 -10164 -1392 3959 -177 -4950 -9712 -379 20859
733 20859 17734 -6129 -16278 -11226 -702 7097 -6280 -26356 -16239 9401 17474 11767 395
746 395 -8008 4788 15890 39 -15783 -11637 326 14340 17200 -1660 -10898 2334 8231
759 8231 366 -8522 -17223 -14507 2196 3608 -6202 -277 10372 12432 9908 -2981 -14688 -2520
773 -2520 12711 6805 -2021 -2747 1829 15801 19715 -1340 -16133 -8990 -1229 1751 -2780 -16951
787 -16951 -16463 6404 16929 8293 -1339 -11403 -10782 4017 6422 -5235 -5560 1335 6566 14204
801 14204 11190 -2344 -2010 3186 -2802 -6820 -7558 -11056 -3426 7983 3683 -172 4353 1791 -1433
816 -1433 -2583 -11169 -11024 4731 10426 3417 1039 246 5210 18370 12725 -10625 -17905 -9448 460
831 460 9104 2637 -12997 -5403 14303 14721 2012 -12208 -19510 -5066 13334 6221 -7872 -5584
845 -5584 4299 15097 18521 1504 -12138 -4424 69 -6031 -8391 -8226 -2978 9747 7425 -8605
859 -8605 -8243 1577 2251 -1323 -10591 -16975 -504 19492 14169 976 -473 4362 16531 18939 -4503
874 -4503 -21559 -9516 6839 12935 8155 -8402 -12850 5174 12090 -2568 -15111 -19701 -13870
887 -13870 3453 7394 -5010 -4384 5318 8432 10280 5959 -5404 -3841 3456 -1270 -2743 5111
901 5111 8452 10765 10698 -2766 -9672 -367 2212 -4355 -8359 -13753 -9965 7814 12429 730 -3855
916 -3855 -2494 -191 6021 414 -15586 -12672 4514 13044 14320 4995 -10204 -6705 9090 8095
930 8095 -2341 -9638 -15173 -5932 10818 9464 717 2784 3823 2931 3453 -5583 -12108 -706 7699
945 7699 2641 585 -214 485 8725 6800 -9177 -11761 -3239 -1269 -2600 -5998 -9496 4304 21059
960 21059 11276 -7475 -11996 -5415 7914 14737 -2352 -16907 -3728 13648 16880 9506 -7577
973 -7577 -15053 -1155 5090 -6977 -14235 -11911 -4215 9152 9408 -5261 -7234 2529 3340 -109 -4473
988 -4473 -10185 -926 14517 11858 4291 7636 10420 11140 9435 -5615 -13226 -97 7615 408 -5809
1003 -5809 -8648 -3179 11660 10240 -11268 -20270 -14648 -7175 1270 -93 -10872 -6687 7853 9960
1017 9960 6614 2647 -4826 -1890 7820 2290 -5126 -1068 3960 10183 17422 7942 -5461 -4179 -830
1032 -830 -2337 -577 -4221 -8485 223 5208 -1615 -1358 3306 2210 2220 -3410 -15896 -11988 4731
1047 4731 9638 6626 1935 -5724 -1563 10213 5327 -5916 -6812 -4525 822 7826 869 -7373 2574
1062 2574 12641 8406 -796 -13299 -16867 976 13414 3401 -5892 -4655 456 10374 9028 -7618
1076 -7618 -11365 -504 1264 -4291 -6302 -5490 5655 17452 7152 -9406 -7520 -27 3902 4368
1090 4368 -6060 -11746 3351 14474 9431 4171 103 -1403 5665 4143 -11156 -14372 -4482 3923
1104 3923 8854 4798 -8695 -7466 6816 6718 -3512 -10867 -14875 -6289 8989 6846 -1612 3650
1118 3650 9937 9467 6846 -3887 -10246 844 7472 -851 -4582 -3443 -418 8903 9770 -3287 -9171
1133 -9171 -6788 -8269 -6047 -2592 -6284 -2632 8119 6649 974 991 -784 3119 11119 3667 -9075
1148 -9075 -6770 2893 10545 15596 5586 -7863 -3513 3270 -2367 -6491 -7043 -5731 3437 5433 -6415
1163 -6415 -8260 2391 7182 6442 527 -12286 -12031 3446 9098 6351 4208 -2480 -3516 4610 1625
1178 1625 -7659 -6042 -1720 258 2465 -2796 -8405 4029 16111 8170 -3262 -9949 -8870 4983
1192 4983 12143 411 -5237 3854 8971 7845 1745 -9238 -7153 4358 124 -11942 -11773 -4656
1206 -4656 5769 14913 5898 -8393 -5902 718 1596 1862 -4291 -10349 -109 10823 7520 3699
1220 3699 2172 654 5948 5541 -9775 -15535 -4164 4612 6986 3421 -5917 -3475 9898 8094
1234 8094 -4697 -7975 -6444 -3020 2179 -3267 -7403 5110 14282 7325 -965 -6925 -8190 2449
1248 2449 7288 -2411 -6916 -3385 -872 6487 10726 2414 -3890 -904 -2176 -3171 -1594 -5510 -3243
1263 -3243 9513 9919 -403 -4604 -4945 745 10270 4748 -9877 -9491 -1078 3197 6777 4212 -2539
1278 -2539 -357 959 -7004 -7649 -230 2449 5310 5142 -4738 -6018 3793 6819 4365 602 -9770
1293 -9770 -11542 1497 7150 2286 59 -1215 845 7517 491 -14151 -10368 3582 7977 4134
1307 4134 -6494 -11042 4712 19640 9851 -5751 -10311 -7690 1435 5355 -3401 -4190 7500 10200
1321 10200 4900 1999 -724 773 6571 -457 -11043 -7938 -247 3709 7617 2453 -7226 -3502
1335 -3502 1791 -3827 -9198 -11587 -11809 -321 8023 -1316 -7066 872 9974 14562 8452 -9156 -13753
1350 -13753 1856 10253 6845 2446 -2265 -684 8033 6129 -2685 -1352 -915 -5443 -4257 -2719 -3047
1365 -3047 4081 8611 4405 4028 3100 -3843 -2691 3527 2061 -472 -1083 -4756 -2482 2821 -2367 -6571
1381 -6571 -628 144 -7041 -11596 -12246 -2782 13262 11674 -5460 -11143 -3482 6794 13355 5374 -8166
1396 -8166 -4923 6768 8266 6156 3910 -980 2141 5942 -2395 -9231 -5830 -1540 5013 9422 382
1411 382 -7003 -234 5089 4219 1419 -5564 -7689 1331 4015 -2812 -113 8102 9283 4523 -7521
1426 -7521 -16878 -5605 7731 1137 -10808 -12499 -5891 7557 13124 128 -8676 -2523 1788 405
1440 405 -975 -5844 -3112 8786 12134 6699 4241 958 -838 5330 5323 -4630 -9115 -7172 -3533 5121
1456 5121 7402 -765 -1780 2758 -716 -3891 -3312 -3083 2687 5882 -2613 -6364 3952 11037 8674
1471 8674 2392 -7937 -9749 256 1770 -4838 -5018 -2702 -1024 3259 357 -6822 -4547 1269 1976
1486 1976 2600 -800 -8991 -3746 10042 13330 7658 -1360 -9065 -3055 9433 6923 -2402 -2122 503
1501 503 1735 2480 -3116 -4779 4326 4527 -6819 -10336 -5117 2254 10017 6123 -4700 -3164 2858
1516 2858 1158 -1248 -1635 -3919 458 5844 755 -2619 722 1982 4341 5824 -4611 -14534 -10053
1531 -10053 -705 5856 7596 -1897 -8389 1625 9839 4997 -1504 -5943 -4762 3384 3672 -4428 -1767
1546 -1767 8610 10216 6084 -722 -7369 -3193 3220 -2264 -7496 -3944 -1441 1431 4953 740 -1802
1561 -1802 3759 3312 -2514 -4318 -7681 -5745 6127 11159 3010 -2445 -2563 1854 9739 6729 -8267
1576 -8267 -11890 -3529 1879 2178 -1356 -5469 1049 8857 1321 -8192 -5755 -229 4634 5472 -2400
1591 -2400 -5642 3099 7407 4823 4423 1932 -2319 -1202 -1562 -4494 -256 2779 -748 -1965 -2781 -7788
1607 -7788 -5339 1896 2677 943 -2585 -7709 -1418 11584 10877 2228 -1815 -2328 1358 6098 -165
1622 -165 -5823 1115 6316 2298 -2468 -6952 -6881 1400 3297 -5972 -9145 -6001 -2247 5948 9871 3855
1638 3855 975 2868 1634 1444 1406 -3179 -2159 4702 3275 -2754 -2441 352 4936 6780 -4328 -15472
1654 -15472 -8994 1178 2648 -461 -4343 -1805 9580 11530 -295 -5257 239 4677 4330 -2362
1668 -2362 -9926 -4371 8439 8889 2381 -1127 -4971 -2948 1548 -2270 -6676 -3607 -1825 -673 3618
1683 3618 2271 -608 4689 7048 1909 -1267 -3977 -3584 5244 8879 859 -2983 341 2388 3909
1698 3909 956 -6680 -5772 774 -1959 -6620 -4880 -2117 2738 6228 -1182 -7728 -2876 1721 3457
1713 3457 5585 1933 -3516 -823 3582 3615 4170 985 -5356 -2689 1693 -1048 -2846 256 2356 5761
1729 5761 3482 -6455 -7338 3001 7453 3153 -1972 -5140 -35 9432 6456 -2735 -2514 -178 -1380
1744 -1380 -3534 -7907 -8947 876 6814 1033 -3363 -3211 -1780 3663 5275 -3577 -6891 -3102 -142
1759 -142 3883 5923 392 -440 5681 4395 -1844 -5326 -6732 -2571 5635 2264 -6023 -2517 5105
1774 5105 8536 7741 -25 -6268 -592 4035 -1260 -3832 -1062 1910 6106 4744 -3106 -3861 1989
1789 1989 1546 -1386 -3807 -7701 -5800 2010 3414 927 475 -1828 -2445 1872 -247 -5818 -4087 -645
1805 -645 213 1385 -1641 -4830 2475 8680 2948 -3332 -4358 -2013 5285 8476 1131 -2058 3113
1820 3113 4493 3032 1567 -2176 -851 4353 977 -4728 -3300 -736 1197 3894 -674 -7888 -6322
1835 -6322 -1879 113 3109 1101 -4422 -527 4764 2180 -1 -1101 -2246 1625 2937 -3865 -5744
1850 -5744 2156 6746 5177 741 -6499 -6313 1970 1856 -4503 -4890 -2597 453 5123 3000 -1728 2190
1866 2190 5273 1863 -710 -3108 -4591 1753 7739 4486 1301 873 447 3993 5283 -2366 -7780
1881 -7780 -4341 -1236 -243 -626 -3965 -2020 6540 5894 -3020 -6265 -4651 -706 3360 -1047 -7743 -3394
1897 -3394 4381 3843 2037 -946 -3342 302 2472 -3499 -5387 -614 2659 4944 5599 82 -1005
1912 -1005 5179 6055 3211 1257 -2904 -2975 3664 4500 -792 -1482 -1148 -903 1013 -2544 -8672 -5001 1325
1929 1325 462 -2224 -4344 -4847 1567 6675 1106 -3323 -1451 169 3141 5266 1588 165 3703
1944 3703 3079 -113 -464 -2292 -2681 1949 1173 -3878 -3284 -1339 563 3794 1603 -6332 -5688 -148
1960 -148 1065 1861 439 -1557 3197 8512 3311 -2073 -945 1173 2820 2038 -5410 -7271 1483 5986
1976 5986 3107 169 -3617 -3870 1879 920 -5548 -5299 -1656 554 3539 2310 -1998 1089 6180 3277
1992 3277 -633 -3192 -5477 -899 4778 958 -2771 312 2673 3539 2873 -3510 -6056 751 2571
2007 2571 -2007 -3490 -3096 1094 7727 5882 -2361 -2997 642 1744 2202 -484 -5179 -1139 4153 2182
2023 2182 117 -51 -1970 48 2173 -2483 -5593 -2114 23 1314 2808 -1464 -3581 1722 3738
2038 3738 934 448 -1498 -1575 3706 4083 -1059 -886 1933 1538 877 -2037 -6708 -2370 3394 1174 -2437
2055 -2437 -3035 -2937 1445 5333 241 -4233 -1442 1525 2966 4959 1389 -799 4651 6199 898 -1718
2071 -1718 -3751 -3740 1033 1363 -4882 -5379 -1322 785 2168 110 -5514 -3973 1244 -398 -2148 -890
2087 -890 181 4336 7459 2368 -1101 2161 4198 2216 215 -4365 -5097 1493 4369 -540 -1329 -1379
2103 -1379 -563 3271 1349 -6170 -5951 -579 1423 2817 1122 -2888 140 6812 4631 -367 -2200
2118 -2200 -3848 -934 3108 -600 -4081 -628 1706 1143 744 -2914 -4741 274 1549 -2824 -3196 -856
2134 -856 846 4793 4158 -1088 -437 3922 2682 1419 -180 -2790 123 4874 1754 -2672 -2484 -1807
2150 -1807 513 2018 -3204 -7359 -2526 1693 2130 1792 -1524 -3389 2513 5334 613 -872 -651 -353
2166 -353 3614 4125 -1216 -1388 1851 668 -853 -2227 -5317 -3233 1651 -175 -2591 -541 260 1254
2182 1254 3806 -262 -3314 123 2192 901 1007 -315 -915 4858 5741 -74 -3042 -2490 -1741 1625
2198 1625 827 -5551 -4881 1239 3350 3176 910 -3594 -1918 3638 1864 -2690 -2435 -1518 1708 5557
2214 5557 2036 -2536 352 2111 179 -550 -3330 -4978 147 2058 -2059 -2383 174 1328 2993
2229 2993 1144 -4208 -3083 2751 2529 406 -158 -1423 2244 7165 3140 -2615 -1894 6 1380 2319
2245 2319 -2043 -5773 -728 3522 1159 -292 -3172 -4216 482 2587 -2041 -3030 -261 338 2992
2260 2992 3446 -908 -1444 2203 1076 -532 -354 -1893 -941 2560 470 -2722 -1003 -380 -784 184 -2631
2277 -2631 -4919 135 3478 1413 915 153 -252 4032 5438 -524 -2741 -314 1149 3134 3291 -2069
2293 -2069 -2401 2765 2575 -227 -2144 -5424 -4254 1666 583 -3763 -2129 -1026 860 3471 317
2308 317 -4020 -1246 1984 191 -51 -342 -1053 3174 5245 310 -1586 618 926 572 -159 -4502 -3023
2325 -3023 3364 3529 -81 -1108 -1540 403 4597 1125 -4334 -2611 1105 2351 3413 332 -3167
2340 -3167 658 3950 635 -2367 -3478 -4382 -112 2220 -2498 -3776 -587 441 1265 1622 -2668 -2926
2356 -2926 1761 2157 -189 930 1387 2266 5453 2542 -2080 -8 1863 440 645 -1578 -3977 -42
2372 -42 3134 -505 -2314 -1932 -2400 288 1440 -3420 -4063 54 2063 2984 2981 -1472 -1885 3345 3426 -151
2390 -151 -945 -2491 -1112 3609 2253 -2442 -1419 529 -183 110 -1878 -4796 -1108 2456 215 -745
2406 -745 438 233 2950 4134 -637 -2515 892 1527 803 1104 -1676 -1164 3395 2496 -1799 -2786 -2750
2423 -2750 -1855 1746 -234 -5350 -2890 1626 2303 2889 148 -3492 -129 4316 1345 -1056 -712 -439
2439 -439 2865 4543 -375 -2370 948 1280 -276 -1025 -4231 -4061 1190 1449 -1460 -912 -665 -537 2258
2456 2258 618 -3449 -922 1863 1492 1245 567 -1517 2247 5316 698 -2976 -2242 -1575 1214 2438
2472 2438 -2491 -3917 421 2117 739 -109 -2783 -2375 2544 2181 -1917 -1053 633 1937 4822 2386
2488 2386 -1944 -1042 1451 297 21 -254 -3301 -1150 2239 -320 -1628 -839 -1564 -551 735 -2742
2504 -2742 -4199 258 2782 1338 1063 -1289 -915 3621 3369 -1183 -1513 -201 528 2958 1047 -2906
2520 -2906 -315 2973 1376 -655 -1914 -3800 -713 2765 -153 -2007 -589 -216 1582 3769 -58
2535 -58 -2969 -90 1037 92 889 -1542 -2045 2417 2693 -1724 -2421 -1524 -1042 1573 -60 -4463 -2150
2552 -2150 2726 2334 1050 -160 -1737 1413 4042 -273 -2380 519 1912 2653 2977 -1016 -2429 1662
2568 1662 1932 -769 -1694 -3591 -3538 898 1845 -1625 -1509 -85 76 1948 761 -3227 -1496 2963 2122
2585 2122 704 44 -1109 2148 5129 598 -2882 -1412 -471 2 728 -2205 -2598 2049 2280 -1055
2601 -1055 -805 -752 -737 1934 846 -2765 -1506 1281 1400 2605 1997 -1930 -1349 1482 293 -688 -1058
2618 -1058 -3122 -1031 2474 264 -2986 -924 726 1056 2017 -2289 -3954 1036 3670 1278 680 -10
2634 -10 59 3359 2820 -1255 -724 1103 23 575 18 -2545 -957 2003 -220 -1668 -1793 -3228 -1433
2651 -1433 1939 -185 -2599 -682 429 1522 2858 -430 -2856 1390 3225 653 -896 -1233 6
2666 6 4364 3164 -2812 -3640 -143 709 489 -953 -3898 -1150 3115 1486 -249 520 408 1069 2344
2683 2344 -544 -2593 798 1810 1274 2046 -337 -2494 548 1627 -806 -1642 -2593 -3447 138 1070
2699 1070 -2391 -1913 1444 1811 1446 -377 -3099 -493 3983 1781 -1027 -616 217 2239 4365 596
2715 596 -2298 -567 340 -1178 -819 -1855 -2546 633 1598 -934 -808 -145 -1143 1484 2444 -1224 -2054
2732 -2054 143 1262 2847 2471 -1317 -965 2089 1222 -1459 -2039 -1940 -109 1930 -1686 -4364 -772
2748 -772 1910 812 -13 -2075 -2311 2146 3442 30 130 1627 1539 2512 2213 -1043 -664 1733 665
2765 665 238 42 -3049 -2296 1549 292 -2183 -2798 -3495 -1394 2184 627 -2946 -54 2100 2136 2016
2782 2016 -367 -1423 2816 4209 -107 -1418 441 1569 3115 2033 -2164 -2140 884 -338 -1839
2797 -1839 -1543 -2662 -1365 1400 -325 -1569 230 174 137 2116 -362 -3583 -1109 1416 1840 2310 -160
2814 -160 -2255 1227 3838 17 -2274 -1787 -1034 1340 1105 -2823 -1582 3229 3244 630 -472 -1769
2830 -1769 289 3190 413 -2172 -383 635 341 1527 -103 -1655 446 235 -1771 -1438 -1769 -2671
2846 -2671 1 1761 -728 -1562 -572 -112 2101 2960 -1534 -2231 1768 2401 1440 695 -1150 199 3658
2863 3658 1147 -2930 -1659 732 976 1112 -1350 -3150 -401 1214 -1042 -923 -888 -1779 -150 1794
2879 1794 68 601 1593 322 1131 2309 -651 -1835 1316 1739 1054 218 -2354 -1330 2966 1995 -2707
2896 -2707 -3016 -1456 -377 942 -2009 -3706 483 3817 1237 -629 -1105 -335 2585 2782 -1356 -2114
2912 -2114 781 1345 1747 1837 -523 -886 996 -353 -1676 -695 -1877 -1968 1053 738 -1462 -284 585
2929 585 1283 2362 210 -3186 -843 2200 1124 -354 -1083 -757 1937 2593 -1821 -2614 313 762 -329
2946 -329 -1610 -3172 -1313 2606 1487 -598 218 122 -51 1879 1209 -735 509 326 -458 1579 1115
2963 1115 -1565 -1026 1080 230 -672 -1858 -3036 79 2744 -599 -2959 -1137 693 1971 1642 -1435
2979 -1435 -969 3096 3145 -64 -299 354 1473 2832 250 -3153 -1013 1128 114 -24 -1183 -2770
2995 -2770 -1202 611 -839 -1323 -1199 -1877 -257 2328 108 -983 1048 2160 2662 2040 -1708 -2472
3011 -2472 1913 2689 -439 -1217 -1455 56 2439 726 -3090 -1207 637 -589 -1414 -1528 -1534 1334 3096
3028 3096 246 -72 1564 1088 893 1203 -952 -1597 -111 -687 -564 810 -816 -1910 431 853 -975
3045 -975 -1468 -2007 -1063 2340 1737 -2097 -826 2056 3323 2898 553 -2133 306 2928 317 -1875
3061 -1875 -423 -321 589 819 -2216 -2414 588 59 -1567 -1161 -1973 -1958 537 880 -478 415 340 -225
3079 -225 1981 2225 -691 -190 1778 1547 1450 -146 -2602 76 3001 246 -2523 -2146 -793 1232 1988
3096 1988 -1660 -2867 451 1179 -256 -472 -961 -208 2670 1790 -734 215 1011 84 1104 267 -1856
3113 -1856 -1379 -287 -994 61 301 -1436 -916 1222 51 -1125 -1117 -1340 597 2273 -517 -1829 1504
3130 1504 3240 2293 740 -1609 -1223 2381 1752 -2086 -1963 -403 618 1269 455 -2019 -388 1737
3146 1737 -470 -1371 -846 -1536 24 2356 949 155 748 466 966 2534 23 -2548 -796 226 -295
3163 -295 -474 -1791 -1556 1503 1147 -2175 -2413 -701 -56 1151 -363 -2728 -546 3032 1746 382
3179 382 683 691 1850 2758 -248 -956 1141 1124 229 666 -903 -1855 188 49 -1137 -144 -1221 -2767
3197 -2767 -2 1239 -797 -1420 -927 -402 1234 1196 -1823 -821 2088 1585 224 -688 -1749 260 2111
3214 2111 -498 -2559 -400 591 434 1023 -615 -1363 1286 1291 -494 -412 -302 -646 2119 2289 -55 -248
3232 -248 1084 912 1700 1222 -2514 -2200 496 289 -664 -732 -2012 -182 2330 31 -2627 -958 482
3249 482 682 817 -1554 -1887 1709 3447 677 119 493 476 1407 291 -2306 -1118 701 -606 -778
3266 -778 -203 -1312 -324 1224 -315 -981 -513 -1124 -492 1983 966 -1025 -17 950 1334 2089 193
3283 193 -1820 882 1411 -589 -1183 -1242 -884 1211 1288 -1885 -1748 559 62 376 308 -1351 -468 1578
3301 1578 440 -425 774 -21 127 1513 359 -1288 -249 574 133 843 -931 -3063 -474 1229
3317 1229 -237 -1071 -1289 -1075 1618 1704 -1421 -1407 762 1438 1064 -19 -1829 148 2962 1612 -767
3334 -767 -244 -180 347 1434 -622 -2546 -300 365 -558 173 30 -881 828 1279 -654 -355 1 -721
3352 -721 707 1637 -613 -603 1343 1063 1232 700 -1541 -1530 879 -198 -2176 -1341 -1041 -77 1710 -525
3370 -525 -2259 85 1106 227 160 -407 -1311 1453 2448 536 296 1109 17 1074 1368 -1130 -1234 -246
3388 -246 -257 -468 99 -1650 -1379 1382 923 -880 -895 -931 -170 2022 102 -2077 -131 1585 886 327
3406 327 -312 -1124 1268 1922 -1236 -2041 -384 -307 811 353 -2088 -1737 890 208 -154 -24 -831 -229
3424 -229 1901 1023 -653 33 190 691 1902 788 -1081 238 1535 752 406 -724 -2082 -38 1011
3441 1011 -1373 -1659 -540 -296 624 1044 -1168 -919 1266 664 -280 322 -635 -306 1798 1194 -657 408
3459 408 213 -203 879 -279 -2358 -1121 -220 -822 -235 -546 -1786 868 2193 -48 -966 -2 40 1262
3477 1262 1878 -992 -1014 1720 2000 1015 683 -754 -460 1495 -211 -2528 -1547 -441 -433 331 -769 -2132
3495 -2132 265 1655 -300 -194 -416 -1238 874 1636 -168 -288 1050 800 717 1092 -1233 -1158 1196 642
3513 642 -814 -752 -1352 -784 1289 493 -1632 -720 586 455 1058 450 -1138 473 1636 68 -180 268
3531 268 -640 573 1460 -542 -1282 181 -563 -407 218 -1735 -2126 131 45 -679 186 -457 -456 2032 1926
3550 1926 -551 -191 862 707 1522 383 -1421 155 2053 1009 -214 -518 -1329 84 1053 -1662
3566 -1662 -2617 -466 -85 352 522 -1113 -951 1575 1376 -599 -331 -797 -585 1518 983 -1347 -451 1042
3584 1042 403 664 -291 -1879 -588 1070 -528 -1257 -705 -296 748 1952 -413 -901 865 842 695
3601 695 901 -428 -339 1583 1262 -278 117 461 -151 1158 -165 -2029 -1181 -58 -832 -423 -237 -1755
3619 -1755 -756 1332 -164 -503 244 -914 241 1851 25 -720 670 589 720 1241 -670 -1259 1157
3636 1157 985 -670 -582 -573 -532 1115 506 -1743 -733 794 601 601 366 -1005 379 2183 429 -681
3654 -681 145 -513 366 1521 -805 -1889 177 387 -84 -90 -1745 -1823 375 432 -1007 -491 -172 72 1636
3673 1636 1130 -979 -40 1331 736 643 217 -1184 225 1766 65 -858 133 -274 -129 650 -1334 -2141
3691 -2141 -16 189 -332 152 -376 -763 1522 1599 -581 -112 480 134 1067 1243 -979 -327 1169 528
3709 528 377 -195 -1463 -608 1118 -370 -1812 -689 -777 -74 1255 -434 -1349 824 1303 404 854 -161
3727 -161 -802 1155 1520 -606 -367 -34 -264 853 331 -1946 -1026 689 -152 -289 -476 -1164 -97 1619
3745 1619 167 -1013 259 447 532 1805 31 -1069 1091 1569 -117 172 -578 -1076 965 776 -1164
3762 -1164 -1038 -4 -526 234 133 -1946 -684 823 163 66 442 -472 161 1892 408 -743 484
3779 484 182 -135 826 -799 -1609 252 643 -478 -80 -829 -1305 462 503 -1340 -862 375 348 986 1176
3798 1176 -496 41 1806 932 265 377 -628 170 1594 135 -1393 84 -404 106 742 -757 -2040
3815 -2040 -92 334 -819 -238 -760 -809 1064 1588 -471 -553 450 490 886 548 -1181 -553 1254 547
3833 547 -273 -39 -962 -269 942 -585 -1727 -218 354 -90 563 -521 -1036 819 1260 -72 506 269
3851 269 -381 1096 1286 -481 -380 525 -322 294 93 -1952 -1086 567 -291 -676 -418 -845 -498 1359
3869 1359 -24 -1178 134 491 555 967 33 -487 968 1399 -114 -279 -92 -626 588 534 -1183 -932
3887 -932 73 -215 398 185 -1201 -867 1073 504 -274 139 -329 365 1954 775 -936 107 711 490
3905 490 653 -827 -1662 205 1027 -668 -826 -535 -919 179 593 -1415 -1092 500 121 99 683 -340
3923 -340 -51 1707 780 -88 77 -91 -47 1407 48 -1043 -55 258 -356 79 -516 -1603 184 1059
3941 1059 -720 -515 -408 -308 862 1149 -481 -479 896 799 474 636 -601 -378 1466 252 -780 -166
3959 -166 -391 -208 287 -458 -1587 3 171 -436 374 -181 -912 204 1394 194 9 468 -321 876
3977 876 1530 -501 -793 731 505 -28 -97 -1719 -747 1150 -6 -1447 -581 -319 -15 1017 -181 -1370
3995 -1370 127 896 392 628 476 -463 890 1479 79 -233 268 -456 352 560 -919 -1278 58 95
4013 95 -154 -77 -1139 -736 901 156 -753 -63 164 552 1625 332 -1077 200 1283 344 -150 -497
4031 -497 -953 384 854 -701 -811 183 -491 -197 186 -1073 -910 797 174 73 469 -241 -344 1370
4049 1370 1141 -216 -27 -88 -363 1039 179 -1310 -396 381 -106 -418 -591 -1249 107 1117 -866 -1142
4067 -1142 77 244 886 999 -546 -624 1192 918 3 257 -153 -36 1027 165 -708 -436 -47 -635 92
4086 92 -183 -1630 -648 582 11 402 -209 -969 257 1557 386 -689 589 226 882 908 -593 -790
4104 -790 1065 631 -416 -391 -872 -584 683 -19 -1390 -130 337 -150 137 294 -852 28 876 29
4122 29 341 427 -220 350 1342 59 -601 63 -251 360 567 -1020 -1614 193 427 -359 -305 -935 -434 1161
4142 1161 725 -1288 -145 792 754 1030 278 -916 448 1369 132 -206 173 -330 -84 520 -603 -868
4160 -868 241 -329 -295 120 -752 -1038 459 708 -174 -51 -386 -164 1444 1103 -310 -267 455 209 505
4179 505 18 -1449 -221 1135 -291 -783 -490 -253 22 446 -1008 -1028 627 142 87 611 343 -214 1043
4198 1043 626 -44 370 82 -816 700 577 -701 -469 129 -276 336 -473 -1569 -807 800 111 -570
4216 -570 -577 -467 614 1295 -407 -789 876 711 379 538 -588 -471 1152 538 -799 -311 -401 -441 0
4235 0 -45 -885 -484 24 -524 11 395 -824 -645 1182 412 294 102 -393 679 1770 66 -1294 191
4254 191 717 80 55 -1022 -1160 776 547 -1001 -993 -188 -37 491 -116 -1146 22 1192 252 379 718
4273 718 -165 247 1015 163 -114 259 -422 -580 536 75 -896 -337 140 62 706 -653 -1316 509 1005
4292 1005 -461 -570 13 307 1238 636 -627 -150 1052 446 -331 -260 -1076 76 697 -789 -938 -215
4310 -215 -186 -478 451 -330 -904 166 103 -205 1082 507 -710 569 1232 25 -101 -78 -274 988 827
4329 827 -1036 -1014 376 77 -255 -619 -1336 -31 948 -347 -1112 4 273 345 255 -666 -388 784 1040
4348 1040 -284 167 172 -437 239 263 -626 -453 -216 -691 -198 596 -856 -479 100 -41 166 -124 -701 -57
4368 -57 1316 430 -625 20 240 788 1318 -278 -907 555 1003 -508 -437 -315 -621 198 387 -926 -342
4387 -342 366 -109 -4 489 -560 -373 554 100 555 929 -343 -115 1189 696 -265 -78 -399 29 634
4406 634 -651 -1644 -276 764 -154 -738 -771 -493 978 613 -720 -509 483 921 835 405 -207 189 1161
4425 1161 131 -535 92 -294 -313 301 -317 -700 -115 -701 -605 584 256 -995 -263 387 329 72 -184 -578
4445 -578 910 1382 -151 -556 501 684 705 211 -1064 -601 585 -44 -1198 -225 -307 -177 681 -190 -781
4464 -781 380 482 -107 459 295 -436 651 814 215 478 -37 -787 236 878 -345 -701 -400 -317 -22
4483 -22 288 -1423 -997 864 524 -656 -499 -461 432 1246 -18 -1387 479 1152 612 132 -67 -580 925
4502 925 669 -421 -418 105 -728 -73 143 -771 -95 140 -350 -81 830 -400 -607 491 650 131 239 -346
4522 -346 23 1307 545 -880 -191 107 -24 96 -719 -959 185 617 -457 -677 95 -129 399 469 -526
4541 -526 -169 590 -26 32 877 174 -173 720 327 -118 267 -401 -638 390 117 -994 -846 9 -7 461
4561 461 -270 -1263 -139 879 -29 -299 -428 220 858 792 -362 -522 651 682 -55 50 -367 -215 813
4580 813 -306 -987 -4 -76 -576 137 -31 -419 44 539 -170 269 35 -674 172 970 344 -17 135 -97
4600 -97 708 905 -551 -728 414 379 -303 -550 -994 -516 1078 296 -916 -96 391 12 221 72 -663
4619 -663 269 666 -398 468 481 -149 40 548 -209 -346 -374 -894 -259 661 -211 -1113 -34 309 100 295
4639 295 -937 -692 976 610 -597 -245 361 526 699 45 -685 38 751 -244 -443 -392 -773 -37 356
4658 356 -566 -514 195 -318 24 673 50 -147 747 234 -99 377 -154 -276 1058 822 -730 -196 -91 -267
4678 -267 314 -67 -1478 -515 126 -544 -662 -505 -723 389 827 -407 -575 428 465 419 423 -241 159 1009
4698 1009 404 -274 769 324 -294 279 225 -502 -195 -302 -715 -61 378 -857 -229 353 282 302 141 -608
4718 -608 104 1160 35 -706 324 196 150 126 -766 -606 324 171 -945 -463 -774 -479 419 -271 -688
4737 -688 70 240 81 788 478 -368 15 739 154 43 567 -416 171 949 -257 -592 25 -93 5 425
4757 425 -913 -1174 483 522 -286 -14 -161 -134 841 381 -941 271 651 168 105 8 -460 -90 620 -120
4777 -120 -567 192 -386 -412 248 -216 -514 151 -208 -56 955 -92 -282 492 629 153 521 44 53 699
4797 699 740 -384 -332 58 -80 25 99 -904 -525 502 -506 -647 -378 -625 -188 582 -123 -387 280 263
4817 263 -49 516 -56 -410 495 577 35 -29 -70 -334 765 453 -862 -717 72 -334 307 -47 -1083 -232
4837 -232 929 249 -401 234 51 269 682 -322 -454 325 607 -247 255 -77 -110 306 92 -720 -348 -66
4857 -66 -943 27 15 -795 -81 518 -135 524 342 -48 161 831 298 -6 224 -157 82 486 -176 -590 -25
4878 -25 8 -532 -237 -455 -779 83 29 -644 -123 167 -120 421 488 -179 41 700 335 267 241 -518 -174 541
4900 541 336 -319 -64 -278 -319 602 -213 -1025 -11 474 -28 214 -358 -171 747 895 -62 97 145 156 482
4921 482 201 -519 -32 481 -19 -431 -60 -344 -156 527 -540 -634 -146 -308 -472 619 -49 -582 444
4940 444 563 -3 630 536 -318 272 399 -272 -253 -3 -82 382 239 -607 -643 75 -404 -121 46 -597 -308
4961 -308 669 -10 -158 382 329 80 618 67 -204 192 493 -368 220 -359 -911 -8 325 -630 -493 -120
4981 -120 -328 167 378 -494 -422 478 524 147 346 22 357 1117 366 -510 -23 -24 -68 368 -694 -521 -64
5002 -64 513 -610 -134 -260 -365 173 217 -440 -273 313 301 305 334 -580 36 766 382 -86 304 -105 22 552
5024 552 74 -548 48 -66 -571 344 -229 -673 324 227 -409 -173 -28 -311 242 458 -161 196 461 36
5044 36 150 446 -438 -195 247 -201 -250 343 -134 -503 319 -68 -433 -55 -16 112 390 59 -544 306 600
5065 600 297 441 440 -305 322 674 -377 -309 180 -213 29 -57 -637 -379 380 -27 -510 -89 -208 -200 539 74
5087 74 -478 66 506 407 418 6 -507 512 529 -134 34 -197 -144 42 197 -391 -497 222 -118 -58 16 -554
5109 -554 -506 354 205 -499 362 87 -24 607 239 -240 441 302 -184 344 176 -485 -14 234 -518 -460 -313
5130 -313 -576 -86 266 -458 -325 103 2 34 604 -50 -244 585 601 -53 156 -91 -242 333 66 -760 128
5151 128 102 -346 -71 -158 -865 -81 568 19 -498 221 -163 295 676 -63 168 512 216 26 319 -43 -173
5172 -173 452 144 -426 -47 -279 -125 100 -232 -870 -47 320 -228 133 55 -398 679 816 -63 19 394
5192 394 -65 190 271 -350 -524 104 -185 -235 64 -627 -783 120 -3 -364 -52 74 -260 460 -44 -390 230
5213 230 558 284 522 332 -204 188 815 99 -245 130 -138 262 224 -829 -351 97 -115 -266 -40 -506
5233 -506 -662 526 411 -397 -28 -73 -213 415 171 -430 116 468 45 102 -87 -420 -14 159 -296 -342 -126
5254 -126 -100 -30 322 -293 -479 365 225 -49 329 -270 -265 598 192 -319 110 102 -51 237 -176 -572 -17 240
5276 240 -561 -96 -288 -526 1 151 -213 -474 260 136 -3 366 -103 -443 363 628 127 375 -57 -384
5296 -384 429 38 -271 -386 -180 -376 -76 -33 -551 -187 200 -261 -128 -2 -404 178 844 -84 -152 345 184
5317 184 114 822 -79 -77 278 343 95 131 -285 -279 6 189 -401 -506 73 -83 339 283 -326 -118 516 190 165
5340 165 107 -200 173 447 -312 -650 -147 197 -213 180 -518 -506 395 65 -400 176 -162 -225 259 -18 -453
5361 -453 314 492 299 174 345 -191 -14 463 148 -145 251 -206 -188 91 -366 -585 -198 106 -97 175
5381 175 -266 -441 371 440 -129 75 128 -58 274 269 -154 -204 304 -68 33 82 -547 -358 142 -57 -279 -202
5403 -202 -663 -389 471 -143 -463 -11 287 -11 260 -74 -245 714 539 193 230 160 -59 463 271 -484 -536
5424 -536 205 1 15 -149 -493 -280 291 -309 -267 334 -112 168 553 284 -248 451 216 29 58 127 -534
5445 -534 162 160 -546 -199 -146 -311 118 473 -375 -238 350 61 466 9 -283 258 620 -168 -167 247 15 42
5467 42 295 -8 -561 132 -25 92 -30 -214 -811 68 -138 -335 -332 258 -327 343 482 105 248 333 111
5488 111 441 514 -104 211 507 330 -283 -237 -164 -279 278 -367 -746 45 88 -462 17 -244 -567 335 263 -104
5510 -104 44 406 324 661 441 -106 95 596 133 335 390 -9 -135 361 -35 -123 -16 -21 -360 232 -124 -697
5532 -697 94 308 -126 104 125 -166 360 324 -73 -40 133 20 376 121 -91 -160 427 39 -290 125 -281
5553 -281 -257 573 -55 -132 410 -82 -55 491 267 -422 119 -12 6 40 34 -457 49 406 -135 -352 26 -99
5575 -99 -64 259 -540 -323 393 130 -208 217 -252 353 491 -70 -94 48 152 58 306 80 -427 -43 115
5596 115 -467 -163 24 -497 -288 214 -119 -245 -215 -279 5 298 -249 -2 661 298 172 161 -204 152 786
5617 786 258 -204 -77 110 -320 -89 -192 -219 165 -251 -381 -204 100 -230 32 237 -177 -61 17 -32 281
5638 281 578 252 186 223 98 63 17 -362 -372 113 195 -831 -101 -347 91 169 -129 -583 223 304 -262 -118
5660 -118 68 -80 188 200 -173 -9 403 66 -73 303 -259 -398 337 85 -214 324 -357 -396 367 174 -249
5681 -249 287 204 -150 148 314 -397 113 311 152 -92 -341 -75 360 267 -491 -406 -296 -132 -162 -210 -140 -170
5703 -170 235 -328 -199 188 -7 11 284 182 -96 560 380 -73 592 103 -487 -2 118 0 -105 -331
5723 -331 -364 -123 223 -339 -406 148 170 -64 165 -104 -303 229 189 -254 65 76 -144 303 -135 -325 295 -93
5745 -93 -126 -170 -166 -327 -115 247 -244 -44 41 -561 -110 459 11 -42 22 155 285 462 -135 -113 205 148 -120
5768 -120 -53 -49 -139 274 -267 -663 -67 -52 -358 -218 -125 -91 -35 156 -301 -129 170 408 -14 240 120 90 241
5791 241 80 193 279 -141 -813 203 48 -223 73 -163 -263 278 -100 -654 -106 231 86 162 137 -440 268
5812 268 676 -95 -241 127 -44 92 310 -189 -152 7 -520 -602 -33 -159 -314 1 -8 -52 126 -8 -132 340
5834 340 295 -87 -3 280 40 147 76 -426 -60 407 -146 -290 -135 -132 -27 46 -309 -387 121 44 -160 159 210
5857 210 -96 186 298 -261 -29 283 -343 -71 179 -198 83 249 -420 169 -202 -447 -231 192 -72 -364
5877 -364 -75 -109 230 476 -109 -165 166 329 25 -98 188 -437 389 168 -178 -190 106 -76 56 -122 -425
5898 -425 -330 35 -238 -157 226 -181 -8 100 149 -134 455 -279 288 647 331 -475 123 265 157 53 -48
5919 -48 -457 176 -72 -451 -296 -46 -330 55 -338 -274 310 428 71 -128 333 15 190 401 -251 38 482
5940 482 164 -239 351 234 -413 96 -286 -274 177 -118 -382 323 -143 -175 78 25 -89 184 285 -83 -29
5961 -29 510 106 109 64 85 193 300 -133 -256 -35 338 220 -11 -211 -236 22 5 17 -131 19 -9 133 401
5984 401 -69 263 215 -80 121 349 -488 -184 279 -1 -369 -39 -206 -108 101 -104 -358 -240 -56 45 50
6005 50 -241 9 479 299 -276 280 367 -45 239 350 -366 48 249 -192 -264 -55 -275 -169 119 -206 -83
6026 -83 226 -206 -246 605 120 -169 150 174 237 465 -29 -249 273 374 -59 -69 98 -434 342 114 -497 79
6048 79 123 -168 -90 75 -32 -51 320 9 -12 316 48 12 461 191 -322 276 -40 -209 102 -44 -337 -8
6070 -8 227 -212 -177 53 -161 31 275 -377 -76 239 45 164 -38 -236 34 405 82 -418 0 -60 -26 121
6092 121 -443 -388 163 -348 -211 -109 11 -438 -105 -42 -185 173 158 -141 585 370 -204 120 312 135 -265
6113 -265 -196 -191 55 409 212 -225 -222 -161 -86 128 -383 -464 44 -35 -365 183 -141 0 75 365 30 66 272 -132
6137 -132 -25 390 123 -71 15 -47 -144 199 -299 -96 -94 189 -235 -12 22 93 40 103 -420 -51 416 378 106
6160 106 -231 -25 113 252 -376 -185 171 127 205 -43 -256 -252 174 -30 -24 -139 -24 -24 381 159 -84 152 -18
6183 -18 -155 502 25 -105 228 225 18 -116 -51 -376 114 303 -463 -210 -111 -210 -20 201 -22 -231 65 -18
6205 -18 -36 143 60 133 265 -65 -34 150 85 -220 189 122 -2 -253 -78 -309 16 -267 -412 -326 80 -61 -60
6228 -60 31 64 346 486 -194 -125 239 188 27 173 -75 23 237 -4 -182 -83 124 -148 83 -88 -287 -66
6250 -66 90 -317 77 164 -318 301 339 146 206 319 -35 48 -38 -245 -116 99 -222 -216 -349 -40 -234 250 -116
6273 -116 -432 -357 47 41 195 67 -61 -37 257 32 161 -5 96 -89 216 -338 -151 245 1 -499 132
6294 132 -248 -317 83 162 -208 119 -103 -132 315 213 -35 345 135 94 413 275 -253 33 327 -66 -383
6315 -383 -156 -449 -53 267 -179 114 -189 19 -282 -18 -156 -256 425 -42 -84 113 143 70 229 306 -264
6336 -264 50 -56 -43 8 -32 -96 -292 -97 -211 -362 -70 -269 95 239 -73 -85 251 223 63 304 436 45
6358 45 346 168 -63 6 45 -122 48 42 -228 -18 87 -373 25 -12 -198 -68 258 -62 274 357 0 221
6380 221 187 223 -74 164 125 119 -5 -122 -385 127 21 211 22 -22 -229 335 232 -257 -90 138 -20 402
6402 402 234 -82 238 345 -74 -90 299 -310 127 5 -48 -297 79 -281 -148 13 -201 -232 77 17 -141
6423 -141 -12 10 264 85 143 -313 36 262 -104 388 110 77 259 268 32 -268 154 -58 -52 -84 -5 -435 50
6446 50 -158 -396 -34 -205 -312 144 297 -11 8 120 -198 341 299 -12 18 198 91 -40 -69 -32 -11 93
6468 93 -112 -290 -52 -7 -42 -54 -165 -283 81 138 173 178 269 75 304 261 53 114 95 -168 199 103 -441 -162
6492 -162 -95 81 -200 -12 -174 82 -5 186 -31 57 21 39 15 -318 -89 183 -181 -94 -136 68 -127 65 -68
6515 -68 -63 -278 -424 -188 -280 48 -28 -31 324 190 15 268 -40 155 303 383 109 219 13 -219 -57 86 -262
6538 -262 -185 50 -181 -200 -8 -234 63 310 -154 -74 -3 86 84 199 -96 -140 205 -107 -125 271 -379 12 92
6561 92 -9 -263 41 -79 -216 225 35 -301 13 354 -288 -123 -68 -173 282 331 1 -204 -19 -197 146
6582 146 167 -145 -133 383 -23 -134 -127 -243 -76 248 19 -400 103 -26 36 268 4 -143 -83 258 -199 -118
6604 -118 -46 111 72 269 -159 97 47 -179 -20 -3 -304 -155 193 -140 -153 49 -128 -331 70 15 43 140 117
6627 117 51 421 141 -22 -175 685 -265 -18 86 -201 -70 -146 -35 -61 -109 -285 63 136 -127 -434 125 5
6649 5 -23 86 -97 104 17 159 -6 125 83 432 30 -239 -198 -187 192 -109 -64 161 -133 -101 177 -408 -17
6672 -17 43 177 -136 278 41 175 96 -17 26 36 55 28 -99 -24 -339 1 153 -75 -10 -187 -9 -300 234
6695 234 -229 -90 -124 -238 101 133 -66 -145 234 12 19 177 -70 -60 5 -83 74 -84 87 -155 113 184 -238
6718 -238 -14 -38 -413 35 -53 -102 184 157 112 -156 411 0 227 147 -123 -89 -99 164 -171 -176 73 -108 33
6741 33 73 10 -81 175 -62 199 -82 -157 -26 49 -155 160 85 -75 -15 -92 -80 4 183 132 -27 118 101 41 164
6766 164 -19 -256 -97 -110 -105 22 57 -305 -1 -99 211 57 -14 -88 137 219 140 -99 -5 -172 -2 60 -249 -232
6790 -232 -152 -124 -136 -33 -168 -179 -67 -10 -354 257 211 111 29 243 31 33 44 -104 -13 45 -226 40 204 102
6814 102 -226 -299 -285 -328 -115 -145 -11 214 -154 -60 386 97 11 132 186 141 253 88 22 203 -16 -491 -52
6837 -52 -70 37 29 125 -201 254 278 -330 39 80 -366 -75 267 235 25 142 109 -122 266 -93 -24 -13 37 -188
6861 -188 -13 -128 -105 75 -310 -183 136 -146 -74 53 84 -87 159 27 14 140 274 -120 9 191 200 -323
6883 -323 -27 -43 -51 134 -72 -140 50 173 12 8 -118 51 -118 72 -131 -113 622 98 2 228 -41 150 259
6906 259 18 -331 221 -109 -96 -19 -110 -213 -55 -18 71 23 -17 -138 120 -205 -161 55 250 -160 286 132 -87
6929 -87 333 277 73 293 205 -182 -92 82 -28 -78 15 -184 -107 17 -207 -240 79 78 -101 63 139 -74 67 186
6953 186 63 195 152 -166 376 -100 -158 -29 -101 108 -126 53 -257 -50 375 -71 65 -132 -187 182 -36
6974 -36 -98 78 148 199 101 -129 -12 -107 65 -22 -205 -112 -26 -192 -24 384 -357 -134 193 146 57 -94 -189 218
6998 218 108 225 -16 -25 -4 113 67 99 -162 176 301 -43 8 -8 -516 -101 281 -131 -209 147 -180 219 -34
7021 -34 -18 57 -119 242 50 -116 -16 -6 155 116 288 13 -258 -437 -142 87 -205 14 30 178 37 88
7043 88 -92 84 157 -257 -77 -69 -152 221 -253 -185 71 157 110 19 355 -150 60 60 -189 -7 246 11 -98 -132
7067 -132 -224 11 152 -37 -42 3 215 -33 -98 -65 -266 53 114 48 16 -103 -486 48 367 -28 -186 51 -101
7090 -101 -158 181 -107 -191 125 -19 -8 57 -292 -178 147 -43 -220 37 -42 109 80 37 -127 -188 50 35 -56
7113 -56 86 -183 -49 390 -132 -147 155 -408 -228 250 86 79 21 -24 34 80 -109 -170 117 -52 -162 -242 27
7136 27 -258 188 -150 -104 275 -88 172 157 3 181 -183 -73 98 -39 323 172 -254 141 -103 -18 7 -199
7158 -199 88 139 182 -297 -153 136 -26 134 -168 -271 101 61 -28 -83 113 225 73 88 15 -128 -218 221 37
7181 37 -12 49 -114 183 -62 -88 115 197 -141 -260 89 -143 -52 49 -94 -169 73 222 215 129 14 -61 193 62
7205 62 -166 139 -186 -306 211 -233 0 -11 168 -203 260 -268 47 238 139 27 85 206 20 3 155 -110
7227 -110 -82 21 -166 -95 118 70 -31 108 -102 47 -27 -237 -45 -180 147 -76 36 -35 88 154 155 -98 299
7250 299 124 -63 106 57 -273 71 -84 -246 -48 -60 141 -268 -44 -52 -118 -55 -217 37 215 -202 -169 238
7272 238 337 340 132 136 -468 49 -32 206 13 37 50 205 -34 -200 -41 -73 -108 126 -133 -72 145 321 94 53
7296 53 285 -140 -279 129 -127 -93 143 164 -59 187 -163 -113 -12 156 -271 -61 -17 104 216 -3 -284 -61
7318 -61 203 -30 56 6 9 15 73 -70 -10 20 -163 -158 -37 176 50 -207 -77 -227 171 2 -85 -165 94 -23 -204
7343 -204 63 -338 193 245 -39 92 184 187 -1 207 -23 136 10 -172 -85 193 -195 -140 -52 -411 -123 91
7365 91 -123 -108 10 24 -8 227 129 52 262 -89 1 -107 124 -59 -157 -25 -174 222 -42 -18 -12 52 57 -294 40
7390 40 106 275 -200 48 100 43 143 185 16 -106 -73 163 259 -96 -231 33 94 -52 -17 -61 -68 306 -271 20
7414 20 112 -80 -106 -30 84 -149 -111 -44 -139 281 -7 44 -227 172 96 -26 254 -216 15 91 -226 -62 326
7437 326 -19 -269 28 23 -140 164 -109 237 134 -28 -168 137 26 -147 -133 -165 -121 182 10 -254 -17 -67
7459 -67 203 102 -187 -211 312 34 68 -140 196 -49 -154 142 -194 -84 -1 100 23 -178 -118 114 -30 -99
7481 -99 -240 66 253 -82 202 -150 11 41 -120 -100 167 384 -26 99 138 234 131 -5 13 13 111 -37 20
7504 20 124 -59 -128 61 124 114 -24 -112 -267 62 -79 57 -120 137 -116 90 266 -276 242 -13 19 56
7526 56 249 -15 -209 65 -102 -56 146 51 -60 11 34 -93 224 -123 10 27 104 -261 -34 187 49 206
7548 206 41 -101 114 116 -135 -215 34 -71 34 -119 -213 -37 -85 18 -17 -305 24 -74 250 121 12 220
7570 220 79 146 55 155 47 -81 -44 -50 -272 -55 -22 -76 -169 65 -291 -23 -3 302 187 13 -20 246 69
7593 69 -99 18 -101 -11 250 5 88 -88 -175 -72 225 151 -66 -81 45 -205 -7 43 -225 -460 -57 34 -39
7616 -39 -326 32 -36 121 309 -118 267 81 76 -104 -37 -58 -185 -146 -89 -218 -49 -61 -327 -173 -17 26 54 -240
7640 -240 200 391 15 131 153 91 -13 141 -35 -2 -59 -236 3 16 -60 -62 -252 -264 -151 -57 267 -178 -121 87
7664 87 -169 -125 119 -3 -197 245 -124 -77 332 -75 161 64 18 -205 102 149 -180 71 48 0 56 74 -249
7687 -249 156 -58 -247 -39 181 -168 -19 97 -30 234 -236 -119 59 314 -30 12 -81 -319 -153 205 76
7708 76 -167 -278 123 82 6 -271 -80 109 -61 -44 -232 230 -196 22 48 -31 160 197 -154 113 11 -57 -8
7731 -8 187 -86 24 247 -156 239 216 195 -108 56 47 142 242 -53 -395 -51 -151 85 -19 40 -17 -110 -5
7754 -5 43 -25 -152 -54 -209 -3 5 -101 -294 -284 -28 141 -44 -42 206 129 279 27 -320 -4 135 109 -173 -158
7778 -158 202 -154 253 72 -18 257 64 91 -178 146 -73 13 71 -57 -30 141 298 188 133 71 -48 113
7800 113 -149 175 -290 -52 -170 -38 -284 112 -78 23 -43 -4 101 -10 42 51 9 -67 474 -147 64 20 12
7823 12 -151 19 51 13 -97 37 -381 73 -279 -82 159 238 -235 107 -66 -137 99 -241 -120 20 203 -64
7845 -64 310 -120 -242 38 180 -92 -205 -41 -60 -8 -119 -228 -184 31 -156 376 273 10 -270 155 166 -8
7867 -8 19 -115 167 173 337 123 21 209 1 -138 32 6 -97 -77 -16 281 72 37 -88 -3 -49 55 -129 -159
7891 -159 -81 216 -47 -44 19 45 -168 -130 -84 -82 92 -4 156 -137 -58 -14 47 -57 14 9 13 -173 155 -227 205 148
7917 148 216 -138 -107 -41 41 -67 306 18 23 89 0 199 72 -48 -278 86 45 125 -219 88 -136 -15 74 87
7941 87 232 63 12 -103 -136 -118 132 -70 -48 -105 133 63 -108 117 98 -237 -94 -114 46 104 -101 130 -53
7964 -53 135 23 352 -52 142 -99 91 -111 377 -22 102 64 -281 113 -152 86 279 -195 84 -145 232
7985 232 376 -181 -77 -90 -239 -223 145 101 -60 -36 29 -1 -180 365 -88 -204 -90 -172 -33 -56 -151 -88 113
8008 113 -40 -132 22 119 -151 144 78 41 38 -43 -199 207 145 -89 206 15 -34 -5 203 -150 -24 207 -213
8031 -213 -138 32 11 8 23 240 12 175 -35 -311 -78 14 -138 244 -84 -185 281 35 -155 207 -5 -249
8053 -249 -2 150 55 241 -151 67 62 8 -152 -99 143 -64 139 -12 -71 -157 138 -1 102 -97 15 117
8075 117 -98 118 -168 -6 106 -237 -180 36 -186 69 255 89 77 207 184 349 53 -24 168 118 162 -146
8097 -146 42 -52 -117 157 -75 -79 374 125 -68 130 226 75 72 -27 81 87 -32 -112 -40 84 46 19 132 -220 232
8122 232 -146 47 246 268 32 63 -67 19 -36 98 -13 -128 -21 146 -7 132 82 160 83 94 36 -157 233
8145 233 -162 -199 -262 -235 -146 -143 -13 -95 168 -212 -367 13 -103 -99 118 78 -272 135 130 17 -15 -99 -165 -134 155
8170 155 165 -16 -109 8 16 -82 -93 -136 -228 12 -2 180 -274 -67 56 177 -91 -85 89 -284 -84
8191h4
##END NTUPLES=NMR FID
##END=
