##TITLE=1H_EC-3099(XII-2)
 CDCl3, 8 sc, 
 28.10.2020
##JCAMPDX= 6.0         $$ Bruker NMR JCAMP-DX V2.0
##DATA TYPE= NMR FID
##DATA CLASS= NTUPLES
##ORIGIN= UXNMR, Bruker Analytische Messtechnik GmbH
##OWNER= root
$$ XWIN-NMR		Version 3.5
$$ Wed Oct 28 12:37:14 2020 Russian Standard Time (UT+4h)  she@DPX200
##.OBSERVE FREQUENCY= 200.1315066352
##.OBSERVE NUCLEUS= ^1H
##.DELAY= (6, 6)
##.ACQUISITION MODE= SIMULTANEOUS
##.ACQUISITION SCHEME= undefined
##.AVERAGES= 8
##.DIGITISER RES= 18
##SPECTROMETER/DATA SYSTEM= spect
##.PULSE SEQUENCE= zg30
##.SOLVENT NAME= CDCl3
##.SHIFT REFERENCE= (INTERNAL, CDCl3, 0, 15.7039)
##AUDIT TRAIL= $$ (NUMBER, WHEN, WHO, WHERE, WHAT)
$$ ##TITLE= Audit trail, XWIN-NMR		Version 3.5
$$ ##JCAMPDX= 5.01
$$ ##ORIGIN= Bruker BioSpin GmbH
$$ ##OWNER= she
$$ F:/spectra/data/she/nmr/H-F/1/audita.txt
$$ ##AUDIT TRAIL=  $$ (NUMBER, WHEN, WHO, WHERE, WHAT)
(   1,<2020-10-28 12:36:01.18 +0400>,<she>,<DPX200>,
      <created by zg, POWCHK disabled, PULCHK disabled
       configuration hash MD5:
       00 E9 B6 7A A2 85 ED C7 34 08 36 98 17 FE 4E 26
       data hash MD5: 16K
       1D 82 58 8E DD FB E2 61 64 6F 85 60 2B 21 51 B2>)
$$ ##END=
$$ 
$$ hash MD5
$$ 6D F7 42 6F EE EB E9 C1 F0 3D 25 DD CB EA 11 6F
##$RELAX= 
##$RELAX= 
##$RELAX= 
##$RELAX= 
##$RELAX= 
##$RELAX= 
$$ Bruker specific parameters
$$ --------------------------
##$DU= <F:/spectra>
##$EXPNO= 1
##$NAME= <H-F>
##$PROCNO= 1
##$TYPE= <nmr>
##$USER= <she>
##$AMP= (0..31)
100 100 100 100 100 100 100 100 100 100 100 100 100 100 100 100 100 100 
100 100 100 100 100 100 100 100 100 100 100 100 100 100 
##$AQSEQ= 0
##$AQ_mod= 1
##$AUNM= <au_zg>
##$AUTOPOS= <>
##$BF1= 200.13
##$BF2= 200.13
##$BF3= 200.13
##$BF4= 200.13
##$BF5= 200.13
##$BF6= 200.13
##$BF7= 200.13
##$BF8= 200.13
##$BYTORDA= 1
##$CFDGTYP= 0
##$CFRGTYP= 5
##$CHEMSTR= <none>
##$CNST= (0..31)
1 1 145 1 1 1 1 1 1 1 1 1 1 1 1 1 1 1 1 1 1 1 1 1 1 1 1 1 1 1 1 1 
##$CPDPRG= <>
##$CPDPRG1= <>
##$CPDPRG2= <>
##$CPDPRG3= <>
##$CPDPRG4= <mlev>
##$CPDPRG5= <mlev>
##$CPDPRG6= <mlev>
##$CPDPRG7= <mlev>
##$CPDPRG8= <mlev>
##$CPDPRGB= <>
##$CPDPRGT= <>
##$D= (0..31)
0 1.2 0 0 0 0 0 0 0 0.06 0 0.03 0 0 0 0 0.0002 0 0 0 0 0 0 0 0 0 0 0 0 
0 0 0 
##$DATE= 1603874160
##$DBL= (0..7)
120 120 120 120 120 120 120 120 
##$DBP= (0..7)
150 150 150 150 150 150 150 150 
##$DBP07= 0
##$DBPNAM0= <>
##$DBPNAM1= <>
##$DBPNAM2= <>
##$DBPNAM3= <>
##$DBPNAM4= <>
##$DBPNAM5= <>
##$DBPNAM6= <>
##$DBPNAM7= <>
##$DBPOAL= (0..7)
0.5 0.5 0.5 0.5 0.5 0.5 0.5 0.5 
##$DBPOFFS= (0..7)
0 0 0 0 0 0 0 0 
##$DE= 6
##$DECBNUC= <off>
##$DECIM= 32
##$DECNUC= <off>
##$DECSTAT= 4
##$DIGMOD= 1
##$DIGTYP= 9
##$DL= (0..7)
0 120 120 120 120 120 120 120 
##$DP= (0..7)
150 150 150 150 150 150 150 150 
##$DP07= 0
##$DPNAME0= <>
##$DPNAME1= <>
##$DPNAME2= <>
##$DPNAME3= <>
##$DPNAME4= <>
##$DPNAME5= <>
##$DPNAME6= <>
##$DPNAME7= <>
##$DPOAL= (0..7)
0.5 0.5 0.5 0.5 0.5 0.5 0.5 0.5 
##$DPOFFS= (0..7)
0 0 0 0 0 0 0 0 
##$DQDMODE= 0
##$DR= 18
##$DS= 0
$$ [...]
##$SUBNAM2= <"">
##$SUBNAM3= <"">
##$SUBNAM4= <"">
##$SUBNAM5= <"">
##$SUBNAM6= <"">
##$SUBNAM7= <"">
##$SUBNAM8= <"">
##$SUBNAM9= <"">
##$SW= 16.880792210976
##$SWIBOX= (0..15)
0 0 2 0 0 0 0 0 0 0 0 0 0 0 0 0 
##$SW_h= 3378.37837837838
##$TD= 16384
##$TD0= 1
##$TE= 0
##$TE2= 300
##$TE3= 300
##$TEG= 300
##$TL= (0..7)
0 120 120 120 120 120 120 120 
##$TP= (0..7)
150 150 150 150 150 150 150 150 
##$TP07= 0
##$TPNAME0= <>
##$TPNAME1= <>
##$TPNAME2= <>
##$TPNAME3= <>
##$TPNAME4= <>
##$TPNAME5= <>
##$TPNAME6= <>
##$TPNAME7= <>
##$TPOAL= (0..7)
0.5 0.5 0.5 0.5 0.5 0.5 0.5 0.5 
##$TPOFFS= (0..7)
0 0 0 0 0 0 0 0 
##$TUNHIN= 0
##$TUNHOUT= 0
##$TUNXOUT= 0
##$USERA1= <user>
##$USERA2= <user>
##$USERA3= <user>
##$USERA4= <user>
##$USERA5= <user>
##$V9= 5
##$VALIST= <valist>
##$VCLIST= <CCCCCCCCCCCCCCC>
##$VD= 0
##$VDLIST= <DDDDDDDDDDDDDDD>
##$VPLIST= <PPPPPPPPPPPPPPP>
##$VTLIST= <TTTTTTTTTTTTTTT>
##$WBST= 1024
##$WBSW= 4
##$XGAIN= (0..3)
0 0 0 0 
##$XL= 0
##$YL= 0
##$YMAX_a= 371335
##$YMIN_a= -355764
##$ZGOPTNS= <>
##$ZL1= 120
##$ZL2= 120
##$ZL3= 120
##$ZL4= 120
##$ABSF1= 10
##$ABSF2= 0
##$ABSG= 5
##$ABSL= 3
##$ALPHA= 0
##$AQORDER= 0
##$ASSFAC= 0
##$ASSFACI= 0
##$ASSFACX= 0
##$ASSWID= 0
##$AUNMP= <proc_1d>
##$AZFE= 0.1
##$AZFW= 0.1
##$BCFW= 1
##$BC_mod= 2
##$BYTORDP= 1
##$COROFFS= 0
##$CY= 11.3945322036743
##$DATMOD= 1
##$DC= 2
##$DFILT= <>
##$DTYPP= 0
##$F1P= 15.9154993809931
##$F2P= -4.1035820241983
##$FCOR= 0.5
##$FTSIZE= 0
##$FT_mod= 4
##$GAMMA= 1
##$GB= 0.15
##$INTBC= 1
##$INTSCL= 1
##$ISEN= 128
##$LB= 0.24
##$LEV0= 0
##$LPBIN= 0
##$MAXI= 10000
##$MC2= 0
##$MEAN= 0
##$ME_mod= 0
##$MI= 1.114404
##$NCOEF= 0
##$NC_proc= 0
##$NLEV= 6
##$NOISF1= 3.799351
##$NOISF2= 2.8
##$NSP= 1
##$NTH_PI= 0
##$NZP= 0
##$OFFSET= 15.70392
##$PC= 1
##$PHC0= -10689.5
##$PHC1= 12.80088
##$PH_mod= 1
##$PKNL= yes
##$PPARMOD= 0
##$PSCAL= 0
##$PSIGN= 0
##$REVERSE= no
##$SF= 200.130013532006
##$SI= 16384
##$SIGF1= 3
##$SIGF2= 2
##$SINO= 400
##$SIOLD= 16384
##$SREGLST= <1H.CDCl3>
##$SSB= 0
##$STSI= 0
##$STSR= 0
##$SW_p= 3612.71676300578
##$SYMM= 0
##$S_DEV= 0
##$TDeff= 0
##$TDoff= 0
##$TI= <>
##$TILT= no
##$TM1= 0
##$TM2= 0
##$TOPLEV= 0
##$USERP1= <user>
##$USERP2= <user>
##$USERP3= <user>
##$USERP4= <user>
##$USERP5= <user>
##$WDW= 1
##$XDIM= 8192
##$YMAX_p= 0
##$YMIN_p= 0
$$ End of Bruker specific parameters
$$ ---------------------------------
##NTUPLES= NMR FID
##VAR_NAME=  TIME,          FID/REAL,        FID/IMAG
##SYMBOL=    X,             R,               I
##VAR_TYPE=  INDEPENDENT,   DEPENDENT,       DEPENDENT
##VAR_FORM=  AFFN,          ASDF,            ASDF
##VAR_DIM=   8192,          8192,            8192
##UNITS=     SECONDS,       ARBITRARY UNITS, ARBITRARY UNITS
##FACTOR=    0.000296,      1,               1
##FIRST=     0,             0,               0
##LAST=      2.424536,      0,               0
##MIN=       0,             -355764,         0
##MAX=       2.424536,      371335,          0
$$ Real data points
##PAGE= N=1
##DATA TABLE= (X++(R..R)), XYDATA
$$ plain form
0 0 0 0 0 0 0 0 0 0 0 0 0 -5 8 -8 8 -13 16 -24 24 -32 37 -45 55 -64 72 -87 103 -119 139 -158 181 -210 238
33 238 -272 307 -347 392 -441 492 -550 614 -684 762 -846 935 -1036 1145 -1263 1394 -1534
50 -1534 1689 -1861 2053 -2261 2493 -2754 3048 -3381 3761 -4203 4723 -5343 6101 -7049 8280
65 8280 -9945 12336 -16097 23092 -68675 371335 128035 -355764 31061 193394 -157991
76 -157991 -38970 326199 -20638 -209151 157199 247085 -120056 72924 186217 -71743
86 -71743 -53913 215002 162625 -106070 -8668 54868 49630 102338 64162 -111053 -58233 181228
98 181228 12810 -80321 28071 27849 -95539 31706 106257 -91323 -89513 34956 24895
109 24895 -97536 75881 49058 -196171 -57759 161476 53032 -186682 -32840 92349
$$ packed form
0@%%%%%%%%%%%nJ3j6J6k1K9m0M8n6O9q2J00j19J36j59J90k22K58k97L39l91M48
33B38n10N79o54P39q33R33j042J164j298J446j608J781j971K181k408K657k928
50a534L223l550L914m314M754n247N802o429P142p964Q926j0066J1444j3150J5329
65H280j8225K2281k8433L9189r1767M40010k43300m83799L86825J62333l51385
76a57991J19021L65169l46837j88513L66350Q9886l67141J92980J13293k57960
86g1743J7830K68915n2377k68695R7402O3536n238N2708l8176j75215N2820K39461
98A81228j68418r3131J08392k22j23388J27245P4551j97580J810J24469j0061
109B4895j22431J73417k6823k45229J38412K19235j08444k39714J53842J25189
$$ plain form
119 92349 -19712 -67738 56659 -5939 -138450 47540 85365 -55217 -110623 54128 24903
130 24903 -111440 19537 95490 -45270 -152485 67883 110947 -41911 -67862 39029 63551
141 63551 -24508 46112 45088 -16167 -11061 107996 47648 -52894 52029 63795 -695 -33502
153 -33502 87301 47159 -51695 -2136 35336 14121 -7979 12685 -56818 13286 45887 -37608
165 -37608 -65656 17289 37036 -85966 319 30310 -59505 -45130 63235 -35291 -109572 92733
177 92733 43870 -132578 -34149 159103 -43210 -139538 114812 83715 -116809 -10494 155568
188 155568 -71985 -68173 141900 22891 -126950 56368 151925 -122294 -72250 140395 32105
199 32105 -121512 32377 76849 -87219 865 62935 -32174 -63971 68466 10577 -86199
$$ packed form
119I2349j12061m8026J24397o2598j32511J85990L7825j40582n5406J64751k9225
130B4903j36343J30977P5953j40760j07215K20368M3064j52858k5951J06891K4522
141F3551q8059P0620j024o1255N106J19057o0348j00542J04923J1766o4490l2807
153c3502J20803m0142r8854M9559L7472k1215k2100K0664o9503P0104L2601q3495
165c7608k8048Q2945J9747j23002Q6285K9991q9815J4375J08365r8526p4281K02305
177I2733m8863j76448R8429J93252k02313r6328K54350l1097k00524J06315J66062
188A55568k27553L812K10073j19009j49841J83318R5557k74219N0044K12645j08290
199C2105j53617J53889M4472j64068Q8084O2070r5109l1797J32437n7889r6776
$$ plain form
210 -86199 40262 43615 -59220 -38603 76183 -17112 -40778 29539 -23039 -36096 47437 46916
222 46916 -110355 -17448 91702 -18794 -86953 40843 51461 -98218 2474 67377 -33984
233 -33984 -76560 52784 25045 -91896 26082 65966 -67894 -94253 98346 46659 -102820
244 -102820 -23635 65067 -3807 -64106 51856 11322 -53404 9734 59370 -21312 -42028 56654
256 56654 6782 -29392 8652 63702 -10422 -45763 27183 40430 17659 -27276 5452 9842
268 9842 28636 5513 -11387 5133 -122 24258 -5376 4470 -8975 2448 283 -3490 5525
281 5525 -7227 9712 -30909 -13183 11332 30100 -36351 -60867 39590 31280 -45961 -48177
293 -48177 49731 -14681 -51416 31670 20422 -64292 -24790 80637 -43943 -62295 66032
$$ packed form
210h6199J26461L353j02835K0617J14786r3295k3666P0317n2578j3057Q3533n21
222D6916j57271R2907J09150j10496o8159J27796J0618j49679J00692O4903j01361
233c3984m2576J29344k7739j16941J17978L9884j33860k6359J92599n1687j49479
244a02820P9185Q8702o8874o0299J15962m0534o4726O3138M9636q0682k0716R8682
256E6654m9872l6174L8044N5050p4124l5341P2946J3247k2771m4935L2728M390
268I842J8794k3123j6900J6520n255K4380k9634R846j3445J1423k165l773R015
281E525j2752J6939m0621J7726K4515J8768o6451k4516J00457q310p7241k216
293d8177R7908o4412l6735Q3086j1248q4714L9502J05427j24580j8352J28327
$$ plain form
304 66032 34939 -102943 -6403 118862 -43350 -79557 53380 62130 -67974 4409 68963
315 68963 -47902 -20177 74022 19785 -75620 42433 61249 -41056 -11094 60779 17259
326 17259 -44138 41103 25278 -5577 22974 20242 -21988 17920 70816 -31163 -28438 43907
338 43907 36277 -40207 6585 42439 -45091 -10551 42068 -11070 -70121 37217 27372 -84243
350 -84243 -20107 62281 -24812 -108277 38609 44115 -73940 -41119 44512 -23539 -68154 50774
362 50774 8384 -72948 -9159 71446 -32912 -61584 63839 26860 -49016 -1411 72237 -10482
374 -10482 -19099 40106 17268 3122 27192 32275 -29516 25541 47264 -4707 -11770 23572 17301
387 17301 -16779 21928 -5426 -12938 8266 13585 -26724 -16182 36862 -21380 -36337 7572
$$ packed form
304F6032l1093j37882R6540J25265j62212l6207J32937Q750j30104P2383O4554
315F8963j16865K7725R4199n4237r5405J18053J8816j02305K9962P1873m3520
326A7259o1397Q5241j5825l0855K8551k732m2230L9908N2896j01979K725P2345
338D3907p630p6484M6792L5854q7530L4540N2619n3138n9051J07338r845j11615
350h4243O4136Q2388q7093q3465J46886N506j18055L2821Q5631o8051m4615J18928
362E0774m2390q1332O3789Q0605j04358k8672J25423l6979p5876M7605P3648q2719
374a0482q617N9205k2838j4146K4070N083o1791N5057K1723n1971p063L5342o271
387A7301l4080L8707k7354p512K1204N319m0309J0542N3044n8242j4957M3909
$$ plain form
399 7572 33018 -32751 -29389 18961 -2330 -15819 -7593 14432 -34035 -7688 24243 -10332 -38942
412 -38942 328 36496 -35841 -27683 21085 20488 -47554 -16597 43948 -12192 -29340 5918 21483
425 21483 -34207 5617 32074 -25990 -28453 32711 30320 -52863 3400 39700 -6434 -26253
437 -26253 25331 25202 -25571 14031 18289 330 -508 32417 -5978 -19871 38279 13340 -20748
450 -20748 -8933 31440 -13775 -13946 12538 -16501 -22408 9540 10640 -55479 -309 28695 -33726
463 -33726 -41342 31179 17075 -62460 6832 36046 -22754 -29165 46736 405 -52322 47005
475 47005 41660 -47207 -22476 81181 -73 -55240 44595 46138 -39927 -12161 71510 -16622
487 -16622 -29967 44657 16134 -41982 16491 51755 -48004 -22201 42514 5344 -45964 10301
$$ packed form
399G572K5446o5769L362M8350k1291j3489Q226K2025m8467K6347L1931l4575k8610
412c8942L9270L6168p2337Q158M8768n97o8042L0957O0545n6140j7148L5258J5565
425B1483n5690L9824K6457n8064k463O1164k391q3183N6263L6300m6134j9819
437b6253N1584j29n0773L9602M258j7959q38L2925l8395j3893N8150k4939l4088
450b0748J1815M0373m5215j71K6484k9039n907L1948J100o6119N5170K9004o2421
463c3726p616P2521j4104p9535O9292K9214n8800o411P5901m6331n2727R9327
475D7005n345q8867K4731J03657q1254n5167R9835J543q6065K7766Q3671q8132
487a6622j3345P4624k8523n8116N8473L5264r9759K5803O4715l7170n1308N6265
$$ plain form
499 10301 14932 -38782 10154 11683 -29465 -19486 35648 -16923 -36296 32801 9656 -35292 -2505
512 -2505 45277 -23788 -16537 31337 -5106 -22153 25317 26707 -51246 -1619 43278 -4600 -41413
525 -41413 14563 26817 -35463 -1118 21936 -2633 -29809 14984 17192 -17836 3079 13884
537 13884 -1957 -23667 27715 22301 -16935 -18023 18999 28427 -16350 -628 9313 8373 -9254
550 -9254 15506 14781 -16126 2118 11021 9243 -11145 14753 486 -18553 3118 18862 1619
563 1619 -28369 1564 -174 6304 -2783 -12093 -13032 -943 16816 -15821 -6080 2683 -48 -14976
577 -14976 14293 17323 -24822 -2881 15200 5301 -16168 24830 167 -39862 15593 41782
589 41782 -20733 -49621 36411 12264 -37640 5231 27340 -36588 -31871 50669 -4260 -44449
$$ packed form
499A0301M631n3714M8936J529m1148R979N5134n2571j9373O9097k3145m4948L2787
512b505M7782o9065P251M7874l6443j7047M7470J390p7953M9627M4897m7878l6813
525d1413N5976J2254o2280L4345K3054k4569k7176M4793K208l5028K0915J0805
537A3884j5841k1710N1382n414l9236j088L7022R428m4777J5722R941r40j7627
550i254K4760p25l0907J8244Q903j778k0388K5898j4267j9039K1671J5744j7243
563A619k9988K9933j738O478r087r310r39J2089J7759l2637R741Q763k731j4928
577a4976K9269L030m2145K1941J8081r899k1469M0998k4663m0029N5455K6189
589D1782o2515k8888Q6032k4147m9904M2871K2109o3928M717Q2540n4929m0189
$$ plain form
601 -44449 9935 27194 -43286 -8497 54047 -25214 -44948 22407 35398 -33622 -1960 23859
613 23859 -24961 -1945 38489 1005 -39761 29795 20286 -20076 12955 28514 -17050 -17153 45819
626 45819 893 -17272 18522 11559 -27448 14475 44146 -35844 -24297 31672 17349 -34857
638 -34857 6433 19093 -31712 -4557 26508 -3005 -40367 17020 12180 -26957 -1978 17858
650 17858 -11641 -34294 20142 12334 -17735 -16163 7528 -406 -9472 11793 -9065 -9395 -4229
663 -4229 14928 -2144 -10089 4068 697 3511 -6262 11566 437 -1923 -4023 7182 12959 -5824
677 -5824 847 -2429 11112 1968 5419 -2863 -2402 10225 588 3906 -5666 9074 -2515 862
691 862 3861 -2448 2335 -102 3318 -12490 11661 5374 -11315 -7367 13833 5248 -23409 12051
$$ packed form
601d4449N4384J7259p0480L4789O2544p9261j9734O7355J2991o9020L1662K5819
613B3859m8820K3016M0434l7484m0766O9556r509m0362L3031J5559m5564j03O2972
626D5819m4926j8165L5794o963l9007M1923K9671p9990J1547N5969j4323n2206
638c4857M1290J2660n0805K7155L1065k9513l7362N7387m840l9137K4979J9836
650A7858k9499k2653N4436p808l0069J572K3691p934r066K1265k0858l30N166
663d229J9157j7072p945J4157l371K814r773J7828j1129k360k100J1205N777j8783
677e824O671l276J3541r144L451q282M61J2627r637L318r572J4740j1589L377
691H62K999o309M783k437L420j5808K4151o287j6689L948K1200q585k8657L5460
$$ plain form
705 12051 8553 -12562 -8434 20367 -6844 -20827 23654 2882 -25387 -173 35568 -20824
717 -20824 -24432 29682 7099 -25011 5055 29767 -28441 -5005 31531 -3935 -23541 18852
729 18852 20387 -33184 8811 28071 -13025 -23154 23470 8686 -23599 14185 3004 -18458
741 -18458 -1029 27741 -19150 -21394 22607 -3108 -19007 6975 15968 -33305 -3449 22273
753 22273 -12866 -16360 12422 1006 -33005 19422 19756 -24785 -18737 24687 8590 -21638 15925
766 15925 6047 -12231 893 29610 -1637 -16794 17616 9129 -2777 2929 21806 -11248 -9577
779 -9577 15771 12008 -3308 -11349 6589 -4525 7152 3130 -5667 -10386 -1834 9595 -4360
792 -4360 -523 -11606 -507 -1594 1992 -806 -7491 -2462 -10974 6757 2532 -389 -15907 -4488
$$ packed form
705A2051l498k1115M128K8801k7211j3983M4481k0772k8269K5214L5741n6392
717b0824l608N4114k2583l2110L0066K4712n8208K3436L6536l5466j9606M2393
729A8852J535n3571M1995J9260m1096j0129M6624j4784l2285L7784j1181k1462
741a8458J7429K8770m6891k244M4001k5715j5899K5982Q993m9273K9856K5722
753B2273l5139l494K8782j1416l4011N2427L34m4541O048M3424j6097l0228L7563
766A5925r878j8278J3124K8717l1247j5157L4410q487j1906N706J8877l3054J671
779i577K5348l763j5316q041J7938j1114J1677m022q797m719Q552J1429j3955
792d360L837j1083J1099j087L586k798o685N029q512J7731m225k921j5518J1419
$$ plain form
806 -4488 8914 2232 960 -11407 1320 -1252 9780 2253 -3037 -3890 -3186 11833 2065 1409 -9238
821 -9238 4545 -654 -1128 11495 -1627 -13348 -9369 24732 668 -14065 -446 6418 -5687
834 -5687 1256 21209 -16818 -12021 14761 14687 -15509 323 14722 -17525 -2640 17607 4948
847 4948 -26788 3388 11204 -9801 2849 4621 -11225 -15478 23302 3354 -16106 146 7182
860 7182 -4640 -1205 19462 -13823 -8515 11788 8678 -8993 5411 10014 -19821 6456 20030
873 20030 1321 -20626 9655 13063 -9138 8371 7042 -7919 -12068 22489 4466 -15555 94
886 94 6036 -5234 -9399 15490 -9130 -17175 -2007 8496 -6633 -12176 2906 -12858 -3659 3967
900 3967 3615 -16969 -5378 10024 -3801 -222 -975 2351 -9210 8827 6348 -4138 729 1800
$$ packed form
806d488J3402o682j272j2367J2727k572J1032p527n290q53P04J5019r768o56j0647
821i238J3783n199m74J2623j3122j1721L979L4101k4064j4733J3619O864j2105
834e687O943J9953l8027M797K6782p4l0196J5832J4399l2247J4885K0247j2659
847D948l1736L0176P816k1005J2650J772j5846m253L8780j9948j9460J6252P036
860G182j1822L435K0667l3285N308K0303l110j7671J4404M603k9835K6277J3574
873B0030j8709k1947L0281L408k2201J7509j329j4961m149L4557j8023k0021J5649
886I4N942j1270m165K4889k4620q045J5168J0503j5129n543J5082j5764R199P626
900C967l52k0584J1591J5402j3825L579p53L326j1561J8037k479j0486M867J071
$$ plain form
914 1800 3724 -2489 14574 -2235 -5403 5017 10860 3412 -2657 9676 -4287 6044 8336 6469
928 6469 -6174 1860 10873 -4120 4010 1196 2547 -8042 4095 3690 -3554 -1061 -5759 3030
942 3030 -3679 3541 -6130 -2748 -2030 -2084 4369 -6424 -2953 -4926 6099 -7780 -4380 3290 -4749
957 -4749 -6009 -3219 7366 -11645 -1954 2032 -3032 -5450 3509 4951 -13051 5635 4731 -702
971 -702 -5308 8582 3563 -7364 8414 2143 1027 -1179 9708 -4598 -993 10364 -1238 -2086
985 -2086 525 9321 -7322 3512 5340 -3368 -1823 4190 4736 -10071 7632 1286 -5515 -3068
999 -3068 8024 356 -12203 6480 347 -2658 -4672 7511 -5945 -7422 9651 644 -5290 -4737
1013 -4737 11686 -6087 -3162 8115 1976 -6731 -1284 13320 -6538 397 2662 667 -4175 4836
$$ packed form
914A800J924o213J7063j6809l168J0420N843p448o069J2333j3963J0331K292j867
928F469j2643Q034R013j4993Q130k814J351j0589J2137m05p244K493m698Q789
942C030o709P220r671L382P18n4O453j0793L471j973J1025j3879L400P670q039
957d749j260K790J0585j9011R691L986n064k418Q959J442j8002J8686r04n433
971g02m606J3890n019j0927J5778o271j116k206J0887j4306L605J1357j1602q48
985b086K611Q796j6643J0834J828q708J545O013N46j4807J7703o346o801K447
999c068J1092p668j2559J8683o133l005k014J2183j3456j477J7073r007n934N53
1013d737J6423j7773K925J1277o139q707N447J4604j9858O935K265j995m842R011
$$ plain form
1027 4836 6395 -12061 2081 2817 1943 -5294 4102 -2522 -6605 7273 -1260 -2288 -4592 5620
1041 5620 -7121 -812 6621 -5670 -6926 -1139 7909 -9548 1354 142 -5943 -1885 4982 2733
1055 2733 -12140 4840 1368 -10 -1490 4431 -885 -5000 7320 -765 3796 -2475 2523 -719
1069 -719 4617 4735 -4112 3468 -1133 4727 458 5390 -4480 -1152 7837 -618 138 -1468 6338 -6838
1085 -6838 2443 4897 -2246 -3436 -343 5344 -6751 4374 -1322 -4003 -2564 4457 807 -8836
1099 -8836 3616 -2456 143 -2432 3242 -4762 -3565 6214 -4265 -441 -1019 3658 -8152 1852
1113 1852 6078 -4289 -2652 1087 5306 -8363 5935 1977 -5498 -1580 6712 1485 -10876 8198
1127 8198 857 -4649 -2356 8644 -3397 -7974 8965 -1988 -3169 223 7361 -8841 -291 9390
$$ packed form
1027D836J559j8456J4142P36q74p237R396o624m083J3878q533j028k304J0212
1041E620j2741O309P433j2291j256N787R048j7457J0902j212o085M058O867k249
1055B733j4873J6980l472j378j480N921n316m115J2320q085M561o271M998l242
1069g19N336J18q847P580m601N860m269M932r870L328Q989q455P56j606P806j3176
1085f838R281K454p143j190L093N687j2095J1125n696k681J439P021l650r643
1099h836J2452o072K599k575N674q004J197R779j0479L824n78M677j1810J0004
1113A852M226j0367J637L739M219j3669J4298l958p475L918Q292n227j2361J9074
1127H198p341n506K293J1000j2041m577J6939j0953j181L392P138j6202Q550R681
$$ plain form
1141 9390 -4951 -3699 2668 6428 -9945 4835 3961 -5556 284 5508 429 -7899 10922 -570
1155 -570 -4451 2636 7572 -2906 -3404 11271 -3993 -58 3948 4852 -5926 3161 7328 -6783
1169 -6783 1908 3140 1773 -7488 5162 820 -4871 2535 -1388 -999 -3843 5755 -6448 -1942 1998
1184 1998 -3140 -2126 -1835 1670 -8417 3276 -2045 -4362 -1677 723 -3528 -6853 6984 -4764
1198 -4764 -3368 -1245 2488 -4011 2 6285 -6761 1486 3590 3200 -5448 6174 4573 -5426 4938
1213 4938 4927 2138 -5158 9641 810 -2639 6308 3788 -2368 -2749 12610 -3184 -2126 4758 3428
1228 3428 -4024 835 8487 -8221 74 3380 760 -8074 3302 2181 -11486 1834 2263 -3582
1242 -3582 -10127 6404 -1788 -8826 3580 1339 -6121 -5589 11342 -5903 -5791 5588 2658 -6927
$$ packed form
1141I390j4341J252O367L760j6373J4780q74r517N840N224n079q328J8821j1492
1155e70l881P087M936j0478m98J4675j5264L935M006R04j0778R087M167j4111
1169f783Q691J232j367r261J2650m342n691P406l923L89k844R598j2203M506L940
1184A998n138J014K91L505j0087J1693n321k317K685K400m251l325J3837j1748
1198d764J396K123L733o499M013O283j3046Q247K104l90q648J1622j601r999J0364
1213D938j1k789p296J4799q831l449Q947k520o156l81J5359j5794J058O884j330
1228C428p452M859P652j6708Q295L306k620q834J1376j121j3667J3320M29n845
1242c582o545J6531q192p038J2406k241p460N32J6931j7245J12J1379k930r585
$$ plain form
1256 -6927 -567 10593 -8612 -1263 5478 1791 -7428 4209 6214 -9861 3259 5209 -247 -6992
1270 -6992 7685 1656 -5972 4721 1737 -1528 -3482 8175 -4435 -1990 4014 -985 -3004 -1072
1284 -1072 5579 -6585 1202 785 -1167 -1798 1533 1869 -5432 4788 -1074 501 -1263 2978 -227
1299 -227 -2414 3169 -2316 3380 -1896 775 -1970 2495 766 -2774 3941 -2711 840 623 5347
1314 5347 -4185 633 5955 -2586 824 3127 4388 -7758 4426 5244 -3257 -1223 2224 802 -7136
1329 -7136 7713 -977 -6442 -2037 5294 -2542 -6922 5985 -5048 -4766 217 5290 -7973 -4577
1343 -4577 5482 -5747 -2403 2262 1708 -12536 2504 7307 -5709 -3977 3118 1758 -8707 9516
1357 9516 3666 -7453 -1446 9793 1919 -6370 10496 392 -4884 3579 12675 -3760 -5969 9593
$$ packed form
1256f927O360J1160j9205P349O741l687r219J1637K005j6075J3120J950n456o745
1270f992J4677o029p628J0693k984l265j954J1657j2610K445O004m999k019J932
1284a072O651j2164P787m17j952o31L331L36p301J0220n862J575j764M241l205
1299b27k187N583n485N696n276K671k745M465j729l540O715o652L551k17M724
1314E347r532M818N322q541L410K303J261j2146J2184Q18q501K034L447j422p938
1329g136J4849q690n465M405P331p836m380J2907j1033K82M983N073j3263L396
1343d577J0059j1229L344M665n54j4244J5040M803j3016J732P095j360j0465J8223
1357I516n850j1119O007J1239p874q289J6866j0104n276Q463R096j6435k209J5562
$$ plain form
1371 9593 -148 -840 3571 6100 -10371 813 11052 -2567 -4542 1874 4019 -8265 6905 4635
1385 4635 -7178 -3728 5575 2419 -7267 5733 -2688 -6114 724 7891 -4051 -8819 4771 -1351
1399 -1351 -1108 -628 2845 -7766 -2159 6639 -1323 -3265 -2931 3550 -4968 2378 2662 -2640 -4992 -719
1415 -719 6672 -3475 -638 -2594 1012 -1651 2510 3401 -6058 -1226 1717 5593 -4330 1340 1334 -2853
1431 -2853 1253 4080 2670 -8001 3368 2357 -388 -82 2759 -2050 -5605 8725 675 -4000
1445 -4000 -2295 5900 -2073 -2397 7416 -2764 -3911 1205 8079 -5938 -745 6111 -2565 -2776 4180
1460 4180 6549 -9581 1596 6030 -1478 -3590 4583 2760 -8613 5916 3809 -3324 -4608 6954
1474 6954 -552 -7842 6086 1692 -5209 -3957 8070 -4514 -5935 5201 -697 -6284 -1420 7951
$$ packed form
1371I593r741o92M411K529j6471J1184J0239j3619j975O416K145j2284J5170k270
1385D635j1813L450R303l156r686J3000q421l426O838P167j1942m768J3590o122
1399a351K43M80L473j0611N607Q798p962j942L34O481q518P346K84n302k352M273
1415g19P391j0147K837j956L606k663M161Q91r459M832K943L876r923N670om187
1431b853M106K827j410j0671J1369j011k745L06K841m809l555J4330q050m675
1445d000J705Q195p973l24R813j0180j147N116O874j4017N193O856q676k11O956
1460D180K369j6130J1177M434p508k112Q173j823j1373J4529k107p133j284J1562
1474F954p506p290J3928m394o901J252J2027j2584j421J1136n898n587M864R371
$$ plain form
1488 7951 -8531 -3398 5204 -1092 -7598 1502 6708 -9728 -302 4385 -996 -6361 5222 2879
1502 2879 -9511 3527 5419 -1342 -6319 7391 586 -5166 5148 4168 -3051 -4110 9521 -1147
1516 -1147 -2335 4101 2041 -3873 -329 9706 -4053 -2798 2380 3573 -3360 1551 4970 -6671
1530 -6671 -139 4047 3345 -6987 1690 3357 -4534 649 3887 288 -9148 5257 4111 -3249 -2369
1545 -2369 3049 -607 -5927 8298 967 -5526 -2839 7581 -339 -5125 5378 -1448 -4100 -252
1559 -252 8315 -5454 -5069 4325 -847 -2318 586 4237 -9569 -478 5755 -558 -5291 82 2946
1574 2946 -6643 4264 2380 -3971 -5355 5599 2130 -5839 3735 417 -2998 -2828 8716 -1133
1588 -1133 -7128 3416 2974 -1281 -2237 7119 -4806 -3131 6162 4143 -4869 -2426 8477 -3707
$$ packed form
1488G951j6482N133Q602o296o506R100N206j6436R426M687n381n365J1583k343
1502B879j2390J3038J892o761m977J3710o805n752J0314r80p219j059J3631j0668
1516a147j188O436k060n914L544J0035j3759J255N178J193o933M911L419j1641
1530f671O532M186p02j0332Q677J667p891N183L238l599r436J4405j146p360Q80
1545b369N418l656n320J4225p331o493K687J0420p920m786J0503o826k652L848
1559b52Q567j3769L85R394n172j471K904L651j3806R091O233o313m733N373K864
1574B946r589J0907j884o351j384J0954l469p969R574l318l415J70J1544r849
1588a133n995J0544m42m255r56R356j1925J675R293k019r012K443J0903j2184
$$ plain form
1602 -3707 -1105 4403 3342 -6966 688 8677 -3887 -1463 2925 2797 -6087 5520 5665 -5964
1616 -5964 -1240 5526 2964 -6616 5277 1379 -4819 579 5397 -2074 -7183 6275 -1779 -5192
1630 -5192 192 3933 -6993 -5197 7272 -3443 -6211 -210 4054 -8243 -532 6170 -5350 -4766
1644 -4766 3564 4550 -9477 2519 5625 -4341 -3856 6367 3491 -8804 4896 4518 -2930 -2528 7668
1659 7668 363 -6425 7333 3375 -3940 -2159 8966 -2599 -4768 6789 1288 -4391 -699 7480
1673 7480 -6050 -1858 5700 -554 -5785 1954 6316 -7957 351 4741 -860 -5366 4324 3721 -7392
1688 -7392 2840 3542 -1650 -4478 6759 70 -6591 3635 3055 -2880 -4857 7061 -2356 -4533
1702 -4533 2655 2470 -3817 -3055 7020 -3866 -2527 2354 2801 -5142 -903 6535 -4002 -2195 1725
$$ packed form
1602c707K602N508j061j0308P654P989j2564K424M388j28q884J1607J45j1629
1616e964M724O766k562r580J1893l898o198N398M818p471n109J3458q054l413
1630e192N384L741j0926J796J2469j0715k768O001M264j2297P711O702j1520N84
1644d766Q330R86j4027J1996L106r966M85J0223k876j2295J3700l78p448M02J0196
1659G668p305o788J3758l958p315J781J1125j1565k169J1557n501n679L692Q179
1673G480j3530M192P558o254n231P739M362j4273Q308M390n601m506R690o03j1113
1688g392J0232P02n192k828J1237o689o661J0226n80n935j977J1918r417k177
1702d533P188j85o287P62J0075j0886J339M881M47p943M239P438j0537J807L920
$$ plain form
1717 1725 3725 -5473 1214 4518 -3875 -1507 3098 3105 -7394 2931 3509 -3530 -2164 4268 1479
1732 1479 -7757 4459 2397 -3470 -2979 4956 -1672 -6312 5901 598 -4888 -2200 7535 -3672
1746 -3672 -4497 6137 526 -4421 847 8166 -5604 -987 6671 331 -4202 3930 6648 -7648
1760 -7648 2111 6445 -942 -5164 5788 3617 -7740 4118 5012 -3483 -5418 8409 -203 -8132
1774 -8132 4280 3161 -5790 -4523 9261 -4198 -7082 4263 2591 -7031 -2134 8079 -7543
1787 -7543 -4438 5003 2354 -8428 567 6626 -7191 -1264 4521 441 -7863 4541 4418 -6476
1801 -6476 624 4037 -1184 -6170 7412 665 -6034 1587 4487 -2324 -3959 7677 -2722 -3670
1815 -3670 3362 4524 -4812 -1732 7788 -3086 -1830 3489 4222 -6109 1192 6757 -2907 -1598 2943
$$ packed form
1717A725K000r198O687L304q393K368M605Pj0499J0325N78p039J366O432k789
1732A479r236J2216k062n867M91P935o628m640J2213n303n486K688R735j1207
1746c672q25J0634n611m947N268P319j3770M617P658o340m533Q132K718j4296
1760g648R759M334p387m222J0952k171j1357J1858Q94q495j935J3827q612p929
1774h132J2412j119q951J267J3784j3459k884J1345j672r622M897J0213j5622
1787g543L105R441k649j0782Q995O059j3817N927N785m080q304J2404j23j0894
1801f476P100L413n221m986J3582o747o699P621K900o811j635J1636j0399r48
1815c670P032J162r336L080R520j0874J256N319P33j0331P301N565r664J309M541
$$ plain form
1830 2943 3523 -6539 3260 4530 -3615 -3252 3834 3280 -7262 2589 3027 -2632 -3517 4765 1023 -6727
1846 -6727 3073 1848 -2392 -4232 5698 -1411 -5699 3763 2189 -3023 -3733 6299 -3204 -3478 3333
1861 3333 1012 -4642 -784 6777 -5799 -1669 4460 870 -6544 2156 5438 -7310 -313 4563
1875 4563 -397 -6956 5457 2591 -7627 1938 5243 -2327 -7109 8650 562 -7116 2758 6198
1889 6198 -4104 -5002 9433 -2063 -4911 3900 5258 -6341 -1367 9550 -3852 -3493 4697 4683
1903 4683 -7327 2064 7283 -4882 -1848 4608 2611 -7175 5093 3588 -5659 -681 5824 -310
1917 -310 -7270 6065 1088 -4680 -218 5047 -3613 -5396 6713 -1455 -4368 284 4611 -6412
1931 -6412 -2977 6489 -2472 -4999 179 5077 -6152 -512 4157 -2995 -3845 2949 4279 -7249 1195
$$ packed form
1830B943N80j0062R799J270q145L63P086n54j0542R851M38n659q85Q282l742p750
1846f727R800j225m240j840R930p109m288R462j574n212p10J0032r503k74O811
1861C333k321n654L858P561j2576M130O129l590p414Q700L282j2748O997M876
1875D563m960o559J2413k866j0218R565L305p570m782J5759q088p678R874L440
1889F198j0302q98J4435j1496k848Q811J358j1599M974J0917j3402L59Q190j4
1903D683j2010R391N219j2165L034O456j997r786J2268j505r247M978O505o134
1917c10o960J3335m977n768M462N265q660j783J2109q168k913M652M327j1023
1931f412L435R466q961k527N178M898j1229N640M669p152q50O794J330j1528Q444
$$ plain form
1946 1195 3401 -1327 -3740 4249 2419 -7181 2332 3696 -717 -4208 4644 335 -4566 4042 2736
1961 2736 -2832 -4324 7419 -796 -4108 2796 2536 -3254 -1819 8107 -3160 -2994 2670 3536 -3814
1976 -3814 746 6554 -5270 -1443 4499 3562 -6252 1894 5029 -4147 50 4304 944 -7235 5195
1991 5195 3217 -5105 -251 4293 -1467 -6372 7273 225 -6069 -645 5603 -3537 -4528 6945 -2683
2006 -2683 -4919 1689 6068 -7049 -2918 7027 -2475 -4252 2762 4490 -8298 339 5761 -2916
2020 -2916 -4071 3134 2740 -8177 3239 3848 -3956 -4271 5381 960 -6887 4008 1466 -3423 -2338
2035 -2338 6216 -1982 -4718 4768 1025 -2750 -506 6590 -4128 -1884 5374 1051 -2803 1037 5965
2050 5965 -4730 939 4864 327 -3914 3609 4921 -5785 1899 3949 -472 -5362 5012 2816
$$ packed form
1946A195K206m728k413P989j830r600R513J364m413l491Q852m309m901Q608j306
1961B736n568j492J1743q215l312O904k60n790J435R926j1267J66N664Q66p350
1976c814M560N808j1824L827N942r37r814Q146L135r176M197M254l360q179J2430
1991E195j978q322M854M544n760m905J3645p048o294N424O248r140r91J1473r628
2006b683k236O608M379j3117M131R945r502j777P014J728j2788Q637N422q677
2020b916j155P205l94j0917J1416O09p804l15R652m421p847J0895k542m889J085
2035b338Q554q198k736R486l743l775K244P096j0718K244P258m323l854L840M928
2050E965j0695N669L925m537m241P523J312j0706P684K050m421m890J0374k196
$$ plain form
2064 2816 -6135 1313 3355 -1421 -5677 5769 144 -5802 885 3823 -2771 -5294 6236 -1365
2078 -1365 -4675 669 4240 -4099 -3683 5901 -2426 -3565 1170 4009 -5976 -1146 5504 -3146 -2993
2093 -2993 1937 3036 -6685 2341 3818 -3840 -2103 3843 1308 -6633 4877 1908 -4332 -1157 5813
2108 5813 -814 -5971 5908 552 -3747 21 6723 -3900 -3507 7239 140 -3785 892 7275
2122 7275 -5345 -1115 6256 -397 -4511 2163 5724 -6544 872 4468 -1398 -4480 4174 3619 -6687
2137 -6687 1517 3158 -1553 -4114 5074 397 -5851 2892 2148 -2076 -3556 5425 -2168 -3743 3388
2152 3388 1708 -3742 -2241 5810 -3507 -2045 2323 1225 -4485 128 4911 -4960 -1570 2361 1402
2167 1402 -5529 2052 3650 -5330 -1009 2628 1042 -6060 3299 1954 -4380 -541 3474 -753 -5820
$$ packed form
2064B816q951P448K042m776m256J1446n625n946O687K938o594k523J1530p601
2078a365l310N344L571q339M16R584q327j139M735K839r985M830O650q650J53
2093b993M930J099r721R026J477p658J737N946k535p941J1510k969o240L175O970
2108E813o627n157J1879n356m299L768O702j0623L93J0746p099l925M677O383
2122G275j2620M230P371o653m114O674L561j2268P416L596n866l082Q654n55j0306
2137f687Q204J641m711k561R188m677o248Q743p44m224j480Q981p593j575P131
2152C388j680n450J501Q051r317J462M368j098n710M613M783r871L390L931r59
2167A402o931P581J598q980M321L637j586p102R359j345o334L839M015m227n067
$$ plain form
2182 -5820 5278 1096 -3731 -435 4649 -1707 -4226 6119 48 -3056 228 5683 -3414 -1985
2196 -1985 5819 -1185 -3004 1897 5395 -5332 -262 5197 -1177 -2976 2762 3927 -6389 1911
2210 1911 3942 -2262 -3133 4539 1590 -6145 3513 2772 -2879 -3262 5697 -904 -4813 3754 1088 -3669
2226 -3669 -1665 5899 -3970 -3597 3956 432 -4360 -414 5294 -5528 -1602 3454 -47 -5070 1345
2241 1345 3882 -6184 201 3396 -673 -5660 3626 2490 -5610 993 2831 -992 -4266 5134 269
2256 269 -4251 1739 3062 -1578 -3609 5942 -1033 -3027 1861 3640 -2620 -2041 5632 -1678 -1632 1662
2272 1662 3381 -3972 315 4652 -2486 -1073 2102 2736 -4910 2095 3179 -2568 -1276 3114 1467
2287 1467 -4805 3577 1781 -2743 -1237 4136 -541 -5111 4362 793 -2834 -1336 4787 -2504 -3909
$$ packed form
2182e820J1098m182m827L296N084o356k519J0345o071l104L284N455r097J429
2196a985P804p004j819M901L498j0727N070N459o374j799N738J165j0316Q300
2210A911K031o204q71P672k949p735R658p41n651l83Q959o601l909Q567k666m757
2226c669K004P564r869L73P553l524m792L946N708j0822L926N056l501n023O415
2241A345K537j0066O385L195m069m987R286j136q100O603J838l823l274R400m865
2256B69m520N990J323m640k031R551o975j994M888J779o260N79P673p310M6L294
2272A662J719p353M287M337p138J413L175O34p646P005J084n747J292M390j647
2287A467o272Q382j796m524J506N373m677m570R473l569l627J498O123p291j405
$$ plain form
2302 -3909 4508 246 -3463 -880 5209 -4218 -2590 4064 -485 -4366 197 4730 -5400 -718 3367
2317 3367 -838 -4154 1877 3450 -5592 788 2547 -1062 -4225 4020 1598 -5210 2084 2111 -1349
2332 -1349 -2942 5196 -1095 -3458 3342 2264 -2742 -1443 6158 -2906 -1921 3510 2172 -3745 289
2347 289 5561 -3725 -599 3193 1678 -4463 2434 4149 -4432 -165 3421 950 -5077 3511 2364
2362 2364 -3926 -307 3334 -349 -4852 4302 509 -2938 -148 3376 -1954 -3668 4286 -694 -2457
2377 -2457 -313 3234 -3250 -2049 3823 -1904 -2343 177 2786 -4233 -164 2901 -2137 -2236 1422 2532
2393 2532 -4817 1100 2011 -1598 -1931 2839 1083 -4816 2584 1780 -1785 -2248 4148 -184 -3699 3221
2409 3221 1609 -1826 -1927 5275 -1319 -2326 3202 1509 -2396 -748 5727 -2850 -1581 3320 1544
$$ packed form
2302c909Q417m262l709K583O089r427J628O654m549l881M563M533j0130M682M085
2317C367m205l316O031J573r042O380J759l609l163Q245k422o808P294K7l460
2332a349j593Q138o291k363O800j078n006J299P601r064R85N431j338n917M034
2347B89N272r286L126L792j515o141O897J715q581M267L586k471o027Q588j147
2362B364o290L619L641l683m503R154l793l447K790L524n330j714P954m980j763
2377b457K144L547o484J201N872n727m39K520K609p019M069L065n038r9L658J110
2393B532p349N917R11l609l33M770j756n899P400q04l565m63O396m332l515O920
2409C221j612l435j01P202o594j007N528j693l905J648O475q577J269M901j776
$$ plain form
2424 1544 -3339 659 4523 -3800 -357 2774 1070 -4070 2419 2868 -4365 466 2858 -164 -4340
2439 -4340 3949 1146 -3729 898 2475 -1231 -3453 4747 -890 -3050 1162 2374 -3191 -2226 4926
2454 4926 -2363 -2468 1200 2134 -4176 -337 3750 -3014 -1958 1540 1857 -4779 1203 2360 -3021 -1450
2470 -1450 2154 811 -4737 2381 1642 -2317 -1219 2562 -437 -3961 3662 783 -1926 -787 3947
2485 3947 -1217 -2330 3728 293 -1988 -249 4353 -2152 -1211 3068 221 -1645 903 4315 -3660
2500 -3660 -168 3005 571 -2550 1036 3261 -4034 938 2551 268 -3288 2317 1784 -3350 1442
2515 1442 1854 -948 -3184 3874 231 -3219 1287 1404 -1594 -2087 4286 -2128 -2930 1518 1767 -3160
2531 -3160 -1477 3783 -3208 -1791 2168 1658 -4611 112 3423 -2943 -961 1924 513 -4776 2468
$$ packed form
2424A544m883L998L864q323L443L131j704n140O489M49p233M831K392l022m176
2439d340Q289k803m875M627J577l706k222Q200n637k160M212J212n565R65P152
2454D926p289j05L668R34o310L839M087o764J056L498L17o636N982J157n381J571
2470a450L604j343n548P118p39l959J098L781k999l524P623k879k709J139M734
2485C947n164j113O058l435k281J739M602o505R41M279k847j866K548L412p975
2500c660L492L173k434l121L586K225p295M972J613k283l556N605n33n134M792
2515A442M12k802k236P058l643l450M506J17k998m93O373o414q02M448K49m927
2531c160J683N260o991J417L959n10o269M723L311o366J982K885j411n289P244
$$ plain form
2546 2468 2563 -3568 -1028 2631 598 -3998 3425 824 -2930 -157 3245 -324 -3118 3527 -184
2561 -184 -1728 595 3414 -2198 -2033 4133 -414 -1147 809 2952 -3303 552 3711 -1289 -1684 1179
2577 1179 2621 -3198 1962 2056 -1495 -1651 2847 1478 -3592 2133 825 -820 -1591 3312 63 -3491
2593 -3491 2109 1425 -1403 -2196 3146 -1245 -2527 2031 935 -1889 -2103 3369 -1979 -1525 1160 495
2609 495 -2653 -707 3530 -2785 -1064 892 1006 -2901 709 2334 -3018 -326 1412 699 -3518 2143
2625 2143 1346 -2741 287 2224 -74 -3211 3509 251 -2125 612 2412 -1422 -2135 4525 -487
2640 -487 -1707 732 3033 -2225 -885 3947 -1229 -1425 1195 3120 -3223 728 2857 -1753 -1209 2074
2656 2074 2213 -4026 2013 2216 -1529 -1166 2590 811 -3721 2766 869 -1407 -1065 2942 -1142 -2930
$$ packed form
2546B468R5o131K540L659k033m596P423k601l754K773L402l569k794O645l711
2561a84j544K323K819n612J65O166m547p33J956K143o255L855L159n000l95K863
2577A179J442n819N160R4l551j56M498j369n070N725j308j645p71M903l249l554
2593c491N600o84k828p93N342m391j282M558j096k824k14N472n348M54K685o65
2609D95l148J946M237o315J721J956J14l907L610J625n352K692J738p13m217N661
2625B143p97m087L028J937k298l137O720l258k376K737J800l834p13O660n012
2640d87j220K439K301n258J340M832n176j96K620J925o343L951K129m610N44L283
2656B074J39o239O039K03l745L63L756j779m532O487j897k276L42M007m084j788
$$ plain form
2672 -2930 3029 -184 -1970 -860 3086 -2498 -1661 2305 -620 -2130 -301 2591 -3124 -546 1646
2687 1646 -760 -2242 772 1947 -3801 551 1150 -212 -2325 1583 726 -3186 1412 941 -134 -2494
2703 -2494 2384 300 -1719 1038 956 -661 -1777 3527 -325 -1016 429 1451 -548 -1041 3188 -1329
2719 -1329 -723 1078 2270 -1563 -400 2489 -1411 -218 1043 2162 -2956 700 2323 -979 -564
2734 -564 1132 1306 -3424 2224 1638 -1483 -1516 1717 641 -2971 2605 -119 -1542 -1013 2739 -900
2750 -900 -2762 2028 -349 -1606 -577 2975 -2656 -1790 2200 -606 -1764 -212 2038 -3299 334
2765 334 1759 -1018 -2593 1174 1797 -3480 1312 1350 -1116 -2430 2680 927 -3136 1405 913 -684
2781 -684 -1355 3030 -770 -2188 1952 1209 -864 -1184 2955 -1710 -701 1829 714 -1419 -403 3101
$$ packed form
2672b930N959l213j786J110L946n584Q37L966k925j510J829K892n715K578K192
2687A646k406j482L014J175n748M352N99j362k113L908q57l912M598m71j075k360
2703b494M878k084k019K757q2j617j116N304l852o91J445J022j999m93M229m517
2719a329O06J801J192l833J163K889l900J193J261J119n118L656J623l302M15
2734e64J696J74m730N648n86l121l3L233j076l612N576k724j423N29L752l639
2750i00j862M790k377j257J029L552n631Q66L990k806j158J552K250n337L633
2765C34J425k777j575L767O23n277M792L8k466j314N110j753m063M541m92j597
2781f84o71M385l800j418M140p43k073l20M139m665J009K530j115k133J016L504
$$ plain form
2797 3101 -1383 228 957 591 -1884 1436 2673 -1908 531 550 921 -1602 1905 517 -1736 581
2813 581 962 517 -2156 1877 -386 -1102 140 1309 -564 -2091 2126 -747 -1173 -645 1247 -1553
2829 -1553 -1316 2058 -995 -1188 -875 2067 -2115 -764 1298 -713 -1321 -401 2063 -2806 9 692
2845 692 -162 -1259 964 1480 -2987 1113 1033 -304 -1788 1935 379 -1930 1731 714 -571 -1365
2861 -1365 2993 -619 -1293 1996 661 -851 -719 3503 -1577 -453 1659 860 -1198 468 2880 -2382
2877 -2382 139 1372 723 -2293 1084 1855 -2334 747 1413 -92 -2649 1990 295 -2145 533 936
2893 936 -245 -2502 2575 -443 -1298 436 887 -918 -1682 2345 -1443 -603 81 1180 -1739 -261
2909 -261 1877 -1936 -516 170 1473 -2545 622 1182 -1633 -254 396 811 -2493 1477 575 -878
$$ packed form
2797C101m484J611P29l66k475L320J237m581K439J9L71k523L507j388k253K317
2813E81L81m45k673M033k263p16J242J169j873j527M217k873m26N28J892k800
2829a553K37L374l053j93L13K942m182J351K062k011o08R20K464m869K815O83
2845F92q54j097K223N16m467M100q0j337j484L723j556k309L661j017j285p94
2861a365M358l612o74L289j335j512J32M222n080J124K112p99k058J666K412n262
2877b382K521J233o49l016L377P71m189L081O66j505k557M639j695k440K678M03
2893I36j181k257N077l018q55J734M51j805p64M027l788Q40O84J099k919J478
2909b61K138l813J420O86J303m018L167N60k815J379O50M15l304L970r02j453
$$ plain form
2925 -878 -912 990 546 -2092 1777 212 -429 -981 1752 -14 -1401 1813 -247 -32 -864 2339 -752
2942 -752 -700 1418 187 -326 -669 2516 -1491 -34 1121 626 -805 406 2122 -1897 908 853 685
2959 685 -1600 1013 1564 -1656 490 544 345 -1781 2196 261 -1622 300 822 -108 -2030 2426 -838
2976 -838 -1252 318 1190 -1187 -1738 2617 -1665 -779 103 1172 -1969 -392 1787 -1818 -370 158 980
2993 980 -2376 630 874 -1441 -139 504 901 -2455 1764 138 -946 -14 1165 130 -1906 2017
3009 2017 -150 -171 -412 1973 -517 -1018 2118 -245 -170 -271 2248 -1191 -103 1864 -36 -187 -3
3026 -3 2156 -1789 457 823 15 -744 404 1561 -2039 902 381 158 -1567 936 647 -1695 965
3043 965 113 411 -1806 1693 -456 -1440 496 273 -309 -1592 2247 -1216 -1030 209 541 -1033 -1273
$$ packed form
2925h78l4J902m44k638L869j565o41n52K733j766j387L214k060K15q32L203l091
2942g52N2K118j231n13l43L185m007J457J155m95j431J211J716m019K805n5j68
2959F85k285K613N51l220K146N4j99k126L977j935j883J922N22r30j922M456l264
2976h38m14J570Q72k377n51M355m282Q86Q82J069l141J577K179l605J448N28Q22
2993I80l356L006K44k315J302O43L97l356M219j626j084R32J179j035k036L923
3009B017k167k1k41K385k490n01L136k363P5j01K519l439J088J967j900j51J84
3026cK159l945K246L66q08p59J148J157l600K941n21k23j725K503k89k342K660
3043I65q52K98k217L499k149r84J936k23n82j283L839l463J86J239L32j574k40
$$ plain form
3060 -1273 2032 -1817 -364 110 947 -1678 -66 1812 -1872 108 312 1125 -2476 857 1014 -1424
3076 -1424 -73 697 640 -2420 1834 443 -943 -289 1276 228 -1608 2282 -295 -258 -156 1858 -558
3093 -558 -675 1890 -490 -101 215 2170 -1600 169 1723 -587 -170 588 1709 -2004 1162 943 -242
3110 -242 -498 782 1244 -1698 1254 269 -141 -1301 1446 250 -1726 968 -274 -309 -1283 1417 -823
3127 -823 -1249 525 -26 -339 -1412 1568 -1307 -391 -65 348 -798 -1027 1524 -1462 202 -248 708
3144 708 -1431 79 1008 -1234 217 12 864 -1877 1168 624 -999 136 961 733 -2004 2180 95
3161 95 -601 109 1322 -18 -1804 2164 -124 -215 -271 1692 -720 -772 2164 -532 -502 -259 2049 -1465
3179 -1465 222 1379 -540 -569 311 2094 -2050 699 400 -163 -768 903 864 -2242 1419 206 -152
$$ packed form
3060a273L305l849J453M74Q37k625J612J878l684J980K04Q13l601L333J57k438
3076a424J351P70n7l060M254j391j386O54J565j048j836L890k577L7J02K014k416
3093e58j17K565k380L89L16J955l770J769J554k310M17P58J121l713L166k19j185
3110b42k56J280M62k942K952r85m10j160K747j196j976K694j242l5r74K700k240
3127h23m26J774n51l13j073K980k875R16L26M13j146k29K551k986J664m50R56
3144G08k139J510R29k242J451k05Q52k741L045n44j623J135Q25k28k737M184k085
3161I5o96P10J213j340j786L968k288r1n6J963k412n2K936k696L0K43K308l514
3179a465J687J157j919k9Q80J783m144K749k99n63o05J671l9l106L661j213l58
$$ plain form
3196 -152 -918 1376 -232 -1705 1151 -215 -365 -1064 1649 -966 -704 1079 -259 -891 -687 1852 -1884
3213 -1884 -178 508 109 -1256 27 1156 -2023 366 147 439 -1409 384 922 -1540 683 241
3229 241 318 -1575 1492 422 -628 528 336 563 -1144 1797 -223 -220 -31 750 172 -551 1922 -416
3247 -416 89 -123 1593 -713 -354 1620 -706 361 -94 1714 -1564 581 1110 -535 -288 183 1423
3264 1423 -1945 778 670 -676 -904 359 570 -2073 825 -7 -541 -1203 1423 -323 -2084 846
3280 846 -30 -596 -1304 1692 -1196 -1039 1077 12 -883 -860 1590 -1834 -91 806 -235 -1544 117
3297 117 1912 -1861 375 316 167 -1342 1292 1008 -1579 771 630 505 -1178 1945 170 -1025 810
3314 810 984 88 -1265 2013 -527 -480 367 688 -715 -762 2254 -885 294 174 1028 -993 76 1309
$$ packed form
3196a52p66K294j608j473K856j366j50o99K713k615K62J783j338o32K04K539l736
3213a884J706O86l99j365J283J129l179K389k19K92j848J793N38k462K223m42
3229B41P7j893L067j070j050J156j92K27j707K941k020LJ89P81n78p23K473k338
3247d16N05k12J716k306L59J974k326J067m55J808l278K145N29j645K47M71J240
3264A423l368K723j08j346k28J263K11k643K898q32n34o62K626j746j761K930
3280H46q76n66p08K996k888J57K116j065q95K3K450l424J743Q97j041j309J661
3297A17J795l773K236n9j49j509K634k84k587K350j41j25j683L123j775j195J835
3314H10J74q96j353L278k540M7Q47L21j403m7L016l139J179j20Q54k021J069J233
$$ plain form
3332 1309 -1262 163 16 1094 -1688 708 321 -918 68 470 636 -1735 1016 -153 -644 -429 775
3349 775 -142 -1630 1502 -214 -281 -954 1199 -410 -1218 938 -524 -639 -762 1650 -993 -730 879
3366 879 -140 -742 -378 1639 -1738 -89 321 227 -899 87 1292 -1823 532 259 566 -1340 991
3383 991 623 -1208 844 507 156 -1289 1782 134 -1054 781 755 -64 -749 2162 -825 -522 802
3400 802 1241 -606 -319 2164 -1435 13 613 1002 -1585 431 1609 -1476 182 659 807 -1949 1273
3417 1273 855 -1023 -169 368 327 -1954 1267 -137 -815 -591 789 -384 -1587 1501 -789 -464 -529
3434 -529 1096 -1063 -1054 1086 -719 -293 -184 1114 -1259 65 886 -581 -542 -22 1013 -1818 735
3451 735 511 -140 -838 880 950 -1546 1061 364 -40 -1108 1326 414 -1104 1074 357 79 -947 1732
$$ packed form
3332A309k571J425j47J078k782K396l87j239R86M02J66k371K751j169m91K15J204
3349G75r17j488L132j716o7o73K153j609q08K156j462j15j23K412k643K63J609
3366H79j019o02L64K017l377J649M10r4j126R86J205l115K355k73L07j906K331
3383I91l68j831K052l37l51j445L071j648j188J835k6q19o85K911k987L03J324
3400H02M39j847K87K483l599J448O00L89k587K016J178l085J658M77J48k756L222
3417A273m18j878Q54N37m1k281L221j404o78K24J380j173j203L088k290L25o5
3434e29J625k159RK140j805M26J09J298k373J324Q21j467L9N20J035k831K553
3451G35k24o51o98J718P0k496K607o97m04j068K434r12j518K178p17k78j026K679
$$ plain form
3469 1732 -183 -760 785 605 -269 -700 1937 -968 -127 653 798 -854 -199 1888 -974 -147 135
3486 135 876 -1398 508 1218 -1258 -208 245 666 -1855 1185 555 -1332 -126 700 240 -2175 1306
3503 1306 -360 -1086 -142 893 -919 -1721 1445 -758 -814 -511 951 -1174 -808 1430 -1065 -903 -356
3520 -356 1033 -1307 456 807 -783 -627 343 1153 -1834 484 515 -326 -561 1230 689 -1612 1502
3537 1502 547 -119 -650 1533 -138 -1087 1278 262 -315 -731 1777 -319 -534 906 453 -460 -308
3554 -308 1868 -892 113 538 566 -952 73 1270 -1510 199 265 370 -1260 420 511 -1424 375
3571 375 168 216 -1569 899 -78 -767 -185 208 -212 -1688 1436 -398 -706 -178 914 -626 -1239 1661
3589 1661 -841 -933 93 1466 -1151 -718 1546 -924 -602 484 1269 -1761 367 1064 -672 -326 791
$$ packed form
3469A732j915n77J545j80q74m31K637k905Q41P80J45j652O55K087k862Q27K82
3486A35P41k274J906P10k476J050M53M21k521L040o30j887J206Q26m60k415L481
3503A306j666p26R44J035j812q02L166k203n6L03J462k125L66K238k495J62N47
3520c56J389k340J763L51j590J56R70Q10k987K318L1q41k35J791n41k301L114
3537A502r55o66n31K183j671r49K365j016n77m16K508k096k15J440m53r13J52
3554c08K176k760J005M25K8j518J025J197k780J709O6J05j630J680R1j935J799
3571C75k07M8j785K468r77o89N82L93m20j476L124j834l08N28J092j540o13K900
3589A661k502r2J026J373k617M33K264k470L22J086P85l030K128O97j736L46J117
$$ plain form
3606 791 1024 -1999 1317 823 -536 -489 1012 555 -1258 1421 97 -641 -535 1800 -363 -1116 1418
3623 1418 19 -375 -299 1854 -1134 -373 1221 -168 -733 23 1290 -1604 385 1087 -228 -991 758
3640 758 908 -1730 654 511 -303 -1080 1260 466 -1777 407 204 -228 -1362 1616 -457 -1061 392
3657 392 481 -339 -1130 1371 -913 -640 103 546 -881 -626 1279 -1062 -268 -180 674 -1143 193 1074
3675 1074 -1010 -224 260 708 -1261 706 854 -1306 -42 911 527 -1789 1311 425 -499 -103 1191
3692 1191 401 -1594 1394 257 -411 -276 1568 -350 -871 1531 63 -651 -393 1497 -1352 -108
3708 -108 1359 -34 -904 108 1441 -1751 244 898 -393 -880 788 947 -1951 834 595 -236 -1019
3725 -1019 1235 105 -1692 1018 381 -589 -916 1573 -639 -1403 861 178 -965 -818 1797 -1350
$$ packed form
3606G91K33l023L316m94j359M7J501m57j813K679j324p38J06K335k163p53K534
3623A418j399l94P6K153k988P61J594j389n65P56J267k894J989P02j315p63J749
3640G58J50k638K384j43q14p77K340p94k243K184k03m32j134K978k073o04J453
3657C92Q9q20p91K501k284K73P43M43j427K55J905k341P94Q8Q54j817J336Q81
3675A074k084P86M84M48j969J967J48k160J264R53l84k316L100q86r24L96J294
3692A191p90j995K988j137o68J35J844j918n21K402j468p14K58J890k849J244
3708a08J467j393q70J012J333l192J995O54j291m87J668J59k898K785k39q31p83
3725a019K254j130j797K710o37r70l27K489k212p64K264o83j143J47K615l147
$$ plain form
3741 -1350 -496 893 446 -1144 -60 1502 -1653 54 693 647 -1309 578 956 -1439 203 477 353
3758 353 -1447 1146 454 -971 348 786 -18 -1320 1762 -105 -687 309 994 -157 -907 2169 -477
3775 -477 -405 465 1350 -931 37 1627 -623 -265 189 1506 -1213 215 1160 -656 -497 169 914 -1801
3793 -1801 355 581 -313 -930 285 425 -1796 835 -29 -486 -1113 1064 -83 -1306 919 -306 -593
3810 -593 -717 1555 -1175 -1023 598 103 -787 -462 1567 -1370 -517 689 -95 -1286 142 1501 -1287
3827 -1287 125 763 442 -1335 961 918 -1243 384 1063 209 -1393 1670 485 -961 470 1065 1
3844 1 -1070 1929 18 -616 438 1166 -864 -801 1719 -774 -449 189 993 -1184 -391 1492 -1214 -284
3862 -284 161 671 -1724 616 523 -1338 -180 399 62 -1719 1189 82 -911 -484 919 -121 -1651
$$ packed form
3741a350Q54J389m47j590J084J562l155J707O39m6j956J887L78k395J642K74j24
3758C53j800K593o92j425J319M38q04j302L082j867n82R96O85j151p50L076k646
3775d77P2Q70Q85k281R68J590k250L58M54J317k719J428R45j816J59O66P45k715
3793a801K156K26q94o17J215J40k221K631q64m57o27K177j147j223K225j225k87
3810e93j24K272k730J52J621m95q90L25K029k937Q53J206p84j191J428J359k788
3827a287J412O38l21j777K296m3k161J627O79q54j602L063j185j446J431N95j064
3844Aj071K999j911o34J054P28k030O3K520k493L25O38Q04k177P93J883k706R30
3862b84M45N10k395K340r3j861J158N79l37j781K908j107r93M27J403j040j530
$$ plain form
3879 -1651 1401 -475 -657 -551 1228 -733 -1039 1279 -257 -736 -474 1513 -1251 -288 1033 3
3895 3 -577 -207 1421 -1234 -47 782 201 -962 582 1153 -1215 704 642 102 -883 1086 498 -1296
3913 -1296 819 514 -93 -945 1803 26 -1295 785 507 -521 -607 1771 -559 -301 625 553 -1038
3930 -1038 -99 1783 -961 -41 725 791 -1264 157 1221 -1241 56 594 721 -1681 632 597 -943
3947 -943 -215 548 123 -1580 1232 252 -767 -179 1009 -411 -1579 1393 -398 -980 -230 1167 -1002
3964 -1002 -505 1442 -707 -474 24 1303 -1338 -222 1008 -403 -679 466 1128 -1451 652 809
3980 809 -865 -1051 698 870 -1172 881 432 -498 -720 1441 119 -1110 834 361 -118 -757 1749
3997 1749 -483 -753 734 376 -429 -432 1574 -965 -245 888 460 -1014 -33 1610 -1352 101 573
$$ packed form
3879a651L052j876j82J06J779j961l06K318j536m79K62J987k764R63J321j030
3895Cn80L70J628k655J187Q29n81j163J544N71k368J919o2n40r85J969n88j794
3913a296K115l05o07q52K748j777j321K080k78j028q6K378k330K58R26p2j591
3930a038R39J882k744R20P66O6k055J421J064k462J297N38J27k402K313l5j540
3947i43P28P63m25j703K812r80j019N88J188j420j168K972j791n82P50J397k169
3964a002M97J947k149K33M98J279k641J116J230j411k76J145O62k579K103J57
3980H09j674j86J749J72k042K053m49r30k22K161j322j229J944m73m79o39K506
3997A749k232k70J487l58q05lK006k539P20J133m28j474R81J643k962J453M72
$$ plain form
4014 573 266 -1161 612 876 -1521 153 804 112 -1828 916 239 -1635 302 588 -96 -1547 1253
4031 1253 -167 -1195 134 578 -1040 -1184 1384 -957 -668 -56 469 -1092 -383 1080 -1026 -534 155
4048 155 1160 -1605 251 1020 -880 -278 522 481 -1595 975 377 -600 -139 1022 367 -1397 1490
4065 1490 417 -441 -279 1529 -58 -681 1494 73 -206 -131 1640 -990 -309 1179 105 -198 202
4082 202 1526 -1246 46 591 -117 -680 440 1060 -1358 387 280 236 -1162 530 352 -1464 400
4099 400 89 -242 -1416 962 -262 -988 156 183 -413 -1074 1242 -924 -716 214 731 -763 -610 1696
4117 1696 -1052 -379 348 773 -1351 -87 1423 -780 -375 580 996 -1320 843 1128 -763 192 800
4134 800 380 -1616 1526 677 -542 -103 1204 355 -1074 1518 -23 -422 -51 1408 -540 -541 1493
$$ packed form
4014E73l07j427J773K64k397J674O51o92j940K744o77j874J937K86o84j451K800
4031A253j420j028J329M44j618j44K568k341K89O12N25j561P09J463k106M92O89
4048A55J005k765J856P69j900O02Q00m1k076K570n98r77M61J161o55j764K887
4065A490j073q58J62J808j587o23K175j421k79P5J771k630O81J488j074l03M00
4082B02J324k772J292N45p08n63J120O20k418J745j07m4j398J692j78j816J864
4099D00l11l31j174K378j224p26J144K7n96o61K316k166K08R30N17j494J53K306
4117A696k748O73P27M25k124J264J510k203M05R55M16k316K163K85j891R55O08
4134H00m20j996L142q49j219M39J307q49j429K592j541l99L71J459j948jK034
$$ plain form
4151 1493 -287 -484 -13 1325 -1236 -181 1055 -683 -836 243 742 -1828 364 679 -719 -867
4167 -867 765 411 -1957 784 543 -538 -994 1141 107 -1530 1027 78 -450 -721 1375 -510 -990
4184 -990 639 71 -702 -394 1269 -936 -285 569 347 -715 -69 1172 -1147 9 564 405 -1113
4201 -1113 487 770 -895 321 261 517 -1479 781 467 -1012 220 682 191 -990 1459 -143 -449
4218 -449 8 592 -400 -1018 1333 -368 -253 -101 926 -883 -408 1127 -647 -232 79 1046 -1067 -230
4236 -230 1279 -420 -352 534 844 -1461 474 757 -450 -542 776 468 -1739 834 263 -316 -718 1018
4254 1018 -385 -1306 1142 -105 -625 -708 1286 -988 -716 930 -116 -1033 -169 1493 -1321 -254 848
4271 848 159 -875 343 1490 -1667 153 504 147 -1132 750 654 -1434 581 676 -139 -569 1569
$$ packed form
4151A493j780j97M71J338k561J055J236j738j53J079M99k570K192L15j398j48
4167h67J632l54k368K741k41j081m56K135j034j637K557r49n28k71K096j885m80
4184i90J629n68p73L08J663k205O51Q54k22j062O46J241k319J156N55j59j518
4201a113J600K83j665J216o0K56j996K260l14j479J232M62m91j181K449j602l06
4218d49M57N84r92o18K351j701J15J52J027j809M75J535j774M15L11R67k113Q37
4236b30J509j699O8Q86L10k305J935K83j207r2J318l08k207K573n71n79m02J736
4254A018j403r21K448j247n20q3J994k274K72J646j046r17Q64J662k814J067J102
4271H48o89j034J218J147l157J820L51l57j279J882r6k088K015R5q15m30K138
$$ plain form
4288 1569 113 -875 787 738 -167 -855 1513 -265 -266 897 836 -633 16 1713 -582 -185 501 756
4306 756 -845 190 970 -1018 -298 372 524 -1044 484 536 -956 -219 86 422 -1217 799 473 -504
4324 -504 -266 198 -33 -1193 801 -209 -665 -535 803 -384 -955 780 -315 -522 -616 746 -821
4341 -821 -607 815 -291 -589 -55 1120 -1180 112 747 -188 -702 580 1207 -1397 579 419 75
4358 75 -772 857 691 -1073 859 721 -57 -751 1281 121 -679 691 628 -154 -533 1708 -583 -581 541
4377 541 645 -880 -456 1330 -998 -286 584 575 -1555 397 1224 -1151 96 215 43 -1576 764 597
4395 597 -1426 -128 548 -155 -1515 981 -303 -722 6 804 -576 -1315 1301 -438 -541 214 675
4412 675 -777 -497 1278 -385 -277 -19 667 -1095 -29 901 -604 -308 165 1026 -1225 453 534 -274
$$ packed form
4288A569j456r88J662m9r05o88K368j778jJ163o1j469O49J697k295L97O86K55
4306G56j601J035P80j988P20O70J52j568J528N2j492P37L05L36j639K016l26r77
4324e04K38M64k31j160J994j010m56J30J338j187n71J735j095k07r4J362j567
4341h21K14J422j106k98N34J175k300J292O35r35n14J282O27k604J976j60l44
4358G5q47J629j66j764J932j38p78o94K032j160q00J370o3p82l79K241k291KJ122
4377E41J04j525M24J786k328P12Q70rk130J952Q27k375J247J19j72j619K340j67
4395E97k023J298O76p03j360K496j284m19P28P98j380p39K616j739j03P55M61
4412F75j452K80J775j663J08K58O86j762J066R30j505K96M73Q61k251J678Q1q08
$$ plain form
4430 -274 -228 390 739 -1211 690 432 -442 -395 1049 185 -867 1210 79 -223 -472 837 -380 -450
4448 -450 900 -29 -519 -602 1326 -1017 -75 557 144 -851 -82 1098 -917 71 535 379 -861 290
4466 290 477 -861 365 343 338 -1313 818 290 -852 277 503 -177 -1218 1084 -308 -692 11 588
4484 588 -339 -818 1299 -487 -521 148 683 -879 -559 888 -821 -247 45 771 -1375 251 919 -700
4502 -700 -244 526 559 -1192 644 685 -350 -388 578 367 -1226 1150 172 -271 -225 927 -233 -838 822
4521 822 26 -384 -285 1219 -566 -400 1010 -120 -234 90 991 -834 29 482 -12 -574 292 748 -1158
4540 -1158 482 145 143 -954 844 145 -1206 248 271 -270 -778 830 -194 -955 126 76 -395 -1003
4558 -1003 947 -850 -644 241 246 -520 -641 1008 -990 -578 165 703 -827 -102 655 -729 47 467
$$ packed form
4430b74M6O18L49j950J901k58q74M7J444q64j052K077j131l02k49J309j217p0
4448d50J350r29m90q3J928k343R42O32m13r95P69J180k015R88M64j56j240J151
4466B90J87j338J226k2nj651K131n28j142J129K26o80j041K302j392l84P03N77
4484E88r27m79K117j786l4O69N35j562L20J447j709N74K92P26k146J626O68j619
4502g00M56P70L3j751J836M1j035l8R66k11j593K376r78m43M6J152j160o05J660
4521H22p96m10R9J504j785J66J410j130j14L24R01j825Q63M53m94n62Q66M56j906
4540a158J640l37kj097J798o99j351J454K3n41n08J608j024p61J081n0m71o08
4558a003J950j797K06Q85Np66j21J649j998M12P43N38j530P25P57j384P76M20
$$ plain form
4576 467 406 -1068 473 491 -767 -61 447 206 -864 1111 165 -360 242 881 36 -747 920 100 -184
4595 -184 124 1117 -281 -559 1062 -273 39 -23 871 -1000 -26 780 -142 -288 77 637 -934 225
4613 225 333 -329 -559 266 478 -1291 432 -181 -294 -609 436 127 -943 299 106 -569 -704 776
4631 776 -613 -915 315 112 -519 -587 901 -791 -365 404 103 -452 -137 888 -787 66 276 593
4649 593 -593 287 708 -737 206 491 373 -938 801 578 -584 -18 498 279 -792 899 169 -285
4667 -285 249 608 -13 -725 1316 -21 -153 116 784 -483 -220 1044 -483 -331 243 701 -958 53
4685 53 834 -544 -520 375 532 -1191 471 378 -497 -472 365 297 -1179 772 -96 -534 -485 726 -191 -859
4705 -859 824 -139 -307 -381 891 -560 -540 545 -158 -437 -144 634 -1007 -58 579 -55 -479 49 659
$$ packed form
4576D67o1j474J541J8j258P06N08k41j070J975r46n25O02O39q45p83J667q20k84
4595a84L08R93j398k78J621j335L12o2Q94j871R74Q06r22j46L65N60j571J159
4613B25J08o62k30Q25K12j769J723o13j13l15J045l09j070J242j93o75j35J480
4631G76j389l02J230k03o31o8J488j692M26P69l01n55L15J025j675Q53K10L17
4649E93j186Q80M21j445R43K85j18j311J739k23j162N66N16k19j071J691p30m54
4667b85N34L59o21p12K041j337j32K69O68j267K63J264j527J52N74M58j659J011
4685E3P81j378K4Q95J57j723J662r3q75K5Q37o8j476J951q68m38M9J211r17o68
4705h59J683r63j68p4J272j451K0J085p03k79K93P78j641R49O37o34m24N28O10
$$ plain form
4724 659 -1087 498 278 32 -704 416 780 -794 520 312 63 -650 898 200 -307 461 353 80
4742 80 -711 1156 -212 -159 152 518 -294 -449 1221 -589 154 -39 530 -690 -238 604 -767 -69 126
4761 126 556 -902 182 452 -704 -115 338 417 -966 495 213 -502 -250 294 21 -1092 555 312
4779 312 -75 -424 911 -356 -941 706 -285 -462 -688 726 -672 -390 629 -186 -549 -103 867 -1087
4797 -1087 -179 624 56 -635 406 779 -931 605 715 -166 -754 543 404 -954 811 409 185 -524
4815 -524 1017 -125 -585 761 247 -190 -92 1017 -509 -66 717 305 -376 -210 1049 -795 143 719
4833 719 322 -661 246 716 -964 272 221 174 -679 444 87 -579 180 209 194 -881 701 -172 -536 -397
4853 -397 36 -242 -932 549 -458 -297 -95 472 -439 -492 524 -373 36 -209 684 -655 -94 695 -43
$$ packed form
4724F59j746J585k20k46p36J120L64j574J314k08k49p13J548o98n07P68j08k73
4742H0p91J867j368N3L11L66q12j55J670j810P43j93N69j220M52Q42j371O98J95
4761A26M30j458J084K70j156N89M53P9j383J461k82p15K52N44k73j113J647k43
4779C12l87l49J335j267n85J647r91j77k26J414j398K82J019q15l63M46R70j954
4797a087R08Q03n68o91J041L73j710J536J10q81n88J297j39j358J765m02k24p09
4815e24J541j142m60J346n14m37R8J109j526M43P83m12o81J66J259j844R38N76
4833G19l97r83R07M70j680J236n1m7q53J123l57o66P59K9j5j075J582q73l64J39
4853c97M33k78o90J481j007J61K02N67r11n3J016q97M09k45Q93j339N61P89p38
$$ plain form
4872 -43 -90 184 798 -785 212 469 -283 -466 234 574 -960 468 167 110 -639 485 307 -556 653
4891 653 224 -54 -666 811 -83 -492 682 255 40 -518 1089 -442 -183 404 175 -396 -393 995 -782
4910 -782 -78 153 163 -723 323 617 -992 271 18 -126 -682 378 329 -922 226 187 -72 -893 639
4929 639 -6 -575 131 599 -277 -660 847 -167 66 -91 713 -433 -315 454 -606 -97 127 425 -665
4948 -665 157 411 -428 -60 218 511 -739 688 400 -285 238 262 396 -510 703 249 -124 11 526
4967 526 28 -425 681 -107 211 -100 792 -223 -181 749 66 -63 -145 823 -479 156 210 273 -190 -362
4987 -362 500 -903 69 50 169 -601 370 366 -739 95 -145 287 -756 422 -9 -711 -10 183 -141 -719
5007 -719 865 -253 -415 143 380 -296 -703 868 -477 -207 -61 318 -650 49 791 -133 192 274 641
$$ packed form
4872d3m7K74O14j583R97K57p52j83P00L40j534J428l01n7p49J124j78q63J209
4891F53m29k78o12J477q94m09J174m27k15n58J607j531K59N87k29n71LJ388j777
4910g82P04K31J0q86J046K94j609J263k53j44n56J060m9j251J148l9k59q21J532
4929F39o45n69P06M68q76l83J507j014K33j57Q04j146J18P69j060N09K24K98j090
4948f65Q22K54q39L68K78K93j250J427k88o85N23K4J34r06J213m54l73J35N15
4967E26m98m53J106p88L18l11Q92j015M2R30o83j29q2R68j302O35N4O3m63j72
4987c62Q62j403R72j9J19p70R71mj105Q34k40M32j043J178m31p02P01J93l24n78
5007g19J584j118j62N58K37o76m07J571j345K70J46L79r68O99P42r24L25Q2L67
$$ plain form
5026 641 -806 282 661 -339 -182 241 499 -784 644 123 -439 91 511 251 -695 915 236 -182
5044 -182 -124 802 -101 -304 693 -108 -31 -48 1126 -386 -422 629 -274 -139 179 717 -884 17 300 -64
5064 -64 -474 173 420 -1006 455 -43 -217 -367 221 198 -640 487 3 -96 -625 533 -325 -668 196 -242
5084 -242 -48 -662 443 -457 -355 261 184 -311 -351 487 -526 73 -15 197 -417 -126 619 -424 66 74 448
5105 448 -622 213 353 -300 120 177 137 -540 415 368 -164 -64 408 73 -352 684 56 102 6 781 -311
5126 -311 -526 671 -299 -205 -30 570 -326 -100 382 -234 -161 -14 659 -770 169 232 -133 -124 197 522 -1057
5147 -1057 474 238 -117 -636 595 -31 -489 434 -133 47 -401 505 -248 -572 274 117 29 -423 662
5166 662 -427 -103 367 140 -314 -238 688 -573 81 188 257 -469 447 589 -437 215 42 356 -428 256
$$ packed form
5026F41j447J088L79j000J57M23K58j283J428n21n62N30M20k60r46J610o79m18
5044a82N8R26r03k03R97q01P7j7J174j512l6J051r03J35L18N38j601R01K83l64
5064f4m10O47K47j426J461m98j74j50N88k3q38J127m84r9n29J158q58l43Q64m38
5084b42J94o14J105r00J02O16p7m95m0Q38j013N99q8K12o14K91P45j043M90QL74
5105D48j070Q35J40o53M20N7m0o77R55m7n32J00M72l35m25J036o28M6r6P75j092
5126c11k15J197r70R4J75O00q96K26M82o16P3J47O73j429R39O3l65RL21L25j579
5147a057J531k36l55n19J231o26m58R23n67J80m48R06p53l24Q46j57q8m52J085
5166F62j089L24M70k27m54P6R26j261O54J07O9p26R16J42j026O52j73L14p84O84
$$ plain form
5186 256 164 -259 116 107 -18 -627 786 213 -155 275 418 70 -333 899 -132 -130 122 517 -461 -118 797
5207 797 -110 30 1 426 -735 127 326 -367 -104 -122 526 -964 350 413 -317 -83 297 32 -779 419
5227 419 -187 -167 -111 346 0 -697 468 -86 -288 -310 415 -411 -651 254 -174 -277 -140 595 -507 199
5247 199 316 140 -435 84 446 -598 322 118 82 -448 426 149 -443 346 264 188 -511 709 62 -317
5267 -317 346 337 252 -330 849 140 -179 63 330 82 -177 795 -541 -117 -39 682 -554 -194 577 -405
5287 -405 -78 -89 313 -533 234 491 -289 -132 -203 450 -670 204 -260 -214 -293 70 123 -674 435 -135 -281
5308 -281 -350 578 -293 -688 591 -178 -176 -306 509 -324 -213 623 -321 -239 -68 692 -682 -55 525 65 -72
5329 -72 238 486 -531 418 242 286 -505 322 431 -634 296 226 -123 -588 621 32 -270 258 115 39
$$ packed form
5186B56r2m23L75rj25o09J413n73l68M30J43l48m03J232j031KK52L95r78L43R15
5207G97r07J40k9M25j161Q62J99o93K63j8O48j490J314O3p30K34L80k65q11J198
5227D19o06K0N6M57l46o97J165n54k02k2P25q26k40R05m28j03J37P35j102P06
5247A99J17j76n75N19L62j044R20k04l6n30Q74k77n92P89q2p6o99J220o47l79
5267c17O63rq5n82J179p09l19K42K67k48k59R72j336M24P8P21j236L60P71r82
5287d05L27j1M02q46P67K57p80J57p1O53j120Q74m64M6p9L63N3p97J109n70j46
5308b81o9R28q71l95J279p69Kj30Q15q33J11Q36r44Q2J71P60j374O27N80m60j37
5329g2L10K48j017R49j76M4p91Q27J09j065R30p0l49m65J209n89l02N28j43p6
$$ plain form
5349 39 -511 580 -587 -19 -83 106 -532 -276 839 -573 167 9 266 -449 34 424 -631 26 -52
5368 -52 311 -817 -49 136 -365 3 -2 83 -690 491 -13 -323 -125 215 80 -348 422 -169 -170 -242 320 -23
5390 -23 -23 566 -277 38 -108 312 -430 -79 330 -232 -94 -50 416 -524 186 198 -192 -258 82 271 -554 447
5412 447 128 -12 -434 363 297 -404 414 106 -22 -677 794 -93 -325 267 177 13 -339 926 -156 -307
5432 -307 214 75 -440 -443 847 -490 -13 164 -66 -499 74 251 -868 162 46 -147 -834 552 159
5451 159 -314 -50 132 216 -620 552 -103 -285 369 270 215 -193 495 -305 -88 -338 500 -396 -319 463 -357
5472 -357 53 -244 171 -851 220 361 -251 300 125 399 -481 626 397 -153 37 239 242 -525 393 -99
5492 -99 -101 -211 452 201 -421 476 264 -148 -401 421 -115 -178 361 -133 -142 -353 502 -313 -315 390 30 -292 -68
$$ packed form
5349C9n50J091j167N68o4J89o38K56J115j412P40j58K57p15M83L90j055O57p8
5368e2L63j128P68J85n01L68nQ5p73J181n04l10J98L40j35m28P70n91jp2N62l43
5390b3%N89q43L15j46M20p42L51M09n62J38M4M66r40P10J2l90o6L40J89q25J001
5412D47l19j40m22P97o6p01Q18l08j28o55J471q87k32N92r0j64l52J265j082j51
5432c07N21j39n15lJ290j337M77J77k30m33N73J77j119J030j16j93o87J386l93
5451A59m73K64J82Q4q36J172o55j82O54r9n5m08O88q00K17k50Q38q96P7P82q20
5472c57M10k97M15j022J071J41o12N51j75K74q80J107k29n50J90K02Lp67R18m92
5492i9kj10O63k51o22Q97k12m12k53Q22n36o3N39m94rk11Q55q15kP05l60l22K24
$$ plain form
5515 -68 440 -752 -31 -62 272 -580 95 193 -630 16 51 86 -662 -1 -24 -561 -166 -44 -26 -520 351 -114
5537 -114 -428 -30 -109 -293 -453 651 -461 -49 69 641 -277 -334 645 -174 -3 -172 521 -419 168 610
5557 610 -414 132 522 327 -646 521 153 -321 -30 420 190 -467 583 271 208 315 459 -37 -231
5576 -231 790 -23 -35 -347 601 -338 -109 499 -318 -188 10 638 -647 164 215 -148 -346 32 264 -362
5596 -362 238 63 2 -759 285 274 -451 141 -153 195 -500 340 -59 -494 184 -10 -164 -547 569 -230
5616 -230 -170 27 65 -170 -325 441 -235 146 5 98 -369 -22 458 -403 -196 -195 365 -570 341 124 -87 7
5638 7 224 139 -452 573 28 -27 -28 376 316 -585 728 10 -186 -215 270 -123 -380 553 -317 -282 -84 531
5660 531 -694 -266 544 -217 -262 49 401 -597 31 70 -278 -316 112 305 -594 369 3 124 -146 384 -11
$$ packed form
5515f8N08j192P21l1L34q52O75R8q23O46L5L5p48O61k3n37L95J22J8m94Q71m65
5537a14l14L98p9j84j60J104j112M12J18N72r18n7R79q19J71j69O93r40N87M42
5557F10j024N46L90j95r73J167l68m74K91M50k30o57J050l12o3J07J44m96j94
5576b31J021q13j2l12R48r39K29O08q17J30J98O28j285Q11N1l63j98L78K32o26
5596c62O00j75o1p61J044j1p25N92k94L48o95Q40l99m35O78j94j54l83J116p99
5616b30O0J97L8k35j55P66o76L81j41R3m67L47M80q61K07JN60r35R11k17k11R4
5638GK17q5n91J025n45n5jM04o0r01J313p18j96k9M85l93k57R33q70L5J98O15
5660E31j225M28Q10p61m5L11L52r98O28L9l48l8M28J93q99R63l66J21k70N30l95
$$ plain form
5681 -11 -403 345 -125 -126 -116 609 -317 -306 482 -57 -167 -283 534 -453 -184 285 115 -203 2 605 -305 -132
5703 -132 271 100 -452 52 609 -303 83 -60 257 -420 468 373 -68 306 162 262 -327 602 -148 -63 15
5724 15 303 -12 -104 481 34 -44 -40 345 -59 -280 264 -186 -342 60 477 -335 53 187 -246 -203 84 367
5746 367 -664 393 -22 -442 -107 108 30 -672 401 -176 -224 -539 -49 -83 -672 234 -185 -26 -343 234
5766 234 -379 -99 198 218 -38 -305 464 -289 220 308 61 -112 145 460 -469 42 222 266 -267 289 258
5787 258 -653 555 86 -48 -298 494 176 -373 295 -89 166 -495 481 185 -116 146 291 -228 -459 641
5807 641 -217 105 139 190 -350 -215 450 -279 -114 176 575 -513 12 193 -284 -336 -121 64 -766 249
5827 249 56 -377 -130 130 302 -409 363 -146 -280 -278 414 -177 -534 346 -220 -101 -239 552 -397 -184 357
$$ packed form
5681a1l92P48m70jJ0P25r26J1P88n39j10j16Q17r87K69M69j70l18K05O03r10J73
5703a32M03j71n52N04N57r12L86j43L17o77Q88r5m41L74j44J00n89R29p50Q5P8
5724A5K88l15r2N85m47p8ML85m04k21N44m50j56M02M17q12L88J34m33M3K87K83
5746C67j031J057m15m20L35K15p8p02J073n77m8l15M90l4n89R06m19J59l17N77
5766B34o13K80K97K0k56k67P69p53N09Q8k47j73K57L15r29N11J80M4n33N56l1
5787B58r11J208m69j34k50P92l18n49O68l84K55o61R76k96l01K62J45n19k31J100
5807F41q58L22L4N1n40J35O65p29J65K90L99j088N25J81m77n2K15J85q30J015
5827B49j93m33K47K60J72p11P72n09j34KO92n91l57Q80n66J19j38P91r49K13N41
$$ plain form
5848 357 -16 -39 -233 542 -609 19 286 -52 267 81 285 -384 -19 309 150 -289 256 331 -524 355
5868 355 125 -2 -222 457 82 -276 172 253 -101 -375 688 -92 -134 265 68 -201 -345 503 -549 -96
5888 -96 95 128 -329 109 619 -371 6 -176 181 -651 339 298 -405 -29 135 93 -649 272 -47 -101 36 110
5910 110 -52 -481 245 -287 -82 -182 232 -202 -401 661 -325 -143 184 298 -527 65 311 0 -21 -98
5930 -98 436 -742 6 250 83 -352 76 334 -543 526 -26 211 -381 167 177 -239 100 353 -34 -495
5950 -495 383 -109 -143 157 153 -123 -366 433 -446 45 70 200 -143 120 424 -517 29 277 144 -360 -43
5971 -43 377 -512 -13 18 14 -441 162 156 -569 192 176 55 -734 378 -229 -213 14 49 -216 -572 836 -278
5993 -278 -78 93 239 -288 -206 445 -322 123 58 62 -394 -11 515 -226 105 -56 288 -495 317 -186 -36
$$ packed form
5848C57l73k3j94P75j151O28K67l38L19j86K04o69L65L28j59m39N45P5q55Q79
5868C55k30j27k20O79l75l58M48Q1l54k74J063p80m2L99j97k69j44Q48j052M53
5888i6J91L3m57M38N10r90L77j82L57q32R90m1p03L76J64m2p42R21l19n4J37P4
5910A10j62m29P26n32K05j00M14m34j99J062r86J82L27J14q25N92K46l11k1p7
5930i8N34j178P48K44j67m35M28K58q77J069n52K37n92N48J0m16L39K53l87m61
5950d95Q78m92l4L00mk76k43P99q79M91K5J30l43K63L04r41N46K48j33n04L17
5971d3M20q89M99L1mm55O03op25P61j6j21p89J112o07J6K27L5k65l56J408j114
5993b78K00J71J46n27Q2O51p67M45o5Mm56L83N26p41L31j61L44p83Q12n03J50
$$ plain form
6014 -36 -60 158 -46 -512 335 106 -41 10 388 35 -188 628 -1 -39 -79 506 -81 -300 252 59 -391 -218
6036 -218 531 -560 -135 170 159 -327 34 434 -383 174 37 -210 -500 316 53 -618 328 -73 28 -602
6056 -602 484 103 -386 347 -22 -68 -657 488 -479 -80 52 241 81 -218 653 -233 -49 85 405 -361
6076 -361 101 453 -410 -47 262 345 -462 241 395 -310 24 265 104 -509 333 34 -98 47 451 191
6096 191 -470 600 118 -79 10 449 39 -391 394 -197 -175 -148 524 -554 -440 400 -159 4 42 299 -653
6117 -653 9 175 -168 -116 238 308 -773 179 -233 -155 -483 127 40 -558 205 -84 -29 -433 598 -162 -351
6138 -351 327 -87 5 -323 495 -302 -147 242 211 -215 -13 489 -511 -153 44 187 -130 280 353 -105 194
6159 194 157 179 -591 492 326 -405 256 382 17 -323 382 -33 -306 176 192 44 -433 508 -157 -245 16
$$ packed form
6014c6k4K18k04m66Q47k29j47N1L78l53k23Q16o29l8m0N85n87k19N52j93m50J73
6036b18P49j091M25L05j1m86L61M00q17N57j37k47k90Q16k63o71R46m01J01o30
6056f02J086l81m89P33l69m6n89J145r67L99J32J89j60k99Q71q86J84J34L20p66
6076c61M62L52q63L63L09Q3q07P03J54p05L34K41j61o13Q42k99j32J45M04k60
6096A91o61J070m82j97Q9M39m10m30P85n91K2K7O72j078J14Q40n59J63L8K57r52
6117f53O62J66l43N2L54P0j081R52m12P8l28O10q7n98P63k89N5m04J031p60j89
6138c51O78m14R2l28Q18p97J55L89l1m26K02N02j000L58J97J43l17M10P3m58K99
6159A94l7K2p70J083j66p31O61J26l65l40P05m15k73M82J6j48m77R41o65q8K61
$$ plain form
6180 16 641 -168 -559 773 -274 -148 -35 280 -576 -19 155 -174 -53 -101 308 -572 -1 1 -237 -222 127
6201 127 223 -694 347 158 -412 -401 390 58 -536 215 -84 -59 -2 585 -273 -187 479 81 -289 -221 590 -417
6223 -417 255 152 -64 122 35 495 -398 199 72 34 -210 78 347 -686 6 170 151 -500 523 127
6243 127 -379 441 248 137 -198 561 -78 -88 220 90 222 -227 734 -196 322 21 112 -302 -240 322 -468
6264 -468 -312 43 235 -583 105 175 -423 -30 -123 72 -387 370 -128 -180 -132 88 50 -625 557 241 123
6285 123 -223 247 -33 -292 532 -42 31 -118 462 -445 -310 172 -192 26 -141 485 -563 -166 334 -58
6305 -58 -7 143 696 -196 368 349 3 13 166 345 -411 331 90 111 -574 420 260 -520 313 29 -59 -546
6327 -546 479 -120 -153 -83 -1 -52 -588 689 -428 264 111 70 -275 -226 129 -531 192 98 246 -604 233
$$ packed form
6180A6O25q09l91J332j047J26J13L15q56N57J74l29J21m8M09q80N71Kk38J5L49
6201A27R6r17J041j89n70J1P91l32n94P51k99K5N7N87q58Q6O66l98l70O8Q11j007
6223d17O72j03k16J86q7M60q93N97j27l8k44K88K69j033O92J64j9o51J023l96
6243A27n06Q20j93j11l35P59o39j0L08j30J32m49R61r30N18l01R1m14O2N62p90
6264d68J56L55J92q18O88P0n98L93r3J95m59P57m98n2M8K20l8o75J182l16j18
6285A23l46M70k80k59Q24n74P3j49N80r07J35M82l64K18j67O26j048L97N00l92
6305e8N1J50N53q92N64j9l46J0J53J79p56P42k41K1o85R94j60p80Q33k84q8m87
6327e46J025n99l3P0Q2n1n36J277j117O92j53m1l45M9L55o60P23r4J48q50Q37
$$ plain form
6348 233 401 -180 -126 251 94 -482 163 -15 -239 -44 54 -244 -560 469 -100 -350 -200 383 -191 -114 229
6369 229 -281 -50 -58 295 -375 276 535 -158 -214 -50 289 -371 91 329 24 -64 20 277 -327 422 169 139
6391 139 -269 480 250 -530 246 177 -17 -394 886 -9 -405 503 -16 -336 -350 637 -142 24 313 242 -176
6412 -176 -370 276 -551 -238 198 226 -466 -136 337 -537 184 -15 168 -299 314 176 -283 342 195 -129
6432 -129 -449 364 54 -286 -17 80 -130 -461 503 -200 -111 12 125 -284 -99 296 -45 -146 -17 338 -662
6453 -662 206 86 -10 188 -30 298 -284 280 573 37 7 313 57 -460 161 235 -35 -25 132 133 -431 380
6475 380 130 -146 -479 506 -78 -187 277 18 -61 -86 609 -370 -244 281 -249 -277 -74 289 -623 -32 265
6496 265 101 -198 276 480 -590 294 91 210 -493 229 108 -303 207 38 12 -130 251 -8 -84 19
$$ packed form
6348B33J68n81N4L77j57n76O45j78k24J95R8k98l16J029n69k50J50N83n74P7L43
6369B29n10K31qL53o70O51K59o93n6J64L39o60M62K38l05q8Q4K57o04P49k53l0
6391A39m08P49k30p80P76o9j94l77J280q95l96R08n19l20j4R87p79J66K89p1m18
6412a76j94O46q27L13M36K8o92L30M73q74P21j99J83m67O13j38m59O25j47l24
6432a29l20Q13l10l40K69R7k10l31R64p03Q9J23J13m09J85L95l41j01J29L55j000
6453f62Q68j20r6J98k18L28n82N64K93n36l0L06k56n17O21P4k70J0J57Jn64Q11
6475C80k50k76l33R85n84j09M64k59p9k5O95r79J26N25n30k8K03L63r12N91K97
6496B65j64k99M74K04j070Q84k03J19p03P22j21m11N10j69k6j42L81k59p6J03
$$ plain form
6516 19 103 -144 -269 316 -179 -198 -8 50 -237 -173 347 -392 33 0 227 -267 55 407 -213 102 -12 459
6538 459 -502 262 289 -239 51 294 267 -399 495 -6 3 -14 184 -174 -146 246 -75 34 -172 324 -261 -245
6560 -245 394 -84 -205 -160 136 -524 212 195 -24 -63 -96 221 -275 605 -146 -41 -451 80 30 -470 -10 202
6582 202 -116 -339 132 -42 -440 19 85 -278 -195 241 -208 -381 -128 461 -26 31 395 -234 -127 72 85
6603 85 -180 -72 474 -313 87 4 307 -260 219 348 -209 3 16 297 -233 334 -12 -252 -112 320 228
6624 228 -142 596 -51 -177 -29 321 -325 -239 230 -400 -11 -316 346 -288 23 102 -123 -22 -81 189 -201
6645 -201 10 172 -144 -39 171 57 -690 1 26 -119 -16 251 244 -263 354 66 105 -214 307 25 -164
6666 -164 -7 -44 -94 -401 499 -167 -140 167 27 -125 -180 393 -330 71 59 218 -186 -146 233 -351 262 285
$$ packed form
6516A9Q4k47j25N85m95j9J90N8k87O4N20p39M25l3K27m94L22L52o20L15j14M71
6538D59r61P64K7n28K90K43k7o66Q94n01Rj7J98l58K8L92l21J09k06M96n85J6
6560b45O39m78j21M5K96o60P36j7k19l9l3L17m96Q80p51J05m10N31n0n00M60K12
6582B02l18k23M71j74l98M59O6l63Q3M36m49j73K53N89m87N7L64o29J07J99J3
6603H5k65J08N46p87M00q3L03n67M79J29n57K12J3K81n30N67l46k40J40M32r2
6624B28l70P38o47j26J48L50o46Q6M69o30L89l05O62o34L11P9k25J01n9K70l90
6645b01K11J62l16J05K10j14p47O91K5j45J03K67pn07O17k88L9l19N21k82j89
6666a64J57l7n0l07R00o66K7L07j40j52n5N73p23M01j2J59m04M0L79n84O13K3
$$ plain form
6688 285 135 -319 580 168 -184 253 -33 273 -438 396 1 -364 29 103 -8 -503 314 -146 -87 -105 153
6709 153 -238 -107 427 -156 134 -66 126 -277 -250 128 -165 -159 -6 195 -438 71 238 -71 124 18 92
6730 92 -478 347 -51 -127 30 174 -22 -237 398 -159 -12 -369 449 -146 -175 215 -34 -256 -78 257 -306
6751 -306 103 248 88 -228 -61 375 -294 246 237 297 -199 136 314 -305 183 130 6 -507 253 -78 -190
6772 -190 27 69 201 -285 377 -96 -368 -201 -20 38 -172 504 -58 -285 161 27 -259 -227 393 -299 -41
6793 -41 118 159 -46 75 134 -269 -108 -1 128 -333 113 -233 -255 -282 138 243 -655 395 -203 40 -212
6814 -212 485 -137 -186 130 -38 -197 -4 219 -269 -105 307 82 139 73 463 -85 43 259 -12 -362 -95
6835 -95 232 -166 74 142 314 -174 315 204 -346 209 122 289 -240 353 189 -44 320 -110 181 -307 478
$$ packed form
6688B85j50m54Q99m12l52M37k86L06p11Q34l95l65L93P4j11m95Q17m60N9j8K58
6709A53l91J31N34n83K90k00J92m03K7L78k93OJ53K01o33N09J67l09J95j06P4
6730I2n70Q25l98p6J57J44j96k15O35n57J47l57Q18n95k9L90k49k22J78L35n63
6751c06M09J45j60l16J67M36o69N40rO0m96L35J78o19M88n3j24n13P60l31j12
6772a90K17M2J32m86O62m73k72J67J81N8k10O76n62k27M46j34k86L2O20o92K58
6793d1J59M1k05J21N9m03J61J07J29m61M46l46k2k7M20J05q98J050n98K43k52
6814b12O97o22m9L16j68j59J93K23m88J64M12k25N7o6L90n48J28K16k71l50K67
6835i5L27l98K40O8J72m88M89j11n50N55q7J67n29N93j64k33L64m30K91m88P85
$$ plain form
6856 478 -95 89 213 -71 -438 -317 361 -494 31 -4 20 -274 149 10 -637 43 -114 147 -619 87 99
6877 99 -257 208 143 -53 -502 200 76 -209 -106 122 -147 -342 289 -44 -235 65 -4 -2 -25 407 -381 -5
6899 -5 80 236 -142 -1 466 -310 9 -57 437 -237 -106 383 -59 23 52 99 -444 326 268 15 -272 359 140
6922 140 -293 307 141 123 -150 557 -83 -315 272 -243 88 -98 362 -315 -194 71 69 -73 -46 101 -318
6943 -318 -7 50 -71 -353 8 167 -361 25 54 -91 -533 83 -19 -378 21 -196 208 -305 400 -34 -260
6964 -260 -95 -155 39 -149 392 -219 -3 -106 103 -208 -7 404 -275 54 -183 183 -356 206 596 -143
6984 -143 125 -200 309 -296 294 336 105 45 378 -134 -348 133 88 366 -211 333 339 -556 468 -104 95
7005 95 -37 161 -60 -224 56 -170 -115 -245 235 -117 50 141 197 -411 -270 309 -303 107 -47 -123 -278 -62
$$ packed form
6856D78n73J84J24k84l67J21O78q55N25l5K4k94M23j39o47O80j57K61p66P06J2
6877I9l56M65o5j96m49P02j24k85J03K28k69j95O31l33j91L00o9Kk3M32p88L76
6899eQ5J56l78J41M67p76L19o6M94o74J31M89m42Q2K9M7n43P70n8k53k87O31k19
6922A40m33O00j66j8k73P07o40k32N87n15L31j86M60o77J21K65kj42K7J47m19
6943c18L11N7j21k82L61J59n28L86K9j45m42O16j02l59L99k17M04n13P05m34k26
6964b60J65o0J94j88N41o11K16j03K09l11K01M11o79L29k37L66n39N62L90p39
6984a43K68l25N09o05N90M2k31o0L33n12k14M81m5K78n77N44Oq95J024n72J99
7005I5j32J98k21j64K80k26N5j30M80l52J67R1N6o08J41N79o12M10j54p6j55K16
$$ plain form
7027 -62 370 -244 169 -74 106 -325 300 -259 -332 -7 -67 -57 -145 292 -210 -195 175 42 -3 -104 531 -281
7049 -281 106 75 234 -173 -220 356 -365 61 -157 279 -252 -96 113 -205 70 19 158 -455 298 544 -26
7070 -26 1 70 16 -62 313 -169 -150 -37 422 56 -120 393 -84 173 -216 352 -198 24 72 -234 -102 -206
7092 -206 108 -415 -39 163 -150 -148 7 260 -465 64 148 236 -229 53 130 -458 274 -4 -21 -186 333 -52
7114 -52 -207 -98 57 229 -20 287 -293 -79 336 66 96 64 247 -127 76 4 119 22 -22 228 -415 57
7136 57 157 271 -246 180 -12 -177 21 -59 30 -417 127 -30 -15 -102 140 45 -323 547 -32 36 148 212 -153
7159 -153 -206 345 -137 166 -182 335 -208 -201 453 -376 -178 -398 243 -298 -57 91 -29 106 -24 -72 -128 192
7181 192 -309 22 -194 76 -73 -148 273 157 -99 -294 420 55 -222 -27 17 3 -115 234 73 25 301
$$ packed form
7027f2M32o14M13k43J80m31O25n59p3L25o0J0q8M37n02J5L70j33m5j01O35q12
7049b81L87l1J59m07m7N76p21M26k18M36n31J56K09l18K75n1J39o13P53K46n70
7070b6K7O9n4p8L75m82J9J13M59l66j76N13m77K57l89N68n50K22M8l06J32j04
7092b06L14n23L76K02l13KJ55K53p25N29Q4Q8m65K82P7n88P32k78j7j65N19l85
7114e2j55J09J55J72k49L07n80K14M15k70L0l2J83l74K03p2J15r7m4K50o43M72
7136E7J00J14n17M26j92j65J98q0Q9m47N44j57J5q7K42r5l68Q70n79O8J12O4l65
7159a53n3N51m82L03l48N17n43PO54q29J98k20O41n41K41J48j20J35j30m8n6L20
7181A92n01L31k16K70j49p5M21j16k56j95P14l65k77J95M4j4j18L49j61m8K76
$$ plain form
7202 301 353 198 -126 322 -60 117 -36 -152 -89 -11 8 -271 179 135 179 -50 355 10 -7 152 154 268 -151
7225 -151 309 110 -88 168 -99 -34 -185 252 -323 -191 -106 -11 -149 -74 349 -224 -58 4 400 -442 -62 61
7247 61 172 -31 -18 -34 -341 179 12 34 95 -44 178 -276 276 -44 -28 -22 -48 -166 -252 92 -112 -76 -49 577
7271 577 8 -321 412 15 -68 -36 311 -259 135 435 238 72 -126 195 -261 88 -46 50 -22 235 368
7292 368 -304 357 -129 244 -168 278 12 -260 187 12 369 -224 338 -216 -80 314 87 -7 -175 152
7312 152 -206 -418 19 -99 -55 -94 342 -106 92 12 275 -573 117 198 -169 -108 -199 175 -425 90 57 -45
7334 -45 -101 -180 231 -350 47 -200 -223 -55 162 -24 -93 472 -125 111 -161 165 170 6 378 106 -60 67
7356 67 383 12 123 108 -145 -27 69 363 -69 317 -93 -38 -33 72 531 -334 147 36 28 -263 430 -187 -183
$$ packed form
7202C01N2j55l24M48l82J77j53j16O3P8J9k79M50m4M4k29M05l45j7J59KJ14m19
7225a51M60j99j98K56k67O5j51M37n75J32Q5R5j38P5M23n73J66O2L96q42L80J23
7247F1J11k03J3j6l07N20j67K2O1j39K22m54N52l20J6Ok6j18q6L44k04L6K7O26
7271E77n69l29P33l97q3L2L47n70L94L00j97j66j98L21m56L49j34R6p2K57J33
7292C68o72O61m86L73m12M46k66k72M47j75L57n93N62n54J36L94k27r4j68L27
7312A52l58k12M37j18M4l9M36m48J98q0K63q48O90Q1l67O1r1L74o00N15l3j02
7334d5n6p9M11n81L97k47k3J68K17j86o9N65n97K36k72L26Nj64L72k72j66J27
7356F7L16l71J11j5k53J18R6K94m32L86m10N5NJ05M59q65M81j11qk91O93o17M
$$ plain form
7379 -183 304 243 39 -413 289 -51 -4 48 -117 -209 -1 395 -253 56 70 138 -245 21 397 -436 29 -112
7401 -112 -173 -296 159 180 -302 24 17 168 -486 171 237 -272 -49 8 -16 -219 515 46 -212 -223 272 53 -236
7424 -236 317 -190 279 -114 320 -286 -27 479 -157 252 86 466 -390 9 270 98 31 91 183 -116 78
7445 78 123 16 40 154 66 -347 168 117 -74 156 278 -3 62 456 -54 -149 -132 402 -94 143 -126 152 98
7468 98 -87 280 -658 2 -116 21 -198 -179 480 -189 70 -47 252 -388 -104 209 -207 165 -222 28 -160
7489 -160 138 102 113 15 56 -57 -349 255 -149 -165 -25 252 -171 43 240 -48 191 162 249 -136 -8 402
7511 402 37 -32 187 269 -164 55 131 -128 50 146 70 -283 326 -26 83 -193 79 13 -516 202 -180 -37
7533 -37 -260 92 53 -121 313 8 14 -16 183 -384 -64 -110 255 14 -62 179 -397 156 72 -87 -149 52 51 -98
$$ packed form
7379a83M87o1k04m52P02l40M7N2j65r2K08L96o48L09J4O8l83K66L76q33M65j41
7401a12o1j23M55K1m82L26pJ51o54O57O6n09K23N7k4k03P34m69k58j1M95k19k89
7424b36N53n07M69l93M34o06K59N06o36M09j66L80q56L99K61j72o7O0R2k99J94
7445G8M5j07K4J14q8m13N15n1j91K30J22k81O5L94n10r5J7N34m96K37k69K78n4
7468I8j85L67r38O60j18J37k19J9O59o69K59j17K99o40K84L13m16L72l87K50j88
7489a60K98l6J1r8M1j13k92O04m04j6J40K77m23K14J97k88K39k9Q7l85J28M10
7511D02l65o9K19Q2m33K19P6k59J78R6p6l53O09l52J09k76K72o6n29P18l82J43
7533c7k23L52l9j74M34l05Ol0J99n67L20m6L65k41p6K41n76N53q4j59o2K01jj49
$$ plain form
7557 -98 190 -154 79 10 192 -179 -320 -21 219 8 -285 352 -83 -454 111 -57 -174 -448 401 -139 -159
7578 -159 157 247 -219 -26 265 -26 32 189 165 -33 116 235 -368 178 92 142 -319 211 -40 -130 -30 -94
7600 -94 239 -189 236 -18 -177 -118 355 19 -100 428 -127 -107 -114 329 59 -38 163 -78 -155 -128 -103 -190 59
7623 59 109 98 -236 112 279 -407 126 9 -439 108 75 262 -157 -275 185 75 -359 -54 -54 -134 15 -26 40
7646 40 -239 263 -8 91 -92 -86 99 -72 318 1 -29 124 250 27 -165 599 -31 -96 21 349 24 -135
7668 -135 450 31 107 120 222 -257 -63 43 37 -149 161 -57 -306 318 170 -172 -12 -159 -304 -200 365
7689 365 28 -37 -154 198 -261 -149 173 -39 -138 -55 199 -456 -54 57 -303 14 49 200 -108 204 37
7710 37 3 -335 74 17 -534 145 -79 -18 -22 123 30 -199 46 -120 14 -221 326 -103 -54 124 115 66 -71 166
$$ packed form
7557i8K88l44K33o9J82l71j41K99K40k11k93O37m35l71N65j68j17k74Q49n40k0
7578a59L16R0m66J93K91k91N8J57k4j98J49J19o03N46q6N0m61N30k51r0J00o4
7600i4L33m28M25k54j59N9M73l36j19N28n55K0pM43k70r7K01k41p7K7K5q7K49
7623E9N0j1l34L48J67o86N33j17m48N47l3J87m19j18M60j10m34L05%q0J49m1O6
7646D0k79N02k71R9j83OJ85j71L90l17l0J53J26k23j92P64o30o5J17L28l25j59
7668a35N85m19P6J3J02m79J94J06oj86L10k18k49O24j48l42J60j47j45J04N65
7689C65l37o5j17L52m59J12L22k12r9Q3K54o55M02J11l60L17L5J51l08L12j67
7710C7l4l38M09n7n51O79k24O1mJ45r3k29K45j66J34k35N47m29M9J78rm9j37K37
$$ plain form
7734 166 -324 -28 158 157 -75 -108 275 -261 154 113 107 57 159 237 -4 242 -12 -89 -165 316 209 -167 -144 -137
7758 -137 30 -33 231 -229 -68 -148 53 168 57 172 -113 6 136 85 -51 -13 181 -195 -168 -102 -28 -365
7780 -365 96 262 -213 -194 5 87 -327 147 -91 -58 -14 315 20 -472 204 -15 21 -146 321 -360 -125 168
7802 168 39 -20 201 271 -271 -164 414 72 -87 -60 353 -277 -73 -14 136 -83 -8 249 378 257 -64 62
7824 62 -18 -130 51 -304 -89 110 -89 -124 364 42 -177 211 236 34 -175 386 12 -133 -9 -27 -124 -133 41
7847 41 -34 53 -246 53 -306 100 165 -174 55 53 95 -307 18 226 -184 93 -280 115 -385 178 92 -59 52
7870 52 121 89 -14 279 150 8 -193 228 -288 -75 542 -25 -129 -91 260 -89 -36 70 -35 16 -215 381
7892 381 -181 182 -37 80 91 -134 171 -101 -27 -25 10 -101 106 -53 -90 234 78 -57 -58 336 -1 -241 32
$$ packed form
7734A66m90K96J86jk32l3L83n36M15m1on0J02P8k41K46k54p7p6M81j07l76K3P
7758a37J67o3K64m60J61q0K01J15j11J15k85J19J30n1j36L8J94l76K7O6P4l37
7780c65M61J66m75J9J99Q2m14M74k38L3M4L29k95m92O76k19L6j67M67o81K35K93
7802A68j29n9K21P0n42J07N78l42j59K7M13o30K04N9J50k19P5K57J29j21l21J26
7824F2q0j12J81l55K15J99j99l5M88l22k19L88K5k02k09N61l74j45J24j8r7rJ74
7847D1p5Q7k99K99l59M06O5l39K29kM2m02L25K08m10K77l73L95n00N63q6j51J11
7870E2O9l2j03K93j29j42k01M21n16K13O17n67j04L8L51l49N3J06j05N1k31N96
7892C81n62L63k19J17J1k25L05k72P4KL5j11K07j59l7L24j56j35jL94l37k40K73
$$ plain form
7915 32 30 226 49 213 -190 164 51 58 -91 -228 91 -21 -75 -128 -43 -209 -17 139 -178 80 -46 304 25
7938 25 358 -78 -184 48 87 195 -192 35 84 -223 -24 74 -30 -252 6 125 102 -88 182 58 -208 249
7960 249 -49 135 50 288 -324 -37 67 103 -95 -73 69 -398 15 -6 -67 184 75 15 -424 75 -270 -252
7982 -252 -27 47 31 -57 406 6 97 -84 157 -231 -11 51 108 -104 -213 112 -141 199 223 -86 15 17 127
8005 127 -145 488 -42 161 -255 15 10 54 151 -9 37 -157 421 104 -247 119 123 130 -376 327 27 78 310
8028 310 -137 183 -357 434 -224 125 77 207 -55 -124 398 -156 -118 26 257 -286 19 -12 -36 -220 89 168
8050 168 -262 232 -61 -57 70 76 -85 -172 414 -65 -21 -150 47 -137 49 95 -171 115 -158 312 -128 -100 -46
8073 -46 56 -86 -165 243 -207 246 -89 206 -22 50 1 -593 94 61 34 -10 -61 241 -97 203 -3 97 -358
$$ packed form
7915C2kJ96j77J64m03L54j13Pj49j37L19j12n4n3Q5j66J92J56l17K58j26L50k79
7938B5L33m36j06K32L9J08l87K27M9l07J99R8j04k22K58J19k3j90K70j24k66M57
7960B49k98J84q5K38o12K87J04L6j98K2J42m67M13k1o1K51j09o0m39M99l45J8
7982b52K25P4j6q8M63m00R1j81K41l88K20O2N7k12j09L25k53L40K4l09J01KJ10
8005A27k72O33n30K03m16K70nM4R7j60M6j94N78l17l51L66MPn06P03l00N1K32
8028C10m47L20n40P91o58L49m8J30k62o9N22n54L8J44K31n43L05l1k4j84L09P9
8050A68m30M94k93MJ27Oj61q7N86m79M4j29J97j84J86M6k66K86k73M70m40K8N4
8073d6J02j42p9M08m50M53l35K95k28P2m9n94O87l3k7m4n1L02l38L00k06J00m55
$$ plain form
8096 -358 52 -230 -313 -153 -112 22 -302 229 83 -76 73 396 46 32 77 -199 145 -28 200 -78 39
8117 39 218 9 182 120 156 -274 254 145 38 224 128 -72 -265 -59 211 -153 -327 -90 -42 -288 154 124
8139 124 -204 -152 26 -28 140 -30 -15 -125 -120 242 -42 118 93 -194 246 -89 -3 -95 -156 -54 167 -140 76
8162 76 41 -169 89 -220 149 -331 131 91 -336 98 -183 -43 -21 23 34 -246 171 -5 30 -13 282 -474 -93
8185 -93 198 108 -37 -80 385 -89
$$ packed form
8096c58M10k82q3J60M1J34l24N31j46j59J49L23l50j4M5k76L44j73K28k78J17
8117C9J79k09J73o2L6m30N28j09j07J86r6k00j93K06K70l64j74K37M8k46M42l0
8139A24l28N2J78n4J68j70J5j10NL62k84J60k5k87M40l35Q6r2o1J02K21l07K16
8162G6l5k10K58l09L69m80M62m0m27M34k81J40K2M4J1k80M17j76L5m3K95p56L81
8185i3K91r0j45m3M65m74
8191h9
$$ Imaginary data points
##PAGE= N=2
##DATA TABLE= (X++(I..I)), XYDATA
$$ plain form
0 0 0 0 0 0 0 0 0 0 0 8 -8 8 -16 16 -24 24 -32 40 -48 59 -72 88 -104 120 -142 166 -192 221 -255 291 -331
31 -331 379 -432 488 -549 619 -694 779 -868 968 -1077 1195 -1326 1468 -1621 1791 -1975
47 -1975 2178 -2401 2642 -2910 3206 -3532 3899 -4309 4773 -5300 5908 -6614 7449 -8455
61 -8455 9693 -11259 13311 -16127 20242 -26846 39134 -69693 302664 351925 -349322 60505
73 60505 320891 295 -66700 339461 46207 -210871 126976 289220 -117282 -63622 180381
84 180381 -77924 -103768 147019 109163 -182152 -105082 73437 840 16394 -28062 -125802
95 -125802 -106240 134365 8363 -164675 -16871 21742 -81148 -27572 92168 -95294 -115753
106 -115753 44770 49568 -72365 5073 77648 -160587 -46025 177339 59401 -178814 -47641
$$ packed form
0@%%%%%%%%%Qj6J6k4L2m0M8n6P2q8J07j31J60j92K24k62L08l58M13m76N46o22
31c31P10q11R20j037J168j313J473j647J836k045K272k521K794l089L412l766
47a975M153m579N043n552O116o738P431q208R082j0073J1208j2522J4063j5904
61h455J8148k0952K4570k9438L6369m7088O5980j08827L72357M9261p01247M09827
73F0505K60386l20596o6995M06161k93254k57078L37847J62244m06502N3660K44003
84A80381k58305k5844K50787l7856k91315P7070J78519p2597J5554m4456r7740
95a25802J9562K40605j26002j73038J47804L8613j02890N3576J19740j87462k0459
106a15753J60523M798j21933P7438P2575k38235J14562K23364j17938k38215J31173
$$ plain form
117 -47641 146710 3658 -69603 31251 42302 -107063 38733 118966 -51020 -88780 51869
128 51869 89173 -80982 20200 112095 -16658 -109318 75078 161717 -44535 -60726 51110
139 51110 94203 -17153 10632 49418 -24085 -13789 63757 44402 -93024 6409 46856 -33510
151 -33510 -56859 27397 33310 -98238 -35057 19968 -5905 -45245 -15851 -42942 -22634 43980
163 43980 -49607 -62342 6761 49841 -64771 -26944 59076 -39484 -35003 56348 18435 -92459
175 -92459 75901 84841 -107263 -28865 154038 14246 -151894 98643 117988 -106971 -44797
186 -44797 146363 -24880 -120227 120170 37608 -133377 6898 141613 -99806 -123674 133709
197 133709 39902 -136950 -14103 101505 -77018 -40444 72097 -26266 -66947 41634 42360
$$ packed form
117d7641J94351j43052p3261J00854J1051j49365J45796Q0233j69986l7760J40649
128E1869L7304j70155J01182R1895j28753r2660J84396Q6639k06252j6191J11836
139E1110M3093j11356K7785L8786p3503J0296P7546j9355j37426R9433M0447q0366
151c3510k3349Q4256N913j31548O3181N5025k5873l9340K9394k7091K0308O6614
163D3980r3587j2735O9103M3080j14612L7827Q6020r8560M481R1351l7913j10894
175i2459J68360Q940j92104P8398J82903j39792j66140K50537J9345k24959O2174
186d4797J91160j71243r5347K40397q2562j70985J40275J34715k41419k3868K57383
197A33709r3807j76852J22847J15608j78523L6574J12541r8363m0681J08581P26
$$ plain form
208 42360 -92265 18548 59384 -52859 -45158 66127 11916 -71629 29734 -61 -30441
219 -30441 29558 42894 -83624 -39734 107585 -7958 -86387 21514 76191 -77035 -23155
230 -23155 86723 -23180 -68704 37985 61873 -78460 7471 79640 -44292 -76541 87225
241 87225 83408 -104265 -21894 85670 22865 -60197 37915 48925 -50822 14698 60546 -1603
253 -1603 -50375 52295 28977 -37209 10129 46735 -1025 -59472 29030 39990 -657 -36148
265 -36148 -8385 19247 5336 1421 -31948 1360 -4354 8485 -8574 -18069 -5448 -12929 4539
278 4539 -14798 2787 -13479 -1420 -18153 -16939 20699 12062 -20164 -56069 41754 42321 -42040
291 -42040 -42041 47506 24005 -54725 32882 34331 -39310 -23414 82730 -1394 -70070 67405 52011
$$ packed form
208D2360j34625J10813M0836j12243P701J11285n4211q3545J01363k9795l0380
219c0441N9999J3336j26518M3890J47319j15543p8429J07901N4677j53226N3880
230b3155J09878j09903m5524J06689K3888j40333Q5931P2169j23932l2249J63766
241H7225l817j87673Q2371J07564o2805q3062R8112J1010r9747O5520M5848o2149
253a603m8772J02670k3318o6186M7338L6606m7760n8447Q8502J0960m0647l5491
265c6148K7763K7632j3911l915l3369L3308n714J2839j7059r495J2621p481J7468
278D539j9337J7585j6266J2059j6733J214L7638q637l2226l5905R7823N67q4361
291d2040jQ9547k3501p8730Q7607J449p3641J5896J06144q4124o8676J37475j5394
$$ plain form
304 52011 -72727 -18823 127876 -14333 -92256 58964 78151 -49986 -27601 84413 -26247
315 -26247 -35113 67538 27277 -71095 14045 80023 -44657 -26895 50673 20129 -55419 14894
327 14894 38282 -30077 1982 5555 -22177 -12603 45265 -35974 -61839 29822 18197 -50377
339 -50377 -34730 34081 -46268 -39355 29673 -13676 -69281 7371 44156 -78272 -28028 62421
351 62421 -5272 -92869 28812 80350 -62386 -36389 59660 19354 -54984 49784 47914 -54866
363 -54866 5577 82698 6516 -60378 68588 55262 -43017 -744 73083 8388 -41983 40295
375 40295 19989 -10236 5019 17586 -30732 -8192 39334 -26492 -33173 1605 9168 -34728
387 -34728 -6309 -4382 -31932 217 -1028 -22329 -30426 27992 -12550 -43890 9792 26636 -22168
$$ packed form
304E2011j24738N3904J46699j42209p7923J51220J9187j28137K2385J12014j10660
315b6247q866J02651m0261r8372Q5140O5978j24680J7762P7568l0544p5548P0313
327A4894K3388o8359L2059L573k7732R574N7868q1239k5865R1661j1625o8574
339e0377J5647O8811q0349O913O9028m3349n5605P6652L6785j22428N0244R0449
351F2421o7693q7597J21681N1538j42736K5997R6049m0306p4338J04768j870j02780
363e4866O0443P7121p6182o6894J28966j3326r8279M2273P3827o4695n0371Q2278
375D0295k0306l0225J5255J2567m8318K2540M7526o5826o681L4778P563m3896
387c4728K8419J927k7550L2149j245k1301q097N8418m0542l1340N3682J6844m8804
$$ plain form
400 -22168 -41448 27676 5782 -16692 -7328 13447 -13598 -15348 33647 -6417 -27057 1733
412 1733 43149 -17708 -29493 33084 24907 -26662 -20040 56645 2573 -30118 12700 30842 -13644
425 -13644 -6363 43438 -15992 -21567 31112 37944 -40394 -10188 55030 -4494 -24548 16001 33743
438 33743 -27323 -1234 23460 -7605 -8245 11011 -973 -36092 22713 8179 -35604 -18991
450 -18991 17966 -7318 -35076 11396 -12064 -20094 5413 16291 -35298 -8464 47728 -18800
462 -18800 -27801 33493 40089 -44293 3412 59585 -8516 -22535 39713 28734 -47778 34979
474 34979 52817 -41836 -27325 68572 19473 -71319 28939 48587 -40621 -33022 56875 -4541
486 -4541 -59047 31180 14244 -46446 -10124 44938 -42311 -45000 41670 4621 -48439 -6903
$$ packed form
400b2168j9280O9124k1894k2474R364K0775k7045j750M8995m0064k0640K8790
412A733M1416o0857j1785O2577q177n1569O622P6685n4072l2691M2818J8142m4486
425a3644P281M9801n9430n575N2679O832p8338L0206O5218n9524k0054M0549J7742
438C3743o1066K6089K4694l1065o40J9256j1984l5119N8805j4534m3783J6613
450a8991L6957k5284k7758M6472k3460q030K5507J0878n1589K6834N6192o6528
462a8800r001O1294O596q4382M7705N6173o8101j4019O2248j0979p6512Q2757
474C4979J7838r4653J4511R5897m9099r0792J00258J9648q9208P599Q9897o1416
486d541n4506R0227j6936o0690L6322N5062q7249k689Q6670l7049n3060M1536
$$ plain form
498 -6903 31718 -33650 -1820 24047 -21968 -14959 33133 7646 -39185 33098 23685 -29174 -3442
511 -3442 45163 -6087 -32801 34972 3664 -22123 13159 27597 -40302 -15142 50519 -4905
523 -4905 -39315 5835 39179 -28468 -10598 30274 -1132 -22309 7853 30296 -19054 -1333
535 -1333 15300 1269 -17232 16054 27074 -25796 -15700 14848 27839 -20018 -14047 11807
547 11807 2190 -7708 -1154 14273 -22821 -5981 8823 1739 -14406 -3050 4550 -24638 1284
560 1284 11799 -1769 -30635 -2628 12010 -2124 93 -15031 -2650 1780 19246 -8359 -11259
573 -11259 11095 2445 -4305 5037 21444 -23269 -7996 19373 4754 -16218 5373 10256 -39124
586 -39124 9370 36740 -18774 -51397 26582 31938 -42542 -1621 28419 -18488 -33902 48064
$$ packed form
498f903L8621o5368L1830K5867m6015P009M8092k5487m6831P2283r413n2859K5732
511c442M8605n1250k6714O7773l1308k5787L5282J4438o7899K5160O5661n5424
523d905l4410M5150L3344o7647J7870M0872l1406k1177L0162K2443m9350J7721
535a333J6633j4031j8501L3286J1020n2870J0096L0548J2991m7857N971K5854
547A1807r617r898O554J5427l7094J6840J4804p084j6145J1356P600k9188K5922
560A284J0515j3568k8866K8007J4638j4134K217j5124J2381M430J7466k7605k900
573a1259K2354q650o750R342J6407m4713J5273K7369j4619k0972K1591M883m9380
586c9124M8494K7370n5514l2623P7979N356p4480M0921L0040m6907j5414Q1966
$$ plain form
598 48064 14927 -48801 10317 36932 -20749 -19088 57657 -8630 -45700 28969 45578 -22576
610 -22576 -17641 37790 -11263 -5525 35554 7071 -38584 17387 36506 -26901 1950 22999
622 22999 -12412 -26664 33774 8403 -36822 8760 8782 -23695 -5919 36251 -32657 -39350 31090
635 31090 15946 -35996 -13204 27380 -26934 -12257 25444 -1201 -36875 6521 28308 -27120
647 -27120 -3844 18862 -3312 -28087 17808 25499 -20903 -10872 11043 13357 -9552 11457
659 11457 678 -8437 6522 13158 7023 -13096 9749 5435 5143 -1231 6963 7074 -6550 3461
673 3461 3633 14068 -7809 -3309 1827 5808 4602 -5284 630 -7594 9873 -1422 -2051 -4803 1173
688 1173 2421 -8519 5698 -5850 569 -2554 988 -8010 2388 9644 -15555 -4505 8260
$$ packed form
598D8064l3137o3728N9118K6615n7681J661P6745o6287l7070P4669J6609o8154
610b2576M935N5431m9053N738M1079k8483m5655N5971J9119o3407K8851K1049
622B2999l5411j4252O0438k5371m5225M5582K2l2477J7776M2170o8908o693P0440
635C1090j5144n1942K2792M0584n4314J4677L7701k6645l5674M3396K1787n5428
647b7120K3276K2706k2174k4775M5895P691m6402J0031K1915K314k2909K1009
659A1457j0779r115J4959O636o135k0119K2845m314k92o374Q194J11j3624J0011
673C461J72J0435k1877M500N136L981j206r886N914q224J7467j1295o29k752N976
688A173J248j0940J4217j1548O419l123L542q998J0398P256k5199J1050J2765
$$ plain form
701 8260 9172 -22291 3839 16008 -14527 -7300 13682 4325 -24985 18478 10483 -23976 -1524
714 -1524 30737 -7561 -33653 30195 14047 -25129 -1787 30234 -16419 -18883 33998 -2106
726 -2106 -25342 8336 25200 -29159 -6267 31025 -14877 -25682 14824 17775 -30002 3362
738 3362 10413 -18811 -3287 20498 -8399 -31170 23193 5647 -20726 3525 17787 -20529
750 -20529 -12506 32175 -7666 -16459 11300 12603 -22369 12008 31346 -22531 -13960 26217 21072
763 21072 -23015 9425 16858 -12031 2277 22284 3601 -25742 14043 11605 -9172 -4046 10533
776 10533 -7964 -20417 15018 5199 -9787 -17527 3156 -9 -3090 2929 -12462 -6639 -3657
789 -3657 10656 -5651 -6169 -5687 -3011 5908 -2324 2686 -8991 1280 -3196 6303 7605 -4622
$$ packed form
701H260R12l1463K6130J2169l0535P227K0982r357k9310M3463p995l4459K2452
714a524L2261l8298k6092O3848j6148l9176K3342L2021m6653k464N2881l6104
726b106k3236L3678J6864n4359K2892L7292m5902j0805M0506K951m7777L3364
738C362P051k9224J5524K3785k8897k2771N4363j7546k6373K4251J4262l8316
750b0529Q023M4681l9841q793K7759J303l4972L4377J9338n3877Q571M0177n145
763B1072m4087L2440P433k8889J4308K0007j8683k9343L9785k438k0777N126J4579
776A0533j8497j2453L5435r819j4986p740K0683l165l081O019j5391N823K982
789c657J4313j6307n18M82K676Q919q232N010j1677J0271m476R499J302j2227
$$ plain form
803 -4622 -6574 -3551 17730 2476 276 -7522 2414 8093 5137 5923 -8305 1053 -1822 11720
817 11720 2270 -4312 -5158 -191 7690 -5313 9281 -3054 -10329 -4842 20500 6793 -21471 2246
831 2246 8630 1067 -4944 16178 -10434 -17718 17198 12022 -13312 -11662 16918 -12886 -7656 16759
845 16759 2232 -23364 -3891 21950 -10257 -2020 5091 -5562 -10028 18405 12297 -21927 2308
858 2308 10818 1774 -5126 15356 -5944 -14375 16335 7654 -7029 -4098 12783 -14356 -142
871 -142 20480 -3578 -19681 1441 19786 -13326 -962 4523 -9905 -11728 12558 7648 -25493
884 -25493 -2848 4901 -3605 -12528 8298 -2700 -20774 3701 8704 -493 -13868 7468 -1388
897 -1388 -1710 10868 4272 -6343 -4581 20118 1687 -201 3274 4839 -310 5426 13593 -6304
$$ packed form
803d622j952L023K1281j5254k200p798R936N679k956P86j4228R358k875J3542
817A1720r450o582q46M967P881j3003J4594j2335p275N487K5342j3707k8264K3717
831B246O384p563o011K1122k6612p284L4916n176k5334J650K8580k9804N230K4415
845A6759j4527k5596J9473K5841l2207Q237P111j0653m466K8433o108l4224K4235
858B308Q510r044o900K0482k1300q431L0710q681j4683K931J6881k7139J4214
871a42K0622k4058j6103K1122J8345l3112J2364N485j4428j823K4286m910l3141
884b5493K2645P749q506q923K0826j0998j8074K4475N003r197j3375K1336q856
897a388l22J2578o596j0615J762K4699j8431j888L475J565n149N736Q167j9897
$$ plain form
911 -6304 2340 3125 6229 -522 8453 3136 -10405 7795 6822 3084 -8427 5344 -1850 -2248 6731
926 6731 -2963 -6462 -7026 9385 -8096 -4665 -856 -4383 -6703 -3877 5140 -10043 -2547 -5902 1165
941 1165 -1657 -2354 -2006 -7230 3447 -4088 4462 -5035 -3865 -673 3328 110 -8026 8297 -2562
956 -2562 -2019 -74 8518 -3070 -3932 10466 -638 849 3241 10423 -7662 3878 11973 -1766
970 -1766 -1277 4841 9242 -9086 6280 4936 -2583 -620 3759 523 -8078 10597 -2889 -5061
984 -5061 -1318 5740 -4342 -5117 7722 -7350 -2171 453 4393 -9500 845 5300 -9469 -961
998 -961 3603 3293 -13827 4083 5181 -4768 -1949 3808 1757 -9962 11053 2627 -5347 -2806 9009
1013 9009 1000 -8919 9835 313 -4946 -3418 11650 -3515 -7577 5244 -2216 -1451 -942 7066
$$ packed form
911f304Q644P85L104o751Q975n317j3541J8200r73l738j1511J3771p194l98Q979
926F731r694l499n64J6411j7481L431L809l527k320K826R017j5183P496l355P067
941A165k822o97L48n224J0677p535Q550r497J170L192M001l218q136J6323j0859
956b562N43J945Q592j1588q62J4398j1104J487K392P182j8085J1540Q095j3739
970a766M89O118M401j8328J5366j344p519J963M379l236q601J8675j3486k172
984e061L743P058j0082p75J2839j5072N179K624L940j3893J0345M455j4769Q508
998i61M564l10j7120J7910J098r949K819N757k051j1719K1015q426p974K541J1815
1013I009q009r919J8754r522n259J528J5068j5165m062J2821p460P65N09Q008
$$ plain form
1027 7066 -11423 -2143 6292 -1109 -3728 -1774 2981 -9045 6906 286 -4904 -2961 2756 -205
1041 -205 -6264 9107 -5266 -4940 909 8901 -4163 -3667 7322 -4872 2659 4316 5531 -9056
1055 -9056 3321 8842 -2104 1830 1829 4077 -5960 7855 1974 -623 405 -1204 3610 -516 5700
1070 5700 -6660 978 404 872 1085 -1199 -1096 -6506 8015 -2854 -3212 -2559 2297 -2991 -4686 6954
1086 6954 -6052 -3320 -2076 5280 -5179 -1512 2726 -7055 797 1449 3044 -9504 2407 2277
1100 2277 -2289 799 -102 427 -6014 7904 -1933 -2222 1498 2424 -2086 -2054 10036 -5218 -1995 1617
1116 1617 5650 -4891 69 7130 -7431 428 4263 3696 -10514 4663 6390 -6823 -159 5327
1130 5327 1812 -10559 8763 2383 -5146 1480 5452 -2915 -5424 12055 -4134 -4410 3026 6144
$$ packed form
1027G066j8489R280Q435p401k619J954M755j2026J5951o620n190J943N717k961
1041b05o059J5371j4373L26N849P992j3064M96J0989j2194P531J657J215j4587
1055i056J2377N521j0946L934jK248j0037J3815n881k597J028j609M814m126O216
1070E700j2360P638n74M68K13k284J03n410J4521j0869l58O53M856n288j695J1640
1086F954j3006K732J244P356j0459L667M238r781P852O52J595j2548J1911j30
1100B277m566L088r01N29o441J3918r837k89L720R26m510L2J2090j5254L223L612
1116A617M033j0541M960P061j4561P859L835n67j4210J5177J727j3213O664N486
1130E327l515j2371J9322o380p529O626L972q367k509J7479j6189k76P436L118
$$ plain form
1144 6144 -6102 -1162 9658 -7421 805 4198 2088 -7822 6290 4782 -8687 3581 4383 -436
1158 -436 -7455 9088 -1514 -6058 4109 454 -4106 -3792 7872 -8754 -2678 3203 -1456 -6353
1172 -6353 -540 4520 -8886 1793 -1497 -1864 -2960 2584 -1771 -6369 5409 -3325 -620 -1763
1186 -1763 2721 -4700 -6 4191 -5493 2361 784 1517 -5014 7495 2090 -4558 4827 3218 2198
1201 2198 -1543 9289 -2974 304 7381 2621 -1649 1071 8695 -7025 3135 4960 41 -4775
1215 -4775 3692 4765 -7772 4746 1241 -3088 -5277 7770 -1343 -9642 4191 -501 -3734 -4954
1229 -4954 6035 -7833 -6132 4536 -2574 -6455 -2102 5855 -11057 -163 4918 -3521 -6775 3676
1243 3676 5798 -9956 5081 4041 -3281 -3774 10152 1185 -9277 8336 3335 -3705 -2614 11158
$$ packed form
1144F144j2246M940J0820j7079Q226L393k110r910J4112j508j3469J2268Q02m819
1158d36p019J6543j0602m544J0167l655m560L14J1664j6626O076N881m659m897
1172f353N813N060j3406J0679l290l67j096N544m355m598J1778q734K705j143
1186a763M484p421M694M197r684P854j577P33o531J2509n405o648R385j609j020
1201B198l741J0832j2263L278P077m760m270K720P624j5720J0160J825m919m816
1215d775Q467J073j2537J2518l505m329k189J3047r113q299J3833m692l233j220
1229d954J0989j3868J701J0668p110l881M353P957j6912J0894N081q439l254J0451
1243C676K122j5754J5037j040p322m93J3926q967j0462J7613n001p040J091J3772
$$ plain form
1257 11158 -4237 -5780 8797 1273 -4377 -144 9314 -8629 163 7686 -1715 -5165 3170 6333
1271 6333 -8798 3696 2440 -2441 -3432 4973 -39 -7014 5881 -1499 -2323 -1568 5260 -3375 -2603
1286 -2603 5134 -2513 610 -186 3987 -4922 2530 2348 -2443 1233 3 2285 -4428 3647 -1394
1301 -1394 618 390 -1871 1121 -484 3525 -4118 3745 -825 -723 2114 1794 -1014 -3965 7086
1316 7086 -3388 -1201 1580 1646 -6050 -1427 7432 -6727 -2582 147 1193 -7070 2636 2270 -9981
1331 -9981 -467 3217 717 -8792 5243 -399 -5935 2931 4172 -2860 -7007 9013 -1810 -2394
1345 -2394 4071 2978 -6101 23 13699 -4474 -2608 4780 5901 -4579 5729 8977 -8264 773
1359 773 8720 4826 -8191 6286 3947 -7547 3018 8240 -2123 -11776 8472 1370 -5218 922
$$ packed form
1257A1158j5395j543J4577p524n650M233R458j7943Q792P523r401l450Q335L163
1271F333j5131J2494j256m881r91Q405n012o975J2895p380q24P55O828q635P72
1286b603P737p647L123p96M173q909P452j82m791L676j230K282o713Q075n041
1301a394K012k28k261K992j605M009p643P863m570J02K837l20k808k951J1051
1316G086j0474K187K781O6p696M623Q859j4159M145K729J046q263R706l66j2251
1331i981R514L684k500r509J4035n642n536Q866J241p032m147J6020j0823n84
1345b394O465j093r079O124J3676j8173J866P388J121j0480J0308L248j7241R037
1359G73P947l894j3017J4477k339j1494J0565N222j0363r653K0248p102o588O140
$$ plain form
1373 922 2213 -7442 -5106 12101 -4621 -7762 124 4039 -6389 72 6794 -9927 -4007 3636
1387 3636 3889 -8599 1252 1592 -7737 2191 5038 -1590 -10896 5806 2579 -2560 499 909 -2609
1402 -2609 -3847 9530 -796 -3429 -1491 3893 -216 -782 5537 -4195 -1922 -104 7815 -1419 -3203
1417 -3203 1376 664 2585 23 5075 -5402 -423 3767 4214 -1777 -2871 4894 -3427 2125 2403
1432 2403 2037 -6664 367 6160 -3063 193 -81 475 -5874 6643 3224 -6500 -953 4054 1632
1447 1632 -5462 6656 -1401 -4994 1894 6497 -2939 -5894 7609 -2224 -3138 2418 5410 -7549
1461 -7549 -3043 8511 -3242 -4092 1145 4055 -8623 1476 6017 -5929 -4262 3550 2954 -9924
1475 -9924 4038 3157 -6151 -3370 5735 283 -9090 6187 922 -5252 -1367 7711 -3784 -6567
$$ packed form
1373I22J291r655K336J7207j6722l141P886L915j0428O461O722j6721N920P643
1387C636K53j2488R851L40r329R928K847o628r306J6702l227n139L059M10l518
1402b609j238J3377j0326k633J938N384m109n66O319r732K273J818P919r234j784
1417c203M579p12J921k562N052j0477M979M190M47n991j094P765q321N552K78
1432B403l66q701P031N793r223L256k74N56o349J2517l419r724N547N007k422
1447A632p094J2118q057l593O888M603r436k955J3503r833r14N556K992j2959
1461g549M506J1554j1753q50N237K910j2678J0099M541j1946J667P812n96j2878
1475i924J3962q81r308K781R105n452r373J5277n265o174L885R078j1495k783
$$ [...]
8191a20
##END NTUPLES=NMR FID
##END=
