##TITLE=1H_EC-3099(XI-3)
 CDcl3, 8 sc, 
 30.9.2020
##JCAMPDX= 6.0         $$ Bruker NMR JCAMP-DX V2.0
##DATA TYPE= NMR FID
##DATA CLASS= NTUPLES
##ORIGIN= UXNMR, Bruker Analytische Messtechnik GmbH
##OWNER= root
$$ XWIN-NMR		Version 3.5
$$ Wed Sep 30 10:10:34 2020 Russian Standard Time (UT+4h)  she@DPX200
##.OBSERVE FREQUENCY= 200.1315066352
##.OBSERVE NUCLEUS= ^1H
##.DELAY= (6, 6)
##.ACQUISITION MODE= SIMULTANEOUS
##.ACQUISITION SCHEME= undefined
##.AVERAGES= 8
##.DIGITISER RES= 18
##SPECTROMETER/DATA SYSTEM= spect
##.PULSE SEQUENCE= zg30
##.SOLVENT NAME= CDCl3
##.SHIFT REFERENCE= (INTERNAL, CDCl3, 0, 15.7039)
##AUDIT TRAIL= $$ (NUMBER, WHEN, WHO, WHERE, WHAT)
$$ ##TITLE= Audit trail, XWIN-NMR		Version 3.5
$$ ##JCAMPDX= 5.01
$$ ##ORIGIN= Bruker BioSpin GmbH
$$ ##OWNER= she
$$ F:/spectra/data/she/nmr/H-F/1/audita.txt
$$ ##AUDIT TRAIL=  $$ (NUMBER, WHEN, WHO, WHERE, WHAT)
(   1,<2020-09-30 10:09:35.17 +0400>,<she>,<DPX200>,
      <created by zg, POWCHK disabled, PULCHK disabled
       configuration hash MD5:
       00 E9 B6 7A A2 85 ED C7 34 08 36 98 17 FE 4E 26
       data hash MD5: 16K
       2E C9 10 14 F1 9E 09 5E F8 15 B3 C1 0C 23 26 C0>)
$$ ##END=
$$ 
$$ hash MD5
$$ 6E B2 90 10 01 33 EB FA EA A8 CB C1 8D 14 58 2D
##$RELAX= 
##$RELAX= 
##$RELAX= 
##$RELAX= 
##$RELAX= 
##$RELAX= 
$$ Bruker specific parameters
$$ --------------------------
##$DU= <F:/spectra>
##$EXPNO= 1
##$NAME= <H-F>
##$PROCNO= 1
##$TYPE= <nmr>
##$USER= <she>
##$AMP= (0..31)
100 100 100 100 100 100 100 100 100 100 100 100 100 100 100 100 100 100 
100 100 100 100 100 100 100 100 100 100 100 100 100 100 
##$AQSEQ= 0
##$AQ_mod= 1
##$AUNM= <au_zg>
##$AUTOPOS= <>
##$BF1= 200.13
##$BF2= 200.13
##$BF3= 200.13
##$BF4= 200.13
##$BF5= 200.13
##$BF6= 200.13
##$BF7= 200.13
##$BF8= 200.13
##$BYTORDA= 1
##$CFDGTYP= 0
##$CFRGTYP= 5
##$CHEMSTR= <none>
##$CNST= (0..31)
1 1 145 1 1 1 1 1 1 1 1 1 1 1 1 1 1 1 1 1 1 1 1 1 1 1 1 1 1 1 1 1 
##$CPDPRG= <>
##$CPDPRG1= <>
##$CPDPRG2= <>
##$CPDPRG3= <>
##$CPDPRG4= <mlev>
##$CPDPRG5= <mlev>
##$CPDPRG6= <mlev>
##$CPDPRG7= <mlev>
##$CPDPRG8= <mlev>
##$CPDPRGB= <>
##$CPDPRGT= <>
##$D= (0..31)
0 1.2 0 0 0 0 0 0 0 0.06 0 0.03 0 0 0 0 0.0002 0 0 0 0 0 0 0 0 0 0 0 0 
0 0 0 
##$DATE= 1601446174
##$DBL= (0..7)
120 120 120 120 120 120 120 120 
##$DBP= (0..7)
150 150 150 150 150 150 150 150 
##$DBP07= 0
##$DBPNAM0= <>
##$DBPNAM1= <>
##$DBPNAM2= <>
##$DBPNAM3= <>
##$DBPNAM4= <>
##$DBPNAM5= <>
##$DBPNAM6= <>
##$DBPNAM7= <>
##$DBPOAL= (0..7)
0.5 0.5 0.5 0.5 0.5 0.5 0.5 0.5 
##$DBPOFFS= (0..7)
0 0 0 0 0 0 0 0 
##$DE= 6
##$DECBNUC= <off>
##$DECIM= 32
##$DECNUC= <off>
##$DECSTAT= 4
##$DIGMOD= 1
##$DIGTYP= 9
##$DL= (0..7)
0 120 120 120 120 120 120 120 
##$DP= (0..7)
150 150 150 150 150 150 150 150 
##$DP07= 0
##$DPNAME0= <>
##$DPNAME1= <>
##$DPNAME2= <>
##$DPNAME3= <>
##$DPNAME4= <>
##$DPNAME5= <>
##$DPNAME6= <>
##$DPNAME7= <>
##$DPOAL= (0..7)
0.5 0.5 0.5 0.5 0.5 0.5 0.5 0.5 
##$DPOFFS= (0..7)
0 0 0 0 0 0 0 0 
##$DQDMODE= 0
##$DR= 18
##$DS= 0
$$ [...]
##$SUBNAM2= <"">
##$SUBNAM3= <"">
##$SUBNAM4= <"">
##$SUBNAM5= <"">
##$SUBNAM6= <"">
##$SUBNAM7= <"">
##$SUBNAM8= <"">
##$SUBNAM9= <"">
##$SW= 16.880792210976
##$SWIBOX= (0..15)
0 0 2 0 0 0 0 0 0 0 0 0 0 0 0 0 
##$SW_h= 3378.37837837838
##$TD= 16384
##$TD0= 1
##$TE= 0
##$TE2= 300
##$TE3= 300
##$TEG= 300
##$TL= (0..7)
0 120 120 120 120 120 120 120 
##$TP= (0..7)
150 150 150 150 150 150 150 150 
##$TP07= 0
##$TPNAME0= <>
##$TPNAME1= <>
##$TPNAME2= <>
##$TPNAME3= <>
##$TPNAME4= <>
##$TPNAME5= <>
##$TPNAME6= <>
##$TPNAME7= <>
##$TPOAL= (0..7)
0.5 0.5 0.5 0.5 0.5 0.5 0.5 0.5 
##$TPOFFS= (0..7)
0 0 0 0 0 0 0 0 
##$TUNHIN= 0
##$TUNHOUT= 0
##$TUNXOUT= 0
##$USERA1= <user>
##$USERA2= <user>
##$USERA3= <user>
##$USERA4= <user>
##$USERA5= <user>
##$V9= 5
##$VALIST= <valist>
##$VCLIST= <CCCCCCCCCCCCCCC>
##$VD= 0
##$VDLIST= <DDDDDDDDDDDDDDD>
##$VPLIST= <PPPPPPPPPPPPPPP>
##$VTLIST= <TTTTTTTTTTTTTTT>
##$WBST= 1024
##$WBSW= 4
##$XGAIN= (0..3)
0 0 0 0 
##$XL= 0
##$YL= 0
##$YMAX_a= 271141
##$YMIN_a= -270692
##$ZGOPTNS= <>
##$ZL1= 120
##$ZL2= 120
##$ZL3= 120
##$ZL4= 120
##$ABSF1= 10
##$ABSF2= 0
##$ABSG= 5
##$ABSL= 3
##$ALPHA= 0
##$AQORDER= 0
##$ASSFAC= 0
##$ASSFACI= 0
##$ASSFACX= 0
##$ASSWID= 0
##$AUNMP= <proc_1d>
##$AZFE= 0.1
##$AZFW= 0.1
##$BCFW= 1
##$BC_mod= 2
##$BYTORDP= 1
##$COROFFS= 0
##$CY= 11.3945322036743
##$DATMOD= 1
##$DC= 2
##$DFILT= <>
##$DTYPP= 0
##$F1P= 16.9975609425685
##$F2P= -3.02152046262296
##$FCOR= 0.5
##$FTSIZE= 0
##$FT_mod= 4
##$GAMMA= 1
##$GB= 0.15
##$INTBC= 1
##$INTSCL= 1
##$ISEN= 128
##$LB= 0.24
##$LEV0= 0
##$LPBIN= 0
##$MAXI= 10000
##$MC2= 0
##$MEAN= 0
##$ME_mod= 0
##$MI= 1.114404
##$NCOEF= 0
##$NC_proc= 0
##$NLEV= 6
##$NOISF1= 3.799351
##$NOISF2= 2.8
##$NSP= 1
##$NTH_PI= 0
##$NZP= 0
##$OFFSET= 15.70392
##$PC= 1
##$PHC0= -9968.731
##$PHC1= 11.40089
##$PH_mod= 1
##$PKNL= yes
##$PPARMOD= 0
##$PSCAL= 0
##$PSIGN= 0
##$REVERSE= no
##$SF= 200.130013532006
##$SI= 16384
##$SIGF1= 3
##$SIGF2= 2
##$SINO= 400
##$SIOLD= 16384
##$SREGLST= <1H.CDCl3>
##$SSB= 0
##$STSI= 0
##$STSR= 0
##$SW_p= 3612.71676300578
##$SYMM= 0
##$S_DEV= 0
##$TDeff= 0
##$TDoff= 0
##$TI= <>
##$TILT= no
##$TM1= 0
##$TM2= 0
##$TOPLEV= 0
##$USERP1= <user>
##$USERP2= <user>
##$USERP3= <user>
##$USERP4= <user>
##$USERP5= <user>
##$WDW= 1
##$XDIM= 8192
##$YMAX_p= 0
##$YMIN_p= 0
$$ End of Bruker specific parameters
$$ ---------------------------------
##NTUPLES= NMR FID
##VAR_NAME=  TIME,          FID/REAL,        FID/IMAG
##SYMBOL=    X,             R,               I
##VAR_TYPE=  INDEPENDENT,   DEPENDENT,       DEPENDENT
##VAR_FORM=  AFFN,          ASDF,            ASDF
##VAR_DIM=   8192,          8192,            8192
##UNITS=     SECONDS,       ARBITRARY UNITS, ARBITRARY UNITS
##FACTOR=    0.000296,      1,               1
##FIRST=     0,             0,               0
##LAST=      2.424536,      0,               0
##MIN=       0,             -270692,         0
##MAX=       2.424536,      271141,          0
$$ Real data points
##PAGE= N=1
##DATA TABLE= (X++(R..R)), XYDATA
0@%%%%%%%%%%%%Qj6J6j6J6k4L2m0M8n6P2q6R8j14J34j56J80k06K36k74L14l56
$$ 0 0 0 0 0 0 0 0 0 0 0 0 0 8 -8 8 -8 8 -16 16 -24 24 -32 40 -46 52 -62 72 -84 96 -110 126 -148 166 -190
34a90M07m60N17n82O54p33Q20r14J018j132J255j390J537j698J874k066K276k506
$$ -190 217 -243 274 -308 346 -387 433 -481 537 -595 660 -730 807 -891 983 -1083 1193 -1313
52a313K760l042L353l700M090m530N031n611O289p088Q054r250J0778j2809J5664
$$ -1313 1447 -1595 1758 -1942 2148 -2382 2649 -2962 3327 -3761 4293 -4957 5821 -6988 8676
67H676k0030K7844o8725K77197j78292l17362K90158J52033k87708N5552K71065
$$ 8676 -11354 16490 -52235 224962 46670 -270692 19466 171499 -116209 -60657 210408
78B10408k14686q8213K31678M0865k88569J71087J40937j98116n5327J80012J6442
$$ 210408 -4278 -92491 139187 180052 -108517 62570 203507 5391 -49936 130076 146518
89A46518j97377O4273L9956j9673Q12l057p0810L931J26609j07413k7036M4926
$$ 146518 -50859 13414 53370 33697 34509 31452 -39358 -35427 91182 -16231 -43267 1659
101A659K1150n3067M4458J4722r2568Q5743K2855p0840l7462J58575n9244j63841
$$ 1659 22809 -30258 14200 28922 -63646 22097 44952 -25888 -63350 95225 35981 -127860
113a27860J25898Q9839r3352j02274J31343j5446o7260M6920K6902q0897j6531
$$ -127860 -1962 87877 -5475 -107749 23594 8148 -59112 -12192 14710 -66187 -82718
124h2718J55551q5335q3286O4025R8883q7146o7423J27646O541o5975l8478J09368
$$ -82718 72833 -12502 -95788 -31763 67120 -20026 -87449 40197 46738 -19237 -57715 51653
136E1653j6179m7688J7298R336k730k5397O9951o0921m1671M9222P1205q8272
$$ 51653 35474 -12214 5084 14420 11690 -13707 56244 -4677 -46348 2874 74079 -14193
148a4193p4657J33512J47q3695j6292J20900n2466o9007Q2213O86m7061K0204
$$ -14193 -88850 44662 44809 -38886 -55178 65722 13256 -55751 26462 27148 -19913 291
160B91P6303j14943R890J07664l8046j02101N3169J06721j19311o831N6321j1484
$$ 291 76594 -38349 -28459 79205 41159 -60942 -7773 98948 -20363 -27194 29127 17643
172A7643m5048N2129k864q3414R1118J1418p6431j6267J13849m7457p6676Q6428
$$ 17643 -27405 24724 21860 -61554 29564 40982 -35449 -51716 62133 14676 -62000 24428
184B4428p439m1342K1035N0357j05988M2901R5377j01421n1367J06221M0434j55831
$$ 24428 16989 -24353 -3318 47039 -58949 -16048 79329 -22092 -73459 32762 73196 -82635
196h2635O5191Q2382q2899k6605R1741l3246r6619J40585k821j27693L1812J41800
$$ -82635 -17444 64938 -17961 -44566 47175 13929 -82690 57895 55074 -72619 -40807 100993
208A00993r7659j07860J50448M693j05150J6543J01881r9963k1435J09693n9682
$$ 100993 3334 -104526 45922 50615 -54535 -37992 63889 -36074 -57509 52184 -7498
219g498o7815P7061P1191j49043J4500J19766l7932q5022M8438O8001q5805K7151
$$ -7498 -75313 1748 72939 -76104 -61604 58162 20230 -64792 -16354 51647 -34158 -7007
231g007K7419k5867k2003N6725j690p5443N5931K3016k5158m3866N5677P703l2850
$$ -7007 20412 -5455 -27458 29267 27577 -47866 8065 31081 5923 -37943 17734 25437 -7413
244g413O468r550L1608r679N491l8580L3044K5741l1777m273M625K5775l1030
$$ -7413 -945 -10495 21113 11434 16925 -21655 11389 37130 5353 1080 5705 31480 450
257D50K8646k3591j1574K7441N580k9408k6916P1107k7594m0279J815N3623k0167
$$ 450 29096 5505 -6069 21372 26952 -2456 -29372 41735 14141 -26138 -24323 29300 9133
270I133m8889L4410J515N890k7186K3757j7410m593K8046l691k2301k5853P2789
$$ 9133 -39756 -5346 -3831 2059 -25127 -1370 -18780 -23373 4673 982 -21319 -47172 25617
283B5617j7804m8229M284P0100k4293p8923O9878K9753m6842l4289Q1289k6838
$$ 25617 7813 -40416 -36132 33968 9675 -69248 630 30383 -16459 -50748 30541 3703
295C703n1108O7572M993o6475O050J14588q2024o6192R4149L8795r4578r892J08054
$$ 3703 -47405 20167 25160 -41315 -35265 79323 -2701 -68893 25256 64051 -30527 -40419 67635
308F7635o1076l5334M8919J7766o4603L0199N2577p9368R744N3143n809p0567
$$ 67635 6559 -28775 20144 37910 -26693 3506 56083 -23285 -13541 39602 33793 -36774
320c6774M6577L1482m1737R508j76M90m408L7969n2532n468N8148k3688m2940
$$ -36774 9803 41285 -452 9056 8880 9370 4962 42931 -9601 -15069 43079 19391 -23549
333b3549K1995M8311p2734J4738L7806l5858k5439N2730L049r3608O6562N0221
$$ -23549 -1554 46757 -25977 -11239 26567 -9291 -34730 18000 21049 -72559 -5997 44224
345D4224o9988m9935R8803J0464r9891M6444M8256l9051m1026Q2313k1287o3226
$$ 44224 -25764 -75699 23104 33568 -66323 -19879 28377 -10674 -51700 30613 9326 -53900
357e3900O1676L1239o3284k6148J02861l5744o5823L9875N3872m5664l9519O4948
$$ -53900 7776 39015 -24269 -50417 52444 16700 -49123 -9248 44624 -1040 -40559 24389
369B4389j7203j7239R980K0795l4631O731M0770l5732q088J1603L0713l5602p53
$$ 24389 7186 -10053 -73 20722 -13909 -7178 33592 -2140 -10228 1375 32088 -3514 -4267
382d267J5214k53L796k2202J2388Q18J8728l3971K001K2204p657o376j0352K1654
$$ -4267 10947 10694 14490 -7712 4676 5494 24222 -9749 -7748 14456 6799 423 -9929 11725
396A1725k1928J8279m310j3065l82J7302Q468m0200K2349J0236M728l1243J1867
$$ 11725 -10203 8076 3766 -9299 -9681 7621 16089 -24111 -1762 8474 13202 -18041 -6174
409f174K7190j7686p394k498K9951k6221N781O246n579p460J2881J7182n3805
$$ -6174 21016 3330 -4064 -6562 23389 -2832 2949 9195 3616 -3844 9037 26219 -27586
422b7586K0818L0696j3985m8918L4201L3963n6289O53K8798J670m5942L9537O349
$$ -27586 -6768 23928 9943 -38975 -4774 29189 -27100 -26447 2351 4021 -41921 -2384 3965
435C965m3774K5839K7978k8205l6410P1779n984m9743J7064M4016k4226l1257
$$ 3965 -39809 -13970 14008 -14197 -50607 21172 15188 -34555 -17491 26525 2299 -28958
447b8958N3177j9523j5276J9303J7410m0635O038M8741m1096j5764K5823K3527
$$ -28958 24219 4696 -10580 8723 26133 -14502 -8464 40277 -819 -16583 9240 32767
459C2767m9331J1263K7477k5036K059Q961L16l0006M0603k714l3113J1133K7970
$$ 32767 -16564 -5301 22176 -2860 -801 8160 8476 -21530 19073 16359 -16754 -5621 22349
472B2349j1508l3624M1197r423j1569P084J1233k0508O31L6512l8968o126K6318
$$ 22349 10841 -22783 18414 8991 -2578 4506 15739 -4769 -4138 32374 -6594 -12720 13598
485A3598J3785m8221J1253L7047l4269m117J5526M386l6550L5503O989m3714J2595
$$ 13598 27383 -20838 -9585 27462 -6807 -10924 4602 8988 -27562 7941 14930 -28784 -16189
498a6189L6781j6356m9731N4581Q708l9291q82L7110j1945l3537M0490j0213j8359
$$ -16189 20592 4236 -45495 9086 17794 -21497 -22379 14731 2786 -30751 9739 -474 -18833
511a8833P655K9160l3615j5880M4593r557k2173n837L9096j9490j1866J3773M457
$$ -18833 -11178 17982 -15633 -31513 13080 3523 -18650 -24487 14609 -4881 -16747 -2974 1483
524A483k070r446K1948j5497P588K262O985j0026k889K5277j4253m894n667K7332
$$ 1483 -587 -10033 11915 -3582 4006 6268 13253 3227 338 25615 11362 6468 801 28133
538B8133j3104j3236P903L776L138j6192J4103j4144Q245k032l052j759l368J0414
$$ 28133 15029 1793 9696 13472 16610 418 14521 377 8622 6590 3538 1779 -1589 8825
552H825j6219J1149j0224O677L33m996p332O144K3066l5132l01K0898J0819l4400
$$ 8825 -7394 3755 -6469 208 541 -4455 -11787 -5643 17423 -17709 -18010 2888 13707 -20693
566b0693O891K9593k8039NJ6382N345l7429K8418J9167l6303j191L1994P62n0763
$$ -20693 -13802 15791 -12248 -12243 4139 9484 -27945 473 19640 -16663 -17854 14140 14902 -35861
580c5861L6737K2689l0721j7694L4467N634l8680K9246M760j9129o580L7360j5180
$$ -35861 876 23565 -7156 -24850 9617 15251 -23429 5817 10577 -8552 -15132 22228 7048
593G048l2181L3079P511j8829j2780L5356j6387j5164J5978K713o531p695J7920
$$ 7048 -25133 7946 15457 -3372 -16152 19204 2817 -12347 3631 6344 -187 -7882 10038
606A0038k1188J0318Q348q080r285P285J2664j8823J5210p970k569N023J3684
$$ 10038 -11150 -832 7516 -564 -9849 -2564 10100 -8723 6487 -1483 -4052 971 14655
619A4655j5264j2292L3427j3975j3029Q043K4227k9527o271L0696j2868j1755
$$ 14655 -609 -12901 20526 6551 -6478 1565 25792 -3735 -10006 20690 7822 -3933
631c933O208J7301l3318J2722K3062k2225j7050J8546K1036l7565P943J2448k524
$$ -3933 2275 19576 -13742 -1020 22042 -183 -17233 1313 22349 -15216 -7273 5175 2651
644B651j6324J0910J1991k3250J0056P01L604j3318J3122J740j5110O199O550
$$ 2651 -13673 -2763 9228 -14022 -3966 -3265 339 -12979 143 1883 -13227 -7028 -478
657d78Q691k6191J1263P992M64j0629J811J2589j6544J0370p35K145j1798J2692
$$ -478 8213 -17978 -6715 1277 1741 -8888 -7077 5512 -11032 -662 -1397 748 -11050 1642
671A642K335j4926J2947K59l04j4254J9624l228p590N035j972L691l644J3601
$$ 1642 3977 -10949 1998 2257 1953 -12301 7323 4095 -3495 1540 -432 3259 -385 13216
685A3216k0342Q169R175m649o051L208J1427j9687J4413M30n608m795J3559l695
$$ 13216 -7126 1043 10218 5569 -482 2726 14153 -5534 8879 9309 3701 -1094 12465 8770
699H770j8132K3837m146j1142o957K5073j1213j6343J7345k197p068l970K0378
$$ 8770 -9362 14475 10329 -813 -7770 17303 6090 -10253 7092 4895 -2173 -6143 14235
712A4235k2778j406J8366o192j5416N127K3432k8783K274J4196q26j7144R625
$$ 14235 -8543 -9949 8417 2225 -13191 -8064 15368 -13415 -11141 3055 2229 -14915 -5290
725e290J2701k3690J3129N418o371j3475K2370M21k3479J5214P198n582j4391
$$ -5290 7411 -16279 -3150 2268 -4103 -17578 4792 5213 -18266 -3052 4146 -1436 -15827
738a5827K3063p745r250J2218j90o293l472K1504j9426j06J0618J337r798J124
$$ -15827 7236 -509 -9759 2459 2269 -4024 -7496 14008 -5418 -5524 5094 6431 -3367 -2243
752b243J3722j6541R510j156N72n820Q927l38j2472J4804n222O37p081J0967o141
$$ -2243 11479 -5062 4448 3292 3864 -1956 6971 6633 -5839 8965 3743 4380 -2701 8266 2125
767B125j300P509j0632N348j280Q350j4875O205M801m444J30k459Q973j1587Q049
$$ 2125 825 8334 -2298 3050 1770 10120 -4755 1450 6251 1807 1937 -522 8451 -3136 4913
782D913m651L357j101k905L939p460R040p339O077j0729L428O434m832m922m127
$$ 4913 262 3619 2518 -387 3552 -3908 5132 -2207 3870 -6859 -3431 3003 -1829 -6751 -10878
797a0878J7057j6011R53N292K014j1233K992J5612j9010N166O111K521j6223J5264
$$ -10878 6179 -9832 -8879 -3587 -1573 -12806 -9814 5798 -13212 -8046 -1935 586 -15637 -373
811c73R401k2058O424J1276L347k0759J7281K061j0928N689O541k414j4571K0537
$$ -373 9028 -13030 -6606 4670 8017 -12742 4539 6600 -4328 1361 7902 5488 -9083 11454
825A1454o235n400K388O460o319o066J5893j1427J973j858M520p285N474N246
$$ 11454 5219 -181 2207 8667 2348 -3718 12175 748 2721 863 5383 -1902 3572 8818
839H818j6840R799K395J034j2752J3008k936j0104J2620l11o344p497K2010j4303
$$ 8818 -8022 1777 4172 5206 -7546 5462 2526 -7578 5042 4731 -1613 -9110 12900 -1403
853a403o776J3985J275j4317j437K4957j9528m360R164N130j4323N455J4826k2495
$$ -1403 -8179 5806 7081 -7236 -8673 16284 -3244 -7604 1560 6690 -7633 -2178 12648 -9847
867i847M681R959L041j9328J1143Q216j4360M896L069K996j4756J2250k424k799
$$ -9847 -5166 4793 7834 -11494 -351 7865 -6495 -1599 1470 4466 -10290 1960 -464 -3263
881c263L277m489J222l854J0503j1248M868j506j824M294K40N22j0815J5724n388
$$ -3263 14 -4475 -3253 -7107 3396 -7852 -2984 -4490 -6314 -2020 -1780 -1258 -12073 3651 -1737
896a737j795J708M656l876m785J5100j0092J616q20O655o863K831P217j1910N620
$$ -1737 -3532 -1824 2832 -1044 -5829 9271 -821 795 -25 6630 -233 2598 9815 -2095 3525
911C525o16O806r233M693j877k211P633o899J816l840R027j1247N022M497q532
$$ 3525 2909 9715 482 5175 3298 1087 8720 1821 3637 -203 8824 -2423 2599 7096 -1436
926a436J049J773N526j4882J2623j563q885K736R492l979j6389J8947k867o287
$$ -1436 -387 1386 6912 -7970 4653 3090 -5795 -3059 6433 2454 -13935 5012 2145 -4142
940d142j702J1335q159p895J7438q434m565R04J1962j4624J492J2267j0136k525
$$ -4142 -5844 5491 -2668 -10563 6875 -1559 -6124 -5220 6742 -7882 -6390 5877 -4259 -6784
954f784L277J0086j6262P653M158p003O10N803J486j4833J5694k634m632k76P764
$$ -6784 -3507 6579 -9683 -2030 2128 -4875 -4265 1538 3024 -11809 3885 1251 -3381 -3657 4107
969D107m956p779J6261q928k146J792Q673j1865J511J2783j2092M50L567Q009
$$ 4107 -849 -8628 7633 -1295 -3441 -1649 7024 -4841 -3330 9453 -2639 -2189 1378 9387
983I387j4944Q587M918r796M153M300K49j3145J5896l411o684K765N370l790q315
$$ 9387 -5557 3030 7948 -1848 2305 6605 6854 -6291 9605 6194 -490 2275 7645 3855 -4460
998d460J4765r435n96K183K758p667J351R094j2885M458M41L412r553N696J990
$$ -4460 10305 870 274 2457 5215 -2452 -1101 7993 -4892 -434 7 3419 -6134 -438 1552
1013A552p944O415k988J718n654R411p162p44N612l956J508l418P403q711O638
$$ 1552 -6392 23 -2965 -1247 -6901 2510 -4652 -5396 216 -3740 -2232 -5650 1753 -6958 -320
1028c20j035l124L076J82J379p264J1935p535l32K834K164m381j769J1367j1882
$$ -320 -1355 -4479 -1403 -1221 158 -7106 4829 -2706 -3038 -204 1960 -2421 -4190 7177 -4705
1043d705L323L228K574r857N078P333j1793O350P15J309r216J0628j80r094P245
$$ -4705 -1382 1846 4420 -5437 -359 6974 -4819 1531 2246 3555 -5661 4967 4787 -4307 2938
1058B938N81r17o968J2973p787k386N379J28k367k631J0050j2150M901L567j932
$$ 2938 3519 2602 -4366 8607 820 -1566 3813 3941 1574 -1057 8993 -3157 1744 5311 3379
1073C379o169N298N673j3772Q938J43j857o774J0262j484j0951J1058j910m188
$$ 3379 -2790 2508 8181 -5591 3347 3490 1633 -5141 5121 3637 -7314 3744 1834 -2354
1087b354l790J4065j1010n218J1110k140n854j560J3543j4215J454P770k390o918
$$ -2354 -6144 7921 -3089 -8307 2803 663 -5191 -6751 6792 -7423 -5969 1801 -589 -7507
1101g507L669R400j4875P046K702j163o637P596K913j0993Q644j204J4m130Q493
$$ -7507 -3838 5562 -9313 -2267 435 -728 -7365 231 3144 -7849 795 -409 -395 -4525 3968
1116C968m982k939P836m832J241j908O931q871M987L189n863J754J133L585j0173
$$ 3968 -1014 -3953 3883 -949 292 -1616 5315 -3556 1431 4620 -1243 511 1644 5229 -4944
1131d944J0122k112l677J351L136k42o770R786o630J075M08L148m509r55P081
$$ -4944 5178 3066 -611 740 3876 3634 -3136 6650 20 1095 1503 4651 142 -813 6268
1146F268p803M369k963L864m447K605L22l839N765n864K992l006N594o526J456
$$ 6268 -1535 2834 -129 3735 -712 1893 2215 -1624 4141 -1723 1269 -1737 3857 -2669 -1213
1161a213M008n878K511j213M139r263P478K48n755J753K777J233j0043J1079l089
$$ -1213 2795 -3083 -572 -1785 2354 -6909 569 817 -4938 -3185 -408 825 -9218 1861 -1228
1176a228l036O6N290k647o303J1047o409o4n7O047o651j77P712o844K086J52N198
$$ -1228 -4264 -4198 1092 -1555 -7858 3189 -3220 -3284 -3341 2706 -3945 -4122 3590 -3254 -1168 -1016 4182
1193D182q722N716L063o206K661J503K204r032J0243k825l632K557K363k397n490
$$ 4182 -4540 1176 4239 -1967 694 2197 4401 -4631 5612 2787 -845 1712 4075 1678 -3812
1208c812J1773p905r42K219M789p282j211J0567r391R46J794M458r470M416N098
$$ -3812 7961 56 -886 1333 6122 -1160 -2371 8196 -1195 -249 1545 6003 -3467 949 6047
1223F047q400K873K087J850j0101R380m25n551K079K327l37p235J0108n291j141
$$ 6047 -2353 520 2607 4457 -5644 3736 3311 -2240 -161 2166 1829 -5406 4702 -589 -1730
1238a730J156K034l018k204Q088q822K400M59K338n556K277L564p174M826j358
$$ -1730 -574 1460 -1558 -3762 4326 -4496 -2096 -1637 701 -4855 -2578 986 -6188 -1362 -2720
1253b720K168n773O139j591l094M348k046J798m492P366m871J194J310n82J189
$$ -2720 -552 -6325 -186 -1777 -4871 -523 -2569 -771 -5263 2103 -2768 -1574 -264 -846 343
1268C43k658N689n904M692k463K008J80j213J897l106N959n495L284r81J172j279
$$ 343 -2315 3374 -2530 2162 -301 1707 1887 674 2571 -535 5424 -71 3213 2232 3404 2125
1284B125P8L794o402M797k750K296l761L275j88n163N072k390J190m623N640l542
$$ 2125 2203 5997 -405 4392 1642 3938 177 3452 3264 -1899 3173 783 1973 -2650 2990 -552
1300e52j158K904k441Q64k505N761o766K737J508j785o81O52M572q428N475n42
$$ -552 -1710 1194 -1247 -383 -2888 2873 -3893 -1156 352 -1433 -2114 -1462 3110 -5318 157 -385
1316c85L30l104L776O49o874P571k066p92l164P080l993l901P035k646j602j991
$$ -385 -55 -3159 617 1266 -5608 1963 -103 -895 -4059 3021 -972 -4873 2162 -484 -2086 -4077
1332d077Q561q470P31N180k710k879J175P284j0497M612K250j690l071M301K879
$$ -4077 4484 -3986 -3255 1925 -785 -3664 -2489 4795 -5702 -1090 1160 -530 -3601 700 3579
1347C579q895P326k57j187k970O494k050n187P397k488k52k369O385n967M19N311
$$ 3579 -5316 2010 1753 566 -2404 4090 2040 -3147 4250 1762 1510 -859 5526 -441 -22 5289
1363E289m101p89O33N249q542M360J815k986j365K454L078q295O023j124j248
$$ 5289 1188 399 1032 6281 -2261 2099 3914 928 -437 2017 5095 -3200 2823 1699 451
1378D51j295L408j151n491O704l270O29l320M955l435j727M646l290J200l245
$$ 451 -844 2564 1413 -4078 2626 -644 -15 -3335 1620 -1815 -3542 1104 -2186 -986 -4231
1393d231M906m207K212J87j347Q52j630M475n036L275k065J686N3p49J990l499
$$ -4231 675 -3532 -1320 -1133 -2480 -1628 -3258 1217 -3819 -544 -2609 -923 -870 -1619 371 -3128
1409c128L879l075L982k937P68K04l55K423l887M224l677K637j133J452q06j041
$$ -3128 751 -2324 1658 -1279 -511 -307 -662 1761 -2126 2098 -1579 1058 -75 1377 571 -470
1425d70K907l549L862k826K167l043K411J789l518K447j839K387l737N077k182
$$ -470 2437 -1112 2750 -76 2091 -952 1459 3248 -270 2177 338 2725 -1012 4065 1883
1440A883k094K245m0Q89m295O359n070l70K436J120l451j765O418o079J833N04
$$ 1883 -211 2034 1994 2883 -1412 4947 -123 -493 1943 3063 -388 -2153 4265 -1814 19 523
1456E23J205n124K606M185o827K454O78P08n083O125n46n708L542J268j77n313
$$ 523 1728 -3396 -790 3395 -3432 -978 -300 408 -4675 1450 904 -4804 -1262 6 -171 -5484
1472e484P518m322k238M433N79k943k262P606o199J412J856M40m245K548M973
$$ -5484 2034 -2288 -4526 -93 486 -2457 -4719 2887 -3312 -1900 -44 396 -3849 -1301 3672
1487C672p607L236J166N14m618N527N86n447L878N59J78m413O626k724k517L937
$$ 3672 -3935 -699 467 981 -3637 1890 2476 -2971 907 1466 1644 -2769 3857 1133 -1384 2553
1503B553j4j213l260P003m599J54J138J032k254r94N248n201J978p04J609k874
$$ 2553 2539 1326 -1934 5069 470 624 1762 2794 540 -454 4794 -407 1571 867 2476 -398
1519c98J614K128m894L017j095K196m507L662q81k104K250j666J851l990M426
$$ -398 1216 3344 -1550 1467 372 2568 -1939 1723 842 -1262 988 -678 1173 -2817 1609
1534A609l075M91L65n7J26k486M219l950K371k062J978j164j103K792k524J749
$$ 1609 -1466 -975 -610 -667 -541 -3027 1192 -2758 -387 -2449 -471 -1635 -2738 54 -2470 -721
1550g21k673L796k676O52Q50n88R20k693M656l370J747o61J454j316o05M130m262
$$ -721 -3394 402 -2274 -1622 -772 -1360 -440 -3133 1523 -1847 -100 -761 693 -623 -1228 2902 -1360
1567a360J857n07L118m356J367L111l653J245j08K937n430L600L18j827L08J309
$$ -1360 497 -10 3108 -1248 119 3230 -423 822 714 3651 -1779 1821 2139 312 620 1929
1583A929N87n262O262j804j487j98K520j666k742N820m309M00K91K889m692Q44
$$ 1929 2516 -2746 3516 1712 225 27 2547 881 -1861 3959 -350 50 341 3230 -1462 -618
1599f18M508n462J367J001K001o466M339J830m497J311J441M03o192O966j452
$$ -618 3890 -1572 -205 796 2797 -3669 670 2500 -1997 -686 755 1158 -5034 1932 480
1614D80l201J030K349j380l812O544l512j211M64L487l256j315N323m371O18K30
$$ 480 -2721 -1691 658 -722 -4534 2010 -1502 -2713 -2249 1238 -2018 -3333 1990 -2381 -1763 -1533
1630a533L206m758J675K590k904R57n7K276m719L965J37j797J59J095J259l738
$$ -1533 1673 -3085 -1410 1180 -1724 -767 -824 1452 -3267 698 835 -962 -803 292 1551 -2187
1646b187M563k160M81n43J912k05k205M161l542J636j115K820k767m43L111k645
$$ -2187 2376 216 697 154 2066 1861 -344 3817 275 1911 796 3616 849 406 3517 872
1662H72Q64j451K854l825J806O48j164j79q94K949m312L040j378P31j790O97K468
$$ 872 1736 285 3139 -686 1120 1768 604 425 -469 2480 -1832 1208 -170 561 -1229 -532 1936
1679A936l899K278j491K461l424J993M81k107J308m25J775m006L717j338o22J28
$$ 1936 -1963 315 -1176 1285 -2139 -146 335 -1772 -464 -889 886 -3120 597 -741 -1363 -1235
1695a235N94P12l464M174j993l93m95K392j762k074M849l084O35j291M105l752
$$ -1235 -641 71 -3393 781 -1212 -1605 -2100 292 -1470 -3544 1305 -1779 -1144 -2435 1670 -2082
1711b082K81L311k758P92N5K875n009L478R36k194j0K003J470n414M916p58j172
$$ -2082 -1801 1510 -1248 -456 -401 2474 -2535 943 1879 -315 -325 1678 3148 -2266 2650 1892 720
1728G20q89K713o28l648N175k570l94o01L863l267j285M317k979k62qL410m994
$$ 720 -169 2544 1916 -1732 3443 873 479 -122 3741 474 -811 3506 527 265 257 3667 -1327
1745a327J837J668k418P4L67K222n281L788o7j387p41J153N37l820M215j825j77
$$ -1327 510 2178 -240 -166 201 2423 -2858 930 863 -524 -1265 -112 425 -3395 820 -1005 -1182
1762a182j323L168j409k430L846j764J5j882M369k872m75K436j673J75q81L385
$$ -1182 -2505 663 -746 -3176 670 -1094 -1079 -2961 1408 -1464 -1939 497 -1176 -1001 -1882 1503
1778A503l827J939M97M6j355nL029l708K458j014J231j858J001Q86k380K743j314
$$ 1503 -2324 -385 112 158 -1197 -1202 1827 -1881 577 -437 794 -1064 -63 823 -1557 1186 -128
1795a28J410k613L035n03j611J443n50J362k761L458j878P2K90N47l36j795L773
$$ -128 1282 -1331 1704 1201 -410 1033 483 1845 -916 2542 664 736 1026 1573 1237 -558 3215
1812C215l033J025q10J819k008n15K760k746J089j067K322l582J723J392k123
$$ 3215 182 1207 397 2216 208 -307 2453 -293 796 -271 2051 -1531 192 1584 -539
1827e39J35J83J981m478L353k77j101m15J293L10l732M100j388n01j123K953j198
$$ -539 -404 -221 1760 -2718 635 358 -743 -1158 135 445 -3287 813 -575 -1076 -2199 754 -444
1844d44k591L372j478Q7j453L691k768k69K800k114R0m86L291m143J710J483j082
$$ -444 -3035 337 -1141 -1054 -2507 1184 -1584 -1853 947 -1167 -1077 -1563 1728 -2415 -705 778 -304
1861c04q34Q66K393l972K740m44J14j164K272n2l136L641j303K64j624K995j411
$$ -304 -1138 -272 2121 -1851 889 445 559 -605 1667 1615 -1521 2120 817 1081 -543 2452 1041
1878A041j682K925j563L54j510L374l427R45J731j211r04k95L284l975J726p7
$$ 1041 -641 2284 721 1075 -435 2939 -488 457 2188 977 73 -222 3062 -913 813 736
1894G36L16j825J168J824l995K431o07P72k763K523L91k727J904l61Q40l336L490
$$ 736 1052 -773 395 2219 -1776 655 48 820 -1943 580 971 -1756 148 -213 627 -2709 781
1911G81j179j167R55J55M2k589M157k646L62k70J323j48k137L375k947J394r75
$$ 781 -398 -1565 -610 -455 -413 -3002 1155 -1491 -1129 -1399 -76 -224 -2361 1014 -1933 -539 -1514
1928a514K274k209Q38J452k381J498o66K060l494K520O65j528M19L30J435l188
$$ -1514 760 -1449 -611 841 -1540 -42 -708 1352 -2142 378 1043 -485 -66 264 1699 -1489
1944a489K999r54m00j82J535j77k758L988j891r2p33K615j831j120L022k140N85
$$ -1489 1510 556 156 -26 1509 1332 -1426 2562 671 579 -154 2461 630 -490 2532 392 977
1961I77j230L459l941Q05K037j511q24K36K624m295K015M52n39j142J035J718
$$ 977 -253 3206 -735 70 2107 596 -228 8 2632 -1663 352 804 265 -877 158 1876
1977A876m410L325p38ok218K623r5k711K700j191M13j961L409k052p98K002q85
$$ 1876 -2534 791 53 47 -2171 452 357 -2354 346 -845 -432 -2393 1016 -1036 -1834 168 -717
1994g17m10j231L720l459O57J054M10j318l77K928l347J958m88O83j295J073J355
$$ -717 -1127 -2358 1362 -2097 -1440 -386 24 -1294 -1671 1257 -2090 -132 -620 63 -1232 -159 1196
2011A196k908J990j16P77k719K990j48j575J551m99J052k467L313j872m55Q08
$$ 1196 -1712 278 162 939 -1780 1210 1062 -513 1038 539 1591 -876 2437 565 110 918
2027I18N68k78j999L786k814N95k21J557k070m49K444k505J027n55J866l225J615
$$ 918 1486 1208 -791 2995 181 776 555 2112 42 -407 2037 -468 559 4 1870 -1355 260
2044B60J598k466N07o9J653l507K543j6j462J76J057N80l506L615j083m36j065
$$ 260 1858 -608 -101 -170 1483 -2024 519 503 -959 -783 274 854 -2652 963 -120 -556 -1621
2061a621K171m23k545K888j293L29j180K563k486K7K040j291j28q16K969k869
$$ -1621 550 127 -2418 470 -823 -494 -1674 889 -1597 -1570 470 -821 -949 -1765 1204 -1665
2077a665N89J210o75l55J51J836k774K123l50j40p72J815L55k918K849q93M72
$$ -1665 -1076 134 -541 -896 -745 1091 -1683 440 90 -50 -822 993 1348 -1570 1279 386 858
2094H58j770K734j232j423K600j261K79j507L627k887j17J585m72m89r12K978
$$ 858 -912 1822 590 -833 1767 506 785 -722 2905 18 -99 1486 1014 525 -387 2591
2110B591l147R48N43K80j476L02K281l522J577J50J064k873J816O82k365J010
$$ 2591 -556 392 935 1215 -261 41 2322 -1200 377 527 1591 -1282 534 1216 -1149 -139
2126a39j12R46k796K774o52j526Q95N89J42k837L308j378j41n33J279n07j122
$$ -139 -251 695 -2101 673 21 -1505 -610 -21 121 -2716 592 -786 -927 -1460 -181 -688 -1810
2143a810K550k170J170n57J211j783M49J534j827O52j71J975k897J698L88j374
$$ -1810 740 -1430 -260 -817 394 -1389 -940 594 -1233 -581 -752 1223 -1674 24 412 -962
2159i62P59R5J190k943L072p02p99n9J630j85k519L273j411r0n74K129j554r39
$$ -962 -203 -108 1082 -1861 1211 509 -290 -349 1281 1096 -1423 1850 439 349 -225 1904 350 -589
2177e89K839j641n8p73K869k975L70J691j285P2o50K489l703J651O75o16j094
$$ -589 2250 609 551 -222 2647 -328 42 1733 448 520 -130 2359 -1344 307 982 366 -728
2194g28R27J816l687K100k54P5j753J943K65k454K311j043K15j362K461j387j028
$$ -728 199 2015 -1672 428 174 249 -1504 439 704 -1750 561 -482 -267 -1629 832 -555 -1583
2211a583J775o08R5j352K656k467L31P05m0m46k89K395l085J662j35L98j444Q61
$$ -1583 192 -416 -321 -1673 983 -1484 -1153 -448 -488 -934 -1223 1172 -1913 -251 -386 12 -1432 -571
2229e71J929l019J983m26Q74k023K112l42j294J095L55L88k148L150j746m20O79
$$ -571 1358 -1661 322 -104 770 -1253 859 517 -777 318 673 1061 -1087 2063 317 -103 576
2246E76M91l38j537K863j890K28L9J254j414n74K431k231R64p20J768k358N14
$$ 576 1067 729 -808 2055 165 393 432 1686 272 -302 2129 -102 862 142 1910 -448 66
2263F6J539j619K96m32J871l259K195J24j078l71Q67O94k664K213o10j69o95J127
$$ 66 1605 -14 282 -150 1721 -1538 657 781 -297 -668 199 893 -1771 442 -168 -337 -1032 95
2281I5l83j393K299j314J88j061K210j935k96J780q98r0p85K500k512J007M77
$$ 95 -288 -1681 618 -696 -508 -1569 641 -1294 -1590 190 -708 -798 -1583 917 -1595 -588 -111
2298a11l17l64l8K099l252J930K38r9j357J300Q89k656K564o76R4j278K424q99
$$ -111 -428 -792 -830 1269 -1983 -53 185 86 -1271 29 918 -1738 826 150 244 -1034 1390 491
2316D91j448K363p30l8j514L091k022m69J403k00o37p10K567k627P07M92L96j279
$$ 491 -957 1406 676 638 -876 2215 193 -276 1127 927 290 -420 2147 -480 227 719 1115 -164
2334a64L0K061k463J006o9N79j738J017P54j923J303j86N51k243K346n27j247
$$ -164 -134 1927 -536 470 401 980 -758 259 1013 -910 393 207 758 -1485 861 334 -913
2351i13P13M7L15j872K502j461Q9j24M64k87j028K425j887K91l04J609j607j32
$$ -913 -200 -153 162 -1710 792 -669 -580 -704 -240 -527 -1555 870 -1017 -726 -1030 579 -1028 -1160
2369a160J611j564M54k53J423k022J415J67j073P72j56R40k255K305r6r20q8J033
$$ -1160 451 -1113 -659 -912 511 -1511 -96 71 -1002 -230 -386 554 -1701 604 508 -412 -500 533
2387E33M19k149K578j263K75q06J824q00j258K352j147J25j260K193j474q7J488
$$ 533 952 -1197 1381 118 393 -413 1411 611 -647 1705 558 683 -577 1616 142 55 1543
2404A543p91l84n15K180k714P82R08j34j050L24J600k628J328j67K34j380J258
$$ 1543 752 368 -147 2033 -681 101 1009 875 -175 149 1749 -879 449 282 516 -864 394
2421C94L53k003J766o13L26j621K241q24j317J051J13j33j242K117j626K19O21
$$ 394 747 -1256 510 -103 223 -1398 843 19 -1298 -247 -134 -267 -1509 608 -1018 -799 -178
2438a78k4o52n33K322k339M43R62K37j576R29J428k091R22l10P47j666J825J27
$$ -178 -202 -854 -1387 935 -1404 -961 1 238 -1338 -409 1019 -1072 -150 -460 287 -1379 446 573
2456E73j562R59K55N56j912K215m34p85L16N12j14j531K671j443P3J20P48q10
$$ 573 -989 -30 225 781 -1131 1084 650 -135 181 693 579 -952 1719 276 349 469 1217 407
2474D07q28J959j242J11l53J537j632J19J210j257P7J75J144k271J266M80q74
$$ 407 -421 1538 296 407 54 1591 -41 78 1288 31 108 283 1427 -844 422 902 28
2491B8j70J76Q22k072K027j101J28o71J178m10j529K280j041J3p94J602j297m31
$$ 28 -142 34 856 -1216 811 -290 -162 -833 345 -65 -1594 686 -355 -342 -1136 466 -831 -1262
2509a262J749j184K12r52J974j957P36O58m59n01L53J560k355J155K39K16j169
$$ -1262 487 -697 -485 -1437 537 -1420 -684 -26 -485 -986 -633 927 -1428 -273 -34 182 -987
2526i87R02P69k116J722k6K48j565J716k55j112J304l82O66j770K277j114n44
$$ -987 -85 684 -1432 290 264 512 -1053 663 408 -704 600 218 884 -886 1391 277 -267
2543b67Q78j0O3j276K605j829l5M93M07q80l40J950k088Q20j22M36j384R11Q91
$$ -267 611 601 664 -612 1993 164 129 622 1029 149 -191 1759 -329 491 369 805 -579 332 1223
2562A223j700M51o1J012k094J592M0q54J35N9N31j622J838r72J61L9N72o19r97
$$ 1223 -477 -26 -87 925 -1169 423 463 -391 -256 -197 334 -1288 550 -422 -261 -222 350 -269 -1266
2581a266J967j263O8m86J545j198m65J493j236K86k42J145j638Q63Q22j097J46
$$ -1266 701 -562 -494 -980 565 -633 -1098 395 -841 -555 -797 348 -1290 -427 395 -702 -556
2598e56M5J322k042J023M88k89n14O76O24j719J705p40K64j043J680m73j330J974
$$ -556 -511 811 -1231 -208 280 -9 -523 153 777 -942 763 23 287 -756 924 451 -879 1095
2616A095p22J7p73J719j120m01J182k48m55l23J632j819L03Q51k25q55J61J345
$$ 1095 373 390 -383 1336 216 -185 997 749 294 -29 1603 -216 87 938 713 -142 19 1364
2634A364j957J330m49Q6j083J431K86j825J146k48L45j217J208l86r19J028l32
$$ 1364 -593 737 288 374 -709 722 1008 -817 329 81 426 -791 417 31 -888 140 -192
2651a92q6q45J775j655L46M07K21n13m84J592j603P55j14K65j029M04J335j706
$$ -192 -278 -1123 652 -1003 -657 -250 -29 -542 -1026 566 -1037 -282 -396 -131 -1160 -756 579 -1127
2669a127O90j05P03r34Q01K58j188J126k34N48j456J659n29n69K66N41J07j330
$$ -1127 -437 -542 161 -773 28 286 -902 224 -10 538 -918 741 212 -357 -91 450 557 -773
2687g73J701p16j4p3O39k43q34J543j156L09l21J213j240kQ90q03K90m75J581
$$ -773 928 212 198 125 764 521 -313 1230 74 383 62 1275 35 33 923 120 410 -65 1516
2706A516j782O46J56k47k13k7P88j946J531m00j1m97N06L34j433J235l89M22j234
$$ 1516 -266 380 536 289 76 49 837 -1109 422 22 11 -486 20 354 -1079 156 -233 189 -1045
2725a045J505q12q81J411p27J76q25J671j481R7J016k55o08k36J519j460N43K51
$$ -1045 460 -352 -1233 178 -549 -373 -1198 473 -1008 -911 105 -150 -758 -994 525 -935 -392 -141
2743a41o6m96K74J084j798J215j4K66j199J344j53j022J022q2K19j325J588k50
$$ -141 -207 -703 -429 655 -1143 72 58 324 -875 469 316 -706 316 234 453 -872 716 466
2761D66r54R97r4J37r07J740j475K10L53L20o07k49J556j779R43n82Q50j064L54
$$ 466 -488 509 415 552 -355 1385 -90 120 473 793 186 -63 1493 -286 657 75 925 -139 215
2780B15P23j089P51l92O48j587J289L2j065P25j40M63j633J605q46r1m2M21R7
$$ 215 938 -151 600 208 856 -731 558 590 -475 250 110 573 -1060 545 -301 -392 -434 -13 84
2799H4j035J472r49M9l96J029o35m47J080j052O99r62J265j074L17P04q14M83
$$ 84 -951 521 -428 -379 -775 254 -381 -828 252 -800 -101 -1063 202 -872 -555 149 -665 -182
2817a82m24J193j582J090l01Q5r0j23J098j436J067o47M80o29N91J57p10Q11k79
$$ -182 -606 587 -995 95 -206 -121 -211 -334 764 -672 395 -252 228 -401 190 347 -363 448 169
2836A69L18j032J519r13l66R16j76Q3r91J632j230N29qJ22l91k66J407j476N70
$$ 169 487 -545 974 61 -305 611 435 518 -473 1159 -71 458 450 572 181 -85 1322 -154 416
2855D16m50Q93j360P42R57j390J84jO77j224J054k18p56N26j26K48j106J417q64
$$ 416 -34 859 -501 241 1198 -192 -8 -9 668 -556 498 280 -476 50 -76 172 -934 483 -381
2874c81l43N91L10m81o96J403j164N27m4M90j123K49R34j302P14j18O23j311P30
$$ -381 -724 -133 177 -304 -1000 403 -761 -234 -278 212 -911 -662 272 -1030 -316 -434 189 -1122 -392
2893c92M35p68L96J5P15j425J232l1n98M40k16M49p15J192q01K27l19P93m36l94
$$ -392 43 -725 -329 -314 401 -1024 208 177 -421 19 -197 252 -463 729 -72 155 -164 629 193 -201
2913b01J123r52O90p18J104q51LL93o26O27o13J357j530N04M7o6k39J73N83j413
$$ -201 922 -30 660 -58 1046 195 198 591 -35 592 -21 1336 -194 310 357 291 52 225 808 -605
2933f05J109o17N68r31O31N47j302J106p07O42j239P93j15n96R91q01M00j019
$$ -605 504 -113 455 -476 155 702 -600 506 -201 441 -798 -5 -120 -716 275 -526 -126 -1145
2951a145J382q25J03L63k30L66j076J342j171Q46p7J1o14r1J161r12N18m00O88
$$ -1145 237 -588 -485 -122 -352 14 -1062 280 -891 -45 -122 -111 -725 -816 345 -567 -49 -449 239
2970B39q36O05L40r87P57m10O07j039J101l08l51L83J82J77r45J294p53P4K01
$$ 239 -597 8 348 -639 118 -292 315 -724 377 69 -282 101 283 460 -485 809 56 130 331
2989C31J98p1n60Q75p49K77m22R44o37o7P43q67L81l80P50r75Q44l70o77P93k30
$$ 331 529 458 -102 773 24 301 -121 823 186 119 862 -5 376 -4 746 -229 615 245 -432 361 131
3010A31M95j178Q69n46P2n1J02L78j035J146j068P49m64N87o06l45Q67p90O09
$$ 131 626 -552 317 -229 -157 -208 -106 272 -763 383 -685 64 -400 187 -419 -764 103 -687 -78
3029g8n67R20r70L82K77l87J76o22J328j271R41m17K14o9j05N59j194J041m11
$$ -78 -645 275 -695 -313 -36 -423 -247 -869 459 -812 129 -288 -74 -143 -248 311 -883 158 -253
3048b53N61n53L01M47q60O47k16L17r02J133m16j46L50l73N43j020J229p00L23
$$ -253 308 -245 56 503 -357 290 74 391 -511 622 206 60 410 37 580 -440 789 89 412
3067D12J78m1m6l96J004j136J93j69O74l33k9M66p36N15n53N68q72N02j1R3o1
$$ 412 590 549 503 107 1111 -25 168 -1 673 340 311 777 41 556 3 571 -301 201 190 283 222
3088B22j76M45j188J157p11j14j46L9N42j041J263p72N19p73N91k10l05O65n70
$$ 222 46 491 -697 460 -251 -365 -511 -472 70 -971 292 -480 39 -734 -143 -353 -658 7 -563
3107e63M15m05P88p86N05K0n05M97m78Q85j152J038n65p7M42k84Q27j349J234
$$ -563 -148 -553 235 -551 -46 -26 -531 -34 -512 373 -779 259 -306 -383 59 -225 602 -747 487
3126D87p45L91l47O24n3p49P77l90M45o85N96l4k55M61n43M71o52R73p17K91q4
$$ 487 -258 133 -214 410 357 -392 385 -5 440 -245 351 317 62 523 -20 451 -201 772 55 346 262
3147B62r4J51j82O72j194R81n84L26m06K51L36p05O52o02O70q28M64o9k89K98
$$ 262 168 319 137 809 -385 596 12 338 -68 183 519 -186 466 -136 534 -294 170 101 -188 110
3167A10n79P61r16J116q90M30r8j92J8m57N52m84N15l98L34j21k39N70n56L25
$$ 110 -469 292 -624 492 -398 32 -66 -258 -240 -697 -145 -629 -114 -512 -178 -299 -538 32 -524 -199
3187a99n45P33n94L60K41l41N40m11N27p86P07m59L88K1o18J051j053P03m05N81
$$ -199 -744 -11 -605 -245 -4 -345 195 -216 311 -475 232 -227 161 182 -436 615 -438 265 -140 441
3207D41l84J81R4n70P50n44O39n02N35n10J19J5l22N74o44P51q18Q57m26J37K26
$$ 441 57 238 332 -238 512 -32 607 105 640 130 249 264 -58 516 -128 623 -195 662 236 373 599
3228E99r73Q99q86P31l24J17k48O8L87n24P77r67N29m61O65m04m57O65r05Q93
$$ 599 -374 525 -361 370 46 163 -85 -17 370 -154 623 -344 185 -276 389 -15 -472 193 -712 181
3248A81r75R73m94J59l1l79O65q16Q23o56M82l84L55j45j62N03o07O40o18N42
$$ 181 -794 179 -315 -156 -187 -566 99 -717 106 -550 -68 -452 -97 -242 -404 99 -508 132 -486 56
3268E6l80Q5M70n71O20n28Q03r72O16k7O8k36k5M22m45Q33r69M89p8K16L5m99
$$ 56 -324 -239 231 -340 280 -248 555 -417 199 172 240 4 -21 401 -44 789 -180 309 231 447 482 -17
3290a7P62o86K88m05M80j34k00M60o81N58n01O06o29K47j33p4N87o95M20p52N21
$$ -17 745 59 347 -58 422 288 88 548 -133 425 -76 530 -99 148 15 -59 528 -167 253 -499 22
3311B2m06N73P2m81L18o14O05o39N91m37O36k77l28M11l53M91q92P36m27L37K8
$$ 22 -384 189 261 -220 98 -516 89 -550 41 -396 240 -37 -365 46 -307 184 -708 28 -399 -62 -34
3332c4k50K23o00N76m68N97k33K1jk41P80q67O58o97Q79l75K05M4o44Q71n45O50
$$ -34 -284 -61 -661 -85 -553 44 -189 -168 -169 -410 370 -497 161 -536 343 -32 173 217 -427 444 -101 549
3354E49p62N20r5l5L58n45P58q44P36m80M50l51L9J90o86P87m45L93o59N62m9
$$ 549 -213 307 212 177 535 -10 748 -96 640 160 610 259 298 488 -198 589 144 537 -122 440 391
3375C91k71J68l90N48o95M87l46K56k42p4J92k43N48q41N47o68O88l70k41P04
$$ 391 120 288 -102 446 -249 238 -108 148 -94 -168 24 -219 329 -512 35 -633 55 -315 -556 148
3395A48o68O56m68L01l32N4K07l72L99l96N25o34P38m71K3M1o6O74r95P42k70
$$ 148 -520 136 -332 -31 -363 -309 -102 -474 -75 -471 54 -580 158 -313 -290 -249 -315 359 -636 106 -164
3416a64M17k94K30j33j65M51o22P38n86L51k66q9N93n45P05o59P53l80O3J09n03
$$ -164 253 -41 189 56 -109 342 -280 458 -128 223 -43 -132 461 -84 621 -38 715 335 398 507 4
3437DK52k78Q08q86M30j75K81j19n5J03m03M54m49L20m41L56j06l12L43k08L83
$$ 4 256 -22 786 -100 330 155 436 317 262 365 -38 416 -33 287 -154 202 96 -216 127 -81 302
3458C02l86L18l64N7J01k00J49n59P38p24O49m85J71J54l55M97m48M23n45O04
$$ 302 -84 234 -130 -73 28 -172 -23 -582 156 -568 81 -404 -233 -79 -434 63 -385 38 -507 97
3478I7n79N95r4l32L07m79O30n00M17j54J6j28R9K29o71R21o02L47l32M21J03
$$ 97 -482 113 19 -313 -6 -485 145 -355 62 -92 -76 -204 -105 124 -547 374 -228 119 -213 208 311
3499C11n49P22n89L27k39K39j53N4L19j75K28n85Q38q04M30k6j56q2p2M40n40
$$ 311 -238 484 -105 222 -17 222 69 123 442 267 495 -90 748 -56 374 348 192 110 38 478 -62
3520f2M18m71M22k49l9M12o83L97k30L14k59K50k95l24O96n97M66n13N27k39n
$$ -62 356 -115 307 58 19 431 -252 145 -85 229 -30 220 -75 -399 297 -300 166 -347 180 -59 -64
3541f4pk76K61k99P17p05J66q2j29L04k41N72o85L97n38O02k61J99m8m66P89m98
$$ -64 -71 -347 -86 -385 332 -373 -207 -289 -418 -114 -355 217 -468 -71 -609 -7 -268 -69 -117 -583 206 -292
3563b92L89p10N06k6K0K26j52J11o16J083p99M74j83j0K17l55O28p50M52k78L82
$$ -292 97 -613 -107 -133 -113 113 -39 72 -544 539 -260 214 31 21 238 -117 511 -239 213 -65 317
3584C17l01J41N27q08N74l93K18l51M42n6l82J27q1N14q65P30l22J13r6L51r1
$$ 317 16 157 684 -124 450 57 275 -76 366 310 -72 55 -26 488 -377 353 31 144 48 399 308
3605C08n89Q30p88L67j55J72p2l29K90n08N49l88O44p83n2M29l07J10j89N19o91
$$ 308 -281 549 -239 128 -27 145 73 -256 34 -474 75 -313 331 -452 -504 -75 -382 -272 -461 58 -633
3626f33N24j35r3Q5qK59m95M86k56K33l99M39l2n46J092p21K52l57O68m45l2M60
$$ -633 -109 -244 -337 -252 -260 -1 -496 -10 -266 -33 -432 7 -25 -571 521 -200 52 -305 363 -82 -114 346
3648C46m34N52n87O30p80K86K46j0Ok82P06o02J64j55K09k62L18K78n83J81l42
$$ 346 -88 464 -123 507 -273 13 259 249 255 -27 679 77 241 86 295 33 351 629 46 227 -115
3669a15O67p24K74J16k32K41j61N39r54M47k00kJ1P0N9m27O84n84J79j13K08K
$$ -115 552 -172 102 218 -14 227 66 605 -349 98 -102 -104 -93 -23 36 -391 293 -291 -112 -225 -17 -15
3691a5k20M07l55J50m23N23m39J24J62k68L65l19M66n35K54J74l79r5Q2N18q56
$$ -15 -235 172 -183 -33 -456 67 -372 -248 -86 -354 11 -308 158 -377 -123 51 -328 -423 -341 177 -679
3712f79J002p19L11J74k02N34o16N31l08L68p64P31j10l29O71m46J29l36N56n83
$$ -679 323 -396 -85 89 -113 421 -195 336 28 396 -368 363 253 -76 595 149 278 -58 498 -85
3732h5L44K23m67R4j20O44q76L84k4J57j49L74k1o34N00m66L21l48K91M1k38O45
$$ -85 259 482 15 109 -11 633 -243 141 117 274 125 499 478 -156 344 -122 199 -149 142 183 -55 590
3754E90q92M06n55N85k23J3J70j42O9n17N88o22M00n82Q74k96k14M97p09N62m38
$$ 590 -302 104 -451 134 -89 -76 94 -48 21 -496 92 -530 -130 -712 162 -134 -348 149 -560 2 -436
3775d36N08m07K38J13m63M09l08M20o33K61N07o24O52k07q1l65P48l27J14j24
$$ -436 72 -335 -97 16 -447 -38 -346 74 -559 -298 209 -415 237 30 -51 -416 332 5 119 -5
3795eK47J6p13O59l84L00o2L24l54j37O59n61L23l25O04q50M89m5j64O4k10P51
$$ -5 242 258 -455 204 -180 120 58 382 28 -109 550 -11 312 -13 591 -259 230 185 21 85 -125 626
3817F26o29O12m78J90m33K46L74n96N18o05J74l23L50P9l79N16l34k4j52O74p98
$$ 626 -3 609 131 321 -112 134 508 -88 430 -175 -1 -324 26 105 -274 242 -92 -116 -268 406 -392
3838c92l1O38j60j41k87P77p49J42K51rl94l8N02q41P78q8o8l33M47N6o17P06
$$ -392 -423 215 55 -86 -373 404 -345 -203 48 39 -355 -393 109 -732 46 -42 -110 -443 4 60 -557 149
3860A49k84K08n31N97l1l07K45j38K24l95O48l01j08K18J01r1n06Q56o21L77j25
$$ 149 -135 73 -458 139 108 -199 46 -92 132 -263 385 84 -24 194 295 204 -302 554 -67 310 185
3881A85K68m00l4M44o14L40pK8l39L13K08m55L41j83K11o29O28j24m60P86n50
$$ 185 453 53 19 463 -151 189 182 210 -129 184 392 -63 278 95 306 -323 305 181 -279 507 -43
3902d3L09o11O17k07k73k9L14j3m47M67n69N56l58K06n46M13nl8J27j96M34o58
$$ -43 266 -345 272 65 -208 -237 77 64 -383 84 -485 71 -287 -81 -627 -214 -219 -257 -130 -326 108 -550
3924e50L62J51k97L11k61L68p05Q63m79R8K6k8K20n73O43Nj51j82M71m86j87O97
$$ -550 -188 -37 -334 -23 -284 84 -621 242 -237 -139 -113 -141 79 -494 149 154 3 -179 292 -194 -381 316
3946C16j91K63l88N58n13K11j55j3J87l14M50o04L52jQ4k04K15L76p33K92J3M0
$$ 316 125 388 0 558 45 256 101 88 275 -39 411 -193 159 158 242 38 253 629 -104 188 201 241
3968B41l75P9J57l76M62m3M1k62J73pl84L89k50L96m92M92n95J23R3K5M1j49N31
$$ 241 -134 -55 102 -274 188 145 186 -76 97 90 -294 95 -155 241 -251 241 -354 -231 -138 -113 -72 -221 310
3991C10m99N1j03K61k66L4L50m33K73l50N75n06J56K58n15M78j76L65m55M08l81
$$ 310 -189 -138 -241 20 -246 -212 138 -295 -22 -372 203 -303 -147 111 -404 74 -102 263 -192 216 -165
4012a65J97l03L95j58j1L82m45K03j82M72m38j80M91m79L81k33O43o23L12J93
$$ -165 32 -271 124 -34 -45 337 -108 95 -87 385 -53 -233 258 -221 160 -73 570 -53 259 452
4032D52l01J66k92P03r81K74L82J4l12L4L63o42R7J04J20l76K40L70o02L47k13
$$ 452 151 317 25 728 -253 21 403 417 105 139 502 -140 -43 61 181 -195 45 415 -187 160 -53
4053e3J54k76L26j96j39J76l08L48l02O77p41L21j52l8j71PO90o84L56j70K28
$$ -53 101 -175 151 -45 -184 -8 -316 32 -270 407 -334 -13 -165 -203 -374 -367 323 -361 -5 -175 53
4074E3n52K27L29l68K94k70L16m69L57J7n80P40q5O1l52O47m50r6K78P7k97j27
$$ 53 -499 -272 57 -311 -17 -287 29 -440 -83 -66 -646 94 9 70 -282 365 -85 -181 97 174 -123 -250
4096b50O70p78M14Q0o1j29j51P43p48N72l48P26r10N13J16n05M05l37L60n52M88
$$ -250 420 -358 56 136 75 -54 -205 538 -210 362 14 740 -170 343 459 -46 359 22 382 -170 318
4117C18j11k15J3L0M16q09L23l00M90m17L12p9k90N32m68L17k74N59n16j4M65
$$ 318 207 -8 5 35 451 -358 -35 -335 155 -262 50 -29 -319 213 -255 62 -212 347 -169 -183 282
4138B82m95J86j94L44m19J07J35o1j6q2M24p37L19r9L89k53k7J89l22L50K07l08
$$ 282 -213 -27 -221 123 -296 -189 -54 -115 -131 -213 211 -526 -207 -306 83 -170 -197 -8 -330 20 227 -81
4160h1n3M11l42k50M51r3l9k13O86l31k64L06j7k1k26N65m19J48p9K97j82j57
$$ -81 -134 277 -65 -315 136 43 4 -209 477 146 -118 188 171 150 -76 489 70 218 139 436 254 97
4182I7L98n95J85l2M75m80J26K86m32L03j98J37n85N85k9j89jj5Q2n72O99l63
$$ 97 495 -100 85 53 528 48 174 460 28 331 133 270 -315 270 241 52 51 36 118 -454 245 -118
4204a18k1j08K42j06k22L97l50K5J01K19m44m0O17m40J12k24N26m29J78K76p51
$$ -118 -139 -247 -5 -111 -333 64 -286 -261 -160 59 -385 -425 192 -248 -136 -360 166 -263 -85 191 -560
4225e60M63j20J60k70N10m30R8L99k34J48l13L94m26K42j9J25j2k57O70m46q2
$$ -560 -97 -217 -57 -327 183 -247 -149 250 16 164 -149 245 -181 61 42 167 155 -102 568 122 40
4246D0q1J94k59K2L66k98J91l60N61l74K08J64m28Q8OK05l44N09m39K77j51k28
$$ 40 -41 153 -106 -84 282 -16 175 -185 376 2 210 374 -54 34 40 245 -99 410 -29 248 97 -131
4268a31M87m37O33p74L38k86N10k70k32K8J50N2l98N70k23l9j40K50k81l70P26
$$ -131 356 -81 552 -222 116 -170 340 70 -162 -134 16 68 -330 240 17 -22 -162 88 -193 -563 163
4289A63o69M17q8K20m01J04M70p03L40k90M16k95R5K63j82o7N8L37o25N50J3m67
$$ 163 -506 -89 -177 43 -358 -254 216 -487 -147 -437 -21 -316 -221 42 -140 -207 -149 188 -437 113 126 -341
4311c41K67j18K69l14N24k06j29J66N1p3k8M75n50Q2o6M27k63j29L37l09N5j3
$$ -341 -74 -192 77 -237 287 81 -48 118 169 96 68 543 -7 75 9 436 173 44 381 72 127 114
4333A14J53k59J6M94k32j76k7K49n65N23k71K63l15J88J18m20L95l52%q4M16k22
$$ 114 267 8 24 518 286 110 83 332 -233 290 19 282 -33 155 273 -147 248 -104 -104 -188 228 6
4355FK0M0j02J85l99M89o54Q3J07J20j71q6N29m07J49j12L48k98QL44p32P34l97
$$ 6 26 66 -36 149 -250 239 -415 -332 -225 -105 -276 -362 167 -240 -91 -203 145 -153 -145 199 -533 201 -196
4378a96J77l37M21k43j06O21k95K54n56O40l38k71L88m4j84L0L37k66j21J09K86
$$ -196 -19 -356 65 -178 -284 337 42 296 -260 380 42 -229 159 115 -69 -39 298 32 -89 20 306
4399C06l34P9N05o24Q2J09L56o04l0M67l94J76J7J98o29O59k60l51O12n98N22
$$ 306 -28 51 556 -68 14 123 479 -125 -155 312 -82 94 111 309 -320 339 79 -272 340 -258 264
4420B64m68L85j72N6k46Q8K8j42N00m45M2n4J81k82j32N05r4o2k71L05k32P9J14
$$ 264 -204 181 9 65 -181 -93 -65 -207 293 -152 -110 -164 17 -265 -397 108 14 -48 -319 -14 -246 -167 -53
4443e3k30K46k47J27k94M59j58L8pK25j20m82O83l93L96m69K82R8n78O56j50J46
$$ -53 -283 -37 -284 -157 -451 8 -150 -112 -119 106 -14 -496 187 -206 190 -279 3 101 -477 179 29 175
4465A75l41L81j88K6Kj76L99m80K90j07l2J21K01N0l94M96m35J83q1P0j88QL68
$$ 175 -166 215 27 53 55 -121 278 -202 88 -19 -51 70 271 321 -73 423 -12 171 90 160 -28 -20 348
4488C48n01M30l85J91j6J45j59k02J83j95M89m11L29l69J98R5k68L44m45M74m89
$$ 348 -153 277 -108 83 67 212 53 -149 34 -161 328 -83 246 -123 75 170 -98 246 -199 275 -214
4509b14J99j03R1j9j65J20k17M79l50j0j70P2K18k51K18l7J00m03M77o5k19m4
$$ -214 -15 -118 -27 -46 -211 -91 -308 171 -179 -189 -359 -287 -69 -320 -102 -139 -39 -442 35 -30 -249 -293
4531b93K63K59m62Q6N7N8R2O1L9l24L84m9o4N4j28K25k08J29q1J08j43K57m48
$$ -293 -30 229 -233 -147 -90 -32 60 121 160 -164 220 171 107 161 33 258 50 179 98 206 63 320 -128
4554a28L75R6m30L86k97K95n09L57j5p5k8J65J72l32J99k48J02j87M87n88K25
$$ -128 247 343 -87 299 2 297 -212 145 130 55 27 192 364 32 231 -17 85 -102 385 -203 22
4575B2K89m57J12j06K10k82J78n2r4O9l0J87j87l98N30k50o8J42L77o92N91j47
$$ 22 311 -146 -34 -140 70 -212 -34 -86 -180 -111 -141 46 -141 -539 -9 -259 -327 -185 192 -500 91 -56
4597e6j50p1K44L3m51N28n3l20ML54nk05J35l4K98m24L65k47N5K88m89J35K73
$$ -56 -206 -277 -33 0 -451 77 24 -296 -292 62 57 -148 -13 -47 251 -173 192 -55 0 288 -201 -66 207
4620B07K15n90J22K30j70k8Q2K58l72J02N2L16m89Q8J41l0J7l26N86l91P6j71
$$ 207 422 -168 -46 184 14 -14 68 326 -46 56 108 424 -65 23 164 134 151 -175 411 20 96 -75
4642g5N4KJ31j40K37q5j13K71m05J87K6j15N5j40M2n5L04m07N5K47r5qm71O66
$$ -75 -21 -19 112 -28 209 124 11 282 -123 64 90 -25 30 -110 -68 -123 181 -226 -171 76 -19 -27 -498 168
4666A68k30k15P1R9J66j30J89m09R0N9k1KK83o1m12L94k21K04m4J10ql02O9N6
$$ 168 -62 -277 -206 -107 59 -71 118 -291 -201 -142 -163 -161 122 61 -351 43 -178 26 -18 92 84 -218 -149 -93
4690i3J25l13P88q05K34K8j60K43K2L42j10l93K44J23m13L8M18m67K42J19j04
$$ -93 32 -281 507 -298 -64 -36 -196 47 69 411 301 -92 152 275 -138 -100 318 -149 93 212 108
4711A08j00L20m7l50K18m3N4j6k0J04l12J23o9L33l40P4nO5j23R3l68M6K99l75
$$ 108 8 328 281 -69 149 106 160 144 124 228 -84 39 -30 303 -37 37 32 97 -26 67 -301 -255 44 -331
4735c31L30j19J42j03j93M03k05R8j31J59k84K61k50j10L33J1pj78J44j00L4K51
$$ -331 -1 -120 22 -81 -274 129 -76 22 -109 50 -234 27 -223 -333 0 11 4 -174 -30 -130 -96 155
4757A55k2k24j41N11m63J76L4k7K4k44M81j55Q9k23L15k37O2K2l37M30k69J20
$$ 155 133 -91 -232 279 -184 -8 26 -1 23 -221 260 105 194 -29 286 49 111 133 -204 226 -43 77
4779G7j54L10K37m50M3k07N03o99M94l09L04p6k4J1j93N12l75kQ6r7N7n0pk4K10
$$ 77 -77 233 470 20 63 -144 359 -340 154 -155 149 73 49 60 -133 379 4 2 88 -9 48 -2 -9 -33 177
4804A77m04L80j46j52J07m4j24j64M54l72K33j21J10K07k62J21k67K31j79J87
$$ 177 -227 153 7 -145 -38 -82 -206 -370 84 -288 -55 -176 -66 141 -121 0 -267 -36 -215 -28
4824b8l49L16k33L25K06k98K97l20K65k05n9Q7L6q9j21Q0P8K23l12P3l24M87L68
$$ -28 -377 -61 -294 31 237 -61 236 -84 181 -24 -83 4 40 -49 -170 -90 -12 211 -101 -28 -352 135 503
4847E03o38K03k66L81j38M3R2j17K03j91K03l76r6L69k14K98j58L6l31K53RJ50
$$ 503 -135 68 -198 183 45 88 180 63 266 75 278 -98 -194 175 -39 259 101 137 -194 59 68 218
4869B18k49M9R5M6Q2m26L92k26J43j14q4K11j79K13m36O20l75Q5j91J19j95P1
$$ 218 -31 18 113 159 241 -185 207 -19 124 10 -74 137 -42 171 -265 355 -20 65 -126 -7 -202 -131
4891a31J63j25L4o6N0K12j42J87k52O7J87k23R2J16j03j65J72R6l08J06M6k00
$$ -131 32 -93 -59 -125 -75 137 -5 182 -70 -3 184 -39 53 169 66 -99 73 169 -139 -33 13 -187
4913a87L3Nr6L25K7P6l35J91O7J04m6j18J01l6K96n82L25j77K03L2l25L34j12
$$ -187 -154 -149 -245 80 107 183 -152 39 106 210 164 46 147 111 407 -175 150 -27 176 208 -117 217 105
4936A05J85l38P7j34J7R1o0L04m09J65K1mP9j71j6j45J08J74j32k23L76m8k02
$$ 105 290 -48 29 -105 -88 3 -57 247 -162 3 24 20 99 -72 -88 -233 -125 49 -83 -306 70 22 -180
4959a80J37Q4j13m1lk02K07M1l3k3Q5K90j08k43J47o7R6k13K59j21J65m04K13
$$ -180 -43 41 -72 -113 -116 -318 -111 -70 -103 -126 -41 249 141 -102 45 -22 74 -139 120 -1 164 -240 -27
4982b7m6Q9m5j56K71k09M86j57J50m98K3p6qM85m04J46l37N71N2k60k3j17K68
$$ -27 -73 16 -29 -185 86 -123 363 206 356 -142 -119 -195 -203 282 -122 24 -313 258 310 50 27 -90 178
5005A78j93L1j55L65j06r3J55j43P1l54O42k92K2j18j70L80k03j81j5R5N6J4J01
$$ 178 -15 16 -139 226 120 27 182 39 110 -244 398 106 128 10 -160 220 17 -164 -179 -84 -28 -14 87
5028H7l9j16l21N77m71J64L5R7q9j81L94l47J58q2L66m40L43L9k74Q0r0m8O5Q6
$$ 87 48 -68 -389 188 -283 -119 -84 13 -76 -257 137 -210 -52 -134 232 -208 135 174 -100 -20 -110 -158 -93 -7
5052gk76K70j11J24k9k50L06J46j23j83J04J68l31L22j12o2p3PK73k95J43N0M7
$$ -7 -283 -13 -124 0 -29 -279 27 173 50 -133 -29 139 -192 130 18 -44 -117 -110 163 -132 11 61 108
5075A08p2K5j32K06j17J05J23j89N5k17L78l46J83J8ok21P1L20k23n2p6LL34k76
$$ 108 36 61 -71 135 18 123 246 57 112 -105 273 -73 110 128 122 -99 -28 292 69 17 -59 -56 278 2
5099Bq4JP4j40L02l30M00j54oj27P2P4j71l8J93j30J80j09l5K01k14Nj40o7P1
$$ 2 -82 -81 -7 -147 155 -175 225 71 65 -62 10 84 -87 -125 68 -62 118 9 -26 175 -39 -34 -174 -241 -170
5124a70pJ81N4l07M17r3r4J26k06M7J30k7k5J48l87M4N4L6J63l31K35J69k80L47
$$ -170 -177 4 58 -249 168 75 -19 107 -99 -52 78 51 26 174 -213 -169 -115 -79 84 -247 -12 157 -123 224
5148B24k97j27M56Q4m25K08j96M9J44JJ88l72q6m3K37M1q6K40k72R7k11L8J24
$$ 224 -73 -200 256 340 -85 123 -73 -24 120 121 309 -63 -149 -192 45 86 0 240 -32 65 -146 -108 16
5171A6J80j8K7j57R3J32o29M77m9k79J28R3mp5J97l89L16ok62n7K75J9k35K83
$$ 16 196 178 205 48 141 273 -356 121 72 -207 -79 14 10 -65 132 -257 59 53 -209 -266 9 28 -207 76
5195G6j08k7j82N0J15J2l8q6L36l66P5P9P8n9l55L33N4J14J05m09L20lj39L0J94
$$ 76 -32 -59 -241 -191 -76 -64 -102 -188 148 -218 -143 -64 14 -45 -400 -67 -13 101 206 -203 117 114 -25 5 199
5220A99k00K51Rj43j14j01R9K30k14J83K1k63L70k85k06K24pJ76k54J46Rl8l7
$$ 199 -1 250 259 116 2 -99 0 230 16 199 220 -43 327 42 -164 60 53 229 -25 121 130 92 55
5243E5J85q8j35J68k27P9q4J44k47K0K96p6lk03J37J95j90P6M3L9j43j36JJ45
$$ 55 240 152 17 185 -42 37 -47 97 -150 -130 166 90 87 -116 21 216 26 102 145 184 41 -95 -94 51
5267E1k35J38j1k39J95k4l50L14Q0j39L58k17r7J98l21K50j06J28k03L04K6n8
$$ 51 -184 -46 -57 -296 -101 -125 -475 -161 -81 -220 138 -79 -176 22 -299 -49 -155 -27 -230 74 100 42
5289D2k4k0K10m46M77j22j82k7q1M06l33J6O9L02k84K81k36n9J53l93N51l64p
$$ 42 18 -2 208 -238 239 117 -65 -92 -173 233 -100 -84 -15 287 3 284 48 -11 142 -251 300 -64 -71
5312g1NK45k03l3J42l22R3J13K88k71J06p6n4j1J13j17Q7J7q1J07k37K45J75l95
$$ -71 -66 179 -24 -57 85 -237 -144 -31 257 -14 92 16 -38 -49 64 -53 34 51 -30 77 -160 85 260 -135
5336a35J27n3m2N3M2J67m1j54l7J27p1j29k7O5j33J32P3j69K06L4k16m1J37m3
$$ -135 -8 -61 -103 -50 -8 159 118 -36 -73 54 -17 -146 -173 -108 -241 -109 -36 -205 1 35 -181 -222 -85 -128
5360a28K25j7j49k08L50k38L04l72J51K56k4j83P9J24k70j94M07J80k74o8k67
$$ -128 97 80 -69 -277 73 -165 139 -233 -82 174 150 -33 46 170 -100 -294 113 293 19 -49 -316
5381c16M83j37O8J74k72K35R2j02l00P7o5L17J28o14r1J8M91j77r4J51k19J28
$$ -316 167 30 98 272 0 235 327 225 -75 2 -63 254 382 -232 -323 -305 186 9 -85 66 -153 -25
5403b5J84j11j33M05n19L58j87K33j82k12K77k02K72k37J86l34J50mP6r0q6M12
$$ -25 159 48 -85 320 -199 159 -28 205 23 -189 88 -114 158 -79 107 -227 -77 -81 -5 -95 -181 231
5425B31m21K59j7o2L1k71L62l27Q7K86j77o9r3L85m73K70l1j14J18J23J36l4n1
$$ 231 -190 69 52 -10 21 -250 112 -215 -128 158 -19 -88 -181 204 -269 1 -30 -144 -26 97 233 199 148
5448A48k99Q1l2K07k27J4mK22R2l62o8K62k75K09J12r6J1K30j03n1k2K46j72j56
$$ 148 -151 -70 -102 105 -122 -108 -112 110 202 -160 -228 34 -241 -32 80 -16 -5 225 122 71 49 295 123 -33
5472c3j82J66N2n7J42k15J82q4k0J06k34M81l02j16K02q8J98m28J49r4K90m88
$$ -33 -215 -49 3 -54 88 -127 55 -29 -49 57 -177 304 2 -114 88 0 198 -230 -81 -175 115 -373
5494c73L94q7k8J99p9p5j8QP3j8J05j75J94K6j28M2j33j33j09K55J09O4j61K8
$$ -373 21 -66 -94 105 26 -49 -67 -59 14 -4 101 -74 120 146 18 60 -73 -206 -315 -60 49 113 -48 -20
5518b0k2n8qK53k12M0j7Q8L7k52j4L00j02K48k21j99J61N5R5j57L2Q5j00QP4l8
$$ -20 -42 -100 -108 145 -67 -27 -44 44 81 -171 -185 115 13 261 40 -159 2 57 152 -5 27 112 12 20 94 56
5544E6L5M0O1k42M4L92l78l8r9J73l22K35K73k99K35o4r9j74K93l30J16J69o5
$$ 56 91 131 192 -50 -6 386 8 -30 -129 44 -278 -43 230 -69 166 102 3 -171 122 -208 -92 77 12
5567A2N2q2P5p8j37J30j13J06l58L29pk46Q4K51N0Nk64K33K26m07K99k22J67M
$$ 12 64 -18 57 -21 -158 -28 -141 -35 -393 -64 -71 -317 -233 18 68 73 -191 42 268 -139 160 -62 105 109
5591A09j31m8J0J73O8l5l14J74O5o4j55J69O2k12M46k86k37J27j89J68J41k55
$$ 109 -22 -70 -60 113 181 146 -168 6 71 7 -148 21 83 -129 317 31 -206 -79 -268 -100 41 -214
5613b14j41L94k32K77k23K11K86j49k04k79M87j77K09j80j54K73k67J17n3j31
$$ -214 -355 39 -193 84 -139 72 358 209 5 -274 213 36 245 65 -89 184 -83 34 -19 -150
5633a50K75L9j37j78K93k39P8P1j50j34J89J2J12L4k90km4Q8r2K32j18j22L19
$$ -150 125 164 27 -151 142 -97 -19 52 -98 -232 -43 -31 81 115 -175 -177 -221 -133 -225 7 -111 -233 86
5656H6n0O5o4J45j54J02r5k22l4M8J83O7K38m51J70P7j86L39k93L60k16nK75l15
$$ 86 36 101 37 182 28 130 35 -187 -221 -173 10 77 315 -136 34 111 -75 264 -29 331 115 110 385 70
5680G0o8q7J07k35K03Kl2N1J73j42Q6J1l27N13j80n0n6K06J07n53K70j23k6M8
$$ 70 2 -85 22 -213 -10 -8 -40 11 184 42 128 139 -188 325 145 95 39 245 352 -201 69 -54 -80 -32
5704c2R0q1M0j66K3J60j74N7MK42k18j06qJ16J37j40j17K6JJ94k11K19mq2j88
$$ -32 58 -23 17 -149 -126 34 -140 -83 -79 163 -55 -161 -169 -53 84 -56 -173 -147 -146 48 -163 56 52 -30 -218
5729b18K19j14K07m20J71J91k96L61k39m4J47q0M18k17l02J70j52J67rL93l57
$$ -218 1 -113 94 -326 -155 36 -260 101 -138 -182 -35 -115 303 86 -216 -46 -198 -31 -40 353 -4
5750dR0k1j58J59oO6p2J39r2N5k22K43j17k49K05o8L28k15J83j65K9k86J52r4
$$ -4 86 65 -93 66 60 126 54 193 101 156 -66 177 60 -189 16 -52 276 61 244 79 108 -178 -26 -120
5774a20J71M7r6J59k69K23m21L97k2J10j08j69l1l4K53k83K13L8k16K56j69O9
$$ -120 51 98 2 161 -108 115 -306 91 69 179 71 -98 -129 -163 90 -193 20 58 -158 98 -71 -2
5796bj49l1K33q5k1k87N86k78P3j48K60j89lJ87k30J25j93J20L00j15j72J17j90
$$ -2 -151 -182 51 -34 -55 -342 244 -34 39 -109 151 -38 -41 146 -84 41 -152 -32 268 153 -19 98 -92
5819i2L21n21J54M11k46J23k77K28o1P5J64l15J80r1j61O5K47P7j32qJ42j45J11
$$ -92 229 -292 -138 273 27 150 -127 101 40 115 279 -36 144 53 -108 -43 204 281 149 141 283 138 249
5842B49l70KK08j88p0K63r4J33l36K45J01l07J10J2k5m6J18J01Mm7%j27J37q9
$$ 249 -121 -119 89 -99 -169 94 0 133 -203 42 143 -164 -54 -42 -67 -113 5 106 110 63 63 -64 73 -16
5866a6K35J9k20L32k24J0k23o3K6l9L28M3k97J2M0J92k06J1L7P5j79J25k61M34
$$ -16 219 238 18 350 126 136 -87 -150 -124 -163 165 208 -89 -77 -37 155 -51 -40 -3 72 -107 18 -243 191
5890A91j51j06R7M1j08q6J9M19m28K03k80J00R8K04l93K62p5j74L15k03N6L4j55
$$ 191 40 -66 31 72 -36 -122 -103 316 -112 91 -189 -89 9 213 -180 82 7 -167 148 -55 1 35 -120
5913a20K77m74L70n3J10k06J70j58R4K1j62M49r6j72l5R8j75J66j6l42K76O4q3
$$ -120 157 -317 53 0 110 -96 74 -84 10 31 -131 318 222 50 15 113 -62 104 88 -254 22 86 3
5936Cm1j0kJ35q6N5o7k27J18J5K57j40kL8K5j04j85R9j08K22p6N3k0j7L4j40K76
$$ 3 -38 -48 -50 85 -1 54 -13 -240 -122 -107 150 10 8 46 71 -33 -218 -119 -227 -5 -81 -28 -48 -65 -31 -171 105
5963A05m57M55l0n1k59K75J68k99j95K52n7J61QPj55o4Q1K46j26j69L79j62q7
$$ 105 -352 103 73 22 -237 38 206 -93 -288 -36 -93 68 76 83 -72 -136 -55 191 65 -104 275 113 26
5986B6J58j87J24J7L9l01J08M7K24k20q8o3r3J77J45j21jJ96j28L9j47o6K05K60
$$ 26 184 -3 121 138 177 -124 -16 31 255 35 -53 -116 -209 -32 113 -8 -9 187 59 98 -49 -115 90 350
6010C50k08j20n8L6R9q8j80J58Mp9P0Q7k00J41k12L48j79o1j18J47K25l41J37
$$ 350 142 22 -36 0 99 11 -169 -11 -7 -86 -16 71 -129 12 -200 148 -31 -92 -210 -63 162 -179 -42
6033d2K3N5k42J68K76k19J19j82L6m5j17L28k0l34R2J15l7J7Q3J48k76J61r1J5
$$ -42 -19 36 -206 -38 238 19 138 -44 -8 -53 -170 158 138 -196 -104 11 -26 -9 74 222 -54 107 16 31
6057C1L4l60L67L2N6p1j00M6j3K77j65J0j19J50k52K7p6j17M39j56q0J54J0N2
$$ 31 65 -295 72 104 160 89 -11 35 22 299 134 144 25 175 -77 -50 -126 -243 196 40 -40 114 124 176
6081A76k61K70M2l87J03P4K0k6o6J36K54m03J90q9j61m6L1J45J77j98j07O2L58
$$ 176 -85 185 227 -160 -57 17 37 11 -55 81 335 -68 122 33 -128 -174 -143 2 179 -19 -126 -64 294
6104B94j25k94L14m50N3K72k39J90j14J50j65K24P9o79N62k70L34j54j62K02j27
$$ 294 169 -125 189 -261 -208 64 -175 15 -99 51 -114 110 189 -490 72 -198 136 -18 -180 22 -105
6125a05j24L4N3J41J89k30J66J03j60R9r6j20O6j62K97j95K02r1nj22J24k18J85
$$ -105 -229 -195 -142 -1 188 -42 124 227 67 166 70 -50 16 -146 151 -44 158 67 62 -60 64 -154 31
6148C1m5o1R3j57k2L46j54j70K95j30k03J79J14J04o0p7OQ7j09Q3r4j16K46k75
$$ 31 -14 -75 18 -139 -161 185 31 -139 156 26 -177 2 116 220 160 83 89 176 67 150 56 -60 186 -89
6172h9R3K80k28j62J33j1k66K63j7M2j47p1L2m8J19n2L44k83K56l40lJ95p3J06
$$ -89 4 284 56 -106 27 16 -250 13 -4 38 -109 -180 -148 -196 -77 -129 215 -68 188 -152 -155 40 -33 73
6196G3k24L80m05L09j60J2J57n2l9k5m4K3N1oJ22j69K71j70j22J34n2K57l45O6
$$ 73 -151 229 -176 133 -27 -15 142 90 51 26 -18 5 56 50 172 3 274 104 -18 116 64 321 -24 42
6220D2j69K91q8p4K22j90j04m9k1L30k58K23k87L05J3p7N0k82P2J68l6k8j81K05
$$ 42 -127 164 76 2 224 34 -70 -119 -140 190 -68 155 -132 173 186 109 159 -123 -51 117 81 53 -128 77
6244G7J19J3k13m2K1J95l79k7k5J31o7P3R8l00K37j81J84j24L52o7j52J26j54
$$ 77 196 209 -4 -46 -25 170 -209 -236 -261 -130 -197 -124 -26 -326 -89 -270 -86 -210 142 75 -77 49 -105
6267a05L7lN9q5m8L32k32K28l43J35j73J61r2qK6q3J07p2K24k08K22k46J39J21
$$ -105 -68 -71 -12 -97 -145 187 -45 183 -160 -25 -198 -37 -129 -137 -111 -194 -87 -159 65 -143 79 -167 -28 93
6291I3k13K77k35J90r6O2oq0J06j87J90J8j30k06J73r3J63j0j15J95j69j16K43
$$ 93 -120 157 -78 112 16 78 72 -8 98 -89 101 119 -11 -217 -44 -137 26 16 -99 96 -73 -189 54
6314E4m1J09k60J08J3J07r6j16L45m16M79l32o1R2J07j32J26r6q8m6P7j70K73
$$ 54 13 122 -138 -30 -17 90 -6 -122 223 -193 286 -46 -107 -15 92 -40 86 -10 -98 -144 -67 -237 36
6337C6Qj23j14K64Pk0k01J43O0R2k40J86k13M0J3L55o4l00j4QK38l88K8L13m22
$$ 36 44 -79 -193 71 78 58 -143 0 60 152 -88 98 -115 -75 -62 293 229 -71 -85 -77 161 -227 -199 114 -308
6362c08J59L11n9r7K09j85n8J06j23N4j17K25j53n7M2j91L04j00J92k08p4K89
$$ -308 -149 162 103 6 215 30 -28 78 -45 9 -108 117 -36 -93 -51 -242 62 -38 154 -54 -128 161
6384A61j05p4K4K93k89j6l54J41K97J79l17n4J17J6j06J76j48J45P3k72J2m8j08
$$ 161 56 -18 6 299 10 -6 -360 -219 78 257 -60 -114 3 19 -87 89 -59 86 159 -113 -101 -149 -257
6407b57J55p6L8r3L7J45j65L31n01L46J1K47k32k22M12j72J51j29p6R3O8j50J16
$$ -257 -102 -178 -140 -233 -196 -51 -216 115 -386 -40 -29 218 -14 -236 176 4 155 26 -50 43 111 -39 77
6430G7r7m2J28l03L12j07K14k39j55K55r8N58n48K96k52J19j13m0L41k29o9J26
$$ 77 -20 -62 66 -237 75 -32 182 -57 -212 43 -55 503 -45 251 -1 118 5 -35 306 77 8 134
6452A34k92K05k4j71L05J0Ll05j4KJ47j76L14l84K63j34J12K4N4k89O6P9LK05
$$ 134 -158 47 23 -148 157 167 170 -135 -149 -147 0 -176 138 -246 17 -117 -5 19 73 -216 -150 -71 -68 137
6476A37j11j53J6Q5j57p9L36j14P3J9J0p7k8k60L04J31k64J03N0p3J57k43J37
$$ 137 26 -127 -111 -26 -183 -262 74 -40 33 52 62 -15 -43 -303 1 132 -132 -29 21 -52 105 -138 -1
6499aJ17j79J26j68J0J48Q0J02q9k77L5J58Q0q7J18m5k34L25j02J5j63K03r4J20
$$ -1 116 -63 63 -105 -95 53 133 235 146 -131 -96 62 142 55 173 128 -106 219 117 132 -31 172 78 198
6523A98q1j35R0j73M49l08J20j08J83k13Q2l3k0R4l32K17k39K90l07K54J51k01
$$ 198 117 -18 72 -101 348 40 160 52 235 22 104 71 51 145 -187 30 -209 81 -226 28 179 -22
6545b2J69m03L95l02J09Q3R3o9j36J61k09L17l39K78j04p3K29jko5J32m57J83
$$ -22 147 -256 139 -163 -54 29 122 53 -83 78 -131 186 -153 125 21 -52 177 176 174 109 241 -216 -33
6568c3Q3j88J25K5p5J25K5O3J32l57L39k67q9K20j39j0K09J01j35m79M25j75M22
$$ -33 50 -138 -13 12 -63 62 87 150 282 -75 264 -3 -92 128 -11 -21 188 289 154 -325 100 -75 347
6591C47l24O0K6k10J07J37l5r3L11m35J05n6l6O8R4n8k4j4L2J60o9j54L03l22
$$ 347 23 83 109 -101 6 143 108 15 326 -109 -4 -60 -96 -28 66 8 -16 -30 2 162 93 -61 242 -80
6615h0Q5k58K01Q5o9p8J08M9q3J99l79J61N0r9L0K15n1j49K48m59R7J18j16J15
$$ -80 5 -253 -52 33 -36 -114 -6 43 -40 159 -220 -59 -9 -108 -78 137 86 -63 185 -274 -177 -59 -175 -60
6639f0k4L7l7Q0Qr9j0J15K97l90J76J8r0J2j03n7J34qk41N32l54N8P2j26m6N65
$$ -60 -84 -47 -84 -4 4 -95 -105 10 307 -83 93 111 21 33 -70 -127 7 -1 -242 290 -64 -6 66 -60 -106 459
6665D59o18J37K29k84L18k53J74j51n9J19j05L20q9m31K38O0j02Lj15P2r8L20
$$ 459 -159 -22 207 -77 241 -12 162 11 -48 71 -34 286 197 -234 4 64 -38 -35 -150 -78 -176 144
6687A44Q9k43M7J6j3k22N7K37r9n2K63k95J8q9J91k20K02j55n4k15K61Q5J15k83
$$ 144 233 -10 37 53 40 -182 -125 112 13 -39 224 -71 -53 -142 49 -171 31 -124 -178 -393 -132 -47 68 -215
6711b15J89J94l88N0J55J29j42j18J72j87K68m02R4L03j51K35k00m3%Q4K7Ll6
$$ -215 -26 168 -220 -170 -15 114 -28 -146 26 -161 107 -295 -201 102 -49 186 -14 -57 -57 27 54 57 21
6734B1J49j49o5J67j15J41l42L35J15m67M18k69K00m01K20L51j76k12K4R9p8N5
$$ 21 170 21 -44 123 8 149 -193 142 257 -210 208 -61 139 -262 -42 309 133 -79 -55 44 -34 21
6756B1N8n8O3j42j64J57p5K82k25kJ21j46J54k42K03L52l10n6j73KJ8L17k73M1
$$ 21 79 21 84 -58 -222 -65 -140 142 -83 -85 36 -110 44 -198 5 357 47 -9 -182 -180 -162 155 -118 -77
6780g7k05Q6j04N30m36J37K06k03K35j59j46J95k63J04Q4j11o1K55J45l29J05
$$ -77 -282 -196 -300 230 -206 -69 137 -66 169 10 -136 59 -204 -100 -16 -127 -188 67 212 -117 -12
6801a2J2K9R3o2M0M0j8k74K61j03N2j67J33o1J98j37K06l10L6Q8J29j12j3q5n7
$$ -12 0 29 122 60 100 140 122 -152 109 6 58 -109 24 -37 161 24 230 -80 -44 44 173 61 48 -37 -94
6826i4J70m6ML3M3l8J34l84K25l6k3M3K55j27m48L12K4k40O2M87m49J84j31j88
$$ -94 76 30 34 67 110 72 206 -178 47 11 -12 31 286 159 -289 23 47 -193 -131 356 -93 91 -40 -228
6850b28J75P5k1q5J33r5LJ1J02j10Q3P7k21QJ75j14R7m46L88M6k79J23J74p9J3
$$ -228 -53 22 1 -84 49 -46 -43 -32 70 -40 43 120 -101 -93 82 -32 65 -381 7 53 -226 -103 71 -8 5
6875Ek9j88jJ51r0J26J32j03J96k60k06N32k06K22k34P5J43k94Q2j0K08j97N3
$$ 5 -24 -212 -213 -62 -152 -26 106 3 199 -61 -267 265 59 281 47 122 265 -29 53 43 251 54 107
6898A07j95J37K07m37K46o8J73k32L0J0Q0J44l49K50m91K96J3mm2K00L2L6L0m89
$$ 107 -88 49 256 -181 65 -3 170 -62 -32 -22 58 202 -147 103 -388 -92 -79 -83 -125 75 107 143 173 -316
6922c16K41M0J10k07m1L01k92M59l13j09Q9K1j06O8M9o3o0j31L44p3l0k12K20
$$ -316 -75 -35 75 -132 -173 128 -164 295 -18 -127 -38 -17 -123 -55 -6 -69 -129 -260 84 11 -19 -231 -11
6945a1J93n6n5J9o3k9K0O5j92K41p7k53K02J70q7j24nK1r2O9J74j56R9K8r2j6
$$ -11 182 126 71 90 27 -2 18 83 -109 132 55 -198 4 174 87 -37 -42 -21 -113 -44 130 -26 73 101 9 -7
6971gkJ04k34K16j31j48K51K6k2J24k63K51k18n9K80k14O3o0J74Lj90j56K67k8
$$ -7 -9 95 -139 77 -54 -202 49 75 53 177 -86 165 -53 -112 168 -46 17 -43 131 134 -56 -212 55 27
6995B7R5j53j3q2K02l5j08n5Q1l80K74R0K04n5j35j03L8K01r4j06K51k70P6K04
$$ 27 122 -31 -44 -126 76 41 -67 -122 -41 -421 -147 -57 147 92 -43 -146 -108 93 -1 -107 144 -126 -50 154
7019A54j99J22Oj37N4K28j93J03k94OJ22R7m9Q9l7j16On1J75m31L44j8k4N4R7
$$ 154 -45 77 83 -54 0 228 35 138 -156 -150 -28 69 20 109 72 -44 -38 -89 86 -345 -1 -19 -43 11 108
7044A08q5l24K94Q0K97l54K2L2j84O9o0J87O1j39P2q0o3Q6K55m50L23j24j03k73
$$ 108 23 -301 -7 73 370 16 38 70 -114 -45 -105 82 143 4 76 -4 -67 19 274 -176 147 23 -80 -353
7068c53K81o1J72j51j83K79J39l80K66J01j45k3J49l77J49j1K60j11Lj1kO2m42
$$ -353 -72 -133 39 -112 -295 -16 123 -257 9 110 -35 -58 91 -286 -137 -148 112 1 4 -7 -9 53 -389
7091c89M17j4N4L4k37K11j87J33P6j12K01r0m7k51J95LK11R5o0l18k30L48j50
$$ -389 28 14 68 102 -135 76 -111 22 98 -14 187 97 50 -201 -6 -3 208 303 243 -75 -305 43 -107
7114a07M5P8Q5l2l0qM1Q8k18j12J49N3J96j11j88J88kMQ1k60l3Q6R7Q8j99R0j42
$$ -107 -62 16 101 69 39 31 72 160 -58 -170 -21 32 228 117 -71 117 115 119 200 -60 -93 -7 90 178 -21 69 -73
7141g3M32k80n7j3j07j3j02Q7p0R7O3p3J87l09L53k84J24l63L74K17k57K35o3
$$ -73 359 79 22 9 -98 -111 -213 -126 -196 -99 -36 -109 78 -231 122 -162 -38 -401 -27 190 -67 168 105
7164A05k59r3J28K62l00N6J12l9K11k86O7O5j6M6o1O6m02K40K29j73o3L51j21
$$ 105 -154 -247 -119 143 -157 -101 11 -28 183 -103 -36 29 13 59 -2 64 -338 -98 131 -42 -105 246 125
7187A25n3Q3j72J36M7k90M15k47k10J9N1K58R5j31o8LJ80p2j52j67J75M2p7nK72
$$ 125 72 155 -17 119 166 -124 291 44 -166 -147 -96 162 257 126 58 61 241 169 17 -150 25 67 -10 -15 257
7212B57l02J84k31K14l50K05J19q3R3j06J01k19K70k41KN3K9J83m45J76J31m8
$$ 257 -45 139 -92 122 -228 -23 96 13 106 0 101 -118 152 -89 -87 -34 -5 178 -267 -91 40 -8
7234hn3np0R1J16k5j01j20J13K2j20L48k30J7m2K83k97q0L10l25J89P2M5Jj66
$$ -8 -61 -66 -136 -45 71 46 -55 -175 -62 -40 -160 188 -42 -25 -67 216 -81 -161 149 -176 13 85 130 131 -35
7259c5m3M08k93j12K80m33M31k43jJ99j07J22j77K48j0J38l48J66m68M01l33L58
$$ -35 -78 330 37 -75 205 -228 203 -40 -41 158 51 173 -4 244 234 372 24 190 -278 123 -210 148
7281A48O9j84j13j70J80K31j72J81l31K48k26K97k92L2K38l51J77J0K00j94j2
$$ 148 217 33 -80 -250 -70 161 -11 170 -161 87 -139 158 -134 -102 136 -215 -38 -28 172 -22 -34
7302c4j15P5K42j91J8q0O0o6M3J53q7j77L52L3j44J09j67j24J53j02k54L3M56
$$ -34 -149 -74 168 -23 -5 -85 -25 -91 -48 105 18 -159 193 226 82 191 24 -100 53 -49 -303 -270 186
7325A86j29r4o0L17r3k07j3k4K44k78L05j6J67k92J9pk34K78k27N1Q7O5L1Q1q4
$$ 186 57 -37 -97 220 127 -80 -93 -117 127 -151 154 138 305 13 32 25 -209 69 -158 -107 -20 45 76 157 73
7350G3N2k06L5O9L5n0J28k56J35j24m4J01J23j55r1O3n3J20L3J65l36J52ok0J83
$$ 73 125 -81 -46 23 58 8 136 -120 15 -109 -153 -52 71 -84 -175 -112 -165 -45 -12 153 -183 -31 -37 -57 126
7375A26j55K20p7j5n8m0k82K21m3J83l1j78M2Q3n5J10k8J93l93J90J8r9N5L2k34
$$ 126 -29 191 114 99 41 1 -281 -60 -103 80 49 -129 -87 -4 -59 51 23 216 -177 13 31 -68 -13 19 -215
7400b15R6K67o1K3j12J62k02L31p7l5J2o0n5R3j27K9N5l15K67j06L3L41l03J60
$$ -215 -119 148 87 110 -2 160 -42 289 212 177 189 129 74 167 40 69 124 -191 76 -30 3 344 41 201
7424B01j01j57K48j67P2j23j1n7J61j06J87j87K34l88RL23k72L71n25J66R4j2
$$ 201 100 -57 191 24 96 -27 -38 -95 66 -40 147 -40 194 -194 -185 138 -134 237 -288 -122 -28 -40
7446d0J41k00J48k67K43k50L22j05j31j43J65J54N1j77J04oo3J44J03M1l02J65
$$ -40 101 -99 49 -218 25 -225 97 -8 -139 -282 -117 37 88 -89 15 9 -54 90 193 234 -68 97
7468I7k9j0j24J04J52J0m43K60M7j49L00p6j23M6p9j0pJ57m4l09K32J72j88J17
$$ 97 68 58 -66 38 190 200 -243 17 64 -85 215 139 16 62 -17 -27 -34 123 79 -230 2 174 -14 103
7492A03j68k8K65j84N4N2j75p7M55k64l3n7j09K78j22N3r5K90k00O0J14j22j19
$$ 103 -65 -93 172 -12 42 94 -81 -158 297 33 0 -57 -166 112 -10 43 -52 238 38 98 212 90 -29
7515b9k01L02k70J91M7m6M0j53J41k39M36l08J83l05L29Mj70j3l9j2nK09j49j1
$$ -29 -230 72 -198 -7 40 -6 34 -119 22 -217 219 -89 94 -211 118 122 -48 -61 -100 -112 -117 92 -57 -68
7539f8k6J31K9p4O6k56K03J18jn1l35L23k9K02k37P3p7J50k62J71M9k76J64j70
$$ -68 -94 37 66 -8 58 -198 5 123 122 71 -264 59 30 232 -5 68 -9 141 -121 50 99 -177 -13 -183
7563a83L69m1l1K4j76m0k4j96J71K2j60Q8K57k28K30m6J33r8J56m07J06jm5L11
$$ -183 186 145 114 138 -38 -78 -102 -298 -127 -105 -265 -177 80 -148 82 36 169 71 227 -180 -74 -75 -120 191
7587A91j26pl00L22q7p3J41j67%L5Q3k54K83p9k53J81K8J83l81L89j12J50j51
$$ 191 65 58 -242 80 -7 -80 61 -106 -106 -71 12 -242 41 -38 -291 -110 -82 101 -280 109 -3 147 -4
7610dj40O0K4J44j21K03l34K44o3l2J99j4J11k74k9J29K11j12R3l51mK81k15K61
$$ -4 -144 -84 -60 84 -37 166 -168 76 13 -19 180 166 277 3 -26 103 314 202 295 -56 -60 221 6 267
7634B67j65j60J93l73K26J9P5j20k6k27K76M0M1j48J36m0l27K57P7q2J84l43K96
$$ 267 102 -58 135 -238 -12 7 82 -38 -64 -291 -15 25 66 -82 54 14 -313 -56 21 -61 123 -220 76
7657G6j64O6j65J39j0K7j5k98M74q4k63K14Mj73R5J09o1P4J35m41L13j3j29N4
$$ 76 -88 -22 -187 -48 -58 -31 -46 -344 130 46 -217 -3 1 -172 -77 32 -29 45 180 -261 52 39 -90 -36
7681c6K9Ql9j32K54j02j10Ql9L34k03L15k05K1j03l9j4R3R9P7k28o3L72k62M5
$$ -36 -7 1 -38 -170 84 -18 -128 -120 -159 175 -28 287 82 103 0 -39 -53 40 139 216 -12 -75 297 35 80
7706H0l8l06N25k30l9P6N4P5k32J63n4lj42j67L85L4j66J38k11J91q7r8J35k8
$$ 80 42 -264 261 31 -8 68 122 197 -35 128 74 71 -71 -238 147 181 15 153 -58 133 46 -52 83 55
7730E5Q6k09L43l04j38J29j77K48j17K4k62K34P7j08K72l29k8J74j17L5q9J28
$$ 55 141 -68 275 -29 -167 -38 -215 33 -84 -60 -322 -88 -11 -119 153 -176 -204 -30 -147 -112 -201 -73
7752g3K56p6k65K0O2J99j3K0j14M9l32N80j26l19K21j06J77k55J89J2k28K34r7
$$ -73 183 107 -158 -138 -76 123 110 130 16 65 -267 313 187 -132 89 -17 160 -95 94 106 -122 112 15
7775A5M7j46j19K39j0J85l36K47n7K34l31NK89k57O8k70L28J41j86m5Q6K0k19
$$ 15 62 -84 -203 36 26 211 -125 122 65 299 -32 -27 262 5 73 -197 131 272 86 41 127 147 -72
7798g2L76j32Jk84K29k3l32K93j41K89m04k7J69k22L49k27K55l41L52O7k90J66
$$ -72 304 172 173 -111 118 95 -237 56 -85 204 -200 -227 -58 -280 69 -158 97 -244 108 175 -115 51
7820E1k91K97o9N8k73J58o6J14l5K89j67j61j22P6m7R7J25QQ8J05j18M7k37J95
$$ 51 -240 57 -12 46 -227 -69 -135 -21 -56 233 66 -95 -217 -141 -188 -91 34 42 130 235 117 164 -73 122
7844A22j21Qk55J93K08j75J75l69M70p3k84J88p2R1j17K49m37R1J03J65k43K44
$$ 122 1 9 -246 -53 155 -20 155 -214 256 183 -101 87 15 106 -11 238 -199 -108 -5 160 -83 161
7866A61l05K95R4j58j66O3K26l00R8K58j00p8j95K89m12L31j50O1N4j05R8m05
$$ 161 -144 151 245 87 -79 -16 210 -90 8 266 166 88 -107 182 -230 101 -49 12 66 -39 59 -346
7888c46J7L03K8q6j5R3j70L68j28j54J15j21J70m06N7K26K16k06j78L39J8k09
$$ -346 -329 -26 2 -84 -99 -6 -176 192 64 -90 25 -96 74 -332 -275 -49 167 -39 -217 122 140 -69
7910f9n8K03r1P7K35k13j51K8K88l31%J65n2J7j42J79j88O9R4K39k99qp7J97n4
$$ -69 -127 76 -15 62 297 84 -67 -39 249 -82 -82 83 31 48 -94 85 -103 -34 60 299 0 -8 -85 112 58
7935E8l41L43K48P7m40K42j97J32l13R6Q7j9K8j83K62j84L08j44l1J6%k23J56
$$ 58 -283 60 308 385 -55 187 -10 122 -191 -95 -8 -27 1 -182 80 -104 204 60 29 45 45 -178 -22
7958b2r5q9J46J54k12K21o9K45l45J9j33N8Q0n5K32j76K79j79j83L9p6K11K2n
$$ -22 -117 -206 -60 94 -118 103 34 279 -66 -47 -180 -122 -42 -97 135 -41 238 59 -124 -85 -161 50 72 67
7982F7l60J44J89j06K75l14J72kr5l33L35M6J40o3O1q7q2K27p8j28P7n0m2J58
$$ 67 -293 -149 40 -66 209 -105 67 65 -30 -363 -28 18 158 95 156 69 -13 214 136 8 85 35 -7 151
8006A51nj48J50N6j83k9j93K9R5J76q4M8l4j6j7j06JR0j36J8J31j40Q1qJ49K25
$$ 151 146 -2 148 204 21 -8 -201 -172 -77 99 15 63 29 13 -4 -110 -109 -19 -155 -137 -6 -146 -65 -73 76 301
8032C01j34m1j94J54q3Q0J%m7j11K49k85P2K13j72r1K24j98p3K01j7J53j28J04
$$ 301 167 126 -68 86 3 83 84 84 37 -74 175 -110 -38 175 3 -88 136 -62 -135 66 49 202 74 178
8056A78k22K4K8k35K20J15k60J04Q4J1q4J67j62J97j39J99J88k33R6k05R7j67
$$ 178 -44 -20 8 -227 -7 108 -152 -48 36 47 -37 130 -32 165 26 225 413 180 276 71 168 1
8078AP8n4J04k54K27j80L45k32J58j13k63K64l91K31K49j45p4J10j11J39k7k87
$$ 1 79 25 129 -125 102 -78 267 35 193 80 -183 81 -310 -79 170 25 -49 61 -50 89 62 -225
8100b25K12o5m0K24j94J9M3j90K93k16Oq8L05j55L87l51J40j50J8J55l26R7J51
$$ -225 -13 -78 -118 106 -88 -69 -26 -216 77 -139 -133 -221 84 -71 316 -35 105 -45 -27 128 -198 -101 50
8123E0j11J04J31k2k1m02O6K51K63k42m8r0J41K0K7j21r4P7J53j66o8m1J90P4
$$ 50 -61 43 174 152 131 -271 -205 46 309 67 19 -71 70 90 117 -4 -98 -21 132 -34 -102 -143 47 121
8147A21j74o8L85j83r2%K69m15L63k65J49k2K0j13n1K32k38L01j39K79k36m3q4
$$ 121 -53 -121 264 81 -11 -11 258 -157 206 -59 90 68 88 -25 -76 156 -82 219 80 359 123 80 -4
8170dK23l70J52J76m40K36Q4J3j9j78K4R4k43K22J15r9j45QL1K26j42
$$ -4 219 -151 1 177 -263 -27 57 70 51 -127 -103 -9 -252 -30 85 -14 -159 -151 -120 106 -36
8191c6
$$ Imaginary data points
##PAGE= N=2
##DATA TABLE= (X++(I..I)), XYDATA
0@%%%%%%%%%%qJ6j6J6k4L2m0N6o4P2r0J14j36J59j86K18k55K93l37L87m43N05
$$ 0 0 0 0 0 0 0 0 0 0 0 -8 8 -8 8 -16 16 -24 32 -32 40 -50 64 -72 87 -99 119 -136 157 -180 207 -236 269
32B69n76O54p36Q29r32J045j169J304j453J612j789J983k194K425k673K948l248
$$ 269 -307 347 -389 440 -492 553 -616 688 -765 847 -942 1041 -1153 1272 -1401 1547 -1701
49a701L575l939M341m783N273n823O441p143P948q876R967j1272J2857j4834J7385
$$ -1701 1874 -2065 2276 -2507 2766 -3057 3384 -3759 4189 -4687 5280 -5992 6865 -7969 9416
64I416k0813K5683l3194M6399p6263K59876L5435m59008K95976J87634k59720
$$ 9416 -11397 14286 -18908 27491 -48772 211104 246539 -212469 83507 271141 11421
75A1421r3019L20835j88449j59480K00423P7432k84368O3956K26866k12406p9241
$$ 11421 -81598 239237 50788 -108692 91731 169163 -115205 -51249 175617 -36789 -116030
86a16030J76102M4172k03571K8202J28067o1997J586j6569j7682k3152J21637
$$ -116030 60072 104244 -99327 -71125 56942 -5055 -3469 -20038 -37720 -60872 60765
97F0765p2715q1162Q3574J0489l6470p694N5951r0789N0368N6768p6668k2794
$$ 60765 -11950 -93112 -9538 951 -35519 -43213 12738 -78051 -27683 29085 -47583 -70377
109g0377J04930J3045j85414J21327J15706r9508j00859J13923N4193j15589N0824
$$ -70377 34553 47598 -137816 -16489 99217 -291 -101150 12773 66966 -48623 2201
120B201K7703m6973l9330J32779m0500j26778Q8313P5913n5442j02338J28134
$$ 2201 29904 -17069 -56399 76380 35880 -90898 -2585 73328 17886 -84452 43682
131D3682K4085q8263k0962Q5441K4612r5142L6976R235P321l0490M0451j8246
$$ 43682 67767 -20496 -41458 43983 68595 -26547 10429 19664 26985 -3505 36946 18700
143A8700o5649O4957L9585n3684r6304J26451K6889j06635p025R5746m696j13606
$$ 18700 -46949 18008 57593 3909 -92395 34056 60945 -45690 -52715 43031 38335 -75271
155g5271Q8825K1971n2852L848O8827o5509m2340J28936m1014r1178L0413J19008
$$ -75271 13554 35525 -17327 -13479 55348 -10161 -52501 76435 35421 -55757 -25344 93664
167I3664r8910n9480R4507j7022m1020J5729L6828q8222N8017M4232q8126p493
$$ 93664 -5246 -64726 29781 12759 -28261 -12532 24296 -63926 -5909 38323 -49803 -57296
179e7296Q8530Q0j14515Q8453K5091n6870J3384N0034n8087j5979J21559q9790
$$ -57296 31234 31314 -83201 5252 30343 -26527 -13143 36891 -21196 -37175 84384 -5406
191e406o1885R4411N4918j38956P839J30993r2164m3988P4846R651j10976R5911
$$ -5406 -67291 27120 82038 -56918 -49079 81914 -10250 -54238 20608 30259 -80717 15194
203A5194M7929j43551K6952J26763n0414j43175J42855M9843j26824R176J02624
$$ 15194 63123 -80428 -53476 73287 22873 -120302 22553 72396 -54428 -45252 57372
214E7372n0196p5961J24891l3916q0265O3110P4592j14835l6088J49848m1565
$$ 57372 7176 -68785 56106 22190 -58075 5035 79627 -35208 -71296 78552 36987
225C6987r0670L1592Q9275p6922j6673O2857l6191j2308K9977K5227q0212M0616
$$ 36987 -53683 -22091 67184 -9738 -26411 36446 255 -12053 17924 43151 -37061 3555
237C555M5664m1317k8481L2801L6948o0310J4086j445J9391m833j5231j1003K569
$$ 3555 49219 7902 -20579 12222 49170 -11140 2946 1501 20892 16059 828 -10175 -7606
250g606M4492m8308l751O840K2855k3210o31J0661l2574L8670m151j6872k7313
$$ -7606 36886 -11422 -15173 -8333 14522 -8688 -9319 1342 -31232 7438 3287 -13585 -40898
263d0898N7076k438o0444K2539L6458Q95o5459L9681J6278r511j3898M223J4239
$$ -40898 16178 13740 -46704 -24165 12293 13188 -52271 -12590 3688 -5823 -19721 -15498 -1259
276a259k4009L6411j1522j2399j7733N2873P643o5034K1488M9487Q51q7550N8570
$$ -1259 -25268 11143 -379 -12778 -30511 22362 30005 -35029 -13541 35946 36797 -50753 7817
289G817N0366n6684l1002N9908J4167q1018O0740J6985n9818n626R3697m1396
$$ 7817 58183 1499 -29503 30405 44572 -36446 24294 41279 -18539 -24165 69532 28136
301B8136j01353J00915M1848q4962l5348J12606l1823p3244O2039J8412m8320
$$ 28136 -73217 27698 69546 -15416 -50764 61842 30019 -43225 18814 37226 -11094
312a1094n650P2576o7702j6129O5237j1076n9929J8833O2008o0218n09J1964j713
$$ -11094 -16744 55832 -11870 -27999 37238 26162 -33767 -14934 47074 -13144 -13653 -1689 -3402
325c402n204J7515k0061l3990O8282k0797m3185J5095N2417n0327k0853O4924
$$ -3402 -8606 8909 -11152 -45142 23140 2343 -40842 -25747 26670 -23657 -44510 20414
337B0414l5218k2056L4775K6062q1952L6683P5599p3744m3063P7810M3442j12314
$$ 20414 -14804 -36860 -2085 23977 -57975 -21292 54307 -19437 -62500 15310 58752 -53562
349e3562K9014P0870m0452m3292N8124J9656q4965N4916L8818n5645l4320Q7104
$$ -53562 -24548 46322 5870 -37422 20702 40358 -44607 10309 49127 -6518 -40838 46266
361D6266k687r2061M8337M9821l3525n8007O4393O445m2141J7333J1461j4561
$$ 46266 43579 -48482 -145 49676 16151 -41856 22537 28982 -13159 4174 15635 1074
373A074j7242M8842l1722j8303K0976J8419k0442k2810L5277j1357M075j9155
$$ 1074 -16168 32674 952 -17351 3625 22044 1602 -21208 14069 2712 6787 -12368
385a2368R321Q357K188j3279j7153L8251j5633n572r349J8720p174m262J5033
$$ -12368 -3047 5310 7498 -5781 -22934 15317 -316 -5888 -15237 3483 -3691 -7953 7080
398G080k4356J1659O400J4034l5633J1718K5229j1213j3690m928L9688k4429q857
$$ 7080 -17276 -5617 783 14817 -20816 -9098 16131 4918 -8772 -13700 25988 1559 -7298
411g298O68K1736j1953j7015K2010j5427J530j511J9664m0421K443M4089k2966
$$ -7298 -6630 15106 3153 -13862 8148 -7279 -5749 -7260 12404 -28017 -25574 18515 -4451
424d451l3413J4929N2442n4273r191M0138L898l5103J5702L6856n0659K0619L0663
$$ -4451 -37864 -22935 29507 -24766 -33957 6181 10079 -25024 -9322 27534 -23125 -2506 28157
437B8157j9917l5823N3131J9594o8153K0198L9659j2435m7540M5727K707l7341
$$ 28157 8240 -27583 25548 45142 -23011 -2813 36846 24411 -23129 22598 25305 -12036
449a2036K3737R896k3659j5679N4421l2301k9020L2382J8341l4738j3280M8455
$$ -12036 11701 21597 -2062 -17741 36680 4379 -24641 7741 26082 -8656 -21936 26519
461B6519k8546n160J1517K734k1484J8735J9424m6016J5831K2390m073l7904L0652
$$ 26519 -2027 -7187 4330 7064 -14420 4315 23739 -22277 -6446 15944 11871 -26033 4619
474D619J2032l1078J4315L934o336j4480L6295k5090k0605L3632O444l2741r539
$$ 4619 16651 -14427 -112 3822 -2514 -16994 19301 -5789 -26394 7238 13682 -19059 -28598
487b8598N2665l2357j4924K1698N627k5433J1590K9951m8702J1211L4316q218
$$ -28598 24067 -8290 -23214 -1516 4111 -21322 -9732 20219 -28483 -17272 17044 8826
499H826m7547L7927L2581n2961L052L1629K245m2806L3018R784l0544J2454J9851
$$ 8826 -38721 -794 31787 -21174 -18122 13507 15752 -27054 5964 15748 -14796 -2342 17509
512A7509j4049l0281M8697l554k9070J168L0956k857l0941K5330N64P7j2207J6673
$$ 17509 3460 -26821 21876 18322 -10748 -9580 21376 18519 -12422 12908 13472 13549 1342 18015
526A8015m471q657J2883p037J194j3881K4262j2366j3142K880J2249r2k8436J6509
$$ 18015 13544 4887 17770 10733 11927 -1954 22308 9942 -3200 -320 11929 11837 -16599 -90
540i0J97L053j6337P472j96o107J0995j3152P327p409J2353j1074K689N030n798
$$ -90 107 3160 -13177 -5705 -5901 -12008 -1013 -14165 -6838 -14247 -1894 -12968 -10279 -5249 -11047
555a1047J0939j1613M140j365K2173k3967j0674L0534K684k2087r405M0689k4080
$$ -11047 -108 -11721 -7581 -8946 13227 -10740 -21414 9120 11804 -10283 -19688 21001 -3079
568c079r841K0160L563k5729P471L5840m0123l385K8832N577m4081J8346M0544
$$ -3079 -12920 7240 10803 -14926 -7455 28385 -11738 -15123 13709 19286 -24795 -6449 34095
581C4095l9494j4163K6873J9310m3670J6152K0586k5996k048K3577K067m3548
$$ 34095 -5399 -19562 7311 26621 -17049 -897 19689 -6307 -8355 15222 17289 -26259
593b6259L1517J5196k4080j1590K6172J442l1850K4109J728n391j0100J5349p115
$$ -26259 5258 20454 -3626 -15216 10956 12398 -19452 4657 6385 994 -9106 6243 -872
606h72n931K0359j5368k409K125J7392j7945L919O171j1886J0946K532l483k0697
$$ -872 -6803 13556 -1812 -4221 -2096 15296 -2649 1270 7441 -4445 6501 9033 5550 -15147
620a5147L0194m420k3198J1676J5761j4965k2520L7578j0208j7657O154J5786
$$ -15147 15047 10627 -12571 -895 14866 -99 -22619 14959 4751 -12906 -6752 9034
632I034j9365o693L4538k4771j4369J5179K4000l1508o349K7414r289q692R15
$$ 9034 -10331 -17024 17514 -7257 -21626 -6447 17553 -13955 -20304 7110 -2179 -10871 -9956
645i956K1067k3125L482J1033l297m082J99J4094k0389Q964O305N039j7962M11
$$ -9956 11111 -12014 -8532 2501 -796 -4878 -4679 9415 -10974 -2010 4295 9334 -8628 -8217
659h217K1344j0107l509n765J7986j3330J996P574n891k091N07J3717k0218J1028
$$ -8217 13127 3020 -489 -6254 11732 -1598 398 7972 2081 -10 497 14214 -6004 5024
673E024L629m578p221Q625R395j9318J0625l226M010m358O894q639n527J9673
$$ 5024 8653 4075 -3146 5479 14874 -4444 6181 2955 6965 2607 9501 862 -4665 15008
687A5008j2537k174k118J3232j5392K708J0817j3880J365L768O368k2468J8048
$$ 15008 2471 297 -1821 11411 -3981 -1273 9544 -4336 -2971 797 7165 -15303 2745
700B745L776j7326k65J4175L007k7296K0040J969q649l223J4457q096j4816K6614
$$ 2745 6521 -10805 -11070 3105 6112 -21184 -1144 825 -7824 -11047 3410 -4686 -19502 7112
714G112q012j1650J183K3923j9143j1071K5156n452j0479J78K0903k1303L459
$$ 7112 -900 -12550 -11367 12556 -6587 -17658 7498 2046 -8433 -8255 12648 -8655 -5196
727e196J4584j0995o646J1154J3041k9346J3613J1693q145j1080J3497P107k1522
$$ -5196 9388 -1607 -8253 2901 15942 -13404 209 11902 3757 -7323 6174 13281 -8241
740h241J6272r83m481n602J6518q380j3176J9376m265n143n850J7067j3026q19
$$ -8241 8031 7048 2567 -3035 13483 5103 -8073 11303 7038 1895 -3955 13112 86 -733
754g33Q774p643J332j196Q616j6840J1828R77o865k61K549M454j2251J2564r968
$$ -733 8041 398 1730 534 9150 -7690 4138 5115 -1750 -2011 538 4992 -7259 5305 -4663
769d663K757K633J681o132m279J5204j1502K882l650P889p029m75N496o434O421
$$ -4663 -1906 727 2408 -3724 -8003 7201 -4301 -1419 -5069 2820 -4209 -4684 812 -5622 799
784G99q968P470o763N380j399k497N49n090J3720r504m53l695J4315o258q965
$$ 799 -8169 -699 -7462 -2082 -3481 -5978 -5429 -10519 3201 -6303 -6756 -10451 3864 -2394 -11359
799a1359J4379k964l130l934J9474j4691k499J3173k235q224L110J8549k4318
$$ -11359 3020 56 -3074 -7008 12466 -2225 -4724 8449 6214 -2010 1100 19649 -4669
812d669L411J3962k28j6529N666J4888j9288O737L765l39j4076J3075M221j6197
$$ -4669 -1258 12704 12476 -4053 1613 16501 -2787 3950 7715 7376 -6700 6375 10596 -5601
826e601Q112J186J30j2000J5373n506o997N569j001N17m308J1067j6512N926Q173
$$ -5601 2511 3697 3827 -8173 7200 1694 -5303 266 -735 -218 -4526 6541 -9971 -4045 4128
841D128l747o906L459R288j6685J3007N08o194n500J4631j464j8310J8711q33
$$ 4128 381 -6525 -3066 6222 -10463 2544 3052 -3142 -8642 5989 4525 -13785 4926 4093
855D093r323n311K2442j0440j5701J7042J248p506m587J9677j8427k626J5778
$$ 4093 -5230 -10541 11901 1461 -14240 2802 4050 -3456 -8043 11634 -6793 -9419 6359
868F359j742j2570L5J9282j8530L174N317M39r376L681R125j1886Q100n754L350
$$ 6359 4617 -7953 -7918 11364 -7166 -3992 1325 1764 -7612 -3931 5194 -6692 1408 -4346 -996
883i96k500P035l800m511Q878p383Q120k960K686q338R299L705j0728P302p59
$$ -996 -3496 3539 -261 -4772 4106 -3277 4843 1883 4569 -3769 5530 9235 -1493 5809 5050
898E050J926r550J3625n113o688N946n21K71o232J1726j2594K172L395O88l332
$$ 5050 6976 -2574 11051 5938 -750 5196 4675 4946 -1286 10440 -2154 18 3413 4101 769
913G69m023O919q410R015o400o61l34L678k244n712J2204j1647K029J791N330
$$ 769 -3254 3665 -4745 4270 -2130 -2791 -3125 553 -1691 -7403 4801 -6846 -4817 -3026 2304
928B304j0193L000Q970j3791O055N026J062j6729J4341N772j3614L439N702P13
$$ 2304 -7889 -4889 4081 -9710 -3655 1371 2433 -14296 45 5817 -7797 -4358 1344 2057
942B057j4162J7708l430r583M818P155n451q591J8568j0423l719M586Q381j0299
$$ 2057 -12105 5603 2173 -7410 -2592 4563 -888 -9479 9089 -1334 -5053 -467 7914 -2385
956b385k534J3793j1254K544K469M306j3515Q894O841j2906M729K619J736j2098
$$ -2385 -4919 8874 -2380 164 2633 6939 -6576 2318 9159 -3747 982 3601 5337 -6761
970f761J4316k293r118O467L530l524p747J7161j1017l333O328M028q249k168
$$ -6761 7555 5262 -3856 2611 6141 2617 -5130 12031 1014 -2319 4009 8037 -212 -2380
984b380J3614j4138L584L385N77j1011P595O437j5308P377J486j15j0413J1688
$$ -2380 11234 -2904 680 4065 4642 -6369 1226 7663 -7645 -268 1218 1103 -9310 2378
998B378j777q856P819j492j289n031J2434j0714j39O278k088k310k044J0364j1641
$$ 2378 601 -8255 -436 -1928 -3217 -8248 4186 -6528 -6667 -389 -2477 -4787 -6831 3533 -8108
1013h108O334L55r81j317K699K129q339J1056n619J815j959M505k382k112P569
$$ -8108 -1774 -1419 -2400 -3717 -1018 1111 -7228 3828 -1791 24 -1935 2570 188 -1924 5645
1028E645q725O141j878K402o142P062j1q310Q791k707O67o330J1353p161l610
$$ 5645 -3080 3061 1183 3585 -2557 4505 4494 -3816 4975 2268 2935 -3395 7958 797 -2813
1043b813Q735k742l450k356J3084j2885K321M952k400m036K157Q235j4106P380
$$ -2813 5922 3180 -270 -2626 10458 -2427 -106 4846 2446 -1590 567 8802 -5304 2076
1057B076J791j856n587P396Q60j1073J0238k970j47m818Q701n971l736R805o381
$$ 2076 3867 2011 -3576 3820 4680 -6393 3845 875 728 -4090 4611 -1360 -5096 4709 -1672
1072a672j653l83R538j3095L721O527o555j756L152O372j5093J0164K091o836
$$ -1672 -3325 -3708 5830 -7265 -3544 2983 -3572 -5328 -2176 4196 -10897 -733 1358 -5478
1086e478p38Q457j395j3190J5253j713n427k361J1683o127p629J4348n129l735
$$ -5478 -6216 2241 846 -12344 2909 1196 -4231 -6592 5091 -1036 -8665 5683 554 -3181
1100c181l14J1733j1614P8R768o006k154J634R126j3340N730L341l758o16K566
$$ -3181 -3495 8238 -3376 -3298 6470 464 -1690 -56 9070 -4270 1460 4801 1043 427 2993
1115B993K451r699J0477m082j026k81L217k522l454J0110r607K126R58K684o943
$$ 2993 5444 -4255 6222 2140 1114 833 4050 1528 -1926 8184 -1423 703 1661 4345 -2598
1130b598L420N270r761M944k04K394p896P165r81n499N460j647M32n811R438o154
$$ -2598 822 6092 -3669 1275 1071 3465 -4431 2734 1753 -3746 1714 67 499 -5312 4126 -2028
1146b028k57K038j292J210l409N799p507O054l247m49J413L07j6m904Q844p076
$$ -2028 -2285 -247 -1539 -329 -3738 2061 -5446 608 -2639 -3088 -1675 -1368 -1384 -6288 2556 -4520
1162d520K084N93J714l965L28P859r929M256J341K595q214O214M260r066M633
$$ -4520 -2436 -1843 -129 -4094 -3766 4093 -5836 -1580 -239 2356 -5858 356 4616 -4450 183
1177A83J199K192r071R701j259n337M199J639o59o428J1251o518p15K475J822
$$ 183 1382 3574 -5497 4204 2945 -2392 1807 3446 2787 -3641 7610 1092 377 2852 4674
1192D674l037k310Q874r402K814J504J448o824L869M581r719N165K31R27p555
$$ 4674 1637 -673 8201 -1201 1613 3117 4565 -2259 1610 6191 -3528 1637 1868 2795 -4760
1207d760Q954k002p208P140j54j804n832J1753o833l484N263J179m214k394J0300
$$ -4760 4194 2192 -5016 2124 1970 166 -5666 6087 -746 -4230 1033 2212 -2002 -4396 5904
1222E904j0272J944L060N91o642K826P375j1149M451J309J184p131O509J135p318
$$ 5904 -4368 -2424 636 1227 -5415 -2589 4786 -6363 -1912 -603 581 -6550 -41 1094 -6224
1237f224N840j229P71n206Q406n294j755N078j303q25k714P942p657L354J908
$$ -6224 -384 -1613 -842 -6048 2358 -2936 -4691 387 -916 -1741 -4455 3487 -4170 -816 1092
1252A092r24j524R85N217p987O182j669R36k405L069J137n006N788m017L091l409
$$ 1092 168 -1356 -371 4846 -3141 3041 1372 2308 -97 2972 4109 -897 4891 874 3965 556
1268E56M014k459o41K811l226L725m868L725l206L456k301j570L371l985K806
$$ 556 4570 2111 1470 4281 1055 4780 -88 3637 431 3887 1586 16 3387 -598 2208
1283B208l813N117n563J363J259k535J013j882M293p386N254o52j193j213J602
$$ 2208 -1605 3512 -2051 -688 571 -1964 -951 -2833 1460 -5926 -672 -1324 -2517 -3730 -2128
1298b128K284o110O441l259J413k048L944j791k823O440m883J751j443N130n738
$$ -2128 156 -5954 487 -2772 -1359 -3407 537 -1254 -4077 2363 -2520 -769 -2212 2918 -2820
1313b820Q88M700m302J102o95M517q091N684J226l790J23K314K094q400Q627k073
$$ -2820 -1932 2768 -1534 -432 -1127 3390 -4701 983 2209 -1581 -1458 856 2950 -5450 3177 1104
1329A104k718l50N411k335n911R739m075j782j79O619o155j331P659n055m03K85
$$ 1104 -1614 -1964 3447 1112 -4799 4940 865 -917 -1096 5523 -632 -1963 5696 641 238 523
1345E23N953q674L702L893m929O9J766L014q883O649j37l080k66K753n29n588
$$ 523 6476 -2198 1504 5397 468 537 2303 5317 -3566 3083 2946 -134 -400 2353 1824 -3764
1361c764Q251m846r70M41M055m963j527P257o420O31J25M255p013K269L536m961
$$ -3764 4487 -359 -1329 -888 3167 -1796 -3323 3934 -2486 -1855 -1730 2525 -4488 -2219 1317 -3644
1377c644J755j71K642o920N775p0k618O47O57K095n340O405k969Q8m34K357j1
$$ -3644 -1889 -2060 582 -6338 -563 -633 -3251 -2604 -1947 148 -5192 1213 -1756 -1668 -2102 255 244
1394B44l097M808l735K813k038L448k649p3K043k364L793l609L219l125K020k64
$$ 244 -2853 1955 -1780 1033 -1005 2443 -206 -279 1764 -600 3193 -416 2803 -322 1698 1434
1410A434O0J235l818M031k775L161l448K096o04j442K965k594K300l969M463k893
$$ 1434 1494 2729 -1089 2942 167 3328 -120 1976 1372 -70 2895 301 2601 -1368 3095 202
1426B02J404K67j598Q45j796M789n437K289o54N58j160L44K388o198M840j517
$$ 202 1606 1873 275 1120 -676 4113 -1324 965 311 869 -291 53 2441 -3757 1083 -434
1442d34J026l654L540j30m887N729j830n72l851O922l535j851L507j197j313j331
$$ -434 592 -3062 478 348 -4539 1190 -640 -1212 -5063 1859 -1676 -3527 -20 -1217 -2530 -3861
1458c861P243p017O52K972o85k270J544M372q382M579J654k73l903M065J706o584
$$ -3861 3382 -3635 -2983 -11 -696 -2966 -1422 2950 -5432 -853 801 528 -3375 690 2396 -4188
1474d188O141l53j587k876O622k609l334N329j889r74j465P407p042K25M335j920
$$ -4188 1953 1600 13 -2863 3759 1150 -2184 3145 1256 282 -1183 6224 -818 -593 3742 1822
1490A822j587M78M699p533L696J652j282k573K471K110p006N753m55j526k850
$$ 1822 235 713 5412 -2121 1575 3227 1945 -628 1843 3953 -3053 2700 2245 719 -2131
1505b131M898o33m620M204j160k14l134N837m062j210K749j407J19j498M497n556
$$ -2131 2767 2134 -2486 1718 558 344 -2790 3047 -1015 -2225 524 -883 -764 -2262 2235 -3321
1521c321K281P01n18r75l62L335n082L756j507Q05j795J506R37k996L621k385
$$ -3321 -1040 -339 -857 -1832 -2194 1141 -3941 -185 -1692 -887 -2682 -1176 -239 -3235 386 -1999
1537a999K037k927L302j242j060K009j455K204l166L841k113Q58o08P89J079k674
$$ -1999 38 -2889 413 -829 -1889 120 -1335 869 -2297 1544 -569 289 -319 470 1549 -1125
1553a125L383k332K281k695L122o63k121K798j569J352k851M485l222n82J759
$$ -1125 2258 -74 2207 -488 2634 1971 -150 2648 1079 2431 -420 4065 843 261 2020
1568B020K66o59k941N661m768P55O04J384k834l00M326n064K081n34J519m197
$$ 2020 2286 1627 -1314 4347 -421 334 938 2322 -512 -812 3514 -1550 531 -3 1516 -2681
1584b681L260J724n286K738K66R73m586M973j346k837K917Kq10k985O262m977
$$ -2681 579 2303 -2983 -245 21 994 -3592 1381 35 -2802 115 117 -693 -3678 2584 -2393
1600b393j59K705K21l053k52O035o668J604J636O08m558L555L269o447K839J162
$$ -2393 -2552 153 374 -2679 -2931 3104 -3564 -1960 -324 284 -4274 -719 2550 -3897 -1058 104
1616A04P76m891N080k13m099L265J244n24l847O195k934j344K349Q54j646k080
$$ 104 880 -4011 1069 856 -3243 22 1266 742 -3105 3090 156 -1188 1161 2015 369 -1711
1632a711N669m021P69L05J364k419M57L558m733K279k13K005l789K544R51l250
$$ -1711 3958 -63 706 1011 2375 -44 413 3971 -762 1517 1304 3309 -480 2064 3015 -235
1648b35K434j179J619l653L518j843p84J461q35q2k663M105k937M39n52R08q18
$$ -235 2199 1020 2639 -1014 2504 661 -123 1338 503 421 -2242 1863 -1074 -635 -1187 -279 -1097
1665a097j707L780l278J396j556K925k035m19K181k071J254j911M143m121J339
$$ -1097 -2804 976 -2302 -906 -2462 463 -1572 -1991 190 -1881 -627 -2538 1605 -2516 -1177
1680a177M98J40j74j363L420l837K046l13J360k307M27K597l314J869q81K254
$$ -1177 -679 -539 -713 -2076 1344 -2493 -447 -760 600 -1707 -1280 1317 -1997 -128 -1009 1245
1696A245l603K919L00k138J651k25J378l978N284j792j456J201J301m33k836N038
$$ 1245 -2358 561 861 -1277 374 149 1527 -2451 2833 1041 -415 786 2087 1654 -1182 3856
1712C856l241M06M71J599k796l81M384m766J283L39K346n133K323K469m144J354
$$ 3856 615 1021 1492 3091 295 -86 4298 -468 815 1154 3500 -1633 690 3159 -985 369
1728C69L10J240m606M596r85k605J636J107k22m103N409k504j565R57J868k206
$$ 369 679 1919 -2687 1909 924 -1681 -45 1062 840 -3263 2146 -358 -1923 -966 902 -1304
1744a304j831M763l879O53J90J996l421P72L114l594J024j66K326m054K813J155
$$ -1304 -3135 1628 -2251 -1598 -1408 588 -2833 -2061 1053 -2541 -1517 -1683 643 -3411 -598 557
1760E57k910J197Q36J548m496M314l63j536J20J665K27l119M001j714q0n86K606
$$ 557 -2353 -1156 -320 1228 -3268 1046 683 -853 -733 932 1159 -1960 2041 327 247 -339 2267
1777B267j685j362L322k250Q55j777L291k520k36J674r97N94j617K902l233K021
$$ 2267 582 -780 2542 292 1147 -630 2661 141 -95 1579 582 1176 -441 2461 -772 1249
1793A249n7j21m54k12K298l729K460q29R83k232J452R67k864K082j133J127k756
$$ 1249 1192 1071 617 405 2703 -1026 1434 605 1588 -644 808 1775 -1089 993 -140 987 -1769
1810a769K922j410j094J409m02Q02l271M175k876L23N05L75p31j468M157l650
$$ -1769 1153 -257 -1351 58 -344 458 -2813 1362 -1514 -1191 -686 -311 -1042 -2510 1647 -2003
1826b003O57J84J511k433L17K684l164J137M4J503l333K732P14k513J070Q19J503
$$ -2003 -1346 -1162 349 -2084 -1767 917 -2247 -1110 -1066 437 -2896 -164 550 -1963 -893 -74 1429
1843A429m476M017k78j247M2J406K02l261M685k270J28l85K452j855j382M143
$$ 1429 -3047 970 692 -555 -513 893 1095 -2166 2519 249 377 -8 2444 589 -793 3350
1859C350k830J16m30L059l517P66K030k391P77m87K064l732K545K35j590Q4N35
$$ 3350 520 636 206 3265 -252 514 2544 153 930 443 2507 -1225 1320 1555 -35 49 584
1876E84R87l720L841j402l74p17J569o14k242L624k236J87j084L041k515q21K765
$$ 584 1571 -2149 1692 290 -84 -801 768 154 -2088 1536 -700 -513 -1597 1444 -1071 -1892 873
1893H73k112N95j231L316l662P28J782r59q79k49L348m523K261K32L73k064J227
$$ 873 -1239 -644 -1875 1441 -2221 -1493 289 -670 -1549 -1798 1550 -2973 -712 -480 -107 -2171 -944
1910i44J865l050K294o33O68k187K701M1k386J892j68R70k519L053j129o03R41
$$ -944 921 -2129 165 -468 200 -1987 714 755 -1631 261 93 1063 -1456 1597 468 -135 806
1927H06RM32k291L483k519Q27K96O05j310p52L338l013R24m21J730k514P84J693
$$ 806 815 1247 -1044 2439 -80 747 1043 1648 338 -414 2924 -89 835 414 2144 -370 414 2107
1945B107k570J245k57J137l421K941P5k008R03O36L17l416M120j965r03M74J444
$$ 2107 -463 782 525 1662 -1759 1182 1257 -751 152 788 1105 -2311 1809 -156 -1059 -585 859
1962H59p80k458M108k727j35j05K502k926j98K668k190q1o0K590l475J418J680
$$ 859 79 -2379 1729 -998 -1133 -1238 1264 -1662 -1860 808 -1382 -1463 -1523 1067 -2408 -990 690
1979F90k236J25K56K381l719K422j69l2q08J131Q71l167L607j425J6r08K580j387
$$ 690 -1546 -1421 -1165 1216 -2503 -81 -250 -282 -1090 41 912 -2255 1352 -73 -57 -965 1615 228
1997B28j962L341j287L43j653L201k433K53J578j159K61q06K681l124J448O30
$$ 228 -1734 1607 320 663 -990 2211 -222 31 1609 450 711 -95 2586 -538 910 1540
2013A540l96q48K50K137l372K226q87N72j402J147P43l054K686r73M94k437K883
$$ 1540 1144 296 546 2683 -689 1537 650 1222 -180 967 1710 -1344 1342 369 863 -1574 1309
2030A309j210j755J936m14L19k409L532k078m68P29M79q55j260L821l375N58K08
$$ 1309 99 -1656 280 -134 185 -2224 1308 -770 -1238 -509 -30 -885 -2145 1676 -1699 -1141 -933
2047i33J340j796J14K385l058J521j07J515l280K013J171k327Q31L04J338l506
$$ -933 407 -1389 -1275 1110 -1948 -427 -534 981 -2299 -286 885 -1442 -611 -307 1031 -2475
2063b475K745p8q88J30N74N98k653M185k216l8k83J612o33j771L262j911N08o32
$$ -2475 270 192 -696 -566 8 606 -2047 2138 -78 -116 -399 1213 580 -1191 2071 160 668 36
2081C6K183k203N87J338j631N48k91J837l814K544P03j543m5J55J419l297K979
$$ 36 2219 16 603 1941 310 858 567 2404 -1410 1134 1837 294 249 404 1823 -1474 1505
2098A505j062m27l82J492q6k849L318j615M4j136K577j586j266K070j205J87j047
$$ 1505 443 16 -366 1126 1040 -1809 1509 -106 -62 -1198 1379 -207 -1473 597 -608 -421 -1468
2115a468L033l278Q0J698n52n15q68L053l179J390O2K37j222M99J660k949K176
$$ -1468 1565 -1713 -1633 65 -487 -1002 -1870 1183 -1996 -606 -544 -307 -1529 -1030 630 -2319 -143
2132a43k24Q83k541J962O69k069J690j86Q02k502K743p37r54J293N8k02j724L438
$$ -143 -367 516 -2025 -63 606 -1463 227 41 843 -1659 1084 347 -607 686 744 542 -1182 2256
2150B256k568N90L3R55j118n34K618k716J508o31J071j980J106J612k674J253
$$ 2256 -312 278 311 1266 148 -386 2232 -484 1024 393 1464 -516 590 2202 -472 781
2166G81m55J739l320K517L07k001N91L01Q20l084L361j117q93j60J130l64k059
$$ 781 326 2065 -1255 1262 1569 -432 159 460 1280 -1804 1557 440 -453 -613 517 153 -1906
2183a906L380k251J57m87J983j743p65K488j872J50m97K661l320R95J458j340
$$ -1906 1474 -777 -620 -1107 876 -867 -1632 856 -1016 -866 -1363 1298 -2022 -1027 431 -909
2199i09j7k23K150k972J820m9l87k94O76P86k618K913q57n4j255J819l39j307
$$ -909 -926 -1149 1001 -1971 -151 -200 -587 -881 -205 581 -2037 876 19 -35 -1290 529 190 -1117
2217a117K065j153P35j317K289j553l15J745j127J74n93K496k636O46Q33k62q89
$$ -1117 948 -205 530 -787 1502 -51 -366 1379 252 426 -167 2329 -307 339 1172 910 21
2234B1M70J520k674J832m15M37j834J480P30k829K299p19N20k071K217l98j238
$$ 21 491 2011 -663 1169 754 1191 -643 837 1567 -1262 1037 318 838 -1233 984 586 -652
2251f52J177j63K40k043K731j342r08Q37N52o29j582K783k124L94O0J051j639
$$ -652 525 362 602 -1441 1290 -52 -960 -123 429 -200 -1782 1001 -1123 -729 -669 382 -1257
2268a257j32K360k388P32l05J624k493J101J332j793N99l70J691k570K305m81
$$ -1257 -1389 971 -1417 -685 -990 634 -1859 -758 574 -1219 -620 -990 701 -1869 436 -45
2284d5p62L85R28K10k499K880j344J31n18J650n70j456K758k119Q63m43J497k082
$$ -45 -807 -422 506 716 -1783 1097 -247 -116 -634 1016 446 -1010 1748 -371 492 49 1546 -536
2302e36M11J776j549L28k32K291l324J435P64j053j40K74J247k642K124j39n90
$$ -536 -125 1651 102 430 198 2489 -835 600 1364 311 171 445 1692 -950 1174 1035 445
2319D45q97J441M8k259K452j131P2j168K035r38j689K399q63k96r83K591k039
$$ 445 -452 989 1037 -1222 1230 99 171 -997 1038 100 -1589 810 -53 -349 -1332 1259 -780
$$ [...]
8191b0
##END NTUPLES=NMR FID
##END=
