##TITLE=1H_EC-3099(XI-1)
 CDcl3, 8 sc, 
 30.9.2020
##JCAMPDX= 6.0         $$ Bruker NMR JCAMP-DX V2.0
##DATA TYPE= NMR FID
##DATA CLASS= NTUPLES
##ORIGIN= UXNMR, Bruker Analytische Messtechnik GmbH
##OWNER= root
$$ XWIN-NMR		Version 3.5
$$ Wed Sep 30 10:05:24 2020 Russian Standard Time (UT+4h)  she@DPX200
##.OBSERVE FREQUENCY= 200.1315066352
##.OBSERVE NUCLEUS= ^1H
##.DELAY= (6, 6)
##.ACQUISITION MODE= SIMULTANEOUS
##.ACQUISITION SCHEME= undefined
##.AVERAGES= 8
##.DIGITISER RES= 18
##SPECTROMETER/DATA SYSTEM= spect
##.PULSE SEQUENCE= zg30
##.SOLVENT NAME= CDCl3
##.SHIFT REFERENCE= (INTERNAL, CDCl3, 0, 15.7039)
##AUDIT TRAIL= $$ (NUMBER, WHEN, WHO, WHERE, WHAT)
$$ ##TITLE= Audit trail, XWIN-NMR		Version 3.5
$$ ##JCAMPDX= 5.01
$$ ##ORIGIN= Bruker BioSpin GmbH
$$ ##OWNER= she
$$ F:/spectra/data/she/nmr/H-F/1/audita.txt
$$ ##AUDIT TRAIL=  $$ (NUMBER, WHEN, WHO, WHERE, WHAT)
(   1,<2020-09-30 10:04:08.50 +0400>,<she>,<DPX200>,
      <created by zg, POWCHK disabled, PULCHK disabled
       configuration hash MD5:
       00 E9 B6 7A A2 85 ED C7 34 08 36 98 17 FE 4E 26
       data hash MD5: 16K
       E8 43 76 82 74 E6 B7 A5 33 18 AE 17 6C 0B 6C 62>)
$$ ##END=
$$ 
$$ hash MD5
$$ 8A 09 E3 73 D3 D6 B2 69 BF D2 7F 05 E4 F4 4D A5
##$RELAX= 
##$RELAX= 
##$RELAX= 
##$RELAX= 
##$RELAX= 
##$RELAX= 
$$ Bruker specific parameters
$$ --------------------------
##$DU= <F:/spectra>
##$EXPNO= 1
##$NAME= <H-F>
##$PROCNO= 1
##$TYPE= <nmr>
##$USER= <she>
##$AMP= (0..31)
100 100 100 100 100 100 100 100 100 100 100 100 100 100 100 100 100 100 
100 100 100 100 100 100 100 100 100 100 100 100 100 100 
##$AQSEQ= 0
##$AQ_mod= 1
##$AUNM= <au_zg>
##$AUTOPOS= <>
##$BF1= 200.13
##$BF2= 200.13
##$BF3= 200.13
##$BF4= 200.13
##$BF5= 200.13
##$BF6= 200.13
##$BF7= 200.13
##$BF8= 200.13
##$BYTORDA= 1
##$CFDGTYP= 0
##$CFRGTYP= 5
##$CHEMSTR= <none>
##$CNST= (0..31)
1 1 145 1 1 1 1 1 1 1 1 1 1 1 1 1 1 1 1 1 1 1 1 1 1 1 1 1 1 1 1 1 
##$CPDPRG= <>
##$CPDPRG1= <>
##$CPDPRG2= <>
##$CPDPRG3= <>
##$CPDPRG4= <mlev>
##$CPDPRG5= <mlev>
##$CPDPRG6= <mlev>
##$CPDPRG7= <mlev>
##$CPDPRG8= <mlev>
##$CPDPRGB= <>
##$CPDPRGT= <>
##$D= (0..31)
0 1.2 0 0 0 0 0 0 0 0.06 0 0.03 0 0 0 0 0.0002 0 0 0 0 0 0 0 0 0 0 0 0 
0 0 0 
##$DATE= 1601445848
##$DBL= (0..7)
120 120 120 120 120 120 120 120 
##$DBP= (0..7)
150 150 150 150 150 150 150 150 
##$DBP07= 0
##$DBPNAM0= <>
##$DBPNAM1= <>
##$DBPNAM2= <>
##$DBPNAM3= <>
##$DBPNAM4= <>
##$DBPNAM5= <>
##$DBPNAM6= <>
##$DBPNAM7= <>
##$DBPOAL= (0..7)
0.5 0.5 0.5 0.5 0.5 0.5 0.5 0.5 
##$DBPOFFS= (0..7)
0 0 0 0 0 0 0 0 
##$DE= 6
##$DECBNUC= <off>
##$DECIM= 32
##$DECNUC= <off>
##$DECSTAT= 4
##$DIGMOD= 1
##$DIGTYP= 9
##$DL= (0..7)
0 120 120 120 120 120 120 120 
##$DP= (0..7)
150 150 150 150 150 150 150 150 
##$DP07= 0
##$DPNAME0= <>
##$DPNAME1= <>
##$DPNAME2= <>
##$DPNAME3= <>
##$DPNAME4= <>
##$DPNAME5= <>
##$DPNAME6= <>
##$DPNAME7= <>
##$DPOAL= (0..7)
0.5 0.5 0.5 0.5 0.5 0.5 0.5 0.5 
##$DPOFFS= (0..7)
0 0 0 0 0 0 0 0 
##$DQDMODE= 0
##$DR= 18
##$DS= 0
$$ [...]
##$SUBNAM2= <"">
##$SUBNAM3= <"">
##$SUBNAM4= <"">
##$SUBNAM5= <"">
##$SUBNAM6= <"">
##$SUBNAM7= <"">
##$SUBNAM8= <"">
##$SUBNAM9= <"">
##$SW= 16.880792210976
##$SWIBOX= (0..15)
0 0 2 0 0 0 0 0 0 0 0 0 0 0 0 0 
##$SW_h= 3378.37837837838
##$TD= 16384
##$TD0= 1
##$TE= 0
##$TE2= 300
##$TE3= 300
##$TEG= 300
##$TL= (0..7)
0 120 120 120 120 120 120 120 
##$TP= (0..7)
150 150 150 150 150 150 150 150 
##$TP07= 0
##$TPNAME0= <>
##$TPNAME1= <>
##$TPNAME2= <>
##$TPNAME3= <>
##$TPNAME4= <>
##$TPNAME5= <>
##$TPNAME6= <>
##$TPNAME7= <>
##$TPOAL= (0..7)
0.5 0.5 0.5 0.5 0.5 0.5 0.5 0.5 
##$TPOFFS= (0..7)
0 0 0 0 0 0 0 0 
##$TUNHIN= 0
##$TUNHOUT= 0
##$TUNXOUT= 0
##$USERA1= <user>
##$USERA2= <user>
##$USERA3= <user>
##$USERA4= <user>
##$USERA5= <user>
##$V9= 5
##$VALIST= <valist>
##$VCLIST= <CCCCCCCCCCCCCCC>
##$VD= 0
##$VDLIST= <DDDDDDDDDDDDDDD>
##$VPLIST= <PPPPPPPPPPPPPPP>
##$VTLIST= <TTTTTTTTTTTTTTT>
##$WBST= 1024
##$WBSW= 4
##$XGAIN= (0..3)
0 0 0 0 
##$XL= 0
##$YL= 0
##$YMAX_a= 313277
##$YMIN_a= -267949
##$ZGOPTNS= <>
##$ZL1= 120
##$ZL2= 120
##$ZL3= 120
##$ZL4= 120
##$ABSF1= 10
##$ABSF2= 0
##$ABSG= 5
##$ABSL= 3
##$ALPHA= 0
##$AQORDER= 0
##$ASSFAC= 0
##$ASSFACI= 0
##$ASSFACX= 0
##$ASSWID= 0
##$AUNMP= <proc_1d>
##$AZFE= 0.1
##$AZFW= 0.1
##$BCFW= 1
##$BC_mod= 2
##$BYTORDP= 1
##$COROFFS= 0
##$CY= 11.3945322036743
##$DATMOD= 1
##$DC= 2
##$DFILT= <>
##$DTYPP= 0
##$F1P= 16.9975609425685
##$F2P= -3.02152046262296
##$FCOR= 0.5
##$FTSIZE= 0
##$FT_mod= 4
##$GAMMA= 1
##$GB= 0.15
##$INTBC= 1
##$INTSCL= 1
##$ISEN= 128
##$LB= 0.24
##$LEV0= 0
##$LPBIN= 0
##$MAXI= 10000
##$MC2= 0
##$MEAN= 0
##$ME_mod= 0
##$MI= 1.114404
##$NCOEF= 0
##$NC_proc= 0
##$NLEV= 6
##$NOISF1= 3.799351
##$NOISF2= 2.8
##$NSP= 1
##$NTH_PI= 0
##$NZP= 0
##$OFFSET= 15.70392
##$PC= 1
##$PHC0= -9970.172
##$PHC1= 13.80089
##$PH_mod= 1
##$PKNL= yes
##$PPARMOD= 0
##$PSCAL= 0
##$PSIGN= 0
##$REVERSE= no
##$SF= 200.130013532006
##$SI= 16384
##$SIGF1= 3
##$SIGF2= 2
##$SINO= 400
##$SIOLD= 16384
##$SREGLST= <1H.CDCl3>
##$SSB= 0
##$STSI= 0
##$STSR= 0
##$SW_p= 3612.71676300578
##$SYMM= 0
##$S_DEV= 0
##$TDeff= 0
##$TDoff= 0
##$TI= <>
##$TILT= no
##$TM1= 0
##$TM2= 0
##$TOPLEV= 0
##$USERP1= <user>
##$USERP2= <user>
##$USERP3= <user>
##$USERP4= <user>
##$USERP5= <user>
##$WDW= 1
##$XDIM= 8192
##$YMAX_p= 0
##$YMIN_p= 0
$$ End of Bruker specific parameters
$$ ---------------------------------
##NTUPLES= NMR FID
##VAR_NAME=  TIME,          FID/REAL,        FID/IMAG
##SYMBOL=    X,             R,               I
##VAR_TYPE=  INDEPENDENT,   DEPENDENT,       DEPENDENT
##VAR_FORM=  AFFN,          ASDF,            ASDF
##VAR_DIM=   8192,          8192,            8192
##UNITS=     SECONDS,       ARBITRARY UNITS, ARBITRARY UNITS
##FACTOR=    0.000296,      1,               1
##FIRST=     0,             0,               0
##LAST=      2.424536,      0,               0
##MIN=       0,             -267949,         0
##MAX=       2.424536,      313277,          0
$$ Real data points
##PAGE= N=1
##DATA TABLE= (X++(R..R)), XYDATA
0 0 0 0 0 0 0 0 0 0 0 0 0 0 8 -8 8 -8 16 -16 24 -25 32 -40 48 -56 65 -78 94 -107 126 -143 166 -191 216 -248
34 -248 280 -317 358 -401 452 -505 564 -629 699 -776 861 -951 1051 -1162 1282 -1410 1554
51 1554 -1712 1887 -2077 2290 -2528 2794 -3095 3437 -3831 4291 -4837 5493 -6304 7332 -8685
66 -8685 10553 -13305 17856 -47411 313277 -2643 -181727 66762 13656 1587 -54850 136268
78 136268 85103 -163095 71090 187187 -122837 80660 94874 -48371 4931 74075 97301
89 97301 -36759 -20603 25363 47434 36211 47134 -50750 -72146 136483 -1266 -61695 43147
101 43147 -6553 -56509 32329 17488 -10172 -54417 -35956 78008 -103521 42033 61489
112 61489 -163801 5469 69391 15840 -56176 -56567 44704 12142 -71036 68358 -10730 -99725
124 -99725 62647 4213 -20102 -45981 16611 25423 -66627 -128 58933 -16070 -103051 55991
136 55991 60935 -22935 -30949 3964 49176 -12047 13247 51223 -7258 -45578 89380 18033
148 18033 -33179 45650 4437 31350 -37546 29068 58389 -45364 -5136 26926 -10480 16985
160 16985 4164 -61633 40917 6049 -24200 -25811 -6907 36197 -65326 -1986 28438 -44663
172 -44663 -36886 54348 -22667 -71520 54624 15896 -54796 -31939 82340 -2276 -82247 42288
184 42288 59682 -58455 -14166 94076 -54407 -17536 63396 5584 -44479 8523 93177
195 93177 -54941 -53737 81249 26243 -76655 33916 36985 -49766 9589 19853 7543 -48601
207 -48601 29363 25539 -56371 13694 36223 -26408 -32036 42319 -17383 -4454 14097 -19165
219 -19165 -11362 16182 33171 -58656 -14139 53400 -1430 -63777 33110 31921 -69314 14002
231 14002 28975 -5694 -46796 19264 27994 -55464 5455 53142 -28329 -64153 54518 20493
243 20493 -28067 -19897 17275 23491 -38679 20818 10148 -17086 -1007 26654 -8268 -8585 21514
256 21514 -5379 7242 -12756 36068 7231 -27586 10087 20497 12596 -9679 5336 -7312
268 -7312 20562 -3703 6068 -3638 -18263 32348 -10792 -7988 1646 6856 -13587 -2824 4230
281 4230 1341 3028 -25559 4837 -13347 23382 -4946 -44792 14279 21438 -24000 -30831 33333
294 33333 -12575 -23849 6713 22979 -30952 -33752 62599 -17767 -45679 34360 37242 -61636
306 -61636 -15534 67384 -2219 -45530 2404 55558 -39675 -8249 46006 -20803 -17734 32019
318 32019 17652 -38581 19407 23778 -6140 -12698 28984 15556 -33285 30523 6517 -8408
330 -8408 20664 19510 -31650 4086 47542 -15046 -18885 11408 36594 -33933 -4798 36996 -27578
343 -27578 -14610 26518 735 -44864 20875 8767 -34719 -20158 30156 2352 -67940 17620
355 17620 17145 -33382 -17557 21287 -18823 -30257 23314 290 -23907 -18921 41442 -10917 -31736
368 -31736 26920 13245 -13390 -8650 30001 5820 2671 -5594 15379 14955 785 20434 -8375
381 -8375 15146 8014 6376 7614 4004 -1506 8275 14337 -17227 8522 -2425 9285 -11526 -11579
395 -11579 20792 -9025 -16744 -8559 18228 -6123 -13139 -12433 12746 -991 -25078 20007 -8704
408 -8704 -12786 -1056 13842 -13440 -17976 17693 2401 -21181 -10913 36356 -23987 -21817 21933
421 21933 2906 -14741 -5941 18599 -18206 -2135 17805 1300 -30257 16351 30977 -35204
433 -35204 4573 21932 1710 -19432 15929 19532 -14407 2226 16714 1901 -14862 32966
445 32966 -5546 -16995 19173 7457 -5623 -8287 15882 -11245 -3120 7075 -4821 -22577
457 -22577 10970 14182 -45188 5865 18197 -19033 -30797 18447 11950 -36013 -3031 19513
469 19513 -6582 -29156 32680 892 -30298 19214 21701 -8215 -17173 30893 8389 -12085
481 -12085 6266 25551 -6149 -6835 25659 -10341 6968 8841 1488 -8660 5847 14618 -13017
494 -13017 -4819 5611 8322 -16640 7636 -2656 -11637 9257 -3899 -4263 -9069 7859 -9139
507 -9139 -5324 8 3452 -6552 -11768 11349 -12400 6777 443 -8911 -3089 6713 6463 -12105
521 -12105 -2445 3113 12671 -17754 2636 7713 -7333 -1773 -6727 16292 -9301 -9899 5447 8092
535 8092 -11559 2085 15209 -14034 -1105 11885 20244 -20506 -3529 27765 2246 -8175
547 -8175 6603 18221 -16782 6318 12461 1232 -4468 -968 7827 -11766 10204 4424 -9911
560 -9911 -8520 13375 -2528 -7751 6952 -13439 3821 1012 6357 -16135 -8307 16290 -11038
573 -11038 -9009 7853 2619 -24733 6975 9389 -5447 -7099 1970 4374 -15865 21089 4828
586 4828 -18159 -3723 22677 428 -19286 16479 -1298 -10778 -599 18619 -10895 -18286 13656
599 13656 2997 -12670 -211 17325 -23195 -3643 15642 4484 -7872 -11561 16294 -2336
611 -2336 3566 2765 -4580 -795 8409 1397 -1709 9827 -11264 2429 4559 11067 -5682 -5634 12591
626 12591 -7149 3437 9339 5747 -18801 4269 17714 -4254 -7632 -2187 9513 -8531 1641
639 1641 1297 -2484 -10321 340 6520 -8602 3082 -11128 2733 -2872 -742 5745 -9411 -4752
653 -4752 -446 9685 -4972 -4063 -5930 6051 -2128 -2284 7755 -13182 3371 1847 3516 -5339
667 -5339 2262 4942 -8545 3469 7441 5787 -14894 6517 9319 -1853 -349 1762 2933 -6076
681 -6076 10694 -1054 66 -4076 4989 4222 -6309 9180 -6547 2022 1368 -28 -1240 4901
695 4901 -1100 -10268 6991 4539 -553 -16122 12126 4386 -13653 4542 3947 -2440 -11048 12139
709 12139 -952 -8862 1105 7916 -5213 -9852 14712 -4354 -5598 -171 6955 -5171 -1672 6225
723 6225 -6327 4369 13 4697 -8039 6891 7333 -9869 4073 5245 1838 -6346 6877 -2213
737 -2213 -122 1271 961 -1348 -7110 10246 -7946 -134 905 -2452 -3001 -201 2314 -7807 4165
752 4165 -3898 -2166 -4860 7498 -1395 -13632 6199 2554 -1009 -8246 6616 -2648 -1728 3801
766 3801 676 3247 -6259 8078 340 5252 2075 249 3484 1968 4584 1127 9149 -8857 1983
781 1983 7301 4006 -4432 -6579 10846 -4217 -1184 1045 2817 -9018 47 6679 -5161 -403
795 -403 -5544 2281 -6913 4298 850 -9076 -2750 -212 2705 -6441 3704 -9134 -1925 4205 1067
810 1067 -3758 -7168 7668 -4299 979 2091 2260 -7562 700 7795 -3749 4469 -5184 424 -863
825 -863 8180 844 -8329 4209 2654 1687 -2089 9613 -7768 -1513 10148 3379 -2495 -4225 10507
840 10507 -4842 1315 6806 2798 -9456 -1520 10744 -2796 807 -6939 2070 -1259 1681 12
854 12 -5214 510 -5151 3570 -927 1495 -10297 570 5657 -5177 1519 -2297 387 -7958 7119
869 7119 4377 -4406 -5421 1341 7128 -4305 5741 -5015 518 2526 2551 1506 -2319 2624 -4739
884 -4739 5346 1773 1716 -7047 1152 3987 -4686 5872 -3768 -3345 -4514 7188 -434 -5754 -488
899 -488 -2085 1407 -2817 6091 -8866 -1397 4531 -1156 -1550 226 3412 -10124 5528 6344 56
914 56 -8057 3619 7758 -7041 6295 2232 -1929 -4784 9711 3068 -5655 2394 1637 2840 -3663
929 -3663 8532 -4344 -1780 4302 -382 1756 119 2625 -8648 5686 4240 -2945 -5673 3317
943 3317 3933 -9894 6265 371 -4591 -5735 6906 -124 -8334 2858 -818 -1243 -6023 7073
957 7073 -3917 -5294 2026 -925 209 -3355 2310 -6139 3454 651 -1156 -2059 -236 4126 -6194
972 -6194 5354 -130 -7 -2223 2863 2470 -2009 3667 -1369 4395 -3426 4635 947 113 1498 -816
988 -816 5762 -3026 1516 -676 5194 -2870 -978 4115 -2604 1265 -3158 4448 -2971 913 -441
1003 -441 -1425 401 -1138 1835 -4600 5183 -4660 -555 1762 -467 -1709 -2945 6568 -5820 -1720
1018 -1720 2205 3350 -7794 -307 8185 -5692 -1493 -292 4509 -6848 2495 4590 -4735 -1128
1032 -1128 1588 2965 -6860 6902 -391 -4341 898 2815 -1272 -5540 7621 -3223 -3140 1058 4733
1047 4733 -7717 -2746 11073 -5120 -3152 682 5621 -6849 1074 7358 -3851 -2783 1755 4721
1061 4721 -6942 6111 483 -4150 1239 3199 555 -6208 7577 -1445 -1964 2733 5154 -5125
1075 -5125 -2620 10503 -3431 -2093 1472 5932 -6892 -1128 7568 -2788 -3560 -600 6138 -7002
1089 -7002 476 1284 -2048 -607 -487 3096 -5542 1089 -1582 1626 -1126 892 -1001 -4079 3720
1104 3720 -3869 2173 -1915 1309 -2843 -2571 3361 -1162 -464 -2802 5859 -3087 -803 526 2360
1119 2360 840 -2980 5963 -1909 -484 -600 5443 -1638 -2019 4194 -2335 74 -1164 5723 -4034
1134 -4034 -822 3144 -1115 -166 620 3293 -6386 4567 1903 -2009 -2256 3565 2431 -8614 5360
1149 5360 2418 -3199 -4518 6487 -902 -6790 5077 1680 -1910 -4616 8094 -3267 -4251 5242
1163 5242 1303 -2284 -1609 6082 -5866 1165 3689 -889 -2942 2772 3641 -8326 4652 4502 -3112
1178 -3112 -5589 7151 221 -8910 5700 3073 -3581 -6640 8489 -1788 -7474 4793 2275 -5035
1192 -5035 -4391 7698 -4221 -2383 1801 971 -4047 -1244 6085 -6663 1263 2147 -861 -4525 3675
1207 3675 3272 -6221 3066 2415 95 -5279 6500 2521 -3854 2821 3068 253 -4234 7987 652
1222 652 -1355 308 3102 1042 -3311 5659 -1551 -239 -757 2545 -1399 -383 2434 -3408 734
1237 734 -755 2995 -5098 393 2149 -3336 -792 -540 1950 -6862 935 1069 -1928 -4595 1012 3258
1253 3258 -7018 718 832 -76 -5194 3890 3212 -4851 369 966 2487 -3892 5480 -246 -3535 1536
1269 1536 1807 -505 -2134 6225 -3465 -1550 2220 3140 -3831 208 8134 -5291 -781 4127 3457
1284 3457 -6431 2860 7442 -5332 -2442 3940 3672 -7964 3933 3337 -5077 -1513 3009 397 -6388
1299 -6388 5516 -437 -3565 247 4262 -3317 -4116 7432 -3565 -2825 2158 3801 -7472 -681
1313 -681 7130 -4741 -3345 2964 4161 -9101 1283 6090 -3282 -2453 3236 3231 -6818 3487 3057
1328 3057 -1204 -1813 3551 388 -5386 5006 -519 -1473 -1090 3501 -3417 -3604 4213 -1348 -1462 -255
1344 -255 4441 -6420 -1567 4949 -266 -2780 -412 4990 -5303 28 3095 1299 -3816 119 4478
1359 4478 -3834 1122 367 1247 -2698 2877 2741 -2885 805 934 2460 -2465 4729 -946 -2591 2303
1375 2303 2204 -443 -3782 5327 -1590 -2041 1017 3591 -3893 -3919 6754 -1 -2344 -1813 3717 -3811
1391 -3811 -1153 5242 -1504 -3703 -1157 5044 -4204 670 1703 -2513 -2201 1625 2705 -6162 2075
1406 2075 710 -2308 -1549 4211 -1764 -6749 6062 1652 -3421 -3529 5860 -2284 -4355 6255 1573
1421 1573 -5241 -2371 8166 -2816 -2288 3458 503 -3329 1107 7000 -5161 -642 2570 1120
1435 1120 -2192 3168 2134 -6222 3120 3411 -615 -4130 4758 277 -4690 4019 2298 -3278 -4546
1450 -4546 7118 -826 -3662 1986 1498 -2562 -2276 6727 -2841 -3418 605 2592 -2549 -538 3461
1465 3461 -4031 69 1617 1936 -4349 1271 2206 -3701 1180 2057 -13 -6049 3913 1795 -3004 -642
1481 -642 2141 -193 -5320 4375 820 -2826 -2085 3971 -167 -4200 2997 -63 -604 -2190 4273 -1296
1497 -1296 -2349 2090 -296 -93 -119 3449 -3660 564 2463 -119 -1720 1321 3887 -4736 1844 2749
1513 2749 -274 -3134 3427 2761 -4892 1863 3168 273 -4445 4994 2323 -4684 936 2597 -298
1528 -298 -4152 5009 -416 -2639 202 1394 -1653 -1962 4876 -3113 -2310 1466 1657 -3976 88 3957
1544 3957 -4297 -1198 2525 1736 -6633 2023 3987 -4621 -1267 2548 975 -6328 3680 2735 -2834
1559 -2834 -2043 2689 382 -4027 4616 -466 -2249 -73 3674 -1528 -2094 4228 -1679 -959 1439 3628
1575 3628 -4556 -528 4560 -1682 -1342 1821 2768 -5871 1918 4635 -859 -2833 2053 3406 -4796
1590 -4796 1892 2040 -571 -2504 3157 1062 -3681 1486 18 -300 -1819 3615 -1827 -3193 2488
1605 2488 388 -730 -1324 3461 -3617 -735 3065 981 -3090 -501 4806 -3374 -675 2030 1484
1620 1484 -3840 570 4145 -2685 -1246 575 2045 -2949 1435 1809 -2523 -588 902 1008 -3432
1635 -3432 2375 -810 -1815 -224 1397 -1871 -3126 4064 -1477 -1706 388 2721 -3493 -1630 5278
1650 5278 -824 -2545 119 4713 -3491 -320 4298 -320 -2110 756 4360 -4137 707 2517 -212
1665 -212 -2193 1869 2114 -3765 2402 1359 -470 -1906 2769 -213 -2652 3313 607 -2083 -1982 4519
1681 4519 -1922 -2438 3078 498 -2760 -1567 4839 -2710 -1697 1589 765 -2947 -358 3414 -3685
1696 -3685 -362 839 213 -3159 1178 1465 -3706 586 836 -743 -3185 3207 -203 -3644 1077 1805
1712 1805 -1468 -3134 4820 -511 -2916 853 3132 -1718 -2245 4645 -731 -1340 370 3438 -1456
1727 -1456 -897 3417 -614 -254 108 2763 -2273 1030 1244 -1201 120 838 928 -3332 2470 587 -1812
1744 -1812 -432 2288 -144 -3450 2819 234 -1114 -1102 3352 -535 -2986 2510 416 -940 -1748 3819
1760 3819 -1517 -1961 1284 560 -559 -934 2977 -2322 -180 819 596 -1447 780 1893 -3929 1016
1776 1016 1210 291 -2948 1869 920 -3643 612 1397 -316 -3815 3089 227 -2752 30 2186 68
1792 68 -3161 3675 106 -963 46 2133 -540 -1444 2683 -1646 -164 360 1472 -2802 301 2582
1808 2582 -1777 94 1354 1429 -3529 2245 2367 -1557 -455 1789 1281 -3984 2580 1669 -1326 -1826
1824 -1826 2642 540 -3084 1942 287 -469 -1387 2532 -1131 -1583 2266 -334 -300 -707 2371 -2867
1840 -2867 -267 2088 -776 -1787 0 2165 -4020 609 1144 -943 -2727 1288 2125 -3498 632
1855 632 840 602 -2600 1894 1530 -2054 236 565 632 -1813 2025 -692 -540 696 402 -447 -1362 2612
1873 2612 -1638 218 824 882 -1491 322 2923 -2136 137 998 1846 -2871 1148 2367 -2028 -1012
1889 -1012 700 2052 -2852 1221 1019 -691 -761 993 1119 -2625 1725 9 -435 -865 1412 -194
1905 -194 -1341 2030 -681 -107 -874 1983 -1793 -1092 2232 -1032 -1284 -394 2790 -2684 -500 1181
1921 1181 -55 -1675 -329 2397 -2602 377 197 355 -1550 554 803 -2278 730 -268 305 -1483
1937 -1483 1685 -703 -1543 1351 310 -445 -1288 2883 -1530 -1039 1572 1385 -1572 -1266 3579 -1768
1953 -1768 -894 756 1994 -1507 -304 2825 -968 -726 -51 2242 -1673 585 1387 -787 46 -71
1969 -71 1654 -1771 1437 -524 -496 514 1001 -226 -1740 2775 -988 -374 78 1624 -1582 -1450 2492
1986 2492 -1004 -1002 -993 2137 -2148 -767 1273 -918 -943 -436 2283 -1826 -137 174 -65 -835 87 957
2004 957 -2266 1082 79 -23 -1302 1039 93 -1981 1723 204 -172 -1483 2203 6 -1215 990
2020 990 587 40 -1573 2885 -416 -586 91 1457 60 -1077 1951 -1328 301 -349 1011 -801
2036 -801 -81 775 -1412 877 82 636 -1644 1262 510 -1067 537 209 367 -2345 2134 20 -1168
2053 -1168 -549 1354 -163 -2050 2101 -269 -765 -1235 1987 -432 -1501 1075 -252 377 -863 1519
2069 1519 -1574 10 544 -661 -159 -220 1007 -2219 1220 546 -482 -860 848 807 -2103 1379 -67
2086 -67 -67 -1836 1864 760 -1991 1040 257 200 -1651 2154 -246 -472 374 305 551 -1000 1593 -1087
2104 -1087 848 127 180 -580 -35 1567 -1804 893 349 471 -1326 915 1194 -1488 759 697 872 -2139
2122 -2139 1442 926 -685 -317 604 1019 -2012 1305 -324 5 -716 600 199 -1226 1026 -1095 284
2139 284 -775 650 -905 -383 813 -1266 300 -564 1242 -1886 248 641 -551 -715 -334 1708
2155 1708 -1801 711 125 432 -1252 260 1374 -1318 604 -212 779 -957 809 188 -734 835
2171 835 -187 798 -806 1400 -1175 212 673 277 -90 -388 2064 -1506 410 582 849 -1079 -71
2188 -71 2048 -1224 -22 -101 1489 -1405 167 1248 -824 -48 -301 1454 -1344 504 -146 142 -266
2205 -266 -354 417 -1067 1013 -989 180 -250 292 -454 -741 1380 -1128 123 -396 1239 -1396 -392
2222 -392 1067 -562 -311 -817 1433 -1497 185 205 63 -389 -217 1432 -1478 695 -177 359 -446 135
2240 135 546 -717 1046 -615 309 -1084 1212 -378 -626 818 -232 54 -1268 2188 -722 -247
2256 -247 121 876 -57 -1089 1773 -483 102 -304 1104 -281 -555 962 -239 555 -940 854 -1089
2273 -1089 240 46 -500 600 -523 383 -1204 1478 -457 -454 91 565 -159 -1463 1491 -916 -476
2290 -476 -900 1294 -437 -1363 706 -551 40 -880 1657 -730 -711 401 136 285 -696 1238 -1048
2307 -1048 462 -281 -71 -198 280 612 -1261 827 -279 -43 -591 1063 528 -991 956 39 434
2324 434 -1033 1597 73 -871 132 472 623 -1237 1314 -390 -109 -229 505 129 -644 827 -721
2341 -721 743 -620 751 -533 271 731 -864 725 -267 1096 -1223 857 115 -1030 -51 103 374
2358 374 -1981 837 217 -442 -764 690 583 -1623 888 -2 454 -1023 638 122 -699 478 -204
2375 -204 421 -1005 948 -843 -121 209 -259 252 -189 857 -1182 436 321 250 -598 100 1251 -1171
2393 -1171 405 287 595 -1355 570 742 -635 146 120 844 -1276 806 59 -5 44 56 368 -641 1099
2412 1099 -552 561 336 488 -524 -289 1279 -1080 280 153 647 -1390 169 1280 -594 45
2428 45 63 1356 -1718 457 240 -119 -492 -281 932 -1458 389 -226 450 -967 -140 259 -924 433
2446 433 -418 396 -629 612 -732 -454 817 -513 85 -435 1094 -1218 84 462 70 -560 -157
2463 -157 1532 -1004 294 122 731 -544 -16 926 -510 314 -349 815 -867 667 443 -435 438
2480 438 -25 436 -1047 1477 -370 30 484 507 -58 -825 1674 -296 -35 -121 1080 -670 -935 1470
2498 1470 -494 -377 -646 1274 -947 -646 684 -422 -289 -448 977 -1033 192 -157 23 -192 -56
2515 -56 476 -957 1092 -339 -240 -84 800 -659 -929 1262 -339 -211 -914 1380 -506 -830 1038 99
2533 99 -336 -478 1813 -807 -348 24 648 -155 -421 948 -1021 80 -266 581 -123 522 480 -967 714
2552 714 7 291 -770 975 305 -819 462 218 125 -872 1575 -71 -617 -316 404 -262 -1133 1163
2570 1163 -360 -343 -565 869 -101 -437 486 -255 208 -533 530 -1265 222 393 -224 -35 -71 52 -1365
2589 -1365 894 208 -384 -731 476 323 -1353 1004 433 -167 -1033 1141 52 -1238 383 167 224
2606 224 -731 1151 -335 -497 486 126 182 -497 918 -985 340 440 261 -403 242 1037 -929 899
2624 899 673 170 -1287 793 1017 -1117 1 631 672 -1245 1192 373 -918 10 479 427 -841 734
2642 734 -442 -72 -113 501 -140 -775 984 -648 436 -138 407 -1073 343 1007 -941 51 92 731
2660 731 -1238 802 523 -716 -434 232 970 -1623 257 343 -351 -482 431 527 -1053 798 -326 322
2678 322 -853 388 -205 -407 646 -293 -34 -299 942 -676 147 696 157 -555 19 1144 -1179 195
2696 195 559 486 -906 -42 1111 -994 -96 394 732 -1026 445 723 -228 346 57 346 -738 851
2714 851 -95 -357 201 278 -270 -844 1395 -710 -143 301 476 -851 -589 1666 -741 -101 185 737 -1220
2733 -1220 -440 992 -482 -315 -387 882 -1275 75 382 -370 -648 -4 305 -1089 902 -260 184
2750 184 -137 251 -284 -821 1366 -414 -261 -291 1081 -833 -539 1077 -22 -356 -453 1660 -952 -26
2768 -26 591 334 -645 -24 1521 -903 74 398 444 -137 224 589 -870 468 -139 353 -624 840 28
2787 28 -436 453 3 95 -692 1594 -513 -555 263 458 -312 -783 1233 -737 -425 -329 716 -327 -439
2806 -439 638 -525 -164 -233 955 -886 101 542 -504 35 -45 548 -831 930 242 -554 -30 152
2824 152 -122 -1102 766 -88 -467 -372 1036 24 -1148 927 252 -233 -553 1310 -178 -877 495 407
2842 407 -256 -462 1225 -633 109 308 34 -485 63 537 -1201 894 300 -81 -717 889 746 -1231
2860 -1231 850 540 205 -762 1162 244 -991 265 270 37 -1171 1058 -328 -678 12 701 -211 -831
2878 -831 893 -610 22 -183 267 -741 0 662 -827 46 7 535 -1190 535 436 -1011 -126 456
2896 456 171 -1346 940 104 -425 -290 438 207 -1135 828 139 -197 -389 491 -81 -577 742 65
2914 65 166 -429 987 -710 177 633 -173 -284 125 997 -1101 733 570 82 -662 429 875 -1210
2932 -1210 311 332 55 -907 591 496 -895 337 190 197 -821 608 -110 -337 129 108 104 -673 1071 -447
2952 -447 -64 263 33 -561 -88 1026 -836 -87 130 136 -1058 286 903 -820 -211 308 691 -1514 641
2971 641 513 -572 -218 159 515 -1139 620 276 -121 -317 663 -36 -655 800 -235 -203 7 851 -750
2990 -750 -134 1242 -631 -39 264 1104 -926 -103 756 -63 -392 71 1107 -1017 310 438 222 -563
3008 -563 355 621 -984 403 -1 57 -900 578 57 -785 587 -94 283 -76 1062 -545 -323 410
3026 410 23 -468 -368 1030 -925 -388 154 424 -856 -186 963 -995 -107 -134 634 -893 110 541
3044 541 -488 455 -1 553 -938 699 -292 -624 -35 -39 42 -788 1092 -239 -108 12 833 -369 -665
3063 -665 1205 -139 -135 -26 667 -314 -464 794 161 -46 -199 937 -816 -161 337 23 -7 -205 621
3082 621 -806 415 69 -162 -285 435 35 -818 878 -65 -301 -814 946 -290 -572 620 19 -373
3100 -373 -811 1467 -658 -713 234 414 -405 -670 975 -805 206 -143 418 -555 -91 570 -768 77
3118 77 189 167 -775 596 224 -545 378 288 52 -1062 956 1 -568 178 501 -33 -609 988 -253
3137 -253 -159 9 623 -327 -415 613 -193 86 -310 656 -583 401 540 -444 104 -236 665 -921 434
3156 434 187 -363 -453 248 448 -936 706 -312 -81 -386 744 118 -768 432 37 -174 -762 494
3174 494 -46 -334 203 119 -17 -771 861 -622 -252 142 -196 -278 -58 686 -816 287 26 -126 -722
3193 -722 -57 545 -924 235 166 384 -1068 556 280 -598 -18 324 366 -963 899 249 -404 -391 406
3212 406 112 -551 732 -248 -14 -219 427 -128 -68 749 -756 172 -227 454 -887 365 601 -403 -266
3231 -266 -24 461 -1014 370 282 -52 -301 459 341 -978 374 75 76 -738 242 29 -614 274 -306 152
3251 152 -434 314 -505 -319 639 -27 -130 -188 634 -809 100 395 -252 -620 95 871 -882 253 381
3270 381 481 -730 23 426 -588 57 337 286 -751 452 -23 -113 347 71 270 -641 644 -344 -49
3289 -49 317 108 -265 -223 1035 -392 -63 -93 491 -465 60 837 -521 -76 -132 735 -702 245 750 -123
3309 -123 -378 -217 758 -656 316 111 238 -86 362 164 -551 737 -27 79 -378 555 -359 -494 670
3328 670 -65 -268 -312 812 -633 -323 415 -241 -596 -389 925 -776 -373 200 316 -486 -31 563 -822
3347 -822 245 67 250 -279 410 53 -315 209 -215 -169 -849 545 -212 -251 534 105 20 -308 711 6
3367 6 63 168 501 -197 -561 733 -590 21 -30 625 -262 -241 110 -114 173 -31 363 -633 403 199 -165
3388 -165 231 156 212 -880 591 -25 -88 -115 455 -10 -869 598 -475 -318 -493 618 -465 -628 360
3407 360 -44 6 -309 599 -374 -52 192 -13 -229 -121 645 -636 283 141 154 -26 151 181 -590 514
3427 514 85 24 -602 455 173 -608 463 248 41 -418 757 -281 -269 -91 399 -59 -565 861 -177
3446 -177 7 -40 399 -73 -268 368 -359 271 9 309 -293 294 320 -484 89 -76 89 -701 415 49
3466 49 -241 -8 295 330 -336 286 -5 67 -409 446 44 -781 422 -420 333 -453 262 -232 -87 403 -275
3487 -275 69 -383 312 -543 82 336 -265 -149 29 583 -857 175 39 23 -407 139 505 -616 67
3506 67 222 55 -591 380 284 -183 291 -7 237 -709 392 172 -142 146 -46 39 -432 395 -178 370 109
3527 109 251 -390 98 624 -465 -11 305 460 -585 212 513 -629 -114 179 389 -907 191 112 -255
3546 -255 -152 57 82 -346 274 -311 -15 -157 152 89 -406 483 -422 -29 -312 448 -459 -345 364 -126 -102
3567 -102 62 657 -604 283 292 176 -221 135 404 -255 69 -45 237 -260 431 387 -562 10 -344 107 -352
3588 -352 215 57 -317 345 32 246 -87 913 -167 -24 280 220 -22 -202 693 -330 20 -68 441 -466
3608 -466 96 370 -135 94 11 399 -467 24 -103 -165 -87 -117 433 -280 434 60 -224 -190 31 -99 -193 268
3630 268 -80 -116 -376 597 -219 -581 373 -1 -204 -152 666 -375 -353 246 21 -92 -223 423 -224 -76 -58
3651 -58 385 101 -332 150 -268 370 -162 65 -43 344 52 -406 407 -40 54 -702 543 -99 -384 164
3671 164 318 148 -453 802 -125 191 -45 -89 -2 -341 624 -327 195 -285 111 -314 123 226 -91 275
3691 275 -138 273 -630 439 6 -343 26 -1 181 -677 358 187 12 -63 365 88 -444 386 194 -57
3711 -57 -265 407 -74 14 86 -32 -142 -542 453 -119 13 -66 -2 22 -272 154 -764 276 -253 25 -35 8
3733 8 278 -697 368 -19 91 -611 352 312 -187 295 -199 -11 -602 329 220 -226 44 86 254 -121 336
3754 336 -14 -12 -39 381 180 85 382 -235 452 -207 142 -322 173 217 -150 8 96 622 -481 264 193 -180
3776 -180 -247 68 300 -439 142 -32 17 -400 53 37 -336 63 -388 -27 -176 261 -431 -322 116 -234 20
3797 20 -135 295 -605 -117 200 -60 -50 22 559 -620 6 54 238 -223 341 324 -247 95 -66 336 -494
3818 -494 297 130 31 158 -248 153 -281 524 -277 -103 253 28 -144 -18 586 -458 218 102 340 -576
3838 -576 -90 527 -615 49 -145 289 -311 -23 186 -190 -163 -492 204 -408 -40 -139 -50 -30 -49 86 -247
3859 -247 206 -299 -115 -224 135 -232 -178 485 -105 259 98 418 -303 -244 410 -86 -161 -337 660 -370 18
3880 18 289 396 -153 57 491 -302 -149 -310 139 -245 177 -80 -473 292 -160 338 -102 413 30 -234
3900 -234 25 76 110 -180 694 -217 -115 -106 244 -142 -406 223 -331 76 -225 303 -129 -148 267 -98 93 -265
3922 -265 396 -353 -27 -179 -400 172 -82 235 -413 361 -134 -139 -101 174 -152 -478 343 -233 34 -408 93
3943 93 129 -217 298 -448 -24 -272 566 -319 -253 -44 -6 223 -286 376 -545 254 158 -129 -189 3 64 -194
3965 -194 558 106 266 -322 233 186 -404 217 157 1 -564 573 166 -116 -40 201 249 -324 292 -282 87
3986 87 -192 78 -221 -249 209 -219 -174 -154 199 -294 71 177 -270 202 -184 214 -516 60 193 -190 69
4007 69 231 173 -815 198 97 -176 -385 57 205 -439 309 83 112 -314 178 50 -20 152 -185 98 -342
4028 -342 7 -264 115 262 -100 -363 -33 465 -274 254 60 40 -245 324 407 -485 58 178 128 -166 367
4049 367 174 -450 -10 -131 73 -225 291 53 -79 -3 106 127 -153 385 -210 -62 -87 -54 -78 -114 400 -465
4071 -465 35 -95 334 -754 -149 357 -294 -188 -164 643 -416 222 -32 -391 -316 -93 385 -435 491 -68
4091 -68 -32 -147 -19 75 -457 339 -294 -24 217 338 -176 -133 164 -308 -16 35 551 -183 31 426 248 -43
4113 -43 -153 558 -268 174 212 223 -579 -79 100 -223 141 68 541 -72 252 -37 -172 90 39 159 -262 212
4135 212 -37 -171 -25 -71 -35 -394 574 -297 -336 108 371 -409 -313 225 -428 -116 -160 213 -234 -28 111 -178
4157 -178 49 -193 422 7 107 77 42 131 -80 168 -244 458 -239 -202 -151 86 -140 -268 301 -219 60 28
4179 28 484 -237 -202 373 -101 -39 -239 427 -348 -239 175 209 26 -195 255 -431 306 291 -64 21 166 345
4201 345 -438 459 258 36 -140 561 70 -452 320 -125 274 -367 393 -171 -184 33 522 304 -499 545
4221 545 21 155 -203 273 -295 -44 347 -80 181 -130 167 -341 29 144 -90 93 -149 145 -666 272
4241 272 130 -242 35 56 142 -461 258 145 -229 -273 127 36 -362 -149 417 21 -145 314 -318 110 385
4262 385 14 102 -85 277 -245 105 361 64 30 282 519 -427 144 133 294 -312 187 162 -403 212 174 261
4284 261 -597 316 128 -266 -26 -71 382 -167 289 -129 39 7 -72 -69 -24 149 -563 -147 -64 181 -292 155
4306 155 289 -489 -62 87 126 -390 316 98 -386 50 -146 249 -602 -10 215 -190 -236 16 246 -456 65
4327 65 -488 176 44 352 -48 90 474 -252 -28 -224 527 -264 230 395 -205 21 206 439 -674 206
4347 206 336 -5 -188 -120 460 -346 -80 72 128 -339 50 -37 -33 309 -139 -67 -191 321 -172 -137 155 -204
4369 -204 228 -343 293 -232 -172 220 60 -59 -246 392 -195 -341 -66 277 -311 -210 163 -301 5 -88 543
4390 543 -321 -137 263 -189 43 36 196 -177 86 -72 26 86 40 -60 -249 624 -187 -204 212 426 -187 -222
4412 -222 364 9 -64 -157 293 -293 -153 111 -31 -260 -101 412 -196 365 91 123 -120 -8 214 -196 177
4433 177 -80 48 -107 213 -126 -536 182 -142 138 -77 572 -312 -145 226 37 27 -272 239 -332 -319 -80
4454 -80 211 -106 -194 350 -161 64 -319 144 -227 -135 77 -270 356 -88 -63 -423 263 -77 -223 134 33
4475 33 355 -467 637 66 -254 -87 268 119 -469 334 -89 144 -393 259 36 -173 212 -160 -32 -300
4495 -300 407 -262 -62 10 -97 14 -129 370 -225 233 111 -71 -318 330 -39 -296 224 5 -2 -450 334
4516 334 238 -359 59 -146 308 -452 313 -127 25 -343 113 37 -342 559 -269 -111 -267 -70 -394 154 135
4537 135 -303 -31 31 -42 -176 55 273 -394 -27 69 142 -514 252 374 -303 -44 59 220 -375 299 5
4558 5 -45 -307 189 3 40 -41 -260 56 -107 223 -251 70 333 -99 160 26 239 -217 28 285 38 -44
4580 -44 194 377 -339 6 -31 25 -282 -228 279 -135 88 50 4 -369 36 30 -253 17 21 26 -173 68 -363 -177
4604 -177 18 -85 -389 -36 91 -279 -193 -57 31 -191 -204 301 -166 41 -132 444 -306 212 426 75 -81
4625 -81 65 203 -353 374 -154 6 -26 144 235 -55 316 -288 89 0 63 -35 -174 558 -110 -109 -206 572 -538
4648 -538 -3 257 -9 41 -116 261 -232 -51 353 116 -143 -161 211 -533 -22 143 53 -35 -64 65 -165 85
4670 85 -329 -181 -158 268 -229 -133 223 -250 -179 -50 182 -206 -178 59 226 -299 -114 463 -167 -272 90 205
4692 205 -32 206 310 -304 -18 -41 204 -149 239 134 -203 191 216 59 -348 296 -218 -123 102 192 38
4713 38 -320 339 -182 148 81 441 -4 -142 226 -30 -159 -192 448 -278 -113 -177 -28 130 -195 308 -278
4734 -278 119 -115 -65 275 198 57 -220 304 -108 22 -387 105 -23 -383 125 205 140 -55 170 27 -322
4755 -322 -5 102 -75 150 64 -377 73 -106 118 -50 -78 227 -255 209 -6 4 -186 280 263 -322 -96
4776 -96 -37 -118 -135 202 128 -119 158 -70 125 -434 173 22 57 -138 200 -91 -523 273 -45 -78 -82 143 -4
4799 -4 133 162 -278 -10 -144 353 -147 260 143 -54 80 112 212 -297 158 131 26 -126 -122 175 -556 245
4821 245 22 -303 -254 63 -3 -204 144 -29 -35 -225 88 -151 110 173 -352 -91 -45 295 -465 109 -67 244
4843 244 -146 -78 252 -178 140 -45 -61 -448 173 131 -56 79 -61 150 -253 331 218 -92 -88 -79 363 -158
4865 -158 82 9 238 25 90 24 77 399 -29 268 36 157 -54 -22 89 -209 -48 -106 135 -463 6 -79
4887 -79 73 -50 0 383 -299 -29 -17 -164 -248 -3 12 -223 198 -202 218 -322 181 2 -184 52 -21 79
4909 79 -203 382 -234 7 297 221 -87 -113 259 -372 -27 138 232 -229 -139 393 -336 290 -5 138 -271 58
4931 58 168 -186 93 -170 113 -157 259 100 55 34 -35 -37 -288 415 -353 -37 123 10 -23 -58 357 -110 135
4954 135 49 165 -150 -55 171 213 -39 -275 70 -208 -56 159 71 104 -134 -66 -283 197 -275 -29 -169 157
4976 157 134 -204 327 -159 63 -307 227 -50 -67 -108 -106 -20 -139 237 -250 -30 -134 190 112 -133 349 -19
4998 -19 202 -99 77 -199 -135 208 -121 405 -455 90 -212 190 60 -292 112 141 60 -336 66 2 -101 217
5020 217 -28 37 -382 333 -78 135 -160 348 -114 17 225 -91 236 -160 274 -70 85 -2 -174 -131 200
5041 200 198 -306 366 4 -313 31 -60 -157 -513 64 -103 -50 7 166 74 -316 252 192 15 100 -119 -147 -172 403
5065 403 -8 75 54 214 65 133 -86 19 89 -47 290 -176 222 94 186 25 272 195 -125 278 92 193
5087 193 -319 168 78 20 129 -86 14 -272 230 -67 -10 -145 150 174 -145 186 -263 22 -60 -17 -274 53
5109 53 206 -230 -81 241 72 -168 136 198 -98 2 86 12 -491 30 42 172 -157 -95 299 -197 55 -148
5131 -148 2 26 110 -175 -323 154 -140 270 -340 316 -265 84 72 -1 -144 -110 106 -57 96 51 42 30 -48
5154 -48 123 -154 -181 -55 238 2 52 95 -75 -27 -47 369 43 169 82 -169 281 -79 27 -92 -142 -303 229
5177 229 321 153 -95 -251 274 -239 109 95 277 -355 -73 133 -231 101 -286 45 -338 -3 201 67 -229
5198 -229 -75 343 -264 165 -121 101 -193 44 118 -350 227 -302 113 57 79 181 -303 188 197 -155 -2 197
5220 197 -145 -155 57 -75 -41 -59 202 -329 -31 -163 259 36 240 159 -140 223 -248 65 -354 33 -78
5241 -78 -114 70 175 284 -385 356 17 -46 308 -64 218 -245 235 -144 -65 32 48 -115 -234 110 -158 -99
5263 -99 -61 75 -80 -88 85 71 -10 -34 83 5 79 12 -44 123 -59 257 -321 180 -101 -24 -304 -122 63 -465
5287 -465 339 127 -39 -116 314 52 -284 -39 -7 -32 -321 342 29 55 63 52 175 -44 69 -232 161 -108
5309 -108 -28 -55 -42 315 -253 38 -49 99 -276 238 5 -128 116 -121 448 -214 388 28 -130 -268 -19
5330 -19 23 -240 389 7 18 -184 -15 -166 -60 144 -217 -156 -56 30 9 -3 -69 -6 -75 -9 -76 -362 74 10
5354 10 -164 -88 30 -30 -129 153 -117 30 -357 79 104 -154 -255 -247 320 -96 -86 251 8 -37 -214 7 -100
5377 -100 239 -221 -15 70 107 -16 -89 173 -478 14 86 149 -72 -88 205 -152 -29 16 228 -17 -36 64 -24
5400 -24 213 -108 208 -273 44 -238 131 -49 -29 -142 -168 -51 -115 -277 -140 -5 -220 -150 -33 -129 -51 175
5422 175 83 -152 181 210 -87 125 50 90 -316 316 69 -7 101 32 42 -172 -49 -73 77 -385 -20 -110 57
5445 57 274 17 80 -54 175 -183 -228 42 112 -195 19 276 -160 -118 54 160 15 -153 -14 -261 42 148
5467 148 199 -270 -101 64 -86 168 49 150 94 93 -40 164 -220 164 252 33 450 -269 97 -22 -84 251
5489 251 69 86 -72 -172 84 153 -143 -217 193 -140 -330 -133 43 20 7 39 69 -34 -333 105 -216 170
5511 170 -65 32 -45 16 88 -95 77 32 195 -214 277 -52 -281 76 -59 112 -203 236 63 -259 12 241
5533 241 45 -303 -201 -97 184 -200 213 -59 -133 100 -118 81 -7 248 -271 20 85 -161 166 140 -7
5554 -7 -157 191 -71 -156 -67 44 39 -70 122 -148 -39 -7 -57 51 -147 -20 -238 -287 -199 137 -100 5 51 15
5578 15 -187 64 68 -429 133 -12 -400 -265 -100 -102 -215 237 19 113 -106 -147 143 -110 303 -221 62 -171
5600 -171 194 226 -73 243 -151 43 -136 156 -386 76 -47 36 134 -104 248 -227 -47 23 191 -141 322
5621 322 285 34 78 40 199 -245 -107 -120 -209 131 -28 90 -171 126 61 71 -71 75 -61 -154 67 -154 188
5644 188 -93 210 -342 183 369 -134 -84 -128 -9 -44 54 89 -47 244 237 206 29 -130 260 159 -302 50 -191
5667 -191 -148 -222 62 -84 -94 -49 98 98 308 -172 3 -208 -61 187 75 345 -7 -156 90 139 -316 110
5689 110 213 165 32 -399 118 -330 272 180 53 -18 107 182 -205 99 -56 -10 -9 239 99 60 155 -66 154
5712 154 -400 151 -25 145 243 36 212 4 234 5 -173 -260 53 -215 22 111 19 83 -102 133 -312 -140
5734 -140 128 -63 14 -182 333 -125 281 70 193 133 -75 132 229 24 193 94 59 -45 -109 -212 217 28
5756 28 -1 -126 346 -149 -220 148 43 155 35 283 -187 -96 175 247 166 -50 377 -152 138 -156 289 -139
5778 -139 4 29 -253 159 -163 144 87 14 -101 -253 -207 -91 -25 -144 335 -160 -155 -236 297 -195 -295 207 -293
5801 -293 -115 58 244 -143 -26 -21 -151 38 -146 12 68 39 12 -207 41 114 24 -136 601 -17 -293 -76
5823 -76 -69 35 -362 276 -47 218 -15 2 -86 -296 14 -14 -10 -337 84 -207 55 135 -117 -12 -69 115 83 190
5847 190 39 -176 61 -21 239 -137 210 196 -40 -264 38 187 -30 44 -68 -73 -233 64 -214 -50 33 140
5869 140 13 -432 212 -170 -195 -156 109 188 -113 129 -141 83 -97 -9 86 116 -91 -89 -119 121 261 -237 367
5892 367 147 -71 -133 -1 324 -14 50 -84 -115 195 156 89 -76 135 -97 -27 -21 -173 50 131 178 -71 154
5915 154 44 216 -112 236 23 -119 -120 -127 565 -154 -23 63 -143 -98 -110 -10 -39 -72 73 310 -280 -133 160
5938 160 -257 233 -71 32 114 60 -258 -61 140 -170 181 -50 412 -328 -189 12 -26 70 -150 164 -64
5959 -64 144 77 352 -175 32 253 -147 -110 160 -121 -299 198 220 -17 -9 -18 328 13 -29 95 -227 -60 35
5982 35 13 -314 -16 -159 81 7 78 -276 -197 260 -77 69 -294 204 -3 113 164 -317 -85 -34 193 -431
6004 -431 4 -27 -24 -26 57 370 -92 -132 -63 -52 -330 -1 -54 -173 105 -214 59 92 281 -159 -120 -221 262 -243
6028 -243 -311 81 -300 -98 -103 -91 23 32 120 -26 153 -225 297 -257 -321 -7 83 357 20 201 -212 281 133
6051 133 -113 -247 12 144 -90 98 98 8 -126 -29 -113 -222 309 -114 -42 -212 152 159 -210 102 -27 62 -231
6074 -231 16 19 208 137 360 -188 130 74 -52 205 -117 116 -161 191 50 -298 152 -42 324 -397 174
6095 174 113 -251 129 72 -87 -24 189 -83 10 -56 -221 166 -99 -46 -307 310 -150 234 -91 -218 171 -108
6117 -108 133 -42 109 -45 30 191 -194 25 331 175 -134 114 105 179 181 153 -65 -117 266 49 113 -264 44
6140 44 -96 -42 57 -92 96 -95 246 -122 119 -14 -221 -114 70 172 -144 -56 341 -107 -15 177 -7 -502
6162 -502 184 -2 187 -181 -59 94 -204 21 -218 -48 -35 211 -70 6 143 27 260 -106 13 -202 -38
6183 -38 -16 11 147 -271 6 -118 -72 -87 137 79 55 72 -350 158 18 214 -307 67 113 -22 -109 -168 198 21
6207 21 252 306 70 124 -193 158 -63 -24 301 133 95 144 -96 -166 280 165 73 28 42 -286 -97 -148 96 -340
6231 -340 -110 295 -172 55 55 -36 -2 -121 128 -164 9 -127 0 48 209 -113 -135 256 21 259 7 270
6253 270 -24 -37 -153 26 -111 -145 105 55 69 167 191 -58 29 64 194 -25 -180 258 -16 71 110 -65 -49 -80
6277 -80 29 -175 47 479 -84 -176 -26 -84 -225 401 33 154 -29 -48 -66 22 63 -16 147 -95 185 -76 -127
6300 -127 487 18 -22 90 -38 -102 -31 65 46 85 -13 187 -232 173 -21 103 -122 -44 -234 111 135 -36 95
6323 95 -48 473 -158 118 -136 -81 -314 -300 157 -184 171 131 30 -157 -129 276 -186 68 48 -101 51 20
6345 20 27 -206 8 -19 100 -73 -17 7 -204 131 -142 -84 -107 165 117 -138 224 28 73 -46 27 -137 18 -53
6369 -53 105 -111 -91 -170 -32 -99 -285 49 -16 133 111 20 61 -148 8 -99 53 165 -203 -51 -95 -109 -55 187
6393 187 54 -174 -132 33 -30 -382 -167 -105 -29 -218 126 85 -229 140 73 284 -89 144 23 138 109 -371
6415 -371 80 -66 167 -109 -21 -160 330 149 -284 -92 -67 178 -221 353 -83 172 -16 -81 -111 13 73 -227
6437 -227 76 -200 -78 -79 -18 176 -29 -67 55 -13 53 43 -6 64 75 6 229 62 46 -330 -219 -141 -160 200 -159
6462 -159 89 -169 26 -235 -5 -49 -229 62 17 -107 -7 -7 -217 -89 292 -8 180 -90 36 -13 285 118
6484 118 55 295 -83 -97 110 251 -133 -54 -175 293 -65 -52 384 -182 41 228 86 47 -121 261 91 -69
6506 -69 101 244 -3 138 78 65 46 -103 79 -126 220 93 89 50 199 31 60 208 104 32 -138 -11 -293
6529 -293 -252 192 66 -121 -218 272 -194 -16 -137 134 25 51 22 -118 186 -186 -92 -173 31 134 11 -89
6551 -89 -138 83 -313 236 -23 30 71 -227 201 -140 90 -8 123 63 10 113 -89 50 -246 -311 -129 196 -21
6574 -21 -146 53 -216 104 11 3 2 318 18 26 161 77 296 149 123 68 40 -71 8 24 -258 199 3 -89 -20
6599 -20 297 102 -65 194 -135 210 -197 61 -59 96 49 -353 -74 -131 67 -21 110 11 24 -168 46 125
6621 125 -183 103 -66 177 -173 -29 4 -215 -212 27 103 -219 120 115 -126 -70 -21 146 -40 155 -127 -102 -53
6644 -53 220 35 -46 70 188 28 -203 -82 -95 -70 81 -324 262 -61 -50 -83 163 6 -308 -66 -83 203
6666 203 -179 -106 84 -82 0 171 190 -93 -26 -11 -87 -42 14 -66 79 292 -94 24 -56 -12 260 -54 -76 -101
6690 -101 -179 -54 298 -108 139 -26 -222 64 31 171 -198 143 -177 147 -97 184 268 -78 54 132 200 -300
6712 -300 56 56 -26 -109 -142 81 -140 -91 -54 150 250 31 66 67 198 -253 209 -130 -43 314 -154 186 163 -81
6736 -81 30 265 17 -7 100 -154 101 -62 237 27 -108 81 -7 209 24 -22 -6 36 -190 38 81 307
6758 307 -178 -135 180 -148 -112 -103 26 -361 72 -227 -248 37 -68 -53 17 -240 57 -122 -47 -74 117 -374 201
6781 201 98 205 -55 -9 -119 -174 225 97 -46 -148 42 80 -34 194 -10 8 118 84 25 183 158 238 25
6804 25 -238 300 98 122 27 31 -44 27 51 109 189 -10 80 -84 2 76 -168 30 -13 -134 -128 292 -36 20 -153 -39
6830 -39 29 -232 398 -132 -2 -281 -22 -246 -96 65 141 -25 -280 85 -34 -5 9 78 -109 -375 66 -238
6852 -238 84 7 77 -77 45 -232 -341 148 -389 309 -81 52 -127 -80 259 194 -147 -322 -62 141 14
6873 14 102 166 164 -277 41 168 -90 -113 -132 1 89 -61 81 138 11 285 -2 66 210 -73 180 -90 9 -15
6897 -15 206 -252 -115 67 -186 69 -162 293 -54 25 -313 72 -7 -132 -9 -138 -17 -165 291 -75 -106
6918 -106 216 -123 -20 105 184 -309 236 117 -70 332 -292 245 -317 -138 -64 107 -75 112 168 -330 -90
6939 -90 15 -27 -31 200 -220 -296 -125 189 -92 -208 82 -160 209 55 62 -7 60 180 118 124 -119 247 -80 122
6963 122 13 15 -61 75 -11 -27 49 73 -235 -53 117 172 -84 125 105 126 -91 -12 74 -38 170 -135 65 -85
6987 -85 -217 -67 258 363 -104 -249 -33 139 -50 209 179 -163 175 -218 218 -380 32 83 -88 42 58
7008 58 151 -165 -62 13 -132 -262 300 42 -262 174 63 64 -66 -124 96 94 288 39 278 -259 239 94 53
7031 53 86 11 61 -55 -29 -367 269 -25 -215 -155 -83 176 -86 110 70 201 -42 202 -92 221 -26 -64 217
7054 217 -20 86 -188 225 -157 67 -32 -239 342 -26 408 -108 72 93 -154 232 219 147 -49 234 -200
7075 -200 -47 10 182 -98 85 127 -66 33 106 223 27 -42 204 69 23 74 290 -22 70 26 2 403 -126
7098 -126 179 14 219 93 6 -58 146 106 131 -7 -32 -67 34 -24 -6 -52 481 -50 -131 125 120 45 -150 162
7122 162 223 -33 -87 170 -68 187 49 68 -149 -200 -13 -246 -11 -210 19 -65 167 29 -110 215 -75 -99
7144 -99 38 44 -94 -115 104 -51 141 -242 100 -10 -15 57 74 22 1 33 -104 211 -82 -81 -43 -32 80 -210 95
7169 95 -17 -204 -215 242 -9 -69 195 -101 98 -198 95 93 -26 164 -24 127 117 79 -51 52 -73 52
7191 52 32 -25 120 141 295 -79 -181 72 55 -172 -182 150 9 72 -262 244 90 -171 -105 -106 212 -213 40
7214 40 -55 56 -129 70 160 43 -137 -9 145 175 99 139 -329 39 -247 -28 36 181 -339 79 125 -28 -270
7237 -270 153 305 -343 51 -190 148 -7 111 203 -194 2 173 53 -202 117 -155 6 217 -224 62
7257 62 -95 0 -47 128 250 -138 218 -156 199 -193 39 -240 29 13 87 -166 59 47 -55 184 -218 -118
7279 -118 -126 -217 197 138 221 -478 72 106 -2 -70 11 -219 5 83 -229 37 89 33 70 -221 115 -294 -174 -28
7303 -28 20 206 -77 81 -249 -198 45 200 -117 -3 -131 83 -101 -17 167 -61 101 84 115 -53 184 11
7325 11 -49 174 -65 188 98 -7 -328 202 165 -172 114 -68 322 -138 -115 -79 144 -164 64 130 -126 -80 -164
7348 -164 95 100 -84 185 -158 -21 -28 -4 -400 51 -34 161 77 104 -61 -41 236 -105 -252 -51 -119 13 96 -142
7372 -142 -96 69 259 207 68 -202 229 88 79 -75 17 -286 -89 -12 -187 26 1 88 -286 158 -146 59 97
7395 97 -8 130 -29 306 238 -46 -65 63 19 -52 94 -138 -64 -40 4 -64 -133 212 114 66 -55 55 -48 -117
7419 -117 32 -54 71 -96 -90 48 -37 -201 -216 51 -114 -145 -81 96 -52 -134 -144 58 -220 -71 -31 -111 -53 -237
7443 -237 51 -33 154 86 -48 45 -319 243 -155 -143 46 108 -50 292 -168 -4 68 -169 89 -136 157 26
7465 26 -106 186 -210 -9 138 289 60 -24 285 128 36 43 186 115 -52 -12 103 -74 93 27 -285 -62 5
7488 5 107 -175 -98 93 91 98 222 375 -43 69 15 188 21 -122 -133 -118 209 -9 3 152 231 41 -238 -74
7512 -74 -5 41 -128 32 -61 63 -35 -59 31 108 249 75 8 -307 -62 -56 24 64 -217 -139 -53 185 15 73 -142
7537 -142 66 61 -19 105 -318 103 30 92 91 331 105 2 -9 102 100 -106 14 278 -342 66 13 -52 -174 207
7561 207 -80 10 178 -130 67 -27 -53 102 -38 74 -115 92 21 76 -193 119 53 -116 13 39 -110 -434
7583 -434 -34 -128 -8 -86 17 -128 31 69 112 222 -297 -107 -123 3 29 -12 -5 -109 89 -194 59 -66 158
7606 158 -154 -118 39 -10 -248 -65 -71 139 -48 285 50 -117 -322 310 -405 69 98 140 -3 183 192 -106 39
7629 39 -144 97 22 -42 -359 35 79 -77 -39 144 186 30 3 121 -48 75 -40 140 -37 -76 100 126 124 -226
7653 -226 145 26 156 -159 -192 -160 78 29 -238 251 113 -73 188 140 -54 132 -68 130 -16 -13 491 -123
7675 -123 114 -286 240 41 8 211 37 154 42 43 -151 194 240 -44 -179 -40 52 -91 -2 9 74 272 33
7698 33 16 -368 107 -23 -96 -27 116 -81 -39 -76 211 17 -45 98 -10 -46 -156 -266 158 -170 -71 -13 -110 13
7722 13 -32 49 -99 108 -180 62 14 -170 47 138 -113 -162 38 -195 129 -165 -1 -114 -135 -21 5 -8 -259
7745 -259 116 91 -261 21 87 -220 -242 194 -31 -1 -215 409 118 -18 -103 -112 135 -32 302 -76 -77 -58 -104 -111
7769 -111 198 252 -200 79 -62 -125 -71 -47 294 -18 127 65 -74 -22 59 -232 -289 93 21 346 81 151 204 -197
7793 -197 53 -178 -178 98 123 -237 187 -41 115 -37 13 -19 -128 112 -160 -96 4 46 61 -56 248 -392 162
7816 162 171 210 97 -51 -53 -191 153 -65 166 -208 196 61 -94 -57 72 30 -37 93 123 -83 36 -199 73
7839 73 -183 245 -163 6 18 176 -26 -168 156 -87 157 -137 25 111 37 -130 41 86 -208 155 68 144
7861 144 79 225 -256 -82 102 -46 89 196 210 -27 85 92 -13 -158 2 103 -1 195 75 161 -36 -18
7883 -18 50 -151 28 118 32 117 -89 15 -32 164 8 61 -26 107 -45 81 -105 5 154 -164 125 -340 22
7906 22 80 71 86 -206 50 -196 -162 -16 -145 -98 -155 -16 67 -58 -215 101 -75 -100 68 247 94 79 -69 -27
7930 -27 -10 131 -88 -55 334 -170 -164 225 -396 -153 -9 43 -101 296 125 -201 65 81 296 263 -166 80 34
7953 34 118 -185 137 -225 -94 -236 -71 -45 30 45 -60 309 130 60 141 73 34 -122 -36 32 118 17 -36 20 -45
7978 -45 121 234 6 -18 109 287 -110 167 -136 89 -56 -85 130 -107 57 -70 69 142 -11 -27 45 -135
8000 -135 101 -131 386 -47 -23 -172 5 226 32 227 14 37 241 -134 1 33 -254 19 10 -255 28 150
8022 150 -210 -65 -14 -112 2 68 -168 154 -80 285 -144 -78 44 -66 -55 36 -45 75 15 213 -115 201 21
8045 21 -80 -326 283 36 -152 91 40 -30 87 222 200 14 -182 -78 26 46 67 -156 22 -111 44 100
8067 100 33 124 -99 252 -147 156 -218 32 -31 -235 15 187 -92 -197 140 32 -131 -188 81 63 -97 241
8089 241 -119 -280 369 5 80 -191 22 -164 -106 -120 56 13 -83 418 -86 151 -246 -48 -178 137 176 -201
8111 -201 -159 -109 127 -39 82 83 -10 123 -119 294 160 122 -36 1 -155 369 206 -68 -169 33 -213 69
8133 69 -47 -59 -148 -205 85 -23 -122 -61 -78 145 -154 60 -148 145 -198 -113 -174 -30 218 -120 -13 -1 67 -241
8157 -241 14 -108 65 151 -159 -123 -70 -92 0 -155 133 -111 63 257 111 109 -51 97 -137 -143 -135 -38 135 -34
8181 -34 43 -269 -58 -118 409 -166 -127 98 154 142
8191A42
$$ Imaginary data points
##PAGE= N=2
##DATA TABLE= (X++(I..I)), XYDATA
0 0 0 0 0 0 0 0 0 0 0 8 -8 8 -16 16 -16 24 -32 40 -48 56 -64 80 -96 112 -128 151 -175 200 -231 264 -302
31 -302 345 -390 441 -498 560 -628 702 -785 874 -973 1079 -1197 1324 -1463 1614 -1782 1963
48 1963 -2163 2380 -2622 2888 -3184 3512 -3882 4299 -4773 5320 -5955 6706 -7612 8723
62 8723 -10128 11963 -14471 18114 -23906 34501 -60124 245925 203103 -267949 138627 86576
74 86576 38617 -2163 104740 105970 -120881 -3210 228105 -105544 -37603 130317 -85981
85 -85981 -24344 51403 44237 -64727 -76138 27930 15978 2382 -29058 -44872 -96335 89900
97 89900 22646 -127461 14295 5166 -67086 7943 27142 -46560 -32930 -41842 71929 -36174
109 -36174 -44416 107075 -134190 -16140 121793 -3716 -52812 -42809 50163 43435 -57822
120 -57822 25817 46634 -102957 56293 50880 -42419 -8592 8861 56529 -42558 2469 66949
132 66949 5892 -73416 47729 103011 -39655 -23596 13648 57024 1182 -9464 37539 -4294
144 -4294 -47909 48792 43968 -79537 28030 1834 -9623 -20951 -20932 53567 -57864 -38194
156 -38194 27520 -13213 -19683 5770 -57523 10803 31375 -52849 -8628 -12008 36199 -37191
168 -37191 -25637 52347 -27554 -28575 47742 18420 -70091 52317 45231 -48513 -14590 70676
180 70676 30360 -85121 34834 74629 -40538 -39376 88943 -18588 -59945 73469 271
191 271 -42797 -7112 72164 -32779 -81822 71660 35870 -83091 -3579 61699 -57568 -7606
203 -7606 27370 -4830 -33561 -535 45624 -55169 -1694 42640 -20492 -39176 36128 7674
215 7674 -31134 24037 -17761 -6052 10894 24967 -38889 -28085 59498 2465 -56335 9124
227 9124 57311 -61683 -2431 49618 -13990 -31418 4742 48306 -41905 -5428 54696 -13338
239 -13338 -60189 47097 48721 -45710 -7362 16271 33809 -29121 3604 31054 -19883 2776
251 2776 21884 4462 -21251 25383 -2438 -788 -1088 11395 17322 -40677 8263 18689 3498
264 3498 -20379 -4465 -3000 3184 2761 -18733 4813 -25724 20540 -1946 -25658 5340 -394
277 -394 -7362 -11982 11949 -7315 2014 -21372 959 5896 2446 11166 -44010 14322 29724 -15958
291 -15958 -28579 31528 11916 -30157 17279 18887 -7973 -33414 56133 12506 -53686 33203
303 33203 42238 -40785 -27326 76187 4909 -49037 2581 55492 -14849 -35197 55290 -10498
315 -10498 -24931 27152 23018 -35449 3536 36079 -15322 -11191 12219 21739 -38222 10765 21089
328 21089 -24876 8924 8305 -25804 -16635 42772 -19470 -35500 6417 21096 -24727 -34606 36995
341 36995 -24410 -29951 19085 2489 -44424 3501 24334 -38125 -12743 21940 15275 -56878
353 -56878 7606 45589 -28880 -11492 26779 7001 -26857 31808 17674 -14937 -2690 38133
365 38133 17173 -36094 33925 25529 -9970 -4614 29793 13399 -9978 2642 4612 20207 -11173
378 -11173 9102 -6928 -4056 9760 -10930 505 -8410 -5198 -7152 7035 -22126 -7830 2923
391 2923 -9490 -4055 -22459 16447 -7505 -21514 -4166 13764 -535 -20498 -2079 5936 10823
404 10823 -25636 13874 6775 -18304 7384 9785 -1255 -19682 20546 7551 -15021 -7572 31575
417 31575 -2310 -32491 32280 9833 -12004 -4463 21869 -3697 -8107 23549 2105 -17524
429 -17524 5428 40339 -28427 -8806 32213 -1953 -15615 5129 25296 -18870 -5813 12795
441 12795 1604 -19169 13581 5282 -34347 15732 3543 -13612 -14428 7254 -5395 -16048 7759
454 7759 -7869 -14969 -691 21742 -34088 -4322 33421 -15209 -20145 17347 28833 -27998 -540
467 -540 30444 5085 -19886 23902 25090 -32301 20426 27764 -7234 -17041 23125 16628 -21640
480 -21640 3036 16105 -2806 -22773 19479 -6918 -12393 9170 -10086 -8494 -5539 11529 -16644
493 -16644 -11399 4333 3603 -14560 -5796 8476 -17977 9199 -1081 -6749 -4982 4560 691 -9549
507 -9549 8326 951 1492 -11578 13423 -223 -1996 11009 -10274 3879 6202 9447 -10764
520 -10764 -974 7350 9314 -8002 -7501 18482 -9381 1103 -1388 11221 955 -13694 11627
533 11627 8828 -3467 -4327 19410 -8936 -3221 14509 11464 -12450 -15019 29532 -644 -15584
546 -15584 -1257 13276 -14041 -9004 15505 -9323 -7447 -8012 6427 -10085 -761 6761 -14861
559 -14861 -7213 8025 4128 -16634 7497 -7482 -1680 6569 -2402 -5891 -13175 20218 -4421
572 -4421 -11622 8629 6612 -16047 2009 21417 -8388 -3175 1211 11062 -9683 10238 13080
585 13080 -22173 -543 17899 6016 -25583 10330 7336 -14730 1531 12346 -2877 -22655
597 -22655 15594 9140 -10435 -2415 17238 -10386 -11129 25662 1145 -5722 -9694 15845 6380
610 6380 -6411 6161 -6062 1341 5640 4576 -8099 6750 -6509 -3741 9890 1703 -1754
623 -1754 -13530 12441 -3875 -3936 7202 -1040 -14306 -5134 20241 -10128 -12032 -3357 7723 -5394
637 -5394 -6849 4622 -6453 -4462 -3144 11424 -8418 -265 -1871 -1646 8314 -5014 8437 -7262
651 -7262 -2653 4433 8748 -1687 -6866 1583 3987 6388 -6948 9947 -7008 -164 9707 -441
665 -441 441 -2577 9686 -6913 2928 7921 2874 -10408 -414 15374 -6527 -1714 -810 3799 -5635
680 -5635 4822 2404 -7413 602 -1197 7725 -9924 4527 -2244 -5123 4850 -3910 34 -896 1715
695 1715 -10820 5677 4912 -3359 -11076 3760 13434 -17596 3153 5854 -1895 -8247 7018 6513
709 6513 -12519 3719 5737 -119 -11292 12157 2350 -10323 4409 4919 710 -6432 9523 -4515
723 -4515 1488 3312 464 -2005 -1200 11464 -11789 754 5987 -1143 -7142 1334 2501 -6627 3429
738 3429 -3583 410 -8081 6621 -996 -7354 6267 -4681 160 -1645 4972 -6273 1987 1864
752 1864 -4165 1991 2985 5341 -13017 7259 7908 -1545 -3830 4382 6396 -4894 8509 221 4029
767 4029 -3630 4846 5729 -1664 3999 -4397 3249 -1102 2502 -2972 2253 -6051 -6189 9396 -3765
782 -3765 -4735 -10057 8002 -1342 -8320 1754 -1047 -5092 -5091 9535 -6660 -2705 -3041 69 -536 -1615
798 -1615 5572 -10490 45 2281 4462 -4376 929 -142 -4343 10279 -327 -50 -5175 8276
812 8276 2378 -2089 5898 264 -1671 -1844 12220 -3458 1103 -529 -1702 4739 2802 4410 -10206
827 -10206 4912 4662 709 -2400 4396 -1718 -7287 12578 -310 -4136 -6308 6659 -978 -6019
841 -6019 6322 -2853 -7668 -5892 11464 -4083 -5296 -3847 -1977 3300 -3789 1990 -6952 1474
855 1474 -1814 2086 1695 -2112 -3330 -2837 11529 -4993 336 886 661 -1580 3720 9140 -7049
870 -7049 -1643 1573 9608 -3683 796 650 -3764 6614 -965 1863 -5186 1921 -2563 1729 2990
885 2990 -4121 -3579 -3540 7981 -6430 1747 -1503 -5430 -131 3124 3437 -9480 1839 -79 2632
900 2632 -881 2832 -2080 -4732 10369 -1013 -13 -388 5045 -5101 2406 10142 -3515 -4557
914 -4557 253 11439 -6765 1180 5087 -4187 -2217 4785 6287 -10224 2052 1795 1138 -3635 2329
929 2329 548 -8288 6298 -2090 -29 -2289 526 -6018 -92 6787 -7323 -4146 -480 6224 -9522
944 -9522 1246 4251 -7127 -2444 3524 4197 -10866 3249 2094 -1576 -2740 3711 2558 -8165
958 -8165 5868 437 1552 -1708 2583 -281 1044 6130 -3590 2144 -606 6372 -3202 2210 4671
973 4671 -3021 2102 720 5487 -3627 3031 -503 1306 -665 -583 3872 -4561 2267 -3097 3466 -2500
989 -2500 -2610 1034 -31 -267 -5951 4815 -3695 -521 -2139 929 79 -4119 2458 -3664 1967 -2066
1005 -2066 1967 -3235 1715 675 -4952 5238 -1700 259 -3177 5576 -1946 -4372 4652 1532 -3208
1020 -3208 -3713 10448 -4775 -3497 2225 3369 -2218 -2124 8262 -5584 -1006 1791 3504 -4797 1732
1035 1732 4158 -7478 2375 1477 655 -6146 5457 1067 -5663 3347 2521 -2252 -5424 12274 -2418
1050 -2418 -6001 3663 4094 -2018 -3200 9673 -4431 -3388 1807 4921 -4611 127 5420 -6874
1064 -6874 2327 1998 1740 -6011 4173 2820 -5693 3529 2105 -2367 -6103 9803 -1690 -6486 2349
1079 2349 2424 -3936 -6323 8478 -3509 -4721 -429 4895 -3746 -4407 5314 -3602 854 -1145 3049
1094 3049 -3639 -969 2461 -617 1418 -2202 1545 -4681 3891 -541 -470 1883 -1538 1282 -3419
1109 -3419 5592 -341 -429 -546 4068 1281 -3673 3744 639 3013 -4000 4338 527 -3455 1886 1949
1125 1949 1141 -5509 4535 -2016 -1020 276 2685 -630 -4412 5318 -1797 128 -234 2708 -4598
1140 -4598 287 5234 -5136 -613 472 3785 -7894 1966 5367 -5400 -2725 3397 3367 -8767
1154 -8767 4691 3137 -2935 -3338 4643 1850 -7898 6234 1106 -2758 -2768 4803 -2349 -3246 5911
1169 5911 -2795 -1951 -122 5026 -7238 937 6686 -4853 -4159 3906 4856 -10247 4072 4760 -4717
1184 -4717 -4899 4960 3848 -9995 5081 3364 -3875 -4177 7438 255 -6009 4701 339 -785
1198 -785 -2567 7061 -3305 -1895 5507 -1350 -1362 1375 6305 -5783 1743 4410 -907 -2776 3122
1213 3122 6006 -6584 2274 2564 18 -4164 4198 2876 -5954 769 34 1637 -5397 2411 -657
1228 -657 -4180 203 -704 273 -3843 2491 -3510 -407 -121 53 -2195 -3467 4666 -4189 -813 -517
1244 -517 1711 -3836 -1197 4684 -2784 -1630 378 5905 -4989 155 4709 -63 -1282 1513 6462
1259 6462 -5267 660 2463 2567 -1868 2066 3437 -5871 2975 1540 681 -2524 4235 -259 -4283
1274 -4283 4272 1429 -896 -2751 7871 -3770 -4457 4959 1477 -4290 -1923 7988 -6279 -4704
1288 -4704 3195 2902 -6525 -1050 6146 -6960 -1430 2662 1865 -5993 2262 3199 -5792 1404 2396 -612
1304 -612 -5875 6390 -462 -5371 3099 2390 -3766 -3821 9069 -3019 -3975 3408 4354 -5650 -1883
1319 -1883 9962 -3504 -2488 2539 3937 -5325 460 5688 -3533 -1517 1003 1991 -6420 3126 2007
1334 2007 -3950 241 1437 -60 -5253 5548 61 -2370 334 2916 -2425 -4201 7348 -394
1348 -394 -2516 -1012 4877 -2366 -2589 5116 -411 -2272 -1705 5603 -2842 -611 2695 -115 -483 147
1364 147 4289 -3964 467 1021 1211 -1844 717 1570 -5076 2779 774 -827 -4305 2597 1026 -4602
1380 -4602 1600 1230 -1408 -5458 6318 477 -4640 -826 2359 -394 -3916 5815 -1868 -3967 -667
1395 -667 4670 -1629 -2951 3822 -2983 -901 1069 3728 -4448 -192 4133 -2395 -234 2466 1379
1410 1379 -6397 5296 4626 -4330 -1912 4203 1913 -5880 6162 2248 -4820 -2023 7468 479 -5705
1425 -5705 4825 366 -1914 -384 6299 -3455 -4199 4660 374 -1526 -387 3369 -6162 1158 4382
1440 4382 -2366 -3401 1464 3023 -6294 2751 2464 -3438 -4281 4814 2270 -6540 2306 1030 -1582
1455 -1582 -2903 5413 -465 -5684 2636 2160 -719 -2896 3999 -2901 -1035 2767 693 -2542 -1571
1470 -1571 4627 -3616 203 2022 -121 -3953 1406 4654 -4649 117 1510 1223 -4406 2771 3318
1485 3318 -4234 -691 2892 2028 -5109 3111 1719 -1486 -349 2192 1457 -3948 3315 428 -138 -64
1501 -64 2292 -1272 -1728 4213 -1464 -574 41 3656 -3398 -973 4249 -1741 -2080 1136 3822 -5680
1517 -5680 -60 3515 -1067 -3762 1600 3992 -6206 5 2158 -279 -4197 2143 1819 -5311 939
1532 939 749 -308 -2842 3826 -1293 -4114 2586 1132 -1642 -1648 5388 -3415 -1875 3364 1431 -3682
1548 -3682 -495 6613 -4406 -1572 3192 1884 -4667 1710 5509 -3974 -1051 2170 2630 -4012 3038
1563 3038 2128 -3410 739 2456 562 -3752 3840 -237 -2025 1704 2259 -2336 -3130 5864 -1286 -2100
1579 -2100 1039 2290 -3899 -969 6005 -2266 -2928 372 3955 -4155 -438 3382 -2026 -2075 925 2653
1595 2653 -4757 801 1633 -592 -1157 1124 690 -4723 3577 1248 -989 -1528 2320 -1078 -2551 4341
1611 4341 178 -2008 -1782 4506 -2133 -2763 3058 434 -2344 -1653 5197 -2483 -2331 1127 1740 -1666
1627 -1666 -960 3148 -3297 -242 976 1171 -2563 391 1873 -2634 1192 865 73 -3321 3652 844
1643 844 -2873 1563 1903 -479 -2447 6023 240 -3318 718 4125 -1084 -2941 5430 -817 -2353
1658 -2353 -237 3761 -2422 -2057 3533 -1407 -1479 -252 2908 -3732 267 2393 -1923 -1506 465 1433
1674 1433 -4267 2242 974 -2710 -1471 2859 185 -4745 3357 216 -2301 -1567 3620 -693 -4034
1689 -4034 2979 142 -1654 -1791 4164 -2460 -2068 2328 24 -1501 -394 3293 -3349 516 1954
1704 1954 -27 -1696 2104 2763 -4166 1874 2253 -422 -2749 3340 1914 -4091 1457 2852 367
1719 367 -3469 4309 428 -2832 1207 2110 -105 -3026 3478 -571 -1343 132 1331 -1531 -1514 2087
1735 2087 -2350 66 -48 566 -2554 368 2055 -2736 425 1165 924 -3912 2114 1984 -2314 -402
1751 -402 1731 987 -4380 2293 1217 -1570 -1417 2103 253 -3810 2168 309 -104 -1564 2228 -807
1767 -807 -1587 2193 -341 -468 -664 2225 -3012 -326 2093 -738 -1713 -96 3134 -3735 507 2244
1783 2244 -161 -2209 1629 2758 -3485 827 1957 1055 -2615 2306 1938 -2699 598 977 600 -2532
1799 -2532 2652 -535 -1414 1008 294 -977 -1464 3498 -1789 -794 1300 1166 -2497 123 3917 -2642
1815 -2642 -637 744 1504 -3596 712 2928 -2780 -1385 1009 1895 -3799 1303 1407 -1240 -930 894
1831 894 649 -3043 2324 -97 -766 -473 1388 -1218 -2354 2940 -1522 -1240 -751 2138 -2388 -677
1847 -677 2922 -1484 -1407 493 3208 -2971 -32 2211 140 -1380 564 3364 -2708 121 785 530
1863 530 -1394 749 828 -2054 1748 -2 435 -1399 2169 -237 -1282 2150 -98 -592 -893 3284
1879 3284 -1919 -1456 1521 455 -1685 -1070 3356 -2586 -1258 569 1792 -1951 -764 2549 -1524
1894 -1524 -349 -44 1909 -2280 411 1352 -1361 -152 -13 1084 -2400 1557 -13 -1358 -143 846
1910 846 -110 -2320 2742 -1030 -970 -75 1900 -1048 -2067 2313 -572 -785 -661 2733 -1692 -942 1763
1927 1763 -562 -324 -449 2310 -1702 324 939 122 -613 519 1454 -2358 1920 676 -37 -623 2195
1944 2195 152 -2478 1964 663 -821 -1792 3107 -334 -2168 1289 842 -541 -1853 2913 -958
1959 -958 -1423 247 1106 -663 -1620 2286 -1723 170 -96 825 -1071 -431 993 -1724 1354 -142 -169
1976 -169 -2252 1606 259 -2186 675 273 -235 -2349 2463 -188 -1720 -184 1344 -103 -1959 2128
1992 2128 -558 -534 -186 2202 -622 -1275 1655 -535 465 -429 1724 -1365 727 1160 -661 329 6
2009 6 1374 -1912 1543 1122 -628 -898 950 1333 -2018 1601 99 -154 -1340 1742 422 -2218 854
2026 854 383 617 -1965 1328 -625 -951 257 42 178 -1432 1394 -1068 735 389 -229 -673 177
2043 177 1598 -2057 685 192 75 -1580 1172 1262 -2587 190 665 1068 -2546 1214 430 -1581 -145
2060 -145 549 796 -2719 1198 69 107 -523 429 101 -1101 1834 -737 206 -317 1228 -1054 -64 1859
2078 1859 -1039 215 70 1630 -1888 648 1308 -949 -252 314 1946 -2414 720 649 161 -726 496
2095 496 1079 -1684 1255 -156 465 -999 716 -86 -753 1119 -897 266 -789 1723 -1106 89
2111 89 1146 -630 -154 -109 1784 -1998 -3 726 34 -1426 118 1732 -2062 -104 28 1062 -2197
2128 -2197 -73 888 -904 37 -458 1004 -1784 634 -234 -25 268 -136 281 -1257 1387 -918 30
2145 30 145 341 -490 -547 2011 -884 6 -6 1879 -795 -352 1576 -433 -16 -369 1896 -1264 406
2163 406 195 42 -24 -456 1399 -1321 1032 -352 505 -174 454 206 -1307 1681 -567 25 -549 1627
2181 1627 -457 -1113 1450 -155 -241 -1184 2106 -1163 -754 329 277 -469 -1142 1724 -1319 -197 -498
2198 -498 834 -671 -789 948 -986 320 -735 968 -1172 239 54 -758 882 -595 474 -1333
2214 -1333 1608 -488 -699 363 543 72 -1288 1894 -663 -268 -40 1257 -313 -993 1308 -503
2230 -503 187 -372 1540 -585 48 491 -81 570 -352 1036 -859 919 34 -308 -384 253 680 -1264
2248 -1264 1231 19 100 -842 1102 250 -1439 846 -245 301 -1663 1289 87 -1134 117 261
2264 261 367 -1485 1094 -696 -37 -454 54 198 -878 850 -843 811 -730 105 -634 199 606
2281 606 -1251 685 -45 421 -1530 810 128 -1325 217 259 570 -1967 1019 118 15 -279 884
2298 884 596 -1338 1082 -59 613 -546 952 -168 -468 822 -582 505 -481 806 -920 155
2314 155 504 -428 374 158 1302 -1438 601 399 -8 -120 629 941 -1482 389 -59 501 -1308 493
2332 493 484 -1085 366 -408 726 -1266 844 -345 -139 95 -351 417 -1005 949 -1102 215 105
2349 105 -89 -507 -293 834 -1344 216 217 465 -1311 377 990 -921 -24 10 1200 -1638 459 689
2367 689 207 -456 -203 651 -1432 768 -257 362 -390 93 49 -741 1234 -341 360 -569 889 -581
2385 -581 -154 1137 -420 -159 -317 1338 -1158 -74 761 78 -412 -345 1278 -1352 266 -273 640 -610
2403 -610 -80 632 -676 600 -343 932 -662 591 208 -312 456 -591 -115 -1099 1171 -853 -544
2420 -544 355 -259 -348 -691 1667 -1123 -542 -58 614 -885 -734 1212 -644 -134 -469 889 -833 -317
2438 -317 812 -319 9 -542 1242 -813 504 96 -160 254 -149 252 -918 1459 -584 231 108
2455 108 829 120 -919 1251 -168 392 -475 1466 -506 -590 786 30 154 -944 1412 -620 -103
2472 -103 73 368 13 -269 1202 -822 335 -566 168 -761 331 283 -1034 761 -343 36 -1101 1086
2490 1086 97 -1334 278 116 -185 -1367 1182 -444 -537 -7 569 -96 -1177 1126 -532 -45 -486
2507 -486 960 -148 -447 487 -491 448 -520 582 -779 528 468 -827 317 133 419 -1360 1154
2524 1154 292 -347 -313 871 289 -1313 1210 217 22 -541 1089 -26 -1310 563 206 517 -783
2541 -783 724 -407 -283 456 113 418 -434 609 -858 670 415 43 -465 115 915 -1357 475 26
2559 26 -41 -1079 729 393 -1430 67 235 542 -1214 860 75 -693 -29 488 339 -1205 666 -384
2577 -384 -49 -427 -77 5 -335 1162 -472 -16 -296 401 -701 278 1220 -893 -322 60 926 -1504 375
2596 375 767 -599 -259 135 1088 -1380 756 373 71 -403 359 551 -812 1204 8 489 -411 615
2614 615 -340 -278 1030 -257 -137 -398 1057 -887 373 788 -485 -290 -19 1272 -1470 85 681
2631 681 355 -728 265 874 -1408 41 302 447 -1281 245 423 -655 192 -184 28 -1145 774
2648 774 -415 -433 393 -175 -301 -399 1148 -1041 -525 415 264 -661 -272 1273 -990 -401 135 957 -1008
2667 -1008 -188 997 -481 1 -126 907 -1018 389 617 -226 -121 163 636 -512 1067 -46 15
2684 15 -149 410 226 -470 993 -612 12 -51 903 -491 -538 1006 -287 -249 -586 1294 -1068 -185 520
2703 520 214 -559 -375 1131 -863 83 70 248 -642 -120 618 -942 689 -93 -18 -723 844 -167 -1088
2722 -1088 617 -54 -166 -1069 1441 -266 -946 448 621 -795 -949 1359 -713 -566 -54 677 -674
2739 -674 -414 1128 -457 54 -307 741 -736 414 516 -561 405 -435 404 -1074 1191 270 -442
2756 -442 176 630 157 -1055 1354 108 -598 33 1193 -191 -836 1248 -51 -10 -419 1227 -519
2773 -519 -637 645 -62 13 -451 861 -785 56 86 -297 -422 -47 707 -962 318 -5 -198 -518 722
2792 722 71 -1499 164 73 125 -755 897 -257 -829 338 385 109 -932 968 -464 -388 378 233 135
2811 135 -600 1122 -565 208 267 451 -476 206 1029 -952 75 89 252 -972 883 496 -768 -13
2829 -13 786 479 -1411 985 541 -407 -118 539 532 -1259 861 340 85 -705 709 -130 -411 754 -212
2848 -212 82 -260 1068 -892 69 784 -406 -258 -260 770 -1314 123 504 -424 -676 566 650 -1261
2866 -1261 299 458 223 -927 570 464 -980 660 358 222 -1118 530 -9 -575 542 183 -163
2883 -163 -651 678 -861 -201 573 -81 -569 -319 1216 -919 -20 555 426 -990 322 972 -719 -127
2901 -127 352 751 -1336 382 553 -590 -130 243 331 -708 1021 139 61 -26 184 195 -412 1008 -322
2920 -322 -160 -119 609 -323 -259 865 -686 -327 -139 723 -1063 -157 747 -259 -585 -213 733 -1132 163
2939 163 41 -9 -616 89 753 -943 432 -239 -200 -278 412 -178 -975 455 -322 67 -212 973 -698
2958 -698 -505 579 -59 -553 -382 1336 -1011 -407 443 542 -578 -201 1233 -791 54 181 671 -736
2976 -736 51 758 -424 -115 199 394 -1112 718 93 -314 338 296 115 -584 1175 -227 -330 146 618
2995 618 -650 -596 1069 -718 -119 -35 1056 -994 -139 1009 -276 -190 -305 790 -937 -37 461 -178
3013 -178 6 150 554 -977 391 51 137 -183 261 -16 -1147 801 -44 -113 -722 661 -418 -885 540
3032 540 148 -20 -648 828 -510 -450 520 485 -289 -534 1299 -500 14 -23 85 -279 -21 527 -793
3051 -793 479 263 316 -722 587 480 -614 466 293 262 -741 1200 136 -583 117 786 -177 -985
3069 -985 914 16 -151 -363 564 -247 -654 623 -91 -91 -460 537 -457 -107 451 -291 -19 -172 244 -989
3089 -989 583 186 -374 -225 349 -52 -1208 1143 58 -558 -317 548 70 -1157 586 158 -120 -786
3107 -786 786 78 -576 567 -64 -40 -592 860 -737 8 451 -7 -249 -337 831 -776 215 364 57
3126 57 -569 367 710 -1082 417 496 73 -828 796 281 -442 122 199 270 -1139 926 33 -419 -118 258
3146 258 -105 -656 1074 -823 75 -59 165 -418 -247 655 -688 74 114 586 -794 164 673 -718 -167
3165 -167 284 573 -1228 156 346 -372 -427 183 594 -1077 391 -208 2 -651 529 -71 -433 505 -240
3184 -240 263 -356 640 -392 -26 759 -144 -113 -286 700 -808 108 662 2 -670 69 1054 -795 90
3203 90 676 327 -607 374 765 -739 458 18 210 -758 412 154 -284 244 -288 297 -547 1026 -289
3222 -289 -112 280 172 -449 -267 1158 -663 -335 80 665 -760 -205 599 -686 -306 -28 582 -693
3240 -693 130 277 -301 -126 -180 693 -862 346 89 -226 -67 24 16 -812 826 -292 -8 86 381 -447
3260 -447 -401 1068 -126 -393 -245 990 -661 -174 590 -68 -48 30 806 -907 84 63 313 -409 -171 633
3280 633 -662 581 -131 91 -591 217 223 -664 587 113 110 -639 869 -96 -518 458 297 -71 -444 1025
3300 1025 -240 -583 -177 417 -253 -425 658 -583 -17 -211 382 -383 -241 349 -275 37 -19 179 -778
3319 -778 392 226 -346 -4 42 115 -792 721 46 -127 -52 246 -88 -584 856 -82 -66 -269 824 -277
3339 -277 -438 693 31 -54 -376 827 -313 -205 357 -106 158 -205 767 -590 130 -115 -3 -203 98
3358 98 268 -750 481 207 142 -742 755 110 -567 226 346 140 -801 603 -55 -352 -8 -126 112
3377 112 -483 423 -493 27 -177 211 -238 -379 446 -383 171 -13 502 -645 257 228 -710 259 -50 288
3397 288 -931 574 247 -459 -78 425 282 -780 671 90 -86 -170 291 -202 -759 343 37 60 -343
3416 -343 337 -258 -185 262 -153 -58 -169 503 -627 385 147 -130 -109 292 340 -960 100 275 150 -621
3436 -621 151 370 -495 404 -32 229 -813 356 323 -303 99 83 207 -545 430 -346 -90 115 45 -282
3456 -282 -267 707 -407 -71 -5 392 -422 -101 545 -791 -10 175 246 -696 -53 507 -204 158 -51 195
3476 195 -540 565 42 126 -125 -6 180 -376 477 -207 154 -25 324 165 -266 525 -289 -92 118 607
3496 607 -518 -239 582 -151 -86 -277 761 -431 46 429 233 -318 -33 671 -387 136 259 291 -465
3515 -465 82 217 -566 309 -98 193 -157 446 -493 -164 214 -276 -57 -323 667 -768 -137 190 308 -451
3535 -451 -349 613 -506 -319 134 591 -402 3 342 -453 70 -244 280 -443 -126 248 -133 112 178 38
3555 38 -756 316 -236 -121 73 228 -82 -267 671 -170 347 -383 575 -53 -257 740 -124 -204 -303 494 -556
3576 -556 -204 231 141 -90 37 539 -371 92 79 -123 153 27 221 -408 346 -29 -27 -275 483 -78 -818
3597 -818 313 84 -160 -601 583 -309 -455 168 239 -29 -796 485 -326 -185 -229 146 -196 -184 280 -508
3617 -508 226 -388 142 -189 -109 86 -86 53 -295 180 -566 250 207 -133 296 -29 146 -835 768 244
3637 244 -261 -63 397 113 -655 605 -61 203 -390 273 -220 -409 223 -47 424 -489 522 -229 314
3656 314 -31 -89 155 167 349 -640 358 -20 181 -4 502 56 -466 504 223 39 -811 172 104 -344 247
3677 247 -23 -80 -500 559 -236 -178 2 -217 6 -421 352 -494 124 -246 -16 -177 -136 279 -582 470
3697 470 -255 220 -381 201 141 -564 308 -21 127 -765 607 101 -178 29 293 383 -367 218 -78 88
3717 88 -44 124 202 -71 384 -122 296 -297 301 -107 75 424 -148 310 42 449 -221 156 256 129 -241
3738 -241 -198 509 -391 217 -33 217 -341 -2 273 -586 40 -98 182 -125 83 83 -2 221 -197 213 -264
3759 -264 536 -420 -198 138 -18 -38 -245 422 -582 109 143 -100 -357 -211 469 -324 3 24 75 -498 175
3780 175 293 -178 -38 -41 303 -504 304 168 145 9 224 201 -257 235 141 191 90 390 -121 -221 501 -229
3802 -229 117 189 446 -405 -155 593 -54 189 -173 428 -433 -140 112 143 214 -171 395 -425 161 -209 139
3823 139 -135 91 209 -501 361 -313 -10 -346 158 -72 -365 167 -191 -123 -259 486 -232 -55 119 44 103
3844 103 -430 410 -491 -154 -319 217 -158 -85 285 -222 481 -139 83 -282 146 14 -285 83 37 394 -364
3865 -364 339 -133 -52 124 246 102 -474 489 -28 12 187 237 -36 -223 569 79 300 -283 510 -319 -241
3886 -241 112 -64 -165 -169 399 -381 131 0 -27 -147 -36 179 -355 197 62 143 -40 199 56 -424 118
3907 118 -121 103 -520 315 115 -141 33 175 234 -470 526 -284 -5 9 -57 -126 -310 203 -442 162 -138
3928 -138 -42 -434 51 273 -348 202 -7 200 -515 74 121 -338 -138 191 247 -552 385 -19 -22 -187 318 181
3950 181 -491 336 -16 186 -169 220 -209 -100 338 -99 253 54 471 -367 -12 170 -325 -53 -174 530
3970 530 -546 218 320 37 -393 61 278 -426 32 -12 306 -563 229 471 -435 -104 -51 307 -610 178
3990 178 116 -121 -158 -138 -102 -170 475 -145 43 -68 73 -257 -161 313 -518 -130 86 -83 -292 -35 384 -90
4012 -90 -15 108 438 -500 27 177 51 88 -80 97 -420 477 -34 248 317 160 229 -283 562 -219 -25 4
4034 4 209 -269 -49 395 -21 90 -50 575 -477 -187 163 -88 -240 -164 513 -476 -216 -91 232 -304 -49
4055 -49 276 -280 129 96 213 -318 274 -248 -200 107 -296 -29 -513 402 -408 -317 -4 39 -96 -382 504 -298
4077 -298 46 192 549 -349 -195 391 -575 -86 -49 600 -286 -132 164 -61 87 -342 306 -290 -146 -192 -8
4098 -8 136 -70 107 -248 383 -49 -57 -1 99 -16 -357 706 -19 208 -377 269 -153 -303 376 74 58 -513
4120 -513 566 -183 -35 186 106 -174 -196 125 -459 272 -274 -105 -448 -11 -108 -192 200 123 11 -402 615
4141 615 63 -226 307 285 -12 -240 430 92 13 -3 215 123 -466 378 -28 14 -99 459 -130 -167 365 -367
4163 -367 297 -182 206 -237 294 448 -454 72 -4 333 -517 182 203 -178 -294 353 228 -289 506 171 -104
4184 -104 -417 204 124 -333 291 -110 -175 -46 393 -126 -173 156 -166 -49 -65 293 -289 251 149 129 -91 -15
4206 -15 439 -514 206 -39 -111 -210 158 336 -500 313 -93 215 -266 233 42 -155 -82 -52 126 23 512 -150
4228 -150 -2 95 -217 -114 -252 408 -535 20 0 96 -294 57 391 -377 391 -79 400 -296 192 -41 -123
4249 -123 174 275 204 -605 305 -4 -147 -256 57 223 -273 248 -258 127 -240 197 166 -206 443 -494 185
4270 185 -227 566 -414 54 454 182 -165 151 267 -671 1 301 118 -321 162 356 -217 344 6 -31
4290 -31 -383 128 230 -90 57 -140 208 -408 170 -234 -132 68 40 -44 -66 356 -323 42 175 -92 -172 -168
4312 -168 547 -528 -42 -16 391 -343 126 242 -36 114 -83 402 3 -13 -16 47 -191 -17 230 -214 237
4333 237 -180 -145 266 77 -45 -177 385 -143 -15 7 202 -368 -338 407 -6 -169 -300 403 -408 23 -72
4354 -72 90 -198 -41 281 -337 69 -83 78 -165 164 288 -505 255 -75 33 -176 91 -110 -210 245
4374 245 -209 54 -421 252 -105 -86 388 106 40 -191 340 -185 83 107 163 109 -188 518 -21 25 -34 293
4396 293 89 45 224 -253 331 149 160 -423 133 108 -404 62 355 25 -354 297 118 -269 -61 259 166
4417 166 -337 384 182 -17 -437 377 -51 -52 297 -146 -96 79 441 -117 81 152 -222 48 52 -70 -345 194
4439 194 76 53 -46 205 226 -560 423 8 -95 -181 476 57 -335 107 265 147 -257 487 -263 5 -188
4460 -188 -15 11 -144 367 -116 236 63 38 -41 16 365 -351 171 95 -149 -441 134 348 -590 -17 54 49 -368
4483 -368 136 148 -113 100 178 -1 -183 218 -153 76 -138 -40 27 90 38 -271 200 -95 147 -76 -48 341
4505 341 -426 243 -30 264 -417 36 90 -559 -322 15 341 -495 3 197 93 -327 -4 210 -235 102
4525 102 111 294 -184 159 -89 -105 -88 -180 -11 -302 365 -395 -59 286 -144 40 -168 273 -335 -21 410 246
4547 246 -123 231 357 -299 11 85 -85 -403 143 254 -225 -94 100 -167 -350 205 27 10 146 18 156
4568 156 44 628 -55 28 -159 122 -246 -1 243 -307 -221 -441 -18 -404 -293 268 -137 -308 11 204 -617
4589 -617 266 -34 -80 -65 -249 142 -205 160 -91 -306 -248 90 -126 -226 326 -139 140 -207 511 -9 -55
4610 -55 328 -59 -58 -126 507 -48 -16 56 181 -196 -373 537 -196 -89 -313 84 -90 134 -52 -240 212 24
4632 24 53 -192 245 81 -142 106 -128 -156 -297 440 -22 -344 -99 256 175 -96 552 18 33 -183 269 -258
4654 -258 -57 437 49 -88 -290 265 -299 83 183 188 -219 -91 47 -282 439 40 -197 -105 38 112 -510
4675 -510 364 241 60 25 219 -95 -360 93 230 212 -253 322 -217 -17 222 327 14 -248 185 -130 -108
4696 -108 79 -13 -12 -66 160 -197 255 -182 74 -171 205 84 -287 282 190 98 -246 158 -82 -136 31 75 67
4719 67 -473 304 -4 -277 57 -36 -258 -174 243 -246 36 54 164 -226 116 -77 -253 78 113 -13 -567 70
4741 70 -6 -182 -85 106 157 -323 281 34 125 -46 297 206 -306 43 63 151 -456 -45 -52 -247 143 -39 6 -299
4765 -299 223 -263 -12 82 -236 107 -98 451 4 45 236 93 -283 97 328 -385 28 234 187 -304 43
4786 43 67 -136 49 272 -165 -367 212 -48 -44 -111 -83 27 -254 259 -87 -78 -23 209 -156 -298 240 -381 -32
4809 -32 126 235 -303 129 184 -266 15 55 180 -289 128 82 -68 -58 -80 308 -545 77 -208 -149 57 -218
4831 -218 -72 -139 339 11 159 48 257 -164 -130 240 -120 -29 -175 432 -230 -100 129 122 131 17 362 -111
4853 -111 -2 71 154 -249 92 57 -103 75 -109 17 -213 -93 44 -251 130 -94 151 -258 30 93 -180
4874 -180 178 212 -231 -251 304 22 79 -132 146 35 -172 120 139 38 34 347 -141 -32 220 59 38 -234
4896 -234 330 -354 -101 -46 111 -440 49 159 -129 -175 -70 72 -142 199 11 4 312 208 -7 -365 42
4917 42 -10 -98 283 93 -43 -59 238 -67 -136 -11 177 -32 -32 132 -187 274 -189 -204 -159 60 85 -249 315
4940 315 -79 -9 -55 213 7 -54 191 61 -59 -15 219 -73 -136 13 205 80 -479 203 -78 -23 -36 105
4962 105 -117 -186 121 -37 70 -37 184 -295 -62 -98 -334 -76 135 179 -97 280 65 -120 138 -27 -9
4983 -9 -201 116 -191 -35 -128 262 218 -368 110 46 146 -313 151 83 4 -52 -240 96 -8 254 -125 190 130
5006 130 -59 -137 -182 341 -119 110 108 61 -391 99 -76 -203 163 -64 -10 -283 50 251 -58 77 33 117 -324
5029 -324 125 132 13 -248 -14 52 -235 385 -58 16 -19 -50 77 50 125 -28 -55 38 54 -436 -60 279 -249 -246
5053 -246 -7 147 -301 221 135 148 -197 -6 195 -175 145 -84 -8 -110 -13 10 39 183 -273 11 -59 140
5075 140 -147 10 45 -4 -33 329 342 -508 58 73 -246 -47 -31 130 -61 -108 -12 219 27 -48 202 -77 73
5098 73 112 273 20 265 -300 -21 101 -44 -107 -331 267 -262 -47 -66 50 -49 -71 345 -218 -96 -388 171
5120 171 -45 -166 344 -217 151 107 108 -215 -218 129 -32 -41 -113 500 -151 328 -144 44 36 141 58 -75 174 -102
5144 -102 26 -100 316 -39 -225 175 -166 121 -252 277 -46 74 52 -109 -63 -185 257 -399 114 -93 108
5165 108 -55 -37 150 -207 15 -329 256 -200 170 48 -125 232 -55 -49 -237 137 -4 -40 -36 -63 -240 -422
5187 -422 257 -195 28 -224 144 -193 -93 159 -1 16 -64 62 -54 46 112 27 222 -157 89 -350 316
5208 316 -101 30 62 153 143 -373 290 -244 -34 -113 51 459 -103 179 4 -91 -363 -114 -37 -11 528 -87
5230 -87 93 -277 275 -155 204 80 34 -95 -171 296 -251 220 164 -51 -182 -12 64 -374 145 94 76 -143
5252 -143 273 58 -323 90 -116 79 -251 94 2 -240 -92 76 -133 -10 163 -270 245 5 136 -135
5272 -135 -141 -162 -269 30 -172 135 -94 134 191 -240 207 69 221 -290 2 57 32 -44 148 71 -373 239 -34
5295 -34 250 -120 148 -94 -290 432 53 175 -294 -8 53 114 -87 172 -20 -39 213 -314 126 -121 22
5316 22 -59 -60 236 -406 92 74 262 -91 167 13 -321 -170 -102 233 -374 -14 16 334 71 -11 -10 -204 92
5339 92 -85 90 189 -68 101 -32 367 -184 -13 -211 -86 -270 -56 363 -180 26 163 148 -332 46 220
5360 220 27 -6 -228 -45 -204 -62 -82 52 250 -193 151 -103 48 -12 79 -59 -247 129 -396 55 -68
5381 -68 -15 -120 180 -171 -54 121 -34 54 38 51 -176 -208 88 165 -143 -82 205 -350 -185 6 184 -26 104
5404 104 -180 -201 -232 39 271 -138 67 -118 -135 249 235 81 -48 196 -55 -207 -26 308 40 -238 123
5425 123 -96 -46 48 109 -110 -232 87 -116 3 -13 96 -229 104 112 311 154 -25 191 -310 204 -50 50
5447 50 3 -16 95 -266 84 -56 -82 -193 363 339 -13 313 134 10 -152 159 -157 -127 -17 -5 -120 -44 246
5470 246 -116 -133 -88 170 263 -74 200 -269 275 -89 -81 125 337 201 -199 -91 -49 -127 -298 147 -263 -122
5492 -122 -158 81 3 -223 404 -214 35 -165 79 55 -6 168 -169 -51 -45 18 -295 7 349 14 231 -68
5514 -68 135 -391 329 173 53 45 82 -23 -334 -28 -23 -130 -135 238 52 -185 143 -143 -9 -304 167 56 -226
5537 -226 44 214 -10 -203 178 -95 8 13 -51 82 -120 234 10 313 39 -1 -30 -59 389 -446 111 -43
5559 -43 102 -231 -18 71 -218 -46 61 -107 -129 226 90 141 -97 226 131 33 95 -270 59 -114 68 21 -54
5582 -54 306 -10 3 -274 147 -165 -3 305 -60 70 -93 60 5 349 -20 187 180 -75 31 -273 404 -109
5604 -109 93 29 224 -245 -46 113 -114 69 18 371 -184 103 307 -92 -56 5 207 -107 127 -240 -253 -152
5626 -152 -138 313 -67 205 -53 -127 -216 -178 112 -110 103 -2 126 -187 -32 -239 -100 -37 -113 102 -185 159
5648 159 -330 -281 198 35 109 -18 273 -351 -91 252 246 26 -178 95 -171 -77 -95 199 90 -277 264 61
5670 61 233 -304 260 41 99 -27 -30 -108 -152 38 -237 154 -247 96 -143 55 -133 -221 67 327 11 -399
5692 -399 362 -195 20 53 -86 -171 -89 303 -181 -100 66 79 7 21 -18 -197 -116 -89 -82 -323 161 85 76 286 -209
5717 -209 149 -81 112 96 -69 174 -24 235 -67 219 -61 -66 28 74 119 -187 138 -54 34 -38 4 383 108
5740 108 153 -163 -109 -66 160 -188 -46 85 -35 132 -13 -122 -262 55 112 -176 -103 -156 3 -403 -1 119
5762 119 183 65 136 -74 -414 137 100 2 -144 3 107 42 -105 69 -34 4 117 -225 304 36 -139 188
5784 188 -23 130 -406 -16 112 -83 -97 205 -84 -125 224 -93 -53 -333 54 -40 35 51 -46 187 -16 376
5806 376 -16 -117 39 -126 175 -24 305 23 35 -97 38 -99 282 179 -221 62 76 80 -252 60 139 -93
5828 -93 -142 95 314 -147 235 68 312 -87 -94 -52 -117 14 19 20 -243 21 -102 -133 23 -159 63 -1 164 -197
5852 -197 165 -98 28 10 -101 9 -343 118 97 287 169 35 -8 -106 168 44 47 -52 61 27 3 12 245 -155
5876 -155 -84 58 -103 -106 -3 39 65 87 342 -70 132 83 124 -103 -72 58 14 110 -15 370 -135 -128 149 -267
5900 -267 77 85 -61 -226 505 133 -116 133 -98 -82 -201 158 55 230 116 108 -24 -11 231 73 155 -367
5922 -367 116 -187 -121 274 -83 71 -223 364 -154 30 26 -66 92 -380 299 -277 -155 -182 43 -135 187 131
5944 131 -124 101 -273 148 -9 128 -47 -236 48 -28 -103 56 347 -36 -361 355 -112 -197 -224 375 71
5965 71 86 -158 -109 -12 -56 235 8 -9 -114 -16 -1 -316 90 -41 322 -231 -98 -149 71 2 -43 -191 -477 18
5989 18 -198 260 -101 134 33 233 87 -206 47 -118 -13 -167 173 -19 -36 106 112 -64 -175 407 -25
6010 -25 5 30 -153 47 95 76 -152 -108 113 114 -113 149 -92 -157 158 22 60 -230 251 159 -320 64 -40 -66
6034 -66 -87 140 85 154 27 -80 -82 -84 73 -19 86 47 70 154 51 206 -3 192 -46 282 -212 118 85 -26
6058 -26 -87 142 -4 -149 216 -80 -42 -72 -17 69 -244 233 -54 -189 31 286 -113 -147 -15 -5 225 -129 376
6081 376 -141 57 164 5 324 -335 452 -334 11 -241 -247 -34 -68 269 -340 -9 30 -122 -440 194 47
6102 47 -26 193 -45 78 -72 -95 70 -121 234 118 -104 49 -37 72 75 -116 -296 24 -293 127 -46 31
6124 31 54 26 -138 -145 234 -25 -51 52 -179 -52 97 205 -67 81 -222 104 -338 -95 97 -57 -82 254
6146 254 151 -25 359 -39 93 75 64 -214 90 189 138 -262 -147 56 -185 -242 171 -108 -102 59 301 -113
6168 -113 186 1 -54 -56 -53 -10 -113 192 126 -108 -186 -57 158 -136 123 55 21 -136 258 -67 -20 368 -73 -87
6192 -87 -84 177 -211 53 50 161 -255 -38 150 -220 87 65 287 23 -77 189 -214 101 -271 166 -220 -50
6214 -50 -55 -386 -158 140 103 -60 162 187 -127 -13 -83 -5 15 214 -48 264 -249 135 -117 -109 180 -87 -60 -93
6238 -93 168 -160 -87 212 180 119 -297 310 55 -5 -53 -48 146 150 -31 -215 164 57 -43 -4 -93 11 -241 314
6262 314 -59 -8 -1 100 -72 191 101 -12 -10 -85 348 -27 154 -130 148 -128 -61 -83 11 221 -93 193 119 186
6286 186 -174 -171 214 -1 224 -323 111 -68 -25 -94 -82 -191 -231 196 13 30 -90 436 -439 -239 239 116
6308 116 93 152 -51 -52 -93 72 -184 -38 -125 -82 -198 -31 2 -79 247 -28 183 -10 160 81 -140 41 142
6331 142 157 -321 -53 68 228 -94 -58 -119 -20 75 -173 -5 99 67 62 9 -127 -37 87 202 -31 6 -84 97
6355 97 -226 40 67 287 -194 274 -69 -93 -226 179 -8 -48 4 -39 207 -177 106 38 -3 115 80 83 65 159
6379 159 147 66 -16 263 -229 -233 43 -144 90 -26 89 -55 -28 22 -1 183 167 22 -105 -39 72 27 -151 -32
6403 -32 288 11 -39 28 62 -79 -115 -66 100 123 162 -125 -145 54 -361 -10 105 46 41 -125 171 -195 53 183
6427 183 21 -155 -11 40 -7 74 -152 179 -81 -47 58 -109 86 0 214 -383 -59 178 -91 158 -4 16
6449 16 18 90 -64 123 138 177 -183 -102 -50 -103 93 -102 -65 -10 20 227 -133 206 116 30 -30 -231 -62 -134 91
6474 91 -234 160 -254 57 150 208 -284 -27 109 -192 18 43 -109 -12 73 -107 -84 124 2 249 -246 93
6496 93 -53 -156 201 -190 74 -162 284 -140 -189 -162 131 -57 -92 184 37 72 -174 232 31 93 12 -49 113
6519 113 -340 166 -5 41 -93 -142 168 -108 146 -148 281 9 -37 122 -191 -82 -30 301 -203 274 -23
6540 -23 5 55 103 155 -11 8 -289 95 -85 -202 348 -67 223 16 -40 -72 354 -58 -93 24 -34 166 -29
6563 -29 503 223 20 -79 160 55 -166 40 -185 275 -86 66 -83 -5 -114 -395 95 -128 3 -23 69 -6
6585 -6 253 -177 -29 245 -127 -40 179 389 -5 -21 -69 -216 66 72 108 -311 254 82 -102 -100 177 132 -131 440
6609 440 -36 189 -15 148 -106 -11 111 64 204 204 113 -119 -67 92 84 42 81 -254 -195 228 70 36 -109 12
6633 12 266 -101 84 102 -83 -297 140 234 -136 -236 0 102 -297 -110 125 88 38 -57 -33 208 119 -127 97
6656 97 2 -45 -64 -66 -68 -153 84 261 -40 -93 65 190 -264 4 -16 -101 -253 -199 -119 -48 112 66 89 -362 -9 -79
6682 -79 156 -117 20 -150 -112 46 -36 -284 132 -75 -14 -208 139 -122 -22 -124 120 -99 29 165 16
6703 16 -53 -260 269 -232 -162 -44 44 27 -2 -12 10 49 -57 267 93 -70 -47 -103 122 28 -71 -117 15 -149 31
6728 31 72 49 28 -113 220 -66 48 -11 -72 -229 -57 246 12 14 -114 78 90 -97 -142 35 125 -385 139 -247
6752 -247 184 -174 -63 143 -132 -34 -27 109 15 -98 -112 136 -181 -81 303 -60 -5 76 -46 -33 18 117 -196
6775 -196 199 -87 437 40 32 176 -226 -79 203 93 -88 139 -171 118 -81 -162 132 -299 81 -13 72 -81
6797 -81 -34 -99 -68 194 -102 43 2 160 -285 -144 63 207 200 -88 307 -12 -78 156 -110 45 -30 -13 -154
6820 -154 -219 -111 76 -39 350 36 -62 -52 56 123 -99 -131 -198 -98 283 -215 204 -12 167 89 47 -96 168
6843 168 253 97 248 -185 -108 -194 90 -26 134 73 -8 96 -81 88 -134 -23 77 46 94 -67 28 -39 250
6866 250 -127 237 -11 93 177 -283 75 -5 -11 -111 -24 -53 -3 120 285 174 -128 7 -193 45 -101 -108 -160
6889 -160 32 108 -180 -73 138 -26 -4 152 -104 -177 23 -47 259 -66 -95 -119 -125 -132 -28 25 -288 144 -12 104
6913 104 -227 408 81 -262 -200 -123 138 18 -116 -149 -143 -67 -94 177 -334 60 211 -212 102 -173 -135 274 78
6936 78 -47 77 24 132 45 153 8 64 388 -207 307 -207 -7 71 -62 227 -208 -131 -134 -150 148 -60 87
6959 87 -222 -179 -200 -55 218 -341 5 -50 -368 5 51 -53 -156 -255 68 -105 -168 84 53 103 27 -313 -225 288
6983 288 232 176 66 -237 153 113 -1 -419 -174 -34 -300 209 -232 200 -128 194 9 283 30 -60 291
7004 291 64 26 -112 157 -230 29 127 -12 -51 88 301 -140 77 -171 -97 38 -280 38 6 123 -160 97
7026 97 -23 -38 61 -148 96 114 260 -74 67 -7 203 78 -26 45 70 -18 113 17 64 103 102 81 -134 -240 -196
7051 -196 -159 178 83 -97 252 -122 2 -164 63 -89 312 -181 -171 54 44 39 -43 473 -104 -245 -220 217 46
7074 46 -190 325 -178 78 -6 175 -9 -11 113 -32 178 -122 -65 -277 -49 332 -233 -33 -213 86 -45 59
7096 59 142 -32 247 228 -70 -187 194 154 37 -294 3 -342 -386 -58 -297 -82 65 368 -94 64 -60 -43
7118 -43 82 -49 -19 -222 -104 -13 51 -201 59 25 78 235 -109 -30 -146 -212 59 -298 -42 52 347 -95 192
7141 192 129 -158 -17 -136 -129 -101 112 97 -2 -18 -80 -150 11 -32 26 129 -18 -4 52 60 5 -271 35 107 227 -182
7167 -182 266 -82 -47 -201 64 117 -407 105 -41 28 165 262 122 -179 -20 -73 135 -379 30 128 84 45 -56
7190 -56 -134 -68 -30 -191 74 28 164 -16 -58 184 -155 197 158 -148 -148 -67 -163 -129 8 -157 185 -50 253 -48
7214 -48 103 140 -133 10 -22 69 123 -104 -33 -129 71 30 103 -191 24 -50 15 12 211 158 -268 -39 -4 283 84
7239 84 -122 -37 116 162 -48 279 -176 -150 226 74 105 96 354 20 -79 232 74 -79 -186 208 98 114 -100
7262 -100 28 -82 -110 -54 -37 -90 3 0 -245 361 -151 140 179 -183 -206 -22 372 14 -53 38 42 -387 -44 384
7286 384 -200 61 -57 259 7 -3 95 -64 -58 -139 -99 106 38 -112 224 -107 344 190 253 339 161 128 -205
7309 -205 -62 123 -60 123 -199 72 -53 -58 -104 -102 -61 -98 262 -20 29 -62 141 135 188 199 -251 91 -6 72 -229
7334 -229 116 -69 -27 -41 15 -129 119 -133 -153 147 -104 -57 -33 78 234 -101 -127 5 -48 -164 -7 77 -111
7357 -111 -25 -10 173 -183 364 -168 68 271 1 -39 -22 128 -221 171 27 -67 -48 -169 55 -156 218 10
7379 10 -65 -53 164 -115 -157 125 -27 166 46 145 -169 -88 100 189 -34 -46 248 -33 81 -25 -19 136 -97
7402 -97 67 -143 35 -22 185 -432 110 120 -358 324 -45 -71 154 81 143 -239 115 5 110 136 192 161 -52
7425 -52 -19 13 152 -40 223 -415 -2 -28 -78 20 162 225 -107 236 73 128 -282 128 143 -41 24 144 -158
7448 -158 -151 -44 -49 -10 129 141 239 -199 -18 150 173 80 -60 33 44 68 -155 -34 17 18 -195 159 247 -147 -153 161
7474 161 118 -94 63 128 -152 281 98 119 -306 -54 -91 -38 -81 -169 290 -214 -142 -120 -73 -6 -59 48 -40 208
7498 208 -15 -201 -162 273 -159 2 99 -187 135 -82 -157 -497 -83 -97 147 92 59 116 -191 -117 -270 -109 -142
7521 -142 125 20 -66 449 73 90 -36 58 -352 -98 31 -98 81 -118 4 6 37 168 -175 -4 -258 260
7543 260 -244 82 -350 -41 -144 -48 59 -177 112 -213 210 -252 -306 149 56 165 75 -212 -51 220 44
7564 44 193 -17 12 105 -259 20 17 141 -75 150 -149 -107 108 -80 -160 -187 28 36 36 -56 129 -66 112 226
7588 226 -13 130 28 -43 77 40 -70 53 35 -225 27 87 113 1 157 171 -22 -111 -214 150 -190 -184 -59
7611 -59 362 -25 74 290 -268 -106 -190 33 97 -179 214 86 -79 103 154 48 -112 -43 -88 104 -102 -89 43
7634 43 36 -133 -67 -53 -20 -63 -439 130 136 153 -153 116 28 -45 -114 193 15 -37 228 12 -26 -104 95 70 -220 139
7660 139 -304 99 -42 -147 1 122 319 -21 130 7 76 38 195 -52 -467 -36 115 -47 -249 94 -76
7681 -76 58 58 2 -172 -193 62 -91 256 -178 96 99 49 55 -52 153 -215 -166 -89 48 -18 -62 -232 -82 239 128
7706 128 -215 229 -119 -59 246 80 -484 82 -3 28 -134 11 -57 -100 381 -316 2 -17 -22 -86 102 4 -241
7729 -241 233 37 -217 -204 137 9 179 -19 24 231 26 -77 -153 85 -7 -78 171 -123 69 -28 153 -132
7751 -132 164 59 -149 -241 -75 38 -120 -206 65 223 -64 -61 -80 -190 7 90 -48 -67 -296 -25 -59 155 -187
7774 -187 25 18 -56 -64 219 160 -65 -175 103 31 -189 220 28 81 72 48 21 -113 -8 -35 197 78 -232 127
7798 127 -33 148 -177 143 -203 159 99 -201 19 -241 -47 -66 14 -179 132 257 195 26 135 103 -96 164
7820 164 47 114 -27 -134 37 -315 -20 -158 117 0 -38 -45 34 212 -7 -67 -176 -40 82 160 1 -24 165
7843 165 23 132 -267 -64 -46 -117 -166 148 239 -73 167 2 80 -206 4 299 -156 -6 -80 129 -89 287
7865 287 177 2 -20 106 34 -117 35 -174 59 -177 168 -31 -260 77 160 286 23 121 -137 -24 -133
7886 -133 -2 -57 11 32 114 44 -53 75 176 -197 239 -110 -44 -128 -180 95 -19 44 85 25 131 150 -170 85
7910 85 199 -95 201 1 -123 -190 180 125 30 182 -105 -103 -192 -4 31 -143 -162 179 -99 66 16 -156 141
7933 141 -69 170 -145 -85 -134 257 135 -105 41 -222 231 -119 -87 99 368 -7 76 61 95 99 -92 93 144
7956 144 58 -42 -232 -77 8 191 -219 -15 3 97 -199 -93 -60 -91 -32 132 -62 -29 289 -190 144 -35 94
7979 94 265 -12 214 287 -192 -82 15 229 -302 100 196 -20 -48 83 122 -102 95 -116 0 -69 58 -117
8001 -117 133 380 -156 127 65 104 12 -22 -97 -87 -192 93 95 -224 -37 -37 -96 -25 -79 -291 -330 -4 71 -109 8
8026 8 -54 -155 71 359 -120 12 -35 60 -37 -304 65 95 240 -123 -34 -316 25 93 -183 -312 211 -32 -7
8049 -7 115 121 -172 -70 -138 2 1 -65 -190 -100 -76 -68 -135 -71 125 -136 383 -37 262 37 -33 -63 -50 73 -314 83
8075 83 -105 -183 -82 32 -90 -47 -180 -80 4 -50 131 -196 -104 -141 -160 213 -205 84 177 118 -91 39 -89
8098 -89 -201 192 -154 55 -219 29 -31 -96 -26 -88 1 -27 235 126 156 -178 -99 129 -395 32 25 355 -154 53
8122 53 60 -54 222 -283 167 -313 189 183 51 -204 -50 61 7 148 -42 93 81 155 -205 -105 54 -96 -24
8145 -24 66 248 -155 -28 48 -25 -8 -150 378 -15 186 157 4 70 -75 239 -261 -184 -70 52 -176 -82 173
8168 173 147 33 -187 285 -217 189 -213 -122 -248 -6 50 -135 170 214 115 -105 -167 72 118 125 85 -2 -21
8191b1
##END NTUPLES=NMR FID
##END=
