##TITLE=1H_EC-3099(X)
 CDCl3, 8 sc, 
 6.2.2020
##JCAMPDX= 6.0         $$ Bruker NMR JCAMP-DX V2.0
##DATA TYPE= NMR FID
##DATA CLASS= NTUPLES
##ORIGIN= UXNMR, Bruker Analytische Messtechnik GmbH
##OWNER= root
$$ XWIN-NMR		Version 3.5
$$ Thu Feb  6 14:13:41 2020 Russian Standard Time (UT+4h)  she@DPX200
##.OBSERVE FREQUENCY= 200.1315
##.OBSERVE NUCLEUS= ^1H
##.DELAY= (6, 6)
##.ACQUISITION MODE= SIMULTANEOUS
##.ACQUISITION SCHEME= undefined
##.AVERAGES= 8
##.DIGITISER RES= 18
##SPECTROMETER/DATA SYSTEM= spect
##.PULSE SEQUENCE= zg30
##.SOLVENT NAME= CDCl3
##.SHIFT REFERENCE= (INTERNAL, CDCl3, 0, 15.7039)
##AUDIT TRAIL= $$ (NUMBER, WHEN, WHO, WHERE, WHAT)
$$ ##TITLE= Audit trail, XWIN-NMR		Version 3.5
$$ ##JCAMPDX= 5.01
$$ ##ORIGIN= Bruker BioSpin GmbH
$$ ##OWNER= she
$$ F:/spectra/data/she/nmr/H-F/1/audita.txt
$$ ##AUDIT TRAIL=  $$ (NUMBER, WHEN, WHO, WHERE, WHAT)
(   1,<2020-02-06 14:12:45.17 +0400>,<she>,<DPX200>,
      <created by zg, POWCHK disabled, PULCHK disabled
       configuration hash MD5:
       00 E9 B6 7A A2 85 ED C7 34 08 36 98 17 FE 4E 26
       data hash MD5: 16K
       8F 81 2D 42 97 78 BE B6 88 46 CD 44 D9 8A 60 E7>)
$$ ##END=
$$ 
$$ hash MD5
$$ 48 DE F2 D0 50 BA 95 46 F0 98 D5 C5 0F 31 B4 DF
##$RELAX= 
##$RELAX= 
##$RELAX= 
##$RELAX= 
##$RELAX= 
##$RELAX= 
$$ Bruker specific parameters
$$ --------------------------
##$DU= <F:/spectra>
##$EXPNO= 1
##$NAME= <H-F>
##$PROCNO= 1
##$TYPE= <nmr>
##$USER= <she>
##$AMP= (0..31)
100 100 100 100 100 100 100 100 100 100 100 100 100 100 100 100 100 100 
100 100 100 100 100 100 100 100 100 100 100 100 100 100 
##$AQSEQ= 0
##$AQ_mod= 1
##$AUNM= <au_zg>
##$AUTOPOS= <>
##$BF1= 200.13
##$BF2= 200.13
##$BF3= 200.13
##$BF4= 200.13
##$BF5= 200.13
##$BF6= 200.13
##$BF7= 200.13
##$BF8= 200.13
##$BYTORDA= 1
##$CFDGTYP= 0
##$CFRGTYP= 5
##$CHEMSTR= <none>
##$CNST= (0..31)
1 1 145 1 1 1 1 1 1 1 1 1 1 1 1 1 1 1 1 1 1 1 1 1 1 1 1 1 1 1 1 1 
##$CPDPRG= <>
##$CPDPRG1= <>
##$CPDPRG2= <>
##$CPDPRG3= <>
##$CPDPRG4= <mlev>
##$CPDPRG5= <mlev>
##$CPDPRG6= <mlev>
##$CPDPRG7= <mlev>
##$CPDPRG8= <mlev>
##$CPDPRGB= <>
##$CPDPRGT= <>
##$D= (0..31)
0 1.2 0 0 0 0 0 0 0 0.06 0 0.03 0 0 0 0 0.0002 0 0 0 0 0 0 0 0 0 0 0 0 
0 0 0 
##$DATE= 1580983964
##$DBL= (0..7)
120 120 120 120 120 120 120 120 
##$DBP= (0..7)
150 150 150 150 150 150 150 150 
##$DBP07= 0
##$DBPNAM0= <>
##$DBPNAM1= <>
##$DBPNAM2= <>
##$DBPNAM3= <>
##$DBPNAM4= <>
##$DBPNAM5= <>
##$DBPNAM6= <>
##$DBPNAM7= <>
##$DBPOAL= (0..7)
0.5 0.5 0.5 0.5 0.5 0.5 0.5 0.5 
##$DBPOFFS= (0..7)
0 0 0 0 0 0 0 0 
##$DE= 6
##$DECBNUC= <off>
##$DECIM= 24
##$DECNUC= <off>
##$DECSTAT= 4
##$DIGMOD= 1
##$DIGTYP= 9
##$DL= (0..7)
0 120 120 120 120 120 120 120 
##$DP= (0..7)
150 150 150 150 150 150 150 150 
##$DP07= 0
##$DPNAME0= <>
##$DPNAME1= <>
##$DPNAME2= <>
##$DPNAME3= <>
##$DPNAME4= <>
##$DPNAME5= <>
##$DPNAME6= <>
##$DPNAME7= <>
##$DPOAL= (0..7)
0.5 0.5 0.5 0.5 0.5 0.5 0.5 0.5 
##$DPOFFS= (0..7)
0 0 0 0 0 0 0 0 
##$DQDMODE= 0
##$DR= 18
##$DS= 0
##$DSLIST= <SSSSSSSSSSSSSSS>
$$ [...]
##$SUBNAM2= <"">
##$SUBNAM3= <"">
##$SUBNAM4= <"">
##$SUBNAM5= <"">
##$SUBNAM6= <"">
##$SUBNAM7= <"">
##$SUBNAM8= <"">
##$SUBNAM9= <"">
##$SW= 24.9337058887773
##$SWIBOX= (0..15)
0 0 2 0 0 0 0 0 0 0 0 0 0 0 0 0 
##$SW_h= 4990.01996007984
##$TD= 16384
##$TD0= 1
##$TE= 0
##$TE2= 300
##$TE3= 300
##$TEG= 300
##$TL= (0..7)
0 120 120 120 120 120 120 120 
##$TP= (0..7)
150 150 150 150 150 150 150 150 
##$TP07= 0
##$TPNAME0= <>
##$TPNAME1= <>
##$TPNAME2= <>
##$TPNAME3= <>
##$TPNAME4= <>
##$TPNAME5= <>
##$TPNAME6= <>
##$TPNAME7= <>
##$TPOAL= (0..7)
0.5 0.5 0.5 0.5 0.5 0.5 0.5 0.5 
##$TPOFFS= (0..7)
0 0 0 0 0 0 0 0 
##$TUNHIN= 0
##$TUNHOUT= 0
##$TUNXOUT= 0
##$USERA1= <user>
##$USERA2= <user>
##$USERA3= <user>
##$USERA4= <user>
##$USERA5= <user>
##$V9= 5
##$VALIST= <valist>
##$VCLIST= <CCCCCCCCCCCCCCC>
##$VD= 0
##$VDLIST= <DDDDDDDDDDDDDDD>
##$VPLIST= <PPPPPPPPPPPPPPP>
##$VTLIST= <TTTTTTTTTTTTTTT>
##$WBST= 1024
##$WBSW= 4
##$XGAIN= (0..3)
0 0 0 0 
##$XL= 0
##$YL= 0
##$YMAX_a= 259736
##$YMIN_a= -130613
##$ZGOPTNS= <>
##$ZL1= 120
##$ZL2= 120
##$ZL3= 120
##$ZL4= 120
##$ABSF1= 10
##$ABSF2= 0
##$ABSG= 5
##$ABSL= 3
##$ALPHA= 0
##$AQORDER= 0
##$ASSFAC= 0
##$ASSFACI= 0
##$ASSFACX= 0
##$ASSWID= 0
##$AUNMP= <proc_1d>
##$AZFE= 0.1
##$AZFW= 0.1
##$BCFW= 1
##$BC_mod= 2
##$BYTORDP= 1
##$COROFFS= 0
##$CY= 11.3945322036743
##$DATMOD= 1
##$DC= 2
##$DFILT= <>
##$DTYPP= 0
##$F1P= 16.9975609425685
##$F2P= -3.02152046262296
##$FCOR= 0.5
##$FTSIZE= 0
##$FT_mod= 4
##$GAMMA= 1
##$GB= 0.15
##$INTBC= 1
##$INTSCL= 1
##$ISEN= 128
##$LB= 0.24
##$LEV0= 0
##$LPBIN= 0
##$MAXI= 10000
##$MC2= 0
##$MEAN= 0
##$ME_mod= 0
##$MI= 1.114404
##$NCOEF= 0
##$NC_proc= 0
##$NLEV= 6
##$NOISF1= 3.799351
##$NOISF2= 2.8
##$NSP= 1
##$NTH_PI= 0
##$NZP= 0
##$OFFSET= 15.70392
##$PC= 1
##$PHC0= -9800.125
##$PHC1= 32.40081
##$PH_mod= 1
##$PKNL= yes
##$PPARMOD= 0
##$PSCAL= 0
##$PSIGN= 0
##$REVERSE= no
##$SF= 200.130013532006
##$SI= 16384
##$SIGF1= 3
##$SIGF2= 2
##$SINO= 400
##$SIOLD= 16384
##$SREGLST= <1H.CDCl3>
##$SSB= 0
##$STSI= 0
##$STSR= 0
##$SW_p= 3612.71676300578
##$SYMM= 0
##$S_DEV= 0
##$TDeff= 0
##$TDoff= 0
##$TI= <>
##$TILT= no
##$TM1= 0
##$TM2= 0
##$TOPLEV= 0
##$USERP1= <user>
##$USERP2= <user>
##$USERP3= <user>
##$USERP4= <user>
##$USERP5= <user>
##$WDW= 1
##$XDIM= 8192
##$YMAX_p= 0
##$YMIN_p= 0
$$ End of Bruker specific parameters
$$ ---------------------------------
##NTUPLES= NMR FID
##VAR_NAME=  TIME,          FID/REAL,        FID/IMAG
##SYMBOL=    X,             R,               I
##VAR_TYPE=  INDEPENDENT,   DEPENDENT,       DEPENDENT
##VAR_FORM=  AFFN,          ASDF,            ASDF
##VAR_DIM=   8192,          8192,            8192
##UNITS=     SECONDS,       ARBITRARY UNITS, ARBITRARY UNITS
##FACTOR=    0.0002004,     1,               1
##FIRST=     0,             0,               0
##LAST=      1.6414764,     0,               0
##MIN=       0,             -130613,         0
##MAX=       1.6414764,     259736,          0
$$ Real data points
##PAGE= N=1
##DATA TABLE= (X++(R..R)), XYDATA
$$ [...]
$$ plain form
2384 -2186 -2102 148 1061 49 -1946 -2073 438 1866 446 -2399 -2659 30 1915 1025 -1440 -1504 514
2401 514 1327 483 -1156 -1687 200 2364 1354 -1128 -1779 318 2334 1267 -617 -1013 335 1918
2417 1918 1518 -637 -1383 -49 2131 2022 116 -1107 136 1902 1685 -487 -1366 115 2146 1663
2433 1663 36 -1551 -1084 1407 2608 238 -1205 -611 1467 1826 300 -1187 -944 905 2343 816
2449 816 -1108 -1005 747 2225 1011 -999 -1224 592 2233 1365 -1029 -1475 -289 1501 2057 156
2465 156 -1996 -927 1128 1581 -318 -1973 -719 944 1376 -102 -2013 -1413 455 1315 49 -1763
2481 -1763 -2003 375 1586 178 -2148 -2224 -95 1000 174 -1464 -2265 -987 1021 618 -1539 -1996 -859
2498 -859 891 217 -1451 -2180 -535 1215 772 -1009 -2022 -917 1311 1159 -819 -2157 -843 1656
$$ packed form
2384b186Q4K250R13j012j995j27K511J428j420k845k60K689J885q90k465o4K018
2401E14Q13q44j639n31J887K164j010k482o51K097K016j067j884l96J348J583
2417A918m00k155p46J334K180j09j906j223J243J766k17k172q79J481K031m83
2433A663j627j587M67K491J201k370j443N94K078L59j526j487K43J849J438j527
2449H16j924J03J752J478j214k010k25J816J641q68k394m46J186J790N56j901
2465A56k152J069K055M53j899j655J254J663M32j478j911O00J868Q60j266j812
2481a763k40K378J211j408k326p6K129J095q26j638q01J278K008m03k157m57J137
2498h59J750o74j668p29J645J750m43j781j013J105K228j52j978j338J314K499
$$ plain form
2514 1656 1550 -415 -1891 -633 1171 1803 -42 -1819 -1155 1661 2234 -14 -1995 -826 1892 2630
2530 2630 201 -2001 -1496 1186 2541 696 -1760 -1838 733 2921 1593 -1876 -2346 717 2754 1103
2546 1103 -1678 -2238 596 2442 1524 -1213 -2511 -134 2894 2230 -1200 -2455 -406 2403 2634 -391
2562 -391 -2227 -519 2506 2466 -145 -2111 -749 2160 2785 26 -2084 -1026 1789 2516 -35 -1985
2578 -1985 -1194 1454 2594 582 -1976 -1515 1082 2192 243 -1740 -1248 1104 2110 353 -1726 -1591
2594 -1591 936 2098 637 -1573 -1788 446 2215 779 -2064 -2285 409 2111 873 -1816 -2334 -332
2610 -332 1886 1309 -1538 -2606 -594 1623 1347 -1135 -2705 -675 2323 1842 -1252 -3019 -1320 1431
2626 1431 2094 -323 -2655 -2033 1280 2398 -39 -2790 -1949 645 2462 430 -1937 -2303 296 1917
$$ packed form
2514A656j06j965j476J258J804O32j845j777O64K816N73k248j981J169K718P38
2530B630k429k202N05K682J355j845k456p8K571K188j328l469m70L063K037j651
2546A103k781n60K834J846r18k737j298K377L028o64l430j255K049K809K31l025
2562c91j836J708L025m0k611j966J362K909O25k759k110J058K815P27k551j950
2578a985P91K648J140k012k558M61K597J110j949j983M92K352J006j757k079J35
2594a591K527J162j461k210k15K234J769j436k843k21K694J702j238k689n18K002
2610c32K218n77k847j068K012K217k76k482j570K030K998m81l094j767J699K751
2626A431O63k417k332O22L313J118k437k751Q41K594J817k032k367l66K599J621
$$ plain form
2642 1917 322 -1844 -2080 314 2381 786 -1921 -2827 -300 2129 1307 -1137 -2004 -368 959 1136
2658 1136 -956 -2123 -563 1946 1614 -610 -1950 -506 1413 1647 -123 -1746 -912 1870 2109 -18
2674 -18 -1834 -1091 2052 2473 454 -1717 -983 1220 2143 326 -1432 -719 1594 2646 991 -1615 -1501
2691 -1501 1358 2785 1205 -1438 -1484 1087 2805 1026 -1285 -1752 857 3011 1791 -1101 -2121 68
2707 68 2387 2303 -1059 -2050 -108 2189 1672 -894 -2823 -816 2143 2639 -570 -2887 -1465 1638 1896
2724 1896 77 -2337 -1684 1221 2309 98 -2680 -2181 760 2490 420 -2105 -2436 849 2372 272
2740 272 -2547 -2068 430 2142 984 -1588 -2673 -261 2219 1124 -2009 -2482 -182 2039 1028 -1774
2756 -1774 -2516 -486 2393 1380 -1470 -2347 -801 1556 1530 -1325 -2616 -600 1710 1697 -1012 -2711
$$ packed form
2642A917j595k166k36K394K067j595k707r06K527K429q22k444q67J636J327J77
2658A136k092j167J560K509l32k224j340J444J919K34j770j623Q34K782K39k127
2674a8j816P43L143M21k019k171P34K203R23j817j758P13K313J052j655k606J14
2691a501K859J427j580k643m6K571J718j779k311m67K609K154j220k892j020K189
2707F8K319q4l362r91J942K297n17k566j929K007K959M96l209k317J422L103K58
2724A896j819k414O53K905J088k211k778M99K941J730k070k525l31L285J523k100
2740B72k819M79K498J712j158k572j085K412K480j095l133m73K300K221j011k802
2756a774p42K030K879j013k850q77J546K357k6k855j291K016K310j3k709j699
$$ plain form
2772 -2711 -1171 1570 1899 -276 -2538 -1208 1421 1864 -703 -2504 -1109 1411 2300 13 -2365 -1501
2788 -1501 1255 2348 439 -2141 -1882 1063 2531 1002 -2238 -1993 878 2443 1033 -1521 -1921 233
2804 233 2578 1643 -1228 -2475 563 2693 1876 -846 -2148 -1 2746 2224 -579 -1829 -182 2104
2820 2104 2113 -36 -1943 -778 1855 2174 283 -2003 -661 1616 2050 445 -1747 -1305 1403 2514
2836 2514 511 -2016 -1470 1010 2333 691 -1406 -1572 1019 2000 375 -1418 -1713 340 1831 1068
2852 1068 -1043 -1789 24 1950 703 -1429 -1831 -53 1788 1361 -1270 -2198 -1086 1343 1669 -1236
2868 -1236 -2179 -808 1389 1432 -1098 -2269 -969 1628 1706 -745 -2241 -1795 1027 1768 -480 -2699 -1575
2885 -1575 996 1944 -271 -2700 -2294 598 1755 578 -1836 -2488 346 1918 346 -1961 -2142 285
$$ packed form
2772b711J540K741L29k175k262J330K629M43k567j801J395K520Q89k287k378Q64
2788a501K756J093j909k580K59K945J468j529l240K45K871J565j410k554m00K154
2804B33K345r35k871j247L038K130q17k722j302K147K747n22k803j250J647K286
2820B104Rk149j907J165K633L19j891k286J342K277M34j605k192M42K708J111
2836B514k003k527N46K480J323j642k097j66K591R81j625j793k95K053J491p63
2852A068k111p46J813J926j247k132m02J778J841m27k631r28J112K429L26k905
2868a236r43J371K197M3k530j171J300K597P8k451j496M46K822P41k248k219J124
2885a575K571R48k215k429M06K892J157j177k414o52K834J572j572k307j81K427
$$ plain form
2901 285 2071 1113 -1838 -2702 -478 1755 1613 -1059 -1936 -424 1731 1583 -1252 -2362 -368 2252
2917 2252 2011 -119 -1669 -707 1514 2042 -98 -1549 -700 1710 2229 -35 -1910 -1168 1698 2820
2933 2820 546 -1398 -1221 1089 2148 857 -1296 -876 1541 2689 561 -1827 -1282 1078 2279 835
2949 835 -1122 -1327 768 2075 1155 -1967 -1742 580 2900 1366 -1482 -1992 193 1849 1204 -992
2965 -992 -1680 335 1857 1592 -1124 -2305 -492 2163 2463 -538 -2169 -741 1557 1864 -523 -2085
2981 -2085 -1004 1670 2054 42 -2033 -1761 1054 2103 398 -1881 -1472 879 1323 -12 -1579 -1302
2997 -1302 538 2212 830 -1923 -2164 -58 1593 685 -1445 -1717 -317 1007 730 -1498 -2053 -523
3013 -523 1410 854 -719 -2017 -700 954 869 -1035 -1931 -700 1338 1313 -838 -1752 -1034 767 1808
$$ packed form
2901B85J786r58k951q64K224K233j42k672q77J512K155j48k835j110J994K620
2917B252k41k130j550R62K221N28k140j451Q49K410N19k264j875P42K866J122
2933B820k274j944J77K310J059j291k153M20K417J148k128k388N45K360J201j444
2949H35j957k05K095J307r20l122K25K322K320j534k848n10K185J656o45k196
2965i92o88K015J522k65k716j181J813K655L00l001j631J428K298L07k387j562
2981b085J081K674L84k012k075K72K815J049j705k279M09K351M44j335j567K77
2997a302J840J674j382k753k41K106J651r08k130k72J400J324k77k228n55J530
3013e23J933n56j573j298J317J654q5j904q96J231K038k5k151r14P18J801J041
$$ plain form
3030 1808 114 -1697 -765 1045 1268 47 -1585 -983 948 1752 428 -1624 -1254 869 1969 568
3046 568 -1815 -1572 852 1735 362 -1390 -1639 511 1965 1138 -769 -1760 -111 1657 1227 -815 -1612
3063 -1612 263 1796 1372 -821 -1750 -449 1690 1627 89 -1409 -813 1434 1628 63 -1733 -744 1594
3080 1594 1505 509 -1382 -668 1412 1819 907 -1411 -821 1149 2091 586 -1084 -950 647 2128 647
3097 647 -819 -1059 635 1753 1134 -997 -1292 213 1583 1037 -1179 -1461 15 1691 883 -879 -1561
3114 -1561 -575 1226 1107 -1065 -1934 -526 1154 1315 -628 -1903 -861 1020 915 -489 -1901 -829
3130 -829 744 872 -390 -2244 -1296 701 1403 -527 -2103 -1163 747 1099 -5 -1624 -1483 404 1280
3147 1280 372 -1454 -1428 226 1577 221 -1162 -1371 73 1234 457 -1233 -1497 -19 1236 685 -1178
$$ packed form
3030A808j694j811R32J810K23j221j632O02J931Q04j324k052L70K123J100j401
3046E68k383K43K424Q83j373j752k49K150J454q27j907r91J649J768m30k042p97
3063a612J875J533m24k193r29J301K139o3j538j498N96K247J94j565j796R89K338
3080A594q9r96j891P14K080M07r12k318N90J970R42j505j670J34J597J481j481
3097F47j466k40J694J118o19k131k95J505J370n46k216k82J476J676q08j762o82
3114a561R86J801j19k172q69J408J680J61j943j275J042J881j05j404j412J072
3130h29J573J28j262j854R48J997P02j930j576R40J910L52j104j619J41J887Q76
3147A280r08j826K6J654J351j356j383k09J444J161p77j690k64J478J255n51j863
$$ plain form
3164 -1178 -1749 -252 1666 900 -807 -1808 -427 1170 1163 -109 -1519 -692 1091 1557 91 -1269 -447
3181 -447 1209 1586 -302 -1401 -475 902 1660 677 -816 -818 874 1667 680 -903 -704 849 1538 647
3199 647 -673 -903 640 1293 971 -292 -784 167 1527 823 -344 -920 312 1487 1093 -608 -1255
3216 -1255 15 1089 1019 96 -999 -111 890 1098 -116 -1386 -287 1222 1232 -215 -1141 -549 727
3233 727 1445 -188 -1125 -611 645 1195 223 -1149 -1156 372 1513 201 -857 -1126 100 901 467 -751
3251 -751 -1643 83 1293 604 -1213 -1543 -129 978 705 -515 -1224 -827 702 711 -780 -1479 -826 532
3269 532 712 -373 -1535 -686 1024 644 -717 -1436 -355 450 887 -156 -1724 -956 594 951 107
3286 107 -1178 -799 92 827 7 -866 -812 83 907 324 -715 -1074 152 883 390 -1148 -973 366 1215
$$ packed form
3164a178n71J497J918p66j707j001J381J597pj272j410Q27J783M66j466j360Q22
3181d47J656L77j888j099R26J377P58r83j493kJ692P93r87j583J99J553O89q91
3199F47j320k30J543O53l22j263m92R51J360p04j167n76J232J175l94j701o47
3216a255J270J074p0r23j095Q88J001K08j214j270J099J509J0j447r26N92J276
3233G27P18j633r37N14J256N50r72j372pJ528J141j312j058k69J226Q01m34j218
3251g51q92J726J210o89j817l30J414J107k73j220p09L97J529Rj491o99O53J358
3269E32J80j085j162Q49J710l80j361p19J081Q05M37j043j568P68J550L57q44
3286A07j285L79Q91P35q20q73N4Q95Q24n83j039l59J226P31m93j538J75J339Q49
$$ plain form
3305 1215 376 -542 -981 117 1340 1016 -258 -843 -99 829 955 -285 -903 97 842 973 -69 -1057
3323 -1057 -59 1362 1126 64 -940 -585 902 1070 470 -763 -141 966 1172 400 -438 -748 646
3340 646 1201 791 -700 -513 602 883 617 -295 -757 201 1018 580 -530 -819 12 966 990 -489 -657
3359 -657 -74 713 390 -649 -760 266 609 564 89 -707 -591 623 609 -300 -900 -367 578 551 -59 -1199
3379 -1199 -513 268 770 -215 -1075 -903 -63 676 154 -787 -997 141 780 -194 -773 -1026 -244 545 304
3398 304 -532 -1268 -308 456 123 -759 -1166 -394 234 364 -186 -841 -478 470 303 -117 -832 -556 590 804
3418 804 -230 -1322 -302 547 641 -323 -789 -672 315 600 397 -814 -605 257 672 533 -402 -609 204
3437 204 765 294 -358 -268 204 386 470 -241 -777 176 1087 575 -56 -452 -94 765 653 -2 -554 213 976
$$ packed form
3305A215q39r18m39J098J223l24j274n85P44R28J26j240o18J000P45J31j042r88
3323a057R98J421k36j062j004L55J487J68o00j233O22J107K06p72q38l10J394
3340F46N55m10j491J87J115K81k66r12m62R58Q17m38j110k89Q31R54K4j479j68
3359f57N83P87l23j039j11J026L43m5m75p96J16J214j4r09o00N33R45k7o10j140
3379a199O86P81N02r85q60J72Q40P39n22r41k10J138O39r74n79k53P82P89k41
3398C04q36p36R60P64l33q82m07P72O28J30n50o55L63R48j67m20p15K76J146K14
3418H04j034j092J020Q49R4r64m66J17R87K85k03j211K09Q62M15j39r35k07Q13
3437B04N61m71o52R0M72J82Q4p11n36R53R11n12o31l96L58Q59j12o55n52P67P63
$$ plain form
3458 976 586 166 -482 225 583 444 138 -552 28 930 552 253 -362 -150 544 890 441 -486 -340 395
3478 395 850 231 -587 -377 561 893 687 -217 -418 65 855 370 -81 -395 131 575 608 -354 -815 -163
3498 -163 516 668 -337 -558 -538 190 395 -237 -773 -171 276 330 -262 -471 -660 -39 259 -275 -566 -310
3518 -310 199 276 -71 -640 -827 71 325 2 -963 -826 -190 124 -70 -682 -913 25 200 108 -625 -758 -102
3539 -102 240 36 -272 -722 -536 277 259 -52 -728 -424 202 566 115 -855 -609 345 317 -24 -331 -445 -106
3560 -106 709 111 -260 -502 268 1028 118 -422 -545 281 540 562 2 -138 204 630 353 90 -504 93
3580 93 585 512 50 -552 -80 464 556 -20 -362 -27 895 492 -3 -366 -184 562 938 166 -14 18 336
3601 336 746 313 -206 -221 747 642 77 -251 -370 126 834 166 -481 -394 428 848 230 -138 -542 111 684
$$ packed form
3458I76l90m20o48P07L58j39l06o90N80R02l78k99o15K12O94L46m49r27J46P35
3478C95M55o19q18K10R38L32k06r04k01M83P90m85m51l14N26M44L3r62m61O52
3498a63O79J52j005k21K0P28K05o32n36O02M47N4n92k09j89O21K98n34k91K56
3518c10N09P7l47n69j87Q98K54l23r65J37O36L14j94o12k31R38J75r2p33j33O56
3539a02L42k04l08m50J86Q13j8l11o76L04O26L64m51r70K46R54k8l41l07j14L39
3560a06Q15n98l71k42P70P60r10n40j23Q26K59K2n60j40L42M26k77k63n94N97
3580I3M92p3m62o02M72N44R2n76l42L35R22m03m95l63J82P46L76p72j80L2L18
3601C36M10m33n19j5R68j05n65l28j19M96P08o68o47Q7Q22M20o18l68m04O53N73
$$ plain form
3622 684 504 -396 -566 -300 273 384 -331 -502 -29 283 220 -398 -570 -394 252 237 -116 -902 -350 247 264
3643 264 -400 -612 -371 -104 399 -79 -606 -508 257 363 -210 -439 -386 -83 715 72 -488 -604 -257 -24 63
3664 63 -37 -697 -273 487 -74 -616 -678 -328 375 222 62 -575 -343 447 475 -379 -759 -270 402 612 -296
3685 -296 -496 -240 240 534 362 -374 -312 281 631 344 -587 -607 192 759 272 -262 -326 260 532 244 -192
3706 -192 -540 202 969 420 -162 -612 -65 1068 718 -224 -453 -258 628 662 242 -393 0 399 900 163
3726 163 -183 -376 841 349 277 -494 -200 403 620 157 -558 -160 524 997 267 -466 -499 37 548 292
3746 292 -573 -469 428 605 300 -442 -686 276 608 762 -350 -712 138 402 65 -447 -582 46 546 499
3766 499 -324 -980 -516 339 730 -286 -861 -320 466 428 -516 -712 -134 420 644 -49 -880 -694 -373 566
$$ packed form
3622F84j80r00j70K66N73J11p15j71M73L12o3o18j72J76O46j5l53p86N52N97J7
3643B64o64k12K41K67N03m78n27R8P65J06n73k29N3L03P98o43n60j16L47K33Q7
3664F3j00o60M24P60n61n42o2L50P03j53j60o37K32P90K8q54l80M89O72K10r08
3685b96k00K56M80K94j72p36O2N93L50k87r31k0P99N67m87n34o4N86K72k88m36
3706a92l48P42P67n49n82m50N47J133l50r42k29J95Q86L4m20o35L93L99N01p37
3726A63l46j93J217m92p2p71K94O03K17m63p15L98O84M73p30p33l3N36N11k56
3746B92q65J04Q97J77l05p42k44R62L32J54j112l62Q50K64l37n12j35O28N00m7
3766D99q23o56M64Q55L91j016n75N41P86l8r44j96N78N54K24o93q31J86L21R39
$$ plain form
3786 566 -194 -371 -122 121 288 4 -500 -580 -110 652 265 -503 -875 1 155 138 -510 -745 109 668 388
3807 388 -413 -1134 -144 401 506 -257 -655 -137 696 227 -405 -784 174 490 397 -10 -885 -480 258 447
3827 447 138 -448 -374 531 718 125 -687 -181 632 941 494 -473 -459 227 865 387 -107 -307 397 1089 358
3848 358 -460 -695 -35 910 791 -163 -522 -44 763 606 28 -840 226 1027 1110 274 -694 -147 490 657
3868 657 161 -321 -349 481 619 -303 -486 -397 683 702 440 -549 -672 -17 612 178 -625 -361 360 736 141
3889 141 -635 -942 17 766 505 -587 -753 86 511 261 -827 -1077 197 856 484 -725 -977 -505 448
3908 448 590 -92 -1130 -683 388 385 -535 -1011 -454 517 413 -203 -952 -865 405 670 -75 -840 -394 595
3928 595 881 314 -758 -817 96 638 -142 -645 -411 -111 808 263 -611 -487 30 714 547 -555 -464 -78
$$ packed form
3786E66p60j77K49K43J67k84n04q0M70P62l87p68l72Q76J54j7o48k35Q54N59k80
3807C88q01p21R90N45J05p63l98N18Q33m69o32l79R58L16r3m07q75M05P38J89
3827D47l09n86P4R05J87n93q12N06Q13L09m47r67J4O86O38m78m94k00P04O92p31
3848C58q18k35O60R45j19r54l59M78Q07j57n78q68J066Q01Q3q36r68N47O37J67
3868F57m96m82k8Q30J38r22j83Q9J080J9k62r89j23O55O29m34q03K64P21L76n95
3889A41p76l07R59P49k61j092j66Q39M25k50j088k50J274O59l72j209k52M72R53
3908D48J42o82j038M47J071lr20m76N57R71j04o16p49Q7J270K65p45p65M46R89
3928E95K86n67j072n9R13N42p80n03K34L00R19n45q74J24N17O84j67j102R1L86
$$ plain form
3948 -78 718 224 -197 -720 208 713 358 -430 -788 -76 716 869 -62 -924 -196 946 826 13 -472 47
3968 47 689 786 133 -707 -76 652 918 244 -320 -528 281 663 16 -770 -229 669 997 565 -320 -654 407
3989 407 1088 361 -608 -453 208 860 529 -217 -580 -30 820 394 -291 -747 -68 872 671 -122 -923 -76
4009 -76 653 727 -593 -589 -264 727 676 -188 -533 -450 743 680 -143 -846 -504 701 891 133 -873 -651 31
4030 31 401 -186 -728 -807 -113 983 223 -834 -882 -244 520 351 -522 -899 -120 484 100 -652 -913 -387
4050 -387 676 475 -731 -1019 -367 433 592 -350 -951 -233 614 543 -483 -1090 -800 632 473 56 -931
4069 -931 -627 507 421 -138 -804 -595 555 863 34 -679 -459 458 872 257 -660 -650 551 630 486 -1013
4089 -1013 -695 483 897 314 -506 -812 100 879 644 -308 -574 333 918 727 -609 -683 -86 924 1043
$$ packed form
3948g8P96m94m21n23R28N05l55p88l58P12P92J53r31q62P28J142j20q13m85N19
3968D7O42R7o53q40O31P28K66o74n64k08Q09L82o47p86N41Q98L28m32q85l34J061
3989D07O81p27r69J55O61O52l31p46l63N50Q50m26o85m56O79R40k01p93q01Q47
4009g6P29P4j320ML25R91n1q64l45Q3J193o3q23p03L42J205J90p58j006K22O82
4030C1L70n87n42p9O94J096p60j057m8O38P64j69q73l77P79O04l84p52k61N26
4050c87J063k01j206k88O52Q00J59r42o01P18Q47p1j026o07K90J432j59m17r87
4069i31L04J134q6n59o66K09J150L08q29p13K20R17M14o15r17J0J201P9j44j499
4089a013L18J178M14n83q20l06R12P79k35r52k66R07N85j91j336p4N97J010J19
$$ plain form
4108 1043 -184 -524 -138 756 901 -384 -791 -420 904 1094 -35 -716 -629 429 789 -53 -725 -568
4126 -568 588 788 91 -743 -810 172 837 454 -453 -836 108 867 371 -531 -679 233 853 223 -818 -683
4146 -683 20 664 145 -451 -598 -90 511 691 -481 -1096 26 599 379 -367 -725 -576 386 393 -181 -764
4166 -764 -573 714 365 -433 -1201 -507 644 515 -212 -940 -707 447 899 -39 -704 -745 320 811 214
4185 214 -746 -750 448 790 363 -646 -617 57 566 9 -729 -750 123 867 594 -262 -1119 -101 724 464
4205 464 -122 -780 -313 551 576 -449 -660 -99 775 744 -143 -547 -302 447 563 106 -594 -343 812 806 31
4226 31 -370 -457 139 900 420 -744 -144 410 1092 290 -577 -333 123 709 549 -657 -496 458 1241 584
4246 584 -94 -532 388 1028 690 -475 -691 53 704 698 -123 -472 -181 823 458 0 -817 -371 652 834
$$ packed form
4108A043j227l40L86Q94J45j285m07L71J324J90j129o81Q7J058L60q42o72J57
4126e68J156K00o97q34o7R82O65l83r07l83R44P59m96r02j48R12O20o30j041J35
4146f83P03O44n19n96j47N08O01J80j172o15J122N73k20p46l58J49R62Pn74n83
4166g64J91J287l49p98p68O94J151j29p27p28K33J154M52r38o65m1J065M91n97
4185B14r60mJ198L42m27j009K9O74N09n57p38k1Q73P44k73q56q57J018Q25k60
4205D64n86o58M67Q64K5j025k11N61Q74l1q87m04K45P49J16m57p00K51J155op75
4226C1m01q7N96P61m80j164O00N54O82q02q67K44M56N86j60j206J61R54P83o57
4246E84o78m38R20O40l38j165k16P44O51oq21l49K91J004l65m58q17M46J023J82
$$ plain form
4266 834 -9 -547 -513 721 821 -64 -793 -580 631 744 -91 -993 -473 483 596 -241 -1117 -667 44 685
4286 685 509 -933 -999 -35 832 413 -908 -662 182 759 377 -567 -734 -529 570 145 -572 -883 -192
4305 -192 643 443 -491 -1041 -254 595 641 -456 -877 -544 323 544 -288 -705 -408 518 496 -136 -961 -426
4325 -426 256 796 258 -570 -517 476 624 120 -772 -415 328 841 320 -620 -404 223 867 216 -289 -486
4345 -486 124 833 566 -567 -627 382 852 548 19 -487 46 774 241 28 -339 -123 883 579 21
4364 21 -566 -25 664 569 20 -411 -344 471 769 296 -625 -513 566 898 415 -724 -498 466 898 134
4384 134 -241 -474 173 803 147 -254 -877 145 894 417 -425 -548 129 475 306 -444 -696 -5 305 344
4404 344 -346 -732 -373 482 359 -253 -413 -146 383 417 -369 -540 -347 510 652 -262 -679 -513 180 397
$$ packed form
4266H34q43n38L4J234J00q85p29K13J211J13q35r02N20R56J13q37q76M50P11O41
4286F85j76j442o6R64Q67m19j321K46Q44N77l82r44j67K05J099m25p17l11O91
4305a92Q35k00r34n50P87Q49M6j097m21L33Q67K21q32m17K97R26k2o32q25N35
4325d26O82N40n38q28N3R93J48n04q92L57P43N13n21r40K16O27O44o51n05j97
4345d86O10P09k67j133o0J009M70l04n29n06N33P28n33k13l67K16J006l04n58
4364B1n87N41O89r5n49m31O7Q15K98m73r21J12J079L32m83j139K26R64M32p64
4384A34l75k33O47O30o56m01o23J022P49m77q42j23O77L46j69p50k52O91L10L9
4404C44o90l86L59Q55j23o12j60K67N29L4p86j71J93Q57J42r14m17J66O93K17
$$ plain form
4424 397 44 -435 -694 401 723 237 -683 -420 66 535 235 -707 -730 248 493 -9 -456 -549 243 434
4444 434 96 -477 -396 17 670 261 -148 -593 9 634 525 -463 -574 -11 334 117 -59 -668 -245 491
4464 491 512 210 -357 -401 15 648 -8 -678 -581 447 577 52 -877 -360 390 706 202 -305 -614 342 819
4485 819 304 -528 -244 555 775 269 -136 -391 -179 812 270 -250 -437 45 448 208 -254 -644 6 655
4505 655 535 -47 -768 -43 574 662 36 -593 76 772 405 -3 -335 -209 354 447 22 -244 -282 547 423
4526 423 -411 -639 -187 387 789 141 -647 -193 39 400 -11 -611 -567 310 286 505 -679 -680 74 429 -38
4547 -38 -241 -550 58 544 369 -470 -493 -80 474 212 -354 -742 -579 647 268 -190 -560 -11 223 299 26
4568 26 -575 -406 369 273 -312 -343 -360 -19 539 94 -403 -274 145 504 129 -508 -323 166 321 2 -261
$$ packed form
4424C97l53m79k59J095L22m86r20K63M86M69l00r42k3R78K45n02m47r3P92J91
4444D34l38n73Q1M13O53m09m09m45O02O25j09r88j11N63L45k17j76o09M23P36
4464D91K1l02n67m4M16O33o56o70R7J028J30n25r29N17P50L16n04n07l09R56M77
4485H19n15q32K84P99K20n06m05k55K12R91n42n20j87M82M03k40m62l90O50O49
4505F55j20n82p21P25O17Q8o26o29O69O96l67m08l32J26N63R3m25k66l8Q29j24
4526D23q34k28M52N74M02o48p88M54K32L61m11o00M4Q77k4K19j184jP54L55m67
4547c8k03l09O08M86j75q39k3M13N54k62n66l88J63J226l79m58l70N49K34P6k73
4568B6o01J69P75r6n85l1j7L41N58m45m97J29M19L59l75o37J85M89J55l19k63
$$ plain form
4589 -261 -329 131 395 193 -336 -561 -3 615 246 -189 -518 111 672 27 -288 -145 180 448 396 -201 -398
4610 -398 -376 615 568 -142 -358 -244 227 528 108 -447 -201 432 313 193 -506 -194 397 600 25 -265 -89
4631 -89 354 642 224 76 -164 8 558 252 -97 -622 128 732 264 -351 -196 102 358 484 -245 -557
4651 -557 -17 436 482 127 -561 -194 366 420 63 -283 -228 399 493 -73 -431 -100 378 376 -23 -478 -316 362
4673 362 115 -135 -437 -588 -29 134 172 -425 -201 86 139 65 -553 -416 -260 382 179 -471 -464 163 318 97
4695 97 -126 -553 -156 362 72 -224 -448 89 296 289 -347 -587 185 353 169 -141 -613 -38 133 347 241
4716 241 -519 -198 431 310 -183 -507 -121 366 402 327 -249 -79 -39 410 204 65 -347 367 257 -98 -130
4737 -130 -412 342 565 472 -209 -374 184 517 327 -27 -160 32 415 597 -343 -164 -10 229 232 -121 -205
$$ packed form
4589b61o8M60K64k02n29k25N58O18l69m35l29O29N61o45l15J43L25K68n2n97j97
4610c98K2R91m7p10k16J14M71L01m20n55K46O33j19j20o99L12N91K03n75k90J76
4631h9M43K88m18j48k40J72N50l06l49n25P50O04m68o15J55K98K56J26p29l12
4651e57N40M53M6l55o88L67N60N4l57l46N5O27R4n66l58L31M78kl99m55J62O78
4673C62k47k50l02j51N59J63L8n97K24K87N3p4o18J37J56O42k03o50PO27J55k21
4695I7k23m27L97N18k90k96k24N37K07po36k40P72J68j84l10m72N75J71K14j06
4716B41p60L21O29j21m93l24L86M87L6p5n76J70M0M49k06j39m12P14j10l55l2
4737a30k82P54K23r3o81j65N58L33j90l54j33J92L83J82r40J79J54K39Ll53q4
$$ plain form
4758 -205 -140 246 241 -173 -117 -372 337 565 -4 -393 -62 -13 371 85 -128 -121 292 571 122 -82 -225 233
4780 233 371 77 -256 -320 28 557 122 -217 -254 -130 177 70 -193 -117 -125 321 -5 -305 -487 42 429 307
4802 307 -202 -505 -513 -73 198 -153 -339 -389 114 204 -58 -451 -224 -5 315 194 -85 -350 176 74 172 -234
4824 -234 -122 87 180 168 -165 -313 104 596 161 32 -325 64 90 -75 -319 -424 -459 273 144 -162 -228 -19
4846 -19 342 405 3 -230 -294 373 230 55 -39 -70 245 49 -255 -9 -457 112 301 62 -262 21 77 288
4868 288 -74 -144 -211 120 223 -63 -169 -308 186 231 188 -387 18 -29 214 339 -199 -219 -32 362 424 4
4890 4 -320 365 370 311 -149 -60 -137 28 358 7 -69 -108 300 275 32 -225 -163 43 492 -139 -101 -255 28 543
4914 543 360 -384 -300 228 335 -229 -163 -329 -49 492 49 -51 -376 -145 332 291 -77 -347 -420 -22 -129
$$ packed form
4758b05O5L86nm14N6k55P09K28n69l89L31M9L84k86k13PM13K79m49k04j43M58
4780B33J38k94l33o4L48N29m35l39l7J24L07j07k63P6qM46l26l00j82N29L87j22
4802C07n09l03qM40K71l51j86n0N03R0k62l93K27K19L20j21k79k65N26j02R8m06
4824b34J12K09R3j2l33j48M17M92m35j29l57L89K6j65k44j05l5P32j29l06o6K09
4846a9L61O3m02k33o4O67j43j75r4l1L15j96l04K46m48N69J89k39l24K83N6K11
4868B88l62p0o7L31J03k86j06j39M94M5m3n75M05m7K43J25n38k0J87L94O2m20
4890Dl24O85Nn9m60Q9p7J65L30l51p6l9M08k5k43k57O2K06M49o31L8j54K83N15
4914E43j83p44Q4N28J07n64O6j66K80N41m43j00l25K31M77m1l68k70p3L98j07
$$ plain form
4935 -129 -112 -423 -247 432 283 -47 -396 -298 70 236 -24 -183 -128 -17 121 -214 -395 -509 5 486 -28
4956 -28 -307 -194 -64 29 21 -337 -250 138 362 85 -490 -245 -104 74 2 -95 -127 -311 239 -13 -206 -556 -207
4979 -207 549 202 -122 -499 -387 458 435 -124 -46 -6 263 106 315 -353 -40 257 373 300 -185 34 6 -34
5001 -34 43 -42 77 26 334 216 102 -115 133 499 25 91 -200 -5 350 104 -248 -223 94 -12 278 -36
5023 -36 -181 -172 136 294 116 -251 173 286 340 -132 -77 13 201 242 -58 -75 -299 -38 264 -31 -284 -266 440
5046 440 42 -103 -386 -364 -170 168 382 -169 -238 38 203 -247 -144 -388 -124 28 -38 -433 -360 -194 234
5067 234 33 -33 -297 116 -59 -145 -448 -274 -76 318 20 -331 -152 -289 186 135 -370 -553 -385 304 269
5088 269 82 -552 -246 292 83 -187 -254 20 8 299 121 39 -16 253 164 199 -363 -263 141 462 227 -276
$$ packed form
4935a29J7l11J76O79j49l30l49R8L68J66k60j59N5J11J38l35j81j14N14M81n14
4956b8k79J13J30R3ql58Q7L88K24k77n75K45J41J78p2r7l2j84N50k52j93l50L49
4979b07P56l47l24l77J12Q45k3n59P8M0K69j57K09o68L13K97J16p3m85K19k8m0
5001c4P7q5J19n1L08j18j14k17K48L66m74O6k91J95L55k46l52K5L17j06K90l14
5023c6j45RL08J58j78l67M24J13N4m72N5R0J88M1l00j7k24K61L02k95k53J8P06
5046D40l98j45k83K2J94L38K14n51o9K76J65m50J03k44K64J52o6l95P3J66M28
5067B34k01o6k64M13j75q6l03J74J98L94k98l51J79j37M75n1n05j83J68O89l5
5088B69j87o34L06N38k09k70o7K74j2K91j78q2n5K69q9L5n62J00M04L21k35n03
$$ plain form
5110 -276 -211 -70 389 445 -556 -367 -72 390 264 -100 -164 -283 324 321 63 -148 240 402 216 211 -176 -58
5132 -58 520 558 -270 86 204 117 178 141 -70 -87 321 331 168 -593 -367 308 203 30 -153 -129 125 364 218
5155 218 -103 -337 241 239 215 -473 -538 88 235 76 -172 -119 -85 420 223 -272 -180 -142 270 -14 -122 -339 -121
5178 -121 209 29 -66 -493 -209 70 643 142 -601 -482 66 277 39 -151 -151 -124 129 -117 -525 -115 -212 134
5200 134 27 -516 -332 -6 268 156 -136 -620 -18 98 309 -266 -401 -12 21 251 -198 -227 -258 85 120
5221 120 -50 -301 -158 296 214 -18 -109 -71 -14 291 50 -501 -456 26 158 -68 -460 -33 261 205 64 -159
5243 -159 -290 2 346 28 -271 -20 196 309 102 25 -94 200 177 204 -65 -446 -81 70 365 -175 -161
5264 -161 112 348 521 -27 -436 -216 272 198 -60 -254 -224 384 174 -71 -294 -197 390 464 197 -280 -291 149
$$ packed form
5110b76O5J41M59N6j001J89K95M62j26l64o4j19O07lk58k11L88J62j86nl87J18
5132e8N78L8q28L56J18q7O1l7k11j7M08J0j63p61K26O75j05j73j83K4K54K39j46
5155B18l21k34N78kk4o88o5O26J47j59k48N3L4N05j97m95R2L8M12k84j08k17K18
5178a21L30j80r5m27K84K79N73n01p43J19N48K11k38j90%K7K53k46m08M10r7L46
5200A34j07n43J84L26K74j12k92m84O02J16K11n75j35L89L3K30m49k9l1L43L5
5221A20j70k51J43M54q2k32r1L8N7L05k41n51M5M82J32k26l92M27K94n6j41k23
5243a59j31K92L44l18k99K51K16J13k07p7j19K94k3K7k69l81L65J51K95n40J4
5264a61K73K36J73n48m09K20M88p4k58j94L0O08k10k45k23R7N87P4k67m77j1M40
$$ plain form
5286 149 171 -120 -132 -293 110 337 -66 -304 -171 295 368 105 -159 -127 46 298 237 -308 -102 -319 228 482
5308 482 124 -465 -129 316 117 71 -332 45 304 337 -49 -599 -113 -245 266 -266 -524 -257 114 248 -130
5329 -130 -133 -342 143 39 65 -460 -426 221 338 -133 -459 -30 73 67 7 -321 -182 -117 142 247 -297 -277 -130
5352 -130 357 251 -144 -80 -136 460 356 -71 -183 -396 6 249 -141 -561 -210 28 231 -52 -330 -97 151
5373 151 561 -61 -635 -406 277 276 219 -43 -163 291 262 203 -364 -203 158 795 464 -44 18 -24 61 390 -108
5396 -108 -473 313 390 99 -12 -233 -90 208 223 -324 -316 -101 470 28 39 -472 -106 460 105 -69 -112 140
5418 140 261 55 -48 -65 -261 310 27 -26 -214 -210 -59 307 60 -337 -265 -265 365 -99 -329 -269 415 -5 -185
5441 -185 -30 -269 5 370 187 -453 -494 -144 123 56 64 -303 -189 223 -51 -177 -312 76 546 272 -162
$$ packed form
5286A49K2k91j2j61M03K27m03k38J33M66P3k63k64L2J73K52o1n45K06k17N47K54
5308D82l58n89L36M45j99m6m03L77K59L3l86n50M86j32N11n32k58K67L71J34l78
5329a30lk09M85j04K6n25L4O47J17m71l26M29J03oo0l28J39O5K59J05n44K0J47
5352a30M87j06l95O4n6N96j04m27j12k13M02K43l90m20L51K38K03k83k78K33K48
5373A51M10o22n74K29O83jn7k62j20M54k9n9n67J61L61O37l31n08O2m2Q5L29m98
5396a08l65P86P7k91j11k21J43K98J5n47QK15N71m42J1n11L66N66l55j74m3K52
5418A40J21k06j03j7j96N71k83n3j88MJ51L66k47l97P2%O30m64k30O0O84m20j80
5441a85J55k39K74L65j83o40m1L50K67o7Ql67J14M12k74j26j35L88M70k74m34
$$ plain form
5462 -162 -311 -66 69 206 -236 -559 -246 86 376 -72 -18 -188 315 199 59 -534 -299 -68 308 162
5482 162 -195 -262 -88 416 -112 -199 -32 133 120 46 -56 -301 -95 384 32 -309 -274 -65 196 -12 -155 -145
5504 -145 -245 186 -11 -32 -136 -7 369 195 -117 -420 -200 354 187 7 -138 -154 320 594 -151 -220 214
5525 214 101 54 224 -407 -63 95 294 -6 -15 77 393 388 -174 -101 -141 333 359 257 102 46 -68 344 156
5548 156 2 -196 206 255 137 -77 -335 -196 156 623 -175 -225 5 137 175 -188 -57 -28 169 131 -111 -209
5570 -209 -260 298 228 334 -260 -2 191 20 -83 -369 102 -230 109 -18 -262 73 -75 232 221 -123 -147
5591 -147 -184 338 73 -99 -241 -244 146 396 -329 -229 -308 118 6 -145 -180 16 303 183 -126 -354 -264 199
5613 199 264 113 -242 -376 48 157 100 -212 -146 -67 269 -22 -180 -339 -112 297 199 -265 -328 188 259 69
$$ packed form
5462a62j49K45J35J37m42l23L13L32K90m48N4j70N03j16j40n93K35K31L76j46
5482A62l57o7J74N04n28q7J67J65j3p4j02k45K06M79l52l41L5K09K61k08j43J0
5504a45j00M31j97k1j04J29L76j74l12l03K20N54j67j80j45j6M74K74p45o9M34
5525B14j13m7J70o31L44J58J99l00rR2L16nn62P3m0M74K6j02j55n6j14M12j88
5548A56j54j98M02M9j18k14k58J39L52M67p98n0K30J32L8l63J31K9J97l8k42r8
5570b09n1N58p0J06n94K58J93j71j03k86M71l32L39j27k44L35j48L07j1l44k4
5591a47l7N22k65j72j42lL90K50p25J00p9M26j12j51l5J96K87j20l09k28R0M63
5613A99O5j51l55j34M24J09n7l12O6P9L36k91j58j59K27M09r8m64o3N16P1j90
$$ plain form
5635 69 -319 -466 77 206 61 -155 -254 -59 295 95 -105 -236 -184 91 232 -32 146 120 592 394 -176
5656 -176 -244 -76 195 86 161 -309 -86 241 -28 62 -218 -487 287 287 -64 -153 -191 13 215 9 -295 84
5678 84 63 133 4 -245 -181 334 294 -108 -100 -230 38 561 379 -43 -13 147 214 142 -324 -371 -108 159 43 -100
5702 -100 -186 -291 -7 -117 -54 -361 -227 50 64 -366 -186 -70 200 -305 -86 -539 -85 401 6 -288 -256
5723 -256 -176 6 -62 299 -329 -133 45 128 113 -327 -491 179 342 45 -26 -205 300 211 -65 -142 -408 -259
5745 -259 172 67 -109 -285 137 -86 -38 -26 -531 -39 246 52 -100 -487 -258 -19 523 18 20 -78 424 167
5767 167 334 -134 -43 375 -13 93 -134 -254 370 760 236 -260 -299 227 341 31 22 -178 340 190 99 -57
5789 -57 -440 297 306 89 -252 -329 -63 8 -62 -98 -279 -107 168 347 -88 103 -135 308 -12 102 -358 -46
$$ packed form
5635F9l88j47N43J29j45k16r9J95L54k00k00j31N2K75J41k64J78k6M72j98n70
5656a76o8J68K71j09P5m70K23L27k69R0k80k69P74%l51q9l8K04K02k06l04L79
5678H4k1P0j29k49O4N15m0m02Qj30K68N23j82m22L0J60O7p2m66m7K63K67j16j43
5702a00q6j05K84j10O3l07J34K77J4m30J80J16K70n05K19m53M54M86l95k94L2
5723b56Q0J82o8L61o28J96J78Q3j5m40j64O70J63k97p1j79N05q9k76p7k66J49
5745b59M31j05j76j76M22k23M8J2n05M92K85j94j52l87K29K39N42n05Kr8N02k57
5767A67J67m68R1M18l88J06k27j20O24L90n24m96l9N26J14l10rk00N18j50r1j56
5789e7l83P37Rk17l41p7K66P1p0l6j81J72K75J79m35J91k38M43l20J14m60L12
$$ plain form
5811 -46 -19 347 3 -408 -261 230 390 46 -235 -177 -10 306 26 -326 -234 157 49 223 -326 -315 -44 -34
5833 -34 199 -419 -164 -48 368 -82 -303 47 -78 191 159 33 -313 -141 245 -428 -298 -198 -242 477 -26
5854 -26 -4 -333 -47 69 198 -276 -236 -126 62 51 -167 -96 165 321 -37 -292 -372 -42 242 -40 19 -175
5876 -175 54 22 379 196 -339 -460 -167 84 -34 -160 -272 289 -55 141 -154 -85 131 471 78 -13 -368
5897 -368 47 50 293 8 -90 132 155 124 -8 -65 -77 687 223 -70 -30 6 250 446 -64 -299 79 192 471
5920 471 108 -114 12 35 362 171 -302 -43 18 39 67 -295 -356 -102 -24 -36 -20 -193 39 153 108 -124 -207
5943 -207 18 207 235 -312 -343 -335 393 55 -44 -91 -367 497 215 -56 -235 -34 -41 350 10 -85 -334 15 38
5966 38 77 -359 -219 30 127 -20 -300 -300 7 18 -81 -42 28 49 10 52 -59 -233 113 289 -6 -137 -21 22
$$ packed form
5811d6K7L66l44m11J47M91J60l44k81N8J67L16k80l52R2L91j08J74n49J1K71J0
5833c4K33o18K55J16M16m50k21L50j25K69l2j26l46J72L86o73J30J00m4P19n03
5854b6K2l29K86J16J29m74M0J10J88j1k18P1K61J56l58k55q0L30K84k82N9j94
5876a75K29l2L57j83n35j21K93K51j18j26j12N61l44J96k95O9K16L40l93r1l55
5897c68M15LK43k85r8K22K3l1j32n7j2P64m64k93M0L6K44J96n10k35L78J13K79
5920D71l63k22J26K3L27j91m73K59O1K1K8l62o1K54P8j2J6j73K32J14m5k32q3
5943b07K25J89K8n47l1QP28l38r9m7k76Q64k82k71j79K01pL91l40r5k49L49K3
5966C8L9m36J40K49R7j47k80%L07J1r9L9P0K1l9M2j11j74L46J76k95j31J16M3
$$ plain form
5990 22 116 -35 -67 -38 15 216 -156 -188 66 -44 10 325 41 -418 -190 33 97 -141 -213 -302 121 470 25
6013 25 -125 -300 77 474 -27 -151 -233 39 244 240 -94 -181 115 373 84 -228 -241 110 145 6 257 -46
6035 -46 -133 267 18 -280 -155 28 537 -6 -360 77 178 321 -20 110 -450 -289 170 -108 -101 -160 -38 249
6057 249 65 165 -242 -40 -101 -5 -4 -429 -97 282 90 -150 -70 195 -173 147 59 -148 24 32 271 -12 -182
6080 -182 -270 -225 169 -111 -229 3 -168 190 81 -163 77 -52 321 -88 -196 -38 -64 215 103 95 -338 -68
6102 -68 -152 -172 -201 -187 -38 68 197 -122 -190 -205 86 -131 42 -308 -133 101 275 5 -86 86 108 -65 -160
6125 -160 -137 143 -31 -117 -51 -369 -300 -275 125 -59 -145 -227 65 253 237 120 -171 -178 -7 -33 15 -204 -34 297
6149 297 -51 22 203 -7 69 185 198 -103 -134 40 290 171 -59 46 383 167 -206 -126 46 112 403 89
$$ packed form
5990B2R4j51l2K9N3K01l72l2K54j10N4L15k84m59K28K23O4k38p2q9M23L49m45
6013B5j50j75L77L97n01j24q2K72K05ml34q7K96K58k89l12j3L51L5j39K51l03
6035d6q7M00k49k98J25J83N09n43l54M37J01J43l41J30n60J61M59k78Pn9J22K87
6057B49j84J00m07K02o1R6Jm25L32L79j92k40Q0K65l68L20q8k07J72QK39k83j70
6080a82q8M5L94k80j18K32j71L58j09k44K40j29L73m09j08J58k6K79j12qm33K70
6102f8q4k0k9J4J49J06J29l19o8j5K91k17J73l50J75K34J74k70r1J72K2j73r5
6125a60K3K80j74q6O6l18O9K5M00j84q6q2K92J88j6j17k91pJ71k6M8k19J70L31
6149B97l48P3J81k10P6J16J3l01l1J74K50j19k30J05L37k16l73Q0J72O6K91l14
$$ plain form
6171 89 -90 -317 -22 71 49 -131 -66 174 381 156 78 53 28 97 101 2 -187 -8 60 4 49 -112 8 201 205
6196 205 224 -213 -244 -169 162 84 24 43 58 204 -67 -274 -201 240 50 -201 -177 133 -216 57 84 -73 -295
6219 -295 28 -80 -228 -125 -251 -172 48 10 -167 -334 19 78 152 102 -103 -229 62 358 -105 52 -49 119
6241 119 -179 -209 -208 -172 181 59 -42 160 232 21 -54 -88 -161 6 512 306 33 142 -13 189 -58 -93 41
6264 41 106 0 195 246 93 100 61 76 -99 -170 -23 48 308 120 -136 321 74 63 229 -48 24 -116 132 122
6288 122 -63 36 -84 123 253 88 -111 -270 -31 219 68 353 -83 130 19 79 134 -250 58 230 -157
6309 -157 268 69 23 -18 -39 -324 -333 80 -42 5 -295 26 -79 -240 -55 -127 -172 -19 190 39 -14 50 -188
6332 -188 69 -76 -119 -47 -29 165 58 -35 -193 -81 20 115 59 -362 -47 25 100 433 -155 -174 16 -26 -141
$$ packed form
6171H9j79k27K95R3k2j80O5K40K07k25p8k5k5O9Mr9j89J79O8n6M5j61J20J93M
6196B05J9m37l1P5L31p8o0J9J5J46k71k07P3M41j90k51K4L10l49K73K7j57k22
6219b95L23j08j48J03j26P9K20l8j77j67L53N9P4n0k05j26K91K96m63J57j01J68
6241A19k98l0JL6L53j22j01K02P2k11p5l4p3J67N06k06k73J09j55K02k47l5J34
6264D1O5j06J95N1j53Pl9J5j75p1J47P1K60j88k56M57k47j1J66k77P2j40K48j0
6288A22j85R9j20K07J30j65j99j59K39K50j51K85m36K13j11O0N5l84L08J72l87
6309a57M25j99m6m1k1k85rM13j22M7l00L21j05j61J85p2m5J53K09j51n3O4k38
6332a88K57j45m3P2J8J94j07r3j58J12J01R5n6m21L15P2P5L33n88j9J90m2j15
$$ plain form
6355 -141 -14 -121 200 285 80 -373 -100 62 -7 272 -29 -277 -191 346 -27 -52 -213 269 -14 246 33
6376 33 -52 -57 156 6 160 -135 -147 88 288 -246 -248 84 149 149 6 -37 -275 128 124 -89 100 -162 221 34
6400 34 50 -56 67 76 83 -140 -222 57 269 -56 -191 -4 134 -69 -21 -112 -346 -175 161 142 75 -319 -77 247
6424 247 89 137 -128 247 -133 194 267 300 -56 29 283 255 107 45 2 149 41 335 -249 7 12 -62 -178
6447 -178 -146 -199 156 353 -31 -77 -237 56 367 -147 -98 39 -14 -66 34 -5 -274 167 14 226 39 -169
6469 -169 212 115 26 -429 -200 87 186 164 -51 -249 -121 -36 -69 -214 -16 -53 -148 -11 69 -209 -245 -26 -27 -72
6493 -72 -241 162 -239 -208 -126 -347 122 101 -186 -152 68 -109 306 -178 -76 178 -258 121 52 -36 -116 -46 183
6516 183 -118 125 129 -91 -13 232 83 -159 -115 -15 332 192 -154 -33 -214 212 -203 222 -277 -100 -34 1
$$ packed form
6355a41J27j07L21Q5k05m53K73J62o9K79l01k48Q6N37l73k5j61M82k83K60k13
6376C3q5nK13j50J54k95j2K35K00n34kL32O5%j43m3k38M03mk13J89k62L83j87
6400C4J6j06J23RPk23q2K79K12l25j35J87J38k03M8r1k34J71L36j9o7l94K42L24
6424B47j58M8k65L75l80L27P3L3l56Q5K54k8j48o2m3J47j08K94n84K56Np4j16
6447a78L2n3L55J97l84m6j60K93L11n14M9J37n3n2J00l9k69M41j53K12j87k08
6469a69L81r7q9m55K29K87R9k2k15j98J28Q5l3j45J98l7r5J37Q0k78l6K19jm5
6493g2j69M03m01L1Q2k21M69k1k87L4K20j77M15m84J02K54m36L79o9q8q0P0K29
6516A83l01K43Mk20P8K45j49k42M4J00L47j40l46J21j81M26m15M25m99J77O6L5
$$ plain form
6538 1 212 -383 -101 127 294 128 21 88 39 -45 -1 15 -93 -233 276 57 263 88 108 58 137 -120 -294
6561 -294 122 -133 67 291 -76 -41 206 29 -32 -149 116 203 148 -17 184 -19 275 31 -136 -12 -217
6582 -217 320 224 53 -24 41 80 106 -83 60 12 123 16 41 -111 -146 213 20 49 -184 -79 52 127 108 6
6606 6 -79 -301 -43 162 -249 -207 -200 -29 201 -306 -215 36 -160 -51 -147 -136 -308 -159 106 -336 61 -169 -159
6629 -159 308 154 -145 50 17 -120 -6 -310 -288 -124 23 -80 -402 227 -50 30 -53 -77 217 -2 331 -4
6651 -4 -267 -242 -45 382 147 92 -80 236 120 46 -131 -86 -61 316 133 74 -275 -83 29 -228 142 -90 180
6674 180 338 307 -152 -63 -37 -23 194 10 -297 -118 325 195 -38 -177 -46 -122 191 152 -173 48 -148 127
6696 127 203 -63 -254 112 1 199 141 -158 -46 167 30 -126 -143 -165 120 74 135 -10 -32 166 14 -29 -217
$$ packed form
6538AK11n95K82K28J67j66j07O7m9q4M4J6j08j40N09k19K06j75K0n0P9k57j74
6561b94M16k55K00K24l67L5K47j77o1j17K65Q7n5j65K01k03K94k44j67J24k05
6582b17N37r6j71p7O5L9K6j89J43m8J11j07K5j52l5L59j93K9k33J05J31P5j9j02
6606Fq5k22K58K05m11M2PJ71K30n07R1K51j96J09r6J1j72J49K65m42L97k30J0
6629a59M67j54k99J95l3j37J14l04K2J64J47j03l22O29k77Q0q3k4K94k19L33l35
6651dk63K5J97M27k35n5j72L16j16p4j77M5K5L77j83n9l49J92J12k57L70k32K70
6674A80J58l1m59Q9K6J4K17j84l07J79M43j30k33j39J31p6L13l9l25K21j96K75
6696A27P6k66j91L66j11J98n8k99J12K13j37j56j7k2K85m6O1j45k2J98j52m3j88
$$ plain form
6719 -217 -45 -108 -5 -33 77 -26 287 56 -233 -51 170 -93 191 -132 -104 -112 -275 364 203 -111 -297 285
6741 285 14 205 -174 26 203 169 0 141 -173 7 -392 261 -270 -419 -27 394 -138 -278 83 -74
6761 -74 166 -50 117 -530 178 46 94 35 -185 -69 121 -51 -282 -178 -250 -111 46 -268 -223 -183 -76 -98
6783 -98 54 -209 -2 -85 -169 84 115 -77 -62 -20 -38 -2 61 15 -64 -66 36 -91 148 252 114 -91 113 -392
6807 -392 63 283 -16 -93 -25 75 221 53 -244 44 -36 63 232 41 -152 -69 -83 -44 -88 17 90 100 138 -194
6831 -194 -202 -16 252 470 -183 -106 299 -187 360 147 -116 93 267 -1 -97 -39 -36 -96 230 23 -363 -145 184
6854 184 138 -67 -346 26 -81 48 50 31 -272 133 -107 -261 -140 71 57 72 263 42 -32 34 171 104 52
6877 52 -60 -20 191 -135 -59 140 84 -108 -111 -20 -168 -1 46 53 169 41 224 8 250 -34 -390 144 -114
$$ packed form
6719b17J72o3J03k8J10j03L13k31k89J82K21k63K84l23K8qj63O39j61l14j86N82
6741B85k71J91l79K00J77l4j69J41l14J80l99O53n31j49L92M21n32j40L61j57
6761g4K40k16J67o47P08j32M8n9k20J16J90j72k31J04p2J39J57l14M5M0J07k2
6783i8J52k63K07q3q4K53L1j92J5M2j8L6O3m6p9kJ02j27K39J04j38k05K04n05
6807c92M55K20k99p7O8J00J46j68k97K88q0R9J69j91j93Q3j4L9m4J05P3J0L8l32
6831a94qJ86K68K18o53P7M05m86N47k13k63K09J74k68r6N8Lo0L26k07l86K18L29
6854A84m6k05k79L72j07J29Kj9l03M05k40j54J21K11j4J5J91k21p4O6J37o7n2
6877E2j12M0K11l26P6J99n6j92lR1j48J67M7PJ16j28J83k16K42k84l56N34k58
$$ plain form
6900 -114 266 -70 -78 -105 84 87 -157 -59 88 250 103 -194 -402 -97 -88 -24 261 33 91 -125 112 199 143 198
6924 198 46 64 283 -52 -257 -79 -99 217 -190 -68 138 151 13 181 -178 249 255 176 75 -130 363 -92
6946 -92 53 -152 -48 64 -144 -123 -308 -194 -23 233 39 219 -68 269 142 -25 -340 -212 -195 -14 137
6967 137 20 -109 -117 -68 -262 48 -138 -185 -105 91 -81 -95 -8 -95 -297 101 -87 263 -148 127 166 -151 84
6990 84 -157 14 -26 8 -40 -62 84 252 432 -99 -152 77 -156 91 -161 -58 -130 113 -74 160 -145 316
7012 316 -331 -28 -73 154 -82 103 -19 -165 -276 30 190 79 -173 -109 -86 -233 3 -193 138 -217 16
7033 16 -150 -235 -358 -243 -175 70 -35 -115 -1 167 80 97 -182 77 -106 -73 -77 -66 -42 62 53 43 -228 -63 65
7058 65 339 -135 197 97 -36 -42 59 -104 58 -95 150 12 -47 182 -282 46 -110 -156 -59 -12 297 3
$$ packed form
6900a14L80l36qk7J89Lk44R8J47J62j47k97k08L05RO4K85k28N8k16K37Q7n6N5
6924A98j52J8K19l35k05J78k0L16m07J22K06J3j38J68l59M27Op9j01k05M93m55
6946i2J45k05J04J12k08K1j85J14J71K56j94J80k87L37j27j67l15J28J7J81J51
6967A37j17j29qM9j94L10j86m7Q0J96j72j4Q7q7k02L98j88L50m11K75L9l17K35
6990H4k41J71m0L4m8k2J46J68J80n31n3K29k33K47k52J03p2K43j87K34l05M61
7012C16o47L03m5K27k36J85j22j46j11L06J60j11k52O4K3j47K36j96L31l55K33
7033A6j66q5j23J15O8K45j05q0J14J68q7J7k79K59j83L3mJ1K4J04rj0k71J65J28
7058F5K74m74L32j00j33oJ01j63J62j53K45j38n9K29m64L28j56m6R7M7L09k94
$$ plain form
7080 3 -220 97 74 113 125 85 80 36 240 30 -54 121 186 144 150 0 -136 -104 -4 -301 -89 53 -193 258 -250
7105 -250 -231 47 -86 242 296 -54 -551 -140 215 -12 -27 37 -157 -48 -89 21 -37 -72 26 222 -1 -13 -138
7128 -138 182 185 -130 165 -225 85 218 -123 -182 39 54 225 19 -87 -46 -242 -42 91 88 -315 -61 80
7150 80 83 -30 -240 -103 -29 137 -32 -142 45 -1 -98 -615 -34 -274 200 82 -140 -37 84 31 -52 208 -94
7173 -94 -294 0 -70 110 -303 279 -39 145 120 -304 -58 -57 -37 260 70 -36 98 -3 18 52 -142 -58 194
7196 194 12 99 -125 276 34 -187 82 -92 -19 66 -31 -135 -197 -14 233 177 46 97 -146 3 250 -39
7218 -39 -47 -10 -13 168 -42 -15 123 32 64 113 52 -30 -324 36 24 -67 105 230 112 -74 77 -261 127 71 256
7243 256 9 -41 41 -90 -94 31 -72 0 319 290 153 272 65 112 92 -224 -28 -117 -124 -121 64 160 -157 -97 35
$$ packed form
7080Ck23L17k3L9J2m0nm4K04k10q4J75O5m2Oj50j36L2J00k97K12J42k46M51n08
7105b50J9K78j33L28N4l50m97M11L55k27j5O4j94J09m1J10n8l5R8J96k23j2j25
7128a38L20Ll15K95l90L10J33l41n9K21J5J71k06j06M1j96K00J33lm03K54J41
7150H0Lj13k10J37P4J66j69j10J87m6r7n17N81k40M74j18k22J03J21n3q3K60l02
7173i4k00K94p0J80m13N82l18J84k5m24K46JK0K97j90j06J34j01K1L4j94Q4K52
7196A94j82Q7k24M01k42k21K69j74P3Q5r7j04o2J83K47n6j31N1k43J49K47k89
7218c9qL7lJ81k10K7J38r1L2M9o1q2k94L60j2r1J72J25j18j86J51l38L88n6J85
7243B56k47n0Q2j31mJ25j03P2L19k9j37J19k07M7k0l16J96q9pLJ85R6l17O0J32
$$ plain form
7268 35 -237 153 62 381 112 -309 84 -53 136 -323 0 -246 -64 -149 -240 11 2 91 -231 -51 -33 163 -160
7291 -160 -15 208 190 -82 -130 -15 -6 -4 -313 34 -134 -226 -25 -105 -112 -14 -35 -190 246 -12 -127 -435 4 -66
7315 -66 -44 -32 56 -120 18 -151 -84 -170 14 -23 58 194 71 -88 129 -138 -159 -32 -66 258 -18 -58 -174 78
7339 78 -127 -44 -201 -85 177 255 76 -286 122 -42 -140 -21 53 -44 61 -30 -23 104 -11 -168 -324 -29 81
7362 81 127 211 365 -71 78 -88 -37 -121 198 99 -199 98 -43 14 160 166 -169 291 -67 86 60 121 48 72
7386 72 -95 158 -145 248 74 -110 249 138 -204 206 -71 -291 -162 -166 -123 116 48 43 5 170 -122 -57 -135
7409 -135 257 45 16 -205 146 -84 85 224 -348 186 -57 -298 12 157 -121 -249 -2 73 -263 -136 233
7430 233 125 10 -400 -46 338 75 -12 -135 -69 114 -25 -53 -55 186 31 -168 -64 9 60 134 80 -26 18
$$ packed form
7268C5k72L90r1L19k69m21L93j37J89m59L23k46J82q5r1K51rQ9l22J80J8J96l23
7291a60J45K23j8k72m8J15RKl09L47j68r2K01q0pR8k1j55M36k58j15l08M39p0
7315f6K2J2Q8j76J38j69O7q6J84l7Q1J36j23j59K17k67k1J27l4L24k76m0j16K52
7339G8k05Q3j57J16K62P8j79l62M08j64r8J19P4r7J05r1PJ27j15j57j56K95J10
7362H1M6Q4J54m36J49j66N1q4L19r9k98K97j41N7J46Ol35M60l58J53k6O1p3K4
7386G2j67K53l03L93j74j84L59j11l42M10k77k20J29mM3K39o8nl8J65k92O5p8
7409a35L92k12k9k21L51k30J69J39n72N34k43k41L10J45k78j28K47P5l36J27L69
7430B33j08j15m10L54L84k63q7j23O6J83j39k8kK41j55j99J04P3N1P4n4j06M4
$$ plain form
7453 18 -145 26 104 78 12 73 107 172 83 -128 -66 -176 -105 104 -100 65 -170 -54 52 35 11 71 -110 -40 -6
7478 -6 -132 93 107 -71 -295 -56 -52 283 121 -78 87 99 -159 -122 81 -19 -188 -95 -93 14 414 -79 -91 16
7502 16 -27 -72 -76 -124 -175 37 -87 -111 137 126 111 22 -94 -6 66 -102 133 -156 123 -73 142 -91 -339 171
7526 171 23 -57 96 30 99 214 272 -11 336 -196 -178 -80 90 142 181 110 -91 59 -141 77 -41 -43 -175 -5
7550 -5 -66 -83 -148 -230 -469 -270 -101 -31 -154 -94 -22 -10 -23 180 7 92 -5 -55 129 41 118 41 146 -62 3 76
7576 76 -1 -94 81 19 117 67 -63 277 116 176 68 44 -10 58 -171 -215 -91 54 329 -90 81 118 127 -206 163
7601 163 56 79 58 48 -102 53 -420 -16 -10 41 -235 -157 -341 55 -53 -270 -187 104 269 -385 270 -105 97
7624 97 242 172 58 17 64 -99 -145 243 100 96 217 -178 -55 -24 -142 241 -309 -76 -61 -212 -31 13 -110
$$ packed form
7453A8j63J71P8k6o6O1L4O5q9k11O2j10P1K09k04J65k35J16J06j7k4O0j81P0L4
7478fj26K25J4j78k24K39ML35j62j99J65J2k58L7K03j00j69R3KJ07M00m93j2J07
7502A6m3m5mm8n1K12j24k4K48j1j5q9j16Q8P2j68K35k89K79j96K15k33k48N10
7526A71j48q0J53o6O9J15N8k83L47n32J8R8J70N2L9p1k01J50k00K18j18kj32J70
7550eo1j7o5q2k39J99J69P0j23O0P2J2j3K03j73Q5r7n0J84q8P7p7J05k08O5P3
7576G6p7r3J75o2R8n0j30L40j61O0j08k4n4O8k29m4J24J45K75m19J71L7Rl33L69
7601A63j07K3k1j0j50J55m73M04ON1k76P8j84L96j08k17Q3K91J65o54O55l75K02
7624I7J45p0j14m1M7j63m6L88j43mJ21l95J23L1j18L83n50K33J5j51J81M4j23
$$ plain form
7647 -110 186 79 93 290 -108 -190 -284 312 -243 -110 -192 -16 -227 -181 96 -32 -61 105 -276 15 -268 34
7669 34 -124 263 -89 -36 418 14 -78 -25 113 -100 -53 -92 -167 315 -93 181 -101 -129 29 4 171 -151 -55
7692 -55 201 105 -39 -477 -24 41 19 -37 -85 14 -13 -64 -218 128 29 231 -136 -155 -127 190 107 226 -53 76
7716 76 42 159 165 165 446 -15 -69 70 -172 208 191 -64 131 57 79 -80 144 45 9 -193 -178 276 127 -58
7740 -58 -22 104 347 -48 -385 -4 127 265 -26 -174 -4 -182 -15 301 -149 -42 -236 108 96 227 55
7761 55 -226 -125 -163 109 32 -65 216 263 -219 33 -26 109 -95 -173 -87 -27 -23 -86 -131 124 -58 69 -245 17
7785 17 -110 -22 -106 74 -111 36 41 32 -53 120 -90 -63 -111 28 -80 -10 284 17 -66 222 131 167 105 -49 112
7810 112 -24 -2 -150 -25 233 -192 -12 103 -197 83 76 -263 -48 -229 244 129 -91 -263 7 100 -305
$$ packed form
7647a10K96j07J4J97l98q2r4N96n55J33q2J76k11M6K77j28k9J66l81K91k83L02
7669C4j58L87l52N3M54m04r2N3J38k13M7l9p5M82m08K74k82k8J58k5J67l22R6
7692e5K56r6j44m38M53O5k2n6m8R9k7n1j54L46r9K02l67j9K8L17q3J19k79J29
7716G6l4J17O%K81m61n4J39k42L80j7k55J95p4K2j59K24r9l6k02J5M54j49j85
7740e8L6J26K43l95l37L81J31J38k91j48J70j78J67L16m50J07j94L44j2J31j72
7761E5k81J01l8K72p7r7K81M7m82K52n9J35k04p8Q6O0Mo3m5K55j82J27l14K62
7785A7j27Q8q4J80j85J47Nrq5J73k10K7m8J39j08P0K94k67q3K88r1L6o2j54J61
7810A12j36K2j48J25K58m25J80J15l00K80pl39K15j81M73j15k20j72K70R3m05
$$ plain form
7831 -305 -86 -130 -26 -49 -115 -138 4 -125 -396 9 -19 -111 -44 417 -55 73 -11 -25 -50 -120 -7 -33 -52 -79 -5
7856 -5 3 -178 -79 53 -198 -12 6 33 -149 114 -353 -42 -249 -87 -219 -419 -78 51 -277 81 120 -147 -325
7879 -325 -72 46 57 70 140 -69 -38 45 -82 131 -18 -26 -155 54 -109 -177 -136 106 -83 -248 145 -159 46
7902 46 97 -27 84 169 99 12 104 36 49 120 -26 -175 126 -24 167 114 -113 91 -24 135 138 243 -210 -2
7926 -2 -201 -22 222 -204 -140 -72 45 -134 -220 148 391 -242 -199 46 24 130 -85 361 27 183 44 -10 -42
7949 -42 33 -29 190 -201 337 -84 -36 21 -45 25 -111 -46 -57 -103 -165 -47 200 16 105 -67 8 256 -168 64
7973 64 -36 91 162 8 17 34 -168 142 83 191 267 -26 -165 -26 34 -77 127 -173 5 -184 -273 150 10
7996 10 -161 -212 -371 304 -37 -44 -59 35 109 7 -196 -35 119 1 163 -95 -54 141 -51 122 -366 125 -82
$$ packed form
7831c05K19m4J04k3o6k3J42j29k71M05k8r2O7M61m72J28q4j4k5p0J13k6j9k7P4
7856eQj81R9J32k51J86J8K7j82K63m67L11k07J62j32k00L41J29l28L58L9k67j78
7879c25K53J18J1J3P0k09L1Q3j27K13j49qj29K09j63o8M1K42j89j65L93l04K05
7902D6N1j24J11Q5p0q7R2o8J3P1j46j49L01j50J91n3k27K04j15J59LJ05m53K08
7926bj99J79K44m26O4O8J17j79q6L68K43o33M3K45k2J06k15M46l34J56j39n4l2
7949d2P5o2K19l91N38m21M8N7o6P0j36O5j1m6o2J18K47j84Q9j72P5K48m24K32
7973F4j00J27P1j54RJ7k02L10n9J08P6k93j39J39O0j11K04l00J78j89q9M23j40
7996A0j71n1j59O75l41pj5R4P4j02k03J61J54j18J62k58M1J95j92J73m88M91k07
$$ plain form
8019 -82 138 214 277 179 -221 32 1 -118 -352 126 183 178 -298 -217 -23 -10 -137 8 -171 325 204 36 91 -191
8043 -191 -172 14 125 67 38 18 -20 -60 -188 43 16 13 162 -68 -12 -87 43 -143 51 160 -173 70 218 -45
8067 -45 -150 212 166 -19 8 56 -75 -49 39 -107 -202 81 154 -108 -78 240 -89 -14 -202 -197 124 340 106 -111
8091 -111 -29 -198 30 349 -127 88 187 -69 4 -166 160 -189 51 -176 -214 -26 161 -50 -69 36 -59 -83
8113 -83 129 1 -142 58 -86 137 -116 241 -208 90 -38 99 -150 -167 218 186 -136 -107 81 -102 123
8134 123 -123 -19 182 -7 -167 -80 -418 -271 51 -23 102 71 110 -40 -239 153 77 -41 -166 -39 -220 -8
8156 -8 -206 -305 -30 -109 121 -198 259 76 140 37 -21 160 -16 161 -126 -30 21 28 -250 -257 -146 19 -123 -136
8180 -136 125 -144 40 67 -101 -61 154 -178 -79 -32 -453
$$ packed form
8019h2K20P6O3r8m00K53l1j19k34M78N7nm76Q1J94J3j27J45j79M96j21j68N5k82
8043a91J9J86J11n8k9k0l8m0j28K31k7lJ49k30N6p5J30j86J94J09l33K43J48k63
8067d5j05L62m6j85K7M8j31K6Q8j46r5K83P3k62L0L18l29P5j88NL21K16k34k17
8091a11Q2j69K28L19m76K15R9k56P3j70L26l49K40k27l8J88J87k11j9J05r5k4
8113h3K12j28j43K00j44K23k53L57m49K98j28J37k49j7L85l2l22K9J88j83K25
8134A23k46J04K01j89j60Q7l38J47L22p4J25l1L9j50j99L92p6j18j25J27j81K12
8156hj98r9K75p9K30l19M57j83O4j03n8J81j76J77k87R6N1Pk78pJ11J65j42j3
8180a36K61k69J84K7j68M0K15l32R9M7m21
8191d53
$$ Imaginary data points
##PAGE= N=2
##DATA TABLE= (X++(I..I)), XYDATA
$$ plain form
0 0 0 0 0 0 0 0 1 -8 8 -8 8 -16 16 -24 24 -32 40 -45 49 -64 72 -81 97 -113 129 -145 168 -190 214 -241 273
31 273 -306 343 -383 430 -478 529 -588 652 -724 800 -886 982 -1087 1205 -1334 1486 -1656
48 -1656 1851 -2079 2350 -2675 3074 -3585 4254 -5179 6551 -8786 13073 -24298 114657 259736
62 259736 -1244 -130613 -54321 101737 107962 37791 -20010 7588 72016 113614 42794 -67991
74 -67991 -75646 57953 143617 68588 -54145 -44873 47335 71129 -3213 -57398 -27626 45757
86 45757 79112 40540 -35376 -69957 -38018 11581 25857 15216 6459 3237 -13025 -42334 -58115
99 -58115 -28677 31358 50448 -4322 -61867 -45504 8710 10887 -35885 -46443 671 34287
111 34287 12430 -25484 -42496 -39227 -12733 23544 18395 -29062 -34924 26192 45765 -33617 -97489
$$ packed form
0@%%%%%%JrJ6j6J6k4L2m0M8n6P2q5R4j13J36j53J78k10K42k74L13l58M04m55N14
31B73n79O49p26Q13r08J007j117J240j376J524j686J868k069K292k539K820l142
48a656L507l930M429n025N749o659P839r433J1730j5337K1859l7371J38955J45079
62B59736k60980j29369P6292J56058O225p0171n7801K7598O4428M1598p0820j10785
74f7991p655J33599Q5664p5029j22733R272R2208K3794p4342n4185K9772P3383
86D5757L3355l8572p5916l4581L1939M9599J4276j0641q757l222j6262k9309j5781
99e8115K9438O0035J9090n4770n7545J6363N4214K177m6772j0558M7114L3616
111C4287k1857l7914j7012L269K6494L6277n149m7457n862O1116J9573p9382o3872
$$ plain form
124 -97489 -41143 60078 77822 12649 -50147 -64834 -34487 20334 49597 12972 -43280 -32482
136 -32482 28400 35306 -29490 -63242 -14794 43176 39529 -3577 -33894 -31724 -1731 26908 17446
149 17446 -22667 -33685 8520 51577 35920 -25804 -61867 -27588 40898 68945 30713 -23255
161 -23255 -36140 -4514 27536 30219 12259 -681 5038 22581 28277 4987 -22239 -6568 40770
174 40770 50225 3317 -28695 -1985 33356 26612 -480 -12002 -7292 7970 29965 30230 -7383
187 -7383 -39381 -19459 21691 22873 -7256 -11588 7766 904 -29571 -28108 8483 23774 690
200 690 -23850 -27661 -15554 4115 14812 -4513 -33769 -26256 12454 22470 -14309 -42174 -16451
213 -16451 27026 22812 -25509 -47518 -8185 42180 36374 -20944 -59670 -28090 40908 63109
$$ packed form
124i7489N6346J01221J7744o5173o2796j4687L0347N4821K9263l6625n6252J0798
136c2482O0882O906o4796l3752M8448N7970l647m3106l0317K170K9993K8639r462
149A7446m0113j1018M2205M3057j5657o1724l6063L4279O8486K8047l8232n3968
161b3255j2885L1626L2050K683j7960j2940N719J7543N696k3290k7226J5671M7338
174D0770R455m6908l2012K6710L5341o744k7092j1522M710J5262K1995K65l7613
187g383l1998J9922M1150J182l0129m332J9354o862l0475J463L6591J5291k3084
200F90k4540l811J2107J9669J0697j9325k9256P513L8710J0016l6779k7865K5723
213a6451M3477m214m8321k2009L9333N0365n806n7318l8726L1580O8998K2201
$$ plain form
225 63109 8233 -56155 -48567 22110 67775 31607 -39907 -52262 13376 66101 29901 -39957
237 -39957 -41396 24123 60803 21006 -38203 -41860 12441 60475 42967 -24638 -62079 -18068
249 -18068 55053 60466 -10162 -58724 -21195 39742 36889 -13176 -33232 -5878 21654 18128 -6367
262 -6367 -23173 -11637 16815 20992 -10549 -34067 -9648 31318 28556 -17030 -41021 -12266 24408
275 24408 20021 -9397 -17105 204 10432 -2185 -20404 -15986 12215 31501 10442 -30542 -39637
288 -39637 -1347 36986 26097 -21286 -44074 -9660 36801 30462 -20638 -46026 -14473 28253
300 28253 28274 -7194 -30992 -16281 14312 20117 -7900 -33667 -18793 24712 40539 -465 -50044
313 -50044 -42282 14469 45624 17792 -24545 -32483 -8620 16257 18440 -2122 -21827 -14091 14170
$$ packed form
225F3109n4876o4388P588P0677M5665l6168p1514j2355O5638N2725l6200o9858
237c9957j439O5519L6680l9797n9209l657N4301M8034j7508o7605l7441M4011
249a8068P3121N413p0628m8562L7529O0937k853n0065k0056K7354K7532l526k4495
262f367j6806J1536K8452M177l1541k3518K4419M0966k762m5586k3991K8755L6674
275B4408m387k9418p708J7309J0228j2617j8219M418K8201J9286k1059m0984r095
288c9637L8290L8333j0889m7383k2788L4414M6461o339n1100k5388L1553M2726
300B8253K1l5468k3798J4711L0593N805k8017k5767J4874M3505J5827m1004m9579
313e0044P762N6751L1155k7832m2337p938K3863K4877K183k0562j9705P736K8261
$$ plain form
326 14170 23731 1188 -22404 -14523 11233 17824 466 -10413 -706 11127 10274 1658 -8104 -11148
340 -11148 1125 22687 26907 3659 -20491 -18015 5206 22945 20531 5587 -5990 -6132 877
353 877 9764 11848 4196 -2559 2373 11632 8771 -1648 -3167 4679 8013 2744 -694 4166 9678
368 9678 6108 -3037 -6214 -2197 2041 5460 9544 7186 -3779 -10963 -9061 -3542 3094 13371 13616
383 13616 -5774 -26385 -20541 9460 25050 4354 -25094 -23821 4476 20138 4775 -21437
395 -21437 -26643 -6167 18948 16271 -14309 -33479 -11209 21758 15653 -23249 -38947 -4975 34947
408 34947 25803 -23867 -52181 -23179 25920 38757 3329 -37570 -36334 4272 31388 9704
420 9704 -28745 -28842 8069 28557 4663 -28293 -25469 7998 25989 4739 -23089 -20287 8213
$$ packed form
326A4170R561k2543k3592P881K5756O591j7358j0879R707J1833q53q616r762l044
340a1148J2273K1562M220k3248k4150K476K3221J7739k414j4944j1577j42P009
353H77Q887K084p652o755M932R259k861j0419j519P846L334n269l438M860N512
368I678l570r145l177M017M238L419M084k358j0965p184J902N519O636J0277K45
383A3616j9390k0611N844L0001J5590k0696k9448J273K8297J5662j5363k6212
395b1437n206K0476K5115k677l0580j9170K2270L2967o105l8902j5698L3972L9922
408C4947r144m9670k8314K9002M9099J2837l5428m0899J236M0606K7116k1684
420I704l8449r7L6911K0488k3894l2956K824L3467J7991k1250k7828K802K8500
$$ plain form
433 8213 23742 7547 -19506 -24808 122 25774 19473 -8274 -20469 -4238 12677 7842 -4720
446 -4720 -513 15358 14409 -6504 -17910 -331 23851 23896 2222 -14027 -6306 16456 27291 10502
460 10502 -13562 -9373 19543 32495 10269 -15339 -7536 21668 29876 4567 -16986 -3475 26507
473 26507 33287 6608 -23448 -21582 13785 41969 26154 -16915 -33353 -3801 28925 23353 -9103
486 -9103 -24168 -5869 17897 13449 -11743 -23063 -8663 10315 10300 -8402 -23843 -15649 5780
499 5780 10928 -9004 -27984 -21092 2657 13035 -1455 -21271 -24377 -11284 -819 46 -2373
512 -2373 -6835 -12367 -14036 -7909 -2605 -1450 -1872 -3214 -6710 -7631 -2559 2083 -363 -5478 -3229 3956
528 3956 5205 -2391 -4681 4156 10331 2682 -6209 -2949 8072 14031 10351 -245 -9791 -5435 10188
$$ packed form
433H213J5529j6195k7053n302K4930K5652o301k7747j2195J6231J6915m835j2562
446d720M207J5871r49k0913j1406J7579K4182M5k1674j6249P721K2762J0835j6789
460A0502k4064M189K8916J2952k2226k5608P803K9204Q208k5309k1553J3511K9982
473B6507O780k6679l0056J866L5367K8184j5815m3069j6438K9552L2726n572l2456
486i103j5065J8299K3766m448k5192j1320J4400J8978j5j8702j5441Q194K1429
499E780N148j9932j8980O892K3749J0378j4490j9816l106J3093J0465Q65k419
512b373m462n532j669O127N304J155m22j342l496r21N072M642k446n115K249P185
528C956J249p596k290Q837O175p649q891L260J1021N959l680j0596r546M356J5623
$$ plain form
543 10188 19368 11352 -3326 -7847 86 8743 8893 4020 2696 2782 760 582 3719 5091 2128 -464
559 -464 2081 4323 3479 -246 -1238 2473 5589 2719 -3772 -4055 2857 10348 10104 -2017 -15281 -10654
575 -10654 11541 24227 8736 -15971 -18898 1625 17673 11629 -6331 -12783 -2006 10460 8804
588 8804 -5786 -14704 -4811 13603 13729 -8287 -21711 -6365 15767 12980 -9563 -22041 -10322
601 -10322 10393 15625 -545 -19267 -18644 -613 11569 5218 -9723 -12929 -2048 4763 -2939
614 -2939 -11048 -5018 6446 6680 -5195 -12550 -6125 6740 10113 -33 -8855 -3960 6746 8660
628 8660 2075 -3169 220 7381 8494 708 -3177 5996 16766 10369 -6561 -10630 7400 23943
642 23943 17125 -4702 -14325 -1072 16758 17890 2998 -9724 -5832 9802 15086 97 -14964
$$ packed form
543A0188R180q016j4678m521P933Q657J50m873j324Q6k022j78L137J372k963k592
559d64K545K242q44l725r92L711L116k870o491k83O912P491k44j2121j3264M627
575a0654K2195J2686j5491k4707k927K0523J6048o044j7960o452J0777J2466j656
588H804j4590q918R893J8414J26k2016j3424J5346K2132k787k2543j2478J1719
601a0322K0715N232j6170j8722O23J8031J2182o351j4941l206J0881O811p702
614b939q109O030J1464K34j1875p355O425J2865L373j0146q822M895J0706J914
628H660o585n244L389P161J113p786l885R173J0770o397j6930m069J8030J6543
642B3943o818k1827r623J3253J7830J132j4892j2722L892J5634N284j4989j5061
$$ plain form
655 -14964 -6622 13631 13948 -6576 -19209 -9086 9612 11992 -4268 -19579 -15703 2659 12577
668 12577 1874 -17389 -21695 -5606 9025 4412 -9957 -14176 -5779 -710 -4035 -8192 -6611 -314
682 -314 2109 -4155 -11336 -9104 -290 3590 -208 -4021 -3975 -1851 -437 -557 -649 482 2349 405 -3677
699 -3677 -1379 6003 9695 779 -10303 -7354 9334 17270 6546 -7749 -8475 1783 9998 9857
713 9857 1323 -4694 297 9687 6638 -5461 -7895 5263 15662 8250 -6056 -9201 1987 11722
727 11722 8680 -1141 -5936 -1695 8073 11781 3166 -6518 -3825 4889 7236 4113 3191 4480 2189
742 2189 -2628 -2489 2541 8654 9237 2873 -4158 -3430 3020 4864 340 -1840 2882 7347 2817 -6958
758 -6958 -9227 97 8530 5381 -5330 -11352 -4862 7945 7879 -9280 -20653 -8225 10537 11766
$$ packed form
655a4964Q342K0253L17k0524j2633J0123J8698K380j6260j5311L876J8362R918
668A2577j0703j9263m306J6089J4631m613j4369m219Q397N069l325m157J581O297
682c14K423o264p181K232Q814L880l798l813M6K124J414j20r2J131J867j944m082
699c677K298P382L692q916j1082K949J6688P936j0724j4295p26J0258Q215j41
713I857q534o017M991R390l049j2099k434J3158J0399p412j4306l145J1188R735
727A1722l042r821m795M241R768L708q615r684K693Q714K347l123r22J289k291
742B189m817J39N030O113N83o364p031P28O450J844m524k180M722M465m530r775
758f958k269R324Q433l149j0711o022O490J2807o6j7159j1373J2428J8762J229
$$ plain form
772 11766 -4324 -16818 -14195 -2487 4725 -40 -8698 -8975 504 4443 -5836 -17502 -12140 5072
786 5072 11521 388 -12415 -11503 -2385 3423 2049 -4159 -7105 -2115 6511 5211 -4291 -8235 -2483
801 -2483 2670 2766 2754 3667 3091 -1175 -5706 -4433 2453 8226 8728 2727 -3556 -3650 790 3009 36
818 36 354 6877 8330 890 -6975 -6452 1055 7727 7239 -827 -6622 -477 8783 5417 -7003 -10831
834 -10831 -512 11369 11129 750 -7568 -7547 -1218 5060 4839 802 528 4669 4200 -4276 -9373 -1142
850 -1142 9715 9997 3154 -1063 -2363 -1769 858 3887 4006 2937 3117 2862 301 -468 1158 810 -1518
867 -1518 -414 6544 10849 4195 -7344 -10334 -1679 7785 9028 2749 -3685 -3419 1986 1693 -6283
882 -6283 -8273 2937 12800 7013 -7691 -14938 -6982 6279 9215 -521 -10430 -6186 6105 7919
$$ packed form
772A1766j6090j2494K623J1708P212m765q658k77R479L939j0279j1666N362J7212
786E072O449j1133j2803R12R118N808j374o208k946M990Q626j300r502l944N752
801b483N153R6j2R13n76m266m531J273O886N773N02o001o283r4M440K219k973
818C6L18O523J453p440p865N23P507O672m88q066n795O145R260l366j2420l828
834a0831J0319J1881k40j0379q318K1O329O278k21m037k74M141m69q476n097Q231
850a142J0857K82o843m217j300N94K627L029J19j069J80k55k561p69J626l48k328
867a518J104O958M305o654j1539k990Q655R464J243o279o434K66N405k93p976
882f283j990J1210R863n787j4704p247P956J3261K936r736r909M244J2291J814
$$ plain form
896 7919 -4738 -15883 -9396 6701 11335 380 -9527 -7318 -773 859 -3125 -6681 -2471 7065
910 7065 7909 -5120 -16195 -9839 5438 9706 986 -6467 -4116 1158 909 -4794 -6582 -213 6976
925 6976 6302 -3173 -9783 -4019 6602 5725 -4738 -8688 2270 12039 6621 -7255 -13302 -4334 9564
940 9564 13229 1411 -8972 -4540 6875 6992 -3946 -9219 1058 13173 11718 -3127 -13494
953 -13494 -7282 8766 14642 3450 -9364 -7486 7525 13045 1176 -11130 -7184 6558 12275
966 12275 5146 -5420 -7119 539 8232 4332 -5548 -5054 5828 10873 1904 -9493 -8609 2798
980 2798 10221 6462 -3184 -6384 -1970 3586 3496 -1421 -3945 576 5287 2077 -4143 -4291 1263 3302
996 3302 102 -3085 -2248 1794 3961 1153 -4713 -5029 606 4637 2485 -1993 -2735 77 1178 -631
$$ packed form
896G919j2657j1145O487J6097M634j0955r907K209O545J632l984l556M210R536
910G065Q44j3029j1075O356J5277M268q720p453K351N274k49n703j788O369P189
925F976o74r475o610N764J0621q77j0463l950J0958R769n418j3876o047Q968J3898
940I564L665j1818j0383M432J1415J17j0938n273J0277J2115j455j4845j0367
953a3494O212J6048N876j1192j2814J878J5011N520j1869j2306L946J3742N717
966A2275p129j0566j699P658P693l900r880M94J0882N045q969j1397Q84J1407
980B798P423l759r646l200M414N556r0m917k524M521M711l210o220j48N554K039
996C302l200l187Q37M042K167k808n866l16N635M031k152m478p42K812J101j809
$$ plain form
1012 -631 -2274 -329 2264 2062 -548 -3487 -3360 1107 4790 1800 -3491 -4251 395 3372 2027 -26
1028 -26 -2012 -2571 232 3235 2833 -109 -2035 -607 1494 1767 -210 -989 -8 1739 2394 1025 -2440
1045 -2440 -3699 1051 5676 2313 -4365 -5473 705 6018 4334 -3024 -8692 -4645 5205 7882 -439
1060 -439 -9043 -7042 1421 5351 -702 -7702 -5364 3210 5858 -2136 -10587 -8554 2263 8714 1775
1075 1775 -9950 -9984 946 7539 783 -9124 -8534 1360 8487 3783 -7064 -10247 -869 7725 3967
1090 3967 -5558 -5788 3696 8758 1593 -9008 -7508 5074 13570 6522 -5354 -7858 1366 10526
1104 10526 6832 -4164 -5416 6430 13811 5636 -7361 -7757 4730 13811 8221 -4376 -6914 4843
1118 4843 13592 6258 -8363 -10067 4349 17421 11686 -6107 -13656 -2295 11424 9942 -2637
$$ packed form
1012f31j643J945K593k02k610k939J27M467L683k990n291p60M646K977j345k053
1028b6j986n59K803L003m02k942j926J428K101K73j977p79R81J747O55j369l465
1045b440j259M750M625l363o678j108O178N313j684p358n668M047R850K677q321
1060d39q604K001Q463L930o053p000K338Q574K648p994q451K033J0817O451o939
1075A775j1725l4J0930O593o756r907N90R894P127m704j0847l183R378Q594l758
1090C967r525k30R484N062p165j0601J500J2582Q496p048j1876k504R224R160
1104A0526l694j0996j252J1846P381q175j2997l96J2487R081n590j2597k538J1757
1118D843Q749p334j4621j704J4416J3072n735j7793p549J1361J3719j482j2579
$$ plain form
1131 -2637 -8507 -19 10840 7555 -7387 -14220 -2678 12813 11703 -3179 -12887 -6707 5796
1144 5796 7960 -2849 -11194 -4990 7954 10159 -2281 -13685 -9924 3568 9032 732 -7853 -5830
1158 -5830 2284 3221 -4745 -10216 -5275 5083 9142 -293 -11506 -10780 -130 5428 652 -6005 -4677
1173 -4677 1903 3968 -2609 -10011 -7292 2320 6947 2180 -5583 -6348 -310 3549 -1249 -7359 -4026
1188 -4026 4852 8563 1665 -7395 -9623 -1637 6873 6729 -51 -3538 177 3786 852 -3315 -3458
1203 -3458 2955 8677 7424 -273 -5951 -3117 3307 7218 4198 -699 -608 4770 6168 768 -4624
1218 -4624 -3434 2697 8397 8353 1181 -5498 -4127 2261 4570 1870 -1307 375 4506 3832 -2551 -7765
1234 -7765 -4680 3989 8825 4378 -4651 -8064 -2318 4426 2294 -4967 -5029 2268 6924 2650 -6100
$$ packed form
1131b637n870Q488J0859l285j4942o833J1542J5491j110j4882r708O180J2503
1144E796K164j0809q345O204J2944K205j2440j1404L761J3492N464q300q585K023
1158e830Q114R37p966n471M941J0358M059r435j1213P26J0650N558m776o657J328
1173d677O580K065o577p402K719R612M627m767p763p65O038L859m798o110L333
1188d026Q878L711o898r060k228P986Q510j44o780l487L715L609k934m167j43
1203c458O413N722j253p697n678K834O424L911l020m897R1N378J398n400n392
1218d624J190O131N700m4p172o679J371O388K309k700l177J682M131o74o383n214
1234g765L085Q669M836m447r029l413N746O744k132p261o2P297M656m274q750
$$ plain form
1249 -6100 -9436 -2886 6418 6479 -1592 -5718 -723 4219 1549 -5994 -7474 1766 10323 7515 -4054
1264 -4054 -10658 -4553 5724 7493 -101 -5781 -578 7853 5323 -5776 -9365 -1025 9617 9774
1278 9774 -529 -8699 -4661 6200 7849 -2395 -9055 -1551 10643 10974 -2980 -13272 -7913 6869
1292 6869 11810 1893 -7965 -6149 4000 7477 -1683 -11355 -6819 8146 13143 660 -13403 -11417
1306 -11417 2620 10130 2838 -9145 -8873 3303 10088 1108 -11941 -11735 1836 11387 5516 -7919
1320 -7919 -11128 -867 7482 2557 -7705 -8747 2214 10875 4930 -9170 -13523 -1191 10604
1333 10604 7349 -4466 -9024 -1600 6283 4516 -4815 -9214 -853 9533 7839 -3827 -10190 -2995
1347 -2995 7404 6853 -2450 -7338 -181 8463 6365 -3228 -8324 -2791 7573 10153 1341 -6640 -3710
$$ packed form
1249f100l336O550R304O1q071m126M995M942k670p543j480R240Q557k808j1569
1264d054o604O105J0277J769p594n680N203Q431k530j1099l589Q340J0642J57
1278I774j0303q170M038J0861J649j0244o660P504J2194L31j3954j0292N359J4782
1292F869M941r917r858J816J0149L477r160r672M536J4965M997j2483j4063J986
1306a1417J4037P510p292j1983K72J2176O785q980j3049K06J3571R551n871j3435
1320g919l209J0261Q349m925j0262j042J0961Q661n945j4100m353J2332J1795
1333A0604l255j1815m558P424P883j767r331m399Q361J0386j694j1666o363P195
1347b995J0399n51r303m888P157Q644k098r593n096N533J0364K580q812p981K930
$$ plain form
1362 -3710 5495 7631 89 -5005 -762 7167 8119 209 -6672 -3751 6043 9377 3248 -4348 -3719
1377 -3719 3942 7893 2563 -4914 -3945 3649 8089 4162 -3244 -5606 45 6255 4909 -2556 -4460
1392 -4460 1038 5334 2877 -3165 -5546 -1951 4674 5420 -673 -6453 -4604 1962 4904 92 -5641
1407 -5641 -4872 1409 3712 -177 -5038 -5294 -913 3037 2008 -3847 -6614 -1672 4286 1913 -4831
1422 -4831 -6754 -1853 4001 3216 -2810 -6851 -3510 3262 4253 -1082 -6327 -4194 2968 5109 -1134
1437 -1134 -6478 -3629 3444 4971 -582 -5786 -3875 3196 6560 406 -7194 -5174 4234 7727 1067
1452 1067 -6121 -5389 2389 7364 2356 -5543 -6273 2508 8568 3254 -6613 -7415 2363 9153 3839 -6494
1468 -6494 -6914 2065 8938 4815 -5513 -8621 -683 9592 8362 -4455 -9966 -1224 8672 6906
$$ packed form
1362c710R205K136p542n094M243P929R52p910o881K921R794L334o129p596O29
1377c719P661L951n330p477R69P594M440l927p406k362N651O210j346p465j904
1392d460N498M296k457o042k381L595O625P46o093n780J849O566K942m812n733
1407e641P69O281K303l889m861k56M381L950j029n855k767M942N958k373o744
1422d831j923M901N854p85o026m041L341O772R91n335n245K133P162K141o243
1437a134n344K849P073J527n553n204J911P071L364o154p600K020R408L493o660
1452A067p188P32P778M975n008p899p30Q781O060n314r867q02R778O790n314j0333
1468f494m20Q979O873m123j0328l108P938J0275j230j2817n511Q742R896j766
$$ plain form
1482 6906 -3531 -8319 -1100 8615 7031 -3350 -9422 -2985 7832 8993 -904 -8957 -4056 7408
1496 7408 8917 -1836 -8679 -3317 6765 9094 208 -8021 -5150 4631 9309 1220 -7007 -4003
1510 -4003 5168 7855 1 -7358 -4949 5200 9714 2461 -6937 -6367 3140 8541 3221 -6358 -5662
1525 -5662 3972 8611 1689 -6991 -5750 2321 7648 3590 -4961 -6944 766 7745 3231 -6461 -7637
1540 -7637 1678 8493 3778 -5813 -8299 -1247 5882 4192 -3637 -6847 -1682 4956 4126 -4238 -8486
1555 -8486 -2178 6001 5251 -3307 -7707 -3945 3257 4438 -1444 -6596 -3717 3555 5137 -1036 -7001
1570 -7001 -5268 2141 5165 1120 -4167 -4451 501 3216 712 -3953 -3888 1212 4996 1951 -4179 -4526
1586 -4526 140 3916 2319 -941 -2888 -958 2661 3135 -1049 -3769 -271 4233 4014 -864 -3415
$$ packed form
1482F906j0437m788P219R715j584j0381o072O437J0817J161r897q053M901J1464
1496G408J509j0753o843N362J0082K329q886q229K871R781M678q089q227L004
1510d003R171K687p854p359K409J0149M514p253r398N70R507N401n320r579O96
1525e662R634M639o922q680J241Q071N327m058q551j983P710O979m514r692j176
1540g637R315O815m715r591k486P052P129j690p829l210N165O638q30q364m248
1555h486O308Q179p50q558m400L762P202J181n882n152K879P272J582o173n965
1570g001J733P409L024m045n287k84M952K715k504m665O5N100L784l045o130l47
1586d526M666L776j597l260j947J930L619M74m184k720L498M504k19m878k551
$$ plain form
1601 -3415 -1262 2912 3630 348 -1937 -787 2877 4506 1366 -3766 -3242 3042 6369 2304 -3662
1616 -3662 -3022 1794 4654 2416 -2077 -3269 1391 5593 3286 -2952 -4803 389 6041 4405 -2187
1631 -2187 -5044 -608 4814 3908 -2130 -5269 -1872 4960 5977 -1035 -6180 -3517 4087 5371 -337
1646 -337 -5213 -2868 2903 5065 225 -6082 -4330 3112 6592 654 -5698 -4868 2113 6184 1337
1661 1337 -5210 -5086 1480 5712 2271 -4771 -5925 166 6422 3188 -4372 -6105 1014 6272 2418
1676 2418 -4672 -5922 248 5920 4168 -3848 -6808 -854 5903 4623 -3242 -7053 -1265 5876 4720
1691 4720 -3275 -6778 -1093 5369 4095 -2563 -6848 -2396 5636 5401 -2946 -8034 -2516 4900 5446
1706 5446 -2039 -7019 -3496 3964 5218 -1327 -7090 -4135 3803 5493 -1183 -6618 -4255 3476 5161
$$ packed form
1601c415K153M174P18l282k285J150L664J629l140n132N24O284L327m065n966
1616c662O40M816K860k238m493j192M660M202k307o238j851N192N652j636o592
1631b187k857M436N422r06o038l139L397O832J017p012n145K663P604J284n708
1646c37m876K345N771K162m840o307J752P442L480n938o352Q30O981M071m847
1661A337o547J24O566M232l441p042j154O091O256l234p560j733P119N258l854
1676B418p090j250O170N672j752q016k960N954O757j280p865l811N788P141j156
1691D720p995l503N685O462j274o658m285M452Q032k35q347n088N518P416N46
1706E446p485m980L523P460J254o545n763K955P938J690o676n435K363P731J685
$$ plain form
1721 5161 -853 -6201 -3746 2658 4872 475 -5551 -4910 2098 6350 1318 -5056 -4617 2049 4793
1736 4793 1132 -3862 -3720 1372 4972 2332 -3204 -4035 923 5236 3562 -2204 -3899 1050 4976
1751 4976 3094 -1933 -2873 489 4380 4287 254 -2658 -403 3875 4066 480 -1243 477 3761 3765 32
1768 32 -2132 -397 3218 4428 1242 -1768 -1218 1769 3275 1035 -1779 -1168 1769 2652 695 -1654
1784 -1654 -2113 -198 2369 1314 -1526 -2760 -438 2142 432 -2386 -3076 -880 1796 1488 -1584 -4023
1800 -4023 -2845 418 1784 -612 -3746 -2848 946 1443 -1471 -4262 -2952 681 1791 141 -3277
1815 -3277 -4123 -803 2147 579 -3589 -4018 -179 2897 978 -3183 -4862 -1236 3099 2174 -1633 -4026
1831 -4026 -1501 2436 2643 -1522 -4181 -1049 3426 3089 -1442 -4360 -2097 2802 4062 383 -3840
$$ packed form
1721E161o014n348K455O404K214m397o026O41P008M252n032o374M39O666K744
1736D793l661m994J42N092L600k640n536q31M958M313j674n766j695M949L926
1751D976j882n027r40L362L891r3m033k912K255M278J91l586j723J720L284Ml733
1768C2k164J735L615J210l186l010N50K987J506k240k814O11K937Q83j957k349
1784a654m59J915K567j055k840j234K322K580j710k818o90K196K676l08l072k439
1800d023J178L263J366k396l134Q98L794M97k914k791J310L633J110j650l418
1815c277q46L320K950j568m168m29L839L076j919m161j679L626M335r25l807k393
1831d026K525L937K07m165k659L132M475l37m531k918K263M899J260l679m223
$$ plain form
1846 -3840 -2080 2831 4255 178 -3524 -2110 2840 4588 1317 -2974 -2695 2129 4284 1678 -2659
1861 -2659 -2184 2493 5469 1861 -3471 -2846 2773 5450 2101 -2338 -2535 1436 4749 2486 -2253 -3218
1877 -3218 1739 5353 2165 -2900 -3750 1203 4803 2026 -3108 -3722 926 4368 2344 -2819 -4596
1892 -4596 -354 4410 2970 -2446 -4262 -508 3646 2577 -2217 -4181 -1090 3438 2619 -1983 -4516
1907 -4516 -1060 2992 2942 -1264 -4022 -1424 2644 3278 -800 -3913 -1626 1896 3098 302 -2879 -1699
1923 -1699 1735 2967 -660 -3428 -1311 1699 2662 206 -2042 -1410 828 2125 577 -1910 -1576 1242
1939 1242 2648 486 -2122 -2023 807 1739 298 -1502 -936 -16 567 -261 -1736 -1604 -89 1551 540
1956 540 -1900 -2606 -525 377 487 -708 -1451 -513 376 95 -1226 -1672 -1317 446 1269 93 -1467 -1406
$$ packed form
1846c840J760M911J424m077l702J414M950J748l271m291K79M824K155k606m337
1861b659M75M677K976l608n332O25N619K677l349m439j97L971L313k263m739r65
1877c218M957L614l188n065q50M953L600k777n134o14M648L442k024n163j777
1892d596M242M764j440n416j816L754M154j069m794j964L091M528q19m602k533
1907d516L456M052n0m206k758K598M068O34m078l113K287L522J202k796l181J180
1923a699L434J232l627k768K117L010R63k456k248O32K238J297j548k487L34K818
1939A242J406k162k608R9K830R32j441j800N66R20N83q28j475J32J515J640j011
1956E40k440p06K081R02J10j195p43R38Q89k81j321m46L55J763Q23j176j560O1
$$ plain form
1974 -1406 -553 -90 -59 -878 -807 259 1306 313 -1630 -2197 -399 1756 1791 385 -1143 -1471 35 1279
1992 1279 559 -814 -141 1018 2317 501 -1805 -1769 771 2594 1837 134 -735 118 766 1068 -808
2009 -808 -1345 942 3614 2622 -478 -2372 -665 1829 2428 1300 -268 415 1424 1036 -671 -1778
2025 -1778 151 2988 3755 530 -1739 -1028 1562 1866 257 -947 237 2391 2448 -357 -3276 -1690
2041 -1690 2015 3203 1024 -1459 -1152 676 1053 -881 -2553 -941 2177 3191 -275 -3384 -3132 127
2057 127 2015 235 -1916 -1670 791 1211 -1406 -3522 -2713 664 2663 1089 -2412 -3009 -600 985
2073 985 -807 -2487 -1239 1536 2154 -463 -3455 -3532 -471 1872 1699 -806 -1875 -1127 487 -230 -2223
2090 -2223 -1413 865 2335 926 -1636 -2273 -1124 1024 1152 -68 -820 87 1172 227 -1348 -1431 -260
$$ packed form
1974a406Q53M63L1q19P1J066J047r93j943n67J798K155L5j406j528l28J506J244
1992A279p20j373O73J159J299j816k306L6K540J823p57j703q69Q53O48L02j876
2009h08n37K287K672r92l100j894J707K494N99j128j568O83J009l88j707j107
2025a778J929K837P67l225k269P11K590L04j609j204J184K154N7k805k919J586
2041a690L705J188k179k483L07J828L77j934j672J612L118J014l466l109K52L259
2057A27J888j780k151K46K461M20k617k116Q09L377J999j574l501n97K409J585
2073I85j792j680J248K775O18k617k992p7L061K343j73k505j069P48J614p17j993
2090b223Q10K278J470j409k562o37J149K148J28j220p52R07J085r45j575q3J171
$$ plain form
2107 -260 1795 2142 563 -843 -851 -257 -139 199 458 827 1211 526 -920 -1050 -191 381 955 1010 885 -206
2127 -206 -394 -58 50 -46 641 1079 851 336 29 74 -435 -245 411 1249 1578 667 -318 33 180 -7 447
2148 447 997 1231 724 189 -54 -330 370 1172 1211 276 46 488 880 264 -712 -326 921 1508 845 -486
2168 -486 -585 29 829 554 -482 -769 365 1438 722 -1645 -1419 31 1792 1187 -553 -2116 -683
2185 -683 1171 1091 -738 -1981 -558 1141 750 -1214 -2402 -1433 686 1175 -873 -2203 -1644 812 1084
2202 1084 -496 -2824 -2162 636 1402 -712 -2215 -1748 -165 771 -101 -1972 -2347 151 1286 -113
2218 -113 -1637 -1521 155 1216 -1 -1643 -1274 605 1041 206 -1297 -1451 -5 1310 760 -920 -789
2235 -789 748 1628 -94 -1155 -791 916 2011 1176 -1011 -1206 367 1448 604 -799 -442 951 2182
$$ packed form
2107b60K055L47j579j406qN94J18L38K59L69L84o85j446j30Q59N72N74N5j25j091
2127b06j88L36J08r6O87M38k28n15l07M5n09J90O56Q38L29r11r85L51J47j87M54
2148D47N50K34n07n35k43k76P00Q02L9r35k30M42L92o16r76L86J247N87o63j331
2168d86r9O14Q00k75j036k87J134J073p16k367K26J450J761o05j740j563J433
2185f83J854q0j829j243J423J699l91j964j188R69K119M89k048j330N59K456K72
2202A084j580k328O62K798P66k114j503M67J583R36q72j871l75K498J135j399
2218a13j524J16J676J061j217j642L69J879M36q35j503j54J446J315n50j680J31
2235g89J537Q80j722j061L64J707J095q35k187j95J573J081q44j403L57J393J231
$$ plain form
2252 2182 1107 -888 -1423 257 1839 1665 365 -548 -118 1352 1226 -301 -845 670 2282 1448 230
2269 230 -801 -1128 586 1805 1377 -212 -639 750 1015 517 -695 -769 792 1774 1430 -131 -571 -781
2287 -781 3 1025 755 -347 -333 775 1047 -555 -1452 -837 284 1250 921 -622 -1524 -870 -23 283
2305 283 -528 -284 -167 506 -137 -1299 -1592 -979 278 854 120 -1035 -1070 -48 -64 -976 -1387 19 1250
2324 1250 597 -670 -1265 -1436 -62 1286 85 -1005 -1011 660 629 -788 -2195 -642 1609 1832 74
2341 74 -1720 -1530 259 1248 439 -1608 -1473 967 2153 117 -2189 -2233 435 1866 1162 -1450 -2060
2358 -2060 -578 1327 731 -1577 -2171 -91 2504 1442 -1994 -3309 -1065 1703 1737 -824 -1984 -638
2374 -638 1294 1516 -922 -2427 -852 2166 2305 -115 -2026 -1013 1553 1795 202 -1556 -736 1927
$$ packed form
2252B182j075j995n35J680J582j74j300r13M30J470j26j527n44J515J612q34j218
2269B30j031l27J714J219m28j589m27J389K65m98j212p4J561R82l44j561m40k10
2287g81P84J022k70j102J4J108K72j602q97O15J121R66l29j543r02O54Q47L06
2305B83q11K44J17O73o43j162k93O13J257N76p34j155l5J022j6r12m11J406J231
2324A250o53j267n95j71J374J348j201j090oJ671l1j417j407J553K251K23j758
2341G4j794J90J789R89q09k047J35K440J186k036k306m4K668J431p04k612o10
2358b060J482J905n96k308n94K080K595j062l436j315K244K768L4k561j160J346
2374f38J932K22k438j505J575L018J39k420j911J013K566K42j593j758Q20K663
$$ plain form
2390 1927 2594 239 -2068 -1059 1775 3033 1135 -1171 -1016 1609 2050 427 -685 -215 1324 2542
2406 2542 1006 -1545 -1398 1596 2765 1069 -874 -747 1231 1940 1076 -959 -1182 646 2216 1487
2422 1487 -745 -1281 196 1882 1071 -862 -1570 477 1750 934 -888 -2191 -654 2075 1863 -828
2438 -828 -1920 -905 938 1142 -486 -1744 -900 1052 1342 -182 -1825 -1563 475 1248 -92 -2161
2454 -2161 -1769 776 1254 -303 -2341 -1739 -431 1059 529 -1193 -2625 -876 1163 769 -1357 -2508
2470 -2508 -818 918 503 -1262 -2259 -891 979 933 -518 -2260 -1411 698 1733 -431 -2156 -1527
2486 -1527 1162 1692 -26 -1480 -1198 317 1795 833 -1110 -1215 824 1786 595 -823 -1149 1051
2502 1051 1848 1160 -697 -1237 531 2075 1605 -462 -1224 415 2313 1700 -411 -1490 295 2334
$$ packed form
2390A927O67k355k307J009K834J258j898k306J55K625M41j623j112M70J539J218
2406B542j536k551J47K994J169j696j943J27J978P09q64k035k23J828J570p29
2422A487k232n36J477J686q11j933p08K047J273q16j822j303J537K729k12k691
2438h28j092J015J843K04j628j258Q44J952K90j524j643K62K038P73j340k069
2454b161L92K545M78j557k038O02J308J490n30j722j432J749K039l94k126j151
2470b508J690J736m15j765r97J368J870m6j451j742Q49K109J035k164j725O29
2486a527K689N30j718j454K82J515J478r62j943j05K039R62j191j418l26K200
2502A051P97o88j857n40J768J544m70k067p62J639J898o13k111j079J785K039
$$ plain form
2518 2334 1622 58 -1457 -113 2065 2180 -720 -2042 -266 2350 2131 -424 -2032 -570 2080 2418
2534 2418 -145 -2386 -1325 1446 2620 362 -2354 -1751 1432 2954 561 -2566 -1620 1152 2567
2549 2567 663 -2185 -2062 910 2963 1366 -2151 -2602 370 2660 1479 -1478 -2494 -187 2430
2564 2430 1678 -1419 -2445 -361 2169 1823 -1183 -2718 -761 1861 1495 -1223 -2708 -574 1546 1993
2580 1993 -745 -2909 -1383 1197 1594 -694 -2635 -1298 1033 1532 -676 -2536 -1493 1014 1564 -443
2596 -443 -2217 -1634 896 1896 -139 -2734 -1798 1229 1942 125 -2530 -1878 480 2082 975 -1863
2612 -1863 -2182 691 2001 1103 -1733 -2457 341 2751 1323 -1743 -2797 -276 2218 1710 -652 -2469
2628 -2469 -710 2324 2085 -796 -2572 -868 2053 2266 -319 -1884 -1226 1337 2262 264 -2090 -1185
$$ packed form
2518B334p12j564j515J344K178J15k900j322J776K616k19k555j608J462K650L38
2534B418k563k241J061K771J174k258k716O03L183J522k393l127R46K772J415
2549B567j904k848J23K972K053j597l517m51K972K290j181k957j016K307K617
2564B430p52l097j026K084K530l46l006j535J957K622l66k718j485K134K120M47
2580A993k738k164J526K580L97k288j941J337K331M99k208j860J043K507N50k007
2596d43j774N83K530J000k035k595R36L027P13j817k655O52K358J602j107k838
2612a863l19K873J310q98k836p24K798K410j428l066j054K521K494n08k362j817
2628b469J759L034k39k881j776J704K921K13k585j565O58K563R25j998k354R05
$$ plain form
2644 -1185 1592 2336 509 -1900 -1905 1107 2601 952 -1064 -1449 543 2070 1429 -1222 -1508 259 2545
2661 2545 1380 -1008 -1505 283 2257 1896 -328 -1248 99 2229 1673 -518 -1584 38 2231 2463
2677 2463 -366 -1845 -507 1888 1957 -84 -1302 -406 1526 1624 -156 -2356 -1446 1822 2033 67 -2205
2694 -2205 -1619 699 2143 75 -1709 -1663 691 2419 149 -2339 -2554 106 2129 807 -2094 -2540
2710 -2540 13 1903 250 -1990 -2782 -187 2362 1465 -1846 -3420 -792 2174 1711 -1418 -2602 -1180
2726 -1180 1540 1608 -818 -2963 -1308 1745 2281 154 -3126 -1683 1463 2046 -237 -2374 -1467 1675
2742 1675 2364 -100 -2596 -2260 842 2639 714 -2084 -1623 707 2277 587 -1785 -1985 1068 2890
2758 2890 1160 -1803 -1978 328 2409 1067 -1382 -2044 495 2955 1213 -1350 -2119 192 2661 1784
$$ packed form
2644a185K777P44j827k409nL012J494j649k016l85J992J527o41k651k86J767K286
2661B545j165k388m97J788J974l61k224r20J347K130n56k191j066J622K193K32
2677B463k829j479J338K395O9k041j218Q96J932R8j780k200R10L268K11j966k272
2694b205N86K318J444k068j784M6K354J728k270k488k15K660K023j322k901m46
2710b540K553J890j653k240p92K595K549q97l311j574K628K966m63l129j184J422
2726a180K720O8k426k145J655L053N36k127l280J443L146N83k283k137R07L142
2742A675O89k464k496L36L102J797j925k798M61K330J570j690k372k00L053J822
2758B890j730k963j75K306K081j342k449o62K539K460j742k563p69K311K469q77
$$ plain form
2774 1784 -1052 -2246 -320 2230 2016 -929 -2057 -86 2311 2103 -716 -2240 -704 2673 2197 -186
2790 -186 -2166 -771 2170 2687 204 -2174 -780 1945 2648 354 -1981 -1113 1318 2557 999 -1946
2806 -1946 -1490 1256 2737 909 -2150 -2047 701 2736 1261 -1775 -1897 522 2465 1468 -1212 -2372
2822 -2372 -347 1965 1901 -876 -2634 -383 1694 1279 -957 -2390 -909 1407 1712 -1051 -2750 -1177
2838 -1177 1189 1682 -295 -2189 -1463 828 1670 -137 -2311 -1435 907 1818 141 -2135 -1854 555
2854 555 1915 208 -2071 -1371 603 1673 403 -1773 -2226 -59 2196 1144 -1699 -2066 -159 1553
2870 1553 905 -1404 -1863 83 1993 1187 -1314 -2025 -665 1632 1645 -841 -2189 -753 2159 1875 -1104
2887 -1104 -2507 -989 1949 2438 13 -1996 -1115 1531 2496 413 -1565 -830 1493 2642 643 -2139
$$ packed form
2774A784k836j194J926K550k14k945j128J971K397k08k819j524J536L377m76k383
2790a86j980J395K941N17k483k378J394K725P03k294k335Q68K431J239j558k945
2806a946M56K746J481j828l059J03K748K035j475l036j22K419J943r97k680j160
2822b372K025K312o4k777j758K251K077m15k236j433J481K316L05k763j699J573
2838a177K366M93j977j894P26K291Q42j807k174Q76K342R11j677k276K81K409
2854E55J360j707k279P00J974J070j270k176m53K167K255j052k843l67J907J712
2870A553o48k309m59J946J910q06k501p11J360K297J3k486j348J436K912k84k979
2887a104j403J518K938M89k425k009Q81K646R65k083j978P35K323J149j999k782
$$ plain form
2903 -2139 -1583 1224 2856 1354 -987 -1950 242 2660 1770 -1281 -1738 921 3271 1521 -840 -1812
2919 -1812 -41 2350 1969 -331 -1373 -82 2056 1268 -767 -1547 -282 2294 2108 -399 -2301 -1067
2935 -1067 1168 1717 -257 -1847 -940 1469 1826 -651 -2397 -864 1221 1850 2 -1880 -1581 828
2951 828 1707 -112 -2257 -1390 979 2599 438 -2321 -2296 571 1970 813 -1678 -2012 292 1617
2967 1617 498 -1929 -2530 270 2402 1097 -1778 -2583 -201 1809 1217 -933 -2461 -574 1630 1830
2983 1830 -1262 -2684 -997 1674 1814 -461 -2197 -1349 1201 1466 -580 -1719 -1264 710 1973 -17
2999 -17 -1897 -1686 525 1910 466 -1782 -1434 239 1612 550 -1500 -1493 441 1742 413 -783 -1737
3016 -1737 139 1727 937 -1355 -1214 549 1772 861 -1071 -1315 27 1890 1789 -536 -1413 28
$$ packed form
2903b139N56K807J632j502k341r63K192K418q90l051m57K659K350j750k361r72
2919a812J771K391l81k300j042J291K138p88k035p80J265K576j86k507j902J234
2935a067K235N49j974j590R07K409L57k477j746J533K085O29j848j882K99K409
2951H28Q79j819k145Q67K369J620k161k759K5K867J399j157k491l34K304J325
2967A617j119k427o01K800K132j305k875q05K382K010n92k150j528J887K204K00
2983A830l092j422J687K671J40k275j736Q48K550K65k046j139M55J974J263j990
2999a7j880K11K211J385j444k248L48J673J373j062k050PJ934J301j329j196r54
3016a737J876J588p90k292J41J763J223r11j932k44J342J863j01k325q77J441
$$ plain form
3032 28 1799 1561 -280 -1121 28 1707 1618 -308 -1590 -362 1510 2091 -2 -1349 -701 1536 2032
3049 2032 -34 -1526 -995 1182 2181 700 -1188 -1454 724 2096 943 -868 -1222 503 1931 518
3065 518 -1136 -1386 -11 2049 1202 -907 -1878 -126 1607 1597 -753 -1647 -218 1603 1763 -547 -1451
3082 -1451 -384 1433 1336 -8 -1678 -1001 1360 1709 -238 -1973 -1188 1038 1270 -275 -1752 -1412 600
3099 600 1324 2 -1825 -1810 434 1244 155 -1753 -1625 497 1399 237 -1640 -1454 73 1195 332
3116 332 -1518 -1659 -71 1513 486 -1279 -2031 -259 1333 671 -1253 -1871 -517 1363 1061 -815
3132 -815 -1671 -200 1352 1118 -543 -1731 -320 1479 1360 -264 -1730 -846 1398 1788 75 -1259
3148 -1259 -661 1200 1470 172 -1570 -957 1042 1990 306 -1153 -732 1135 1712 652 -982 -1234 598
$$ packed form
3032B8J771k38j841q41J149J679q9j926j282J228J872N81k093j347O48K237M96
3049B032k066j492N31K177R99j481j888k66K178J372j153j811l54J725J428j413
3065E18j654k50J375K060q47k109r71J752J733j0k350q94J429J821J60k310r04
3082a451J067J817r7j344j670O77K361L49j947j735P85K226K32j545j477L40K012
3099F00P24j322j827J5K244Q10j089j908J28K122R02j162j877J86J527J122q63
3116C32j850j41J588J584j027j765p52J772J592o62j924o18J354J880l02j876
3132h15q56J471J552k34j661j188J411J799j19j624j466Q84K244L90j713j334
3148a259N98J861K70j298j742O13J999R48j684j459M21J867N77j060j634k52J832
$$ plain form
3165 598 1768 1098 -1086 -1223 451 1700 1050 -526 -1003 104 1664 1331 -362 -1188 -182 1619 1185
3182 1185 -494 -1242 -95 1556 1265 -127 -1284 -548 1144 1690 513 -1183 -575 1059 1538 185
3198 185 -1197 -744 687 1015 373 -1498 -731 564 1212 220 -1295 -1099 416 1289 336 -1174 -1473 128
3216 128 1053 406 -885 -1182 -220 1119 584 -973 -1450 27 1129 789 -679 -1390 -615 633 647 -820
3234 -820 -1453 -670 945 762 -632 -1472 -961 654 978 -156 -1370 -819 642 736 0 -1102 -988 430
3252 430 1369 34 -1461 -1127 539 1252 314 -1024 -1299 -201 1289 563 -1048 -1280 246 1196 880
3269 880 -690 -919 -215 1122 860 -456 -924 -302 833 868 -111 -1014 -214 1040 1422 -242 -937 -309
3287 -309 711 1100 306 -754 -357 918 939 91 -770 -561 878 1381 573 -489 -400 805 1254 158
$$ packed form
3165E98J170o70k184j37J674J249o50j576m77J107J560l33j693q26J006J801m34
3182A185j679p48J147J651k91j392j157P36J692N46j177j696O08J634M79j353
3198A85j382M53J431L28o42j871P67J295O48r92j515J96J515Q73r53j510k99J601
3216A28R25o47j291k97R62J339n35j557m77J477J102l40j468p11P75J248J4j467
3234h20o33P83J615j83j394q40N11J615L24j134j214N51J461R4p36j102J14J418
3252D30R39j335j495L34J666P13r38j338k75J098J490p26j611k32J526R50l16
3269H80j570k29P04J337k62j316m68O22J135L5r79r03Q00J254L82j664o95O28
3287c09J020L89p94j060L97J275K1q48q61K09J439N03q08j062Q9J205M49j096
$$ plain form
3305 158 -720 -568 803 1250 656 -730 -871 422 1402 1024 -897 -654 619 870 567 -266 -772 404
3323 404 1132 623 -384 -1038 -348 920 798 -145 -831 -187 1071 677 -427 -646 -625 455 686 96 -828
3342 -828 -881 575 405 -71 -812 -576 256 811 -74 -1188 -930 -139 659 168 -333 -1011 37 144 321
3361 321 -627 -857 -129 634 265 -284 -935 -302 433 -58 -625 -1055 -83 905 257 -226 -1119 -694 525 709
3381 709 -310 -649 -580 330 465 44 -911 -677 753 1099 -202 -845 -692 473 755 189 -880 -827 482
3400 482 980 425 -668 -599 154 1000 728 -445 -1109 120 756 685 -118 -594 13 716 617 -249 -865 184
3420 184 765 660 -51 -446 108 769 818 60 -410 -391 864 989 170 -548 -50 763 829 230 -622 -252 715
3441 715 857 447 -493 -428 524 1114 199 -619 -133 321 857 362 -326 -429 310 864 388 -556 -1025 211
$$ packed form
3305A58q78J52J371M47n94j386j41J293R80l78j921K43J273K51l03q33n06J176
3323D04P28n09j007o54O90J268j22r43o86O44J258l94j104k19K1J080K31n90r24
3342h28n3J456j70m76p41K36Q32N55q85j114K58P91P98m91n01o78J048J07J77
3361C21r48k30P28P63l69n49o51O33P35m91n67m30R72R88o48m83q93M25J219J84
3381G09j019l39O9R10J35m21r55K34J430L46j301o43J53J165K82n66j069N3J309
3400D82M98n55j093O9P53Q46k72j173o64J229O36p1q03m76O07P03r9q66o16J049
3420A84N81j05p11l95N54O61M9p58m70J9J255J25q19p18M98Q13O6n99q52L70R67
3441G15J42m10r40O5R52N90r15q18M86M54N36m95o88j03P39N54m76r44m69J236
$$ plain form
3461 211 104 506 -434 -925 46 534 527 -292 -569 27 124 441 -113 -688 -472 295 569 -171 -665 -591 132
3482 132 364 197 -533 -880 -106 514 -69 -697 -837 226 517 214 -504 -680 42 349 242 -480 -501 -6
3502 -6 253 136 -450 -743 -264 150 348 -368 -830 -356 379 149 -271 -489 -529 205 359 -351 -570 -94 545
3523 545 344 -120 -722 -663 274 367 141 -476 -324 161 494 -69 -422 -397 539 629 133 -225 -440 11 617
3544 617 576 -176 -169 -205 832 510 35 -578 -12 565 831 129 -181 -107 352 697 299 -442 -306 591 713
3565 713 150 -469 -394 475 810 395 -308 -343 317 565 262 -148 -276 218 833 238 -536 -473 129 560 319
3586 319 -353 -419 -157 716 504 -234 -654 207 626 363 -545 -662 -70 310 183 -206 -697 -411 334 415 -370
3607 -370 -634 -552 36 498 -158 -528 -449 310 270 -304 -532 -756 -256 281 46 -744 -809 -82 417 42 -407
$$ packed form
3461B11j07M02r40m91R71M88pq19k77N96R7L17n54n75K16P67K74p40m94P4P23
3482A32K32j67p30l47P74O20n83o28j40J063K91l03p18j76P22L07j07p22k1M95
3502fK59j17n86k93M79M14J98p16m62M74P35k30m20k18m0P34J54p10k19M76O39
3523E45k01m64o02N9R37R3k26o17J52M85L33n63l53K5R36R0m96l58k15M51O06
3544F17m1p52Pl6J037l22m75o13N66N77K66p02l10P4M59L45l98p41J36Q97J22
3565G13n63o19P5Q69L35m15p03l5O60K48l03m10j28M94O15n95p74O3O02M31k41
3586C19o72o6K62Q73k12p38m20Q61M19k63r08j17N92L80j27l89m91K86P45Q1p85
3607c70k64Q2N88M62o56l70P9P59m0n74k28k24N00N37k35p90o5P27M99l75m49
$$ plain form
3628 -407 -692 -195 246 324 -576 -1078 -211 -63 38 -335 -586 -351 438 532 -394 -467 -492 319 16 -179 -640
3649 -640 -257 181 415 127 -448 70 467 563 -5 -346 66 470 470 309 -276 -50 484 992 217 -380 -264
3670 -264 554 674 450 -275 -98 173 735 701 -60 -434 376 1017 854 74 -302 -81 382 777 477 -232
3690 -232 -104 494 667 184 -488 -191 654 794 -73 -620 -119 279 553 163 -169 -441 490 871 496 -450
3710 -450 -441 399 777 173 -301 -253 72 580 309 -195 -450 179 449 374 -435 -967 -94 562 346 -699 -479
3731 -479 -165 319 316 -353 -733 -419 507 938 -286 -827 -483 231 319 -78 -613 -529 371 436 -304 -910 -505
3752 -505 129 721 46 -860 -734 161 821 -82 -827 -171 -103 892 421 -728 -893 -215 610 349 -455 -508
3772 -508 -183 370 433 -531 -649 -222 299 390 -525 -726 -292 119 937 -70 -643 -323 423 114 45 -631 -333
$$ packed form
3628d07k85M97M41P8r00n02Q67J48J01l73k51K35P89R4r26p3k5Q11l03j95m61
3649f40L83M38K34k88n75N18L97R6n68l41M12M04%j61n85K26N34N08p75n97J16
3670b64Q18J20k24p25J77K71N62l4p61l74Q10O41j63p80l76K21M63L95l00p09
3690b32J28N98J73m83o72K97Q45J40q67n47N01L98K74l90l32k72R31L81l75r46
3710d50RQ40L78o04m74M8L25N08k71n04k55O29K70p5q09n32Q73O56k16j045K20
3731d79L14M84lo69l80L14R26M31j224n41L44P14Q8l97n35Q4R00O5p40o06M05
3752e05O34N92o75r06J26Q95O60r03p45O56O8R95m71j149j65O78Q25k61q04n3
3772e08L25N53O3r64j18M27N21R1r15k01M34M11Q18j007n73L20P46l09o9o76K98
$$ plain form
3793 -333 470 851 266 -565 -424 318 635 133 -166 -2 588 747 32 -446 -269 304 917 430 -246 -396
3813 -396 213 580 489 -312 -299 487 847 277 -312 -256 -125 759 810 8 -673 -101 569 702 -198 -676 -125
3834 -125 1057 1006 -98 -684 -387 199 698 124 -723 41 582 746 -106 -761 -482 251 903 220 -276 -893
3854 -893 -230 489 213 -417 -455 -82 566 183 -927 -942 -250 386 355 -15 -606 -440 281 585 -734 -943
3874 -943 -66 558 813 -629 -821 -617 147 450 -129 -587 -270 39 556 -286 -877 -711 345 449 -23
3893 -23 -950 -708 203 463 125 -839 -859 -154 698 633 -778 -413 270 830 419 -384 -772 -17 767 165 -435
3914 -435 -949 -8 1030 490 -319 -758 -143 1065 729 -185 -575 -148 762 606 208 -615 -291 754 855
3933 855 119 -758 -242 415 902 115 -636 -167 442 1245 238 -588 -561 87 1011 250 -549 -322 408 867
$$ packed form
3793c33Q03L81n85q31J41P42L17n02k99J64N90J59p15m78J77N73O13m87o76j50
3813c96O09L67r1q01J3P86L60n70n89N6J31Q84N1q02o81N72O70J33r00m78N51
3834a25J182n1j104n86K97N86M99n74q47P64N41J64q52o55K79P33O52o83m96o17
3854h93O63P19k76o30l8L73O48l83j110j5O92O36l1l70n91J66P21L04j319k09
3874i43Q77O24K55j442j92K04P64L03n79m58L17L09N17q42n91J66J056J04m72
3893b3r27K42R11K60l38r64k0P05Q52o5j411L65O83N60m11q03l88P55P84o02o00
3914d35n14R41J038n40q09m39O15J208l36r14l90M27R10j56l98q23L24J045J01
3933H55p36q77N16O57M87p87p51M69O09Q03j007q26K7O48R24p61p99K27P30M59
$$ plain form
3953 867 447 -333 -505 263 1004 718 -370 -724 148 820 472 -544 -677 113 656 590 -533 -523 -109 704
3973 704 409 -294 -604 -221 787 834 -167 -631 -235 408 719 -144 -768 -453 330 680 -38 -870 -361 276
3993 276 926 82 -961 -718 39 953 209 -625 -863 21 565 -42 -916 -815 -46 698 159 -645 -759 -199
4013 -199 523 324 -637 -991 -501 513 580 -495 -865 -423 746 553 -319 -741 -358 287 648 -298 -795
4032 -795 -284 421 695 184 -1104 -807 558 628 133 -557 -443 -3 689 -54 -611 -791 441 958 56
4051 56 -637 -516 230 1310 379 -285 -547 -11 970 773 -339 -669 135 845 910 -355 -708 174 449 628
4071 628 -139 -201 -281 754 675 136 -562 -281 755 1070 140 -681 -328 641 983 87 -624 -467 801 1028
4091 1028 477 -939 -652 349 684 488 -751 -557 165 802 328 -639 -747 44 814 484 -612 -804
$$ packed form
3953H67m20p80j72P68P41k86j088l54Q72O72l48j016j33P90N43o6j123J0M14Q13
3973G04k95p03l10L83J008M7j001m64L96O43L11q63o24L15P83L50p18q32N09O37
3993B76O50q44j043K43P57R14p44q34k38Q84N44o07q74J01P69P44n39q04j14N60
4013a99P22j99r61l54M90J014O7j075l70M42J169j93q72m22L83O45L61r46m97
4032g95N11P05K74n11j288K97J365P0m95o90J14M40O92p43n57j80J232N17r02
4051E6o93J21P46J080r31o64k62N36R81j97j112l30Q04P10O5j265l53Q82K75J79
4071F28p67o2q0J035p9n39o98K81J036L15r30q21L53R69L42q96p11J57J268K27
4091A028n51j416K87J001L35j96j239J94P22O37m74r67j08P91P70l30j096j92
$$ plain form
4109 -804 28 693 233 -716 -651 77 601 697 -695 -1147 -624 775 625 -81 -851 -414 541 438 -502 -1016
4129 -1016 -454 413 158 58 -973 -813 -28 707 50 -911 -488 57 639 70 -735 -862 349 929 181
4148 181 -567 -777 33 242 22 -911 -675 274 550 -181 -1055 -1136 -80 768 425 -601 -678 -68 505 421
4168 421 -602 -512 95 628 861 -347 -1107 -383 755 620 -312 -737 -320 474 991 -232 -954 -106 767
4187 767 850 150 -607 -407 348 879 207 -696 -518 362 768 365 -407 -424 468 1125 575 -248 -555 203 757
4208 757 299 -109 -650 -24 930 586 -70 -762 17 451 711 -45 -386 22 706 984 23 -842 153 934
4228 934 909 -121 -711 -400 500 755 49 -548 -431 353 667 169 -684 -379 340 616 73 -419 -681 177
4248 177 689 -115 -895 -905 523 908 426 -794 -683 -159 772 503 -569 -975 -120 702 35 -872 -799 -314
$$ packed form
4109h04Q32O65m60r49O5P28N24R6j392m52N23J399j50p06p70M37R55j03r40n14
4129a016N62Q67k55j00j031J60P85P35o57r61M23N45N82n69q05j27J211N80p48
4148A81p48k10Q10K09k20r33K36R49K76p31q74q1J056Q48l43j026p7O10N73q4
4168D21j023R0O07N33K33j208p60P24J138j35r32m25M17P94N17j223p22Q48Q73
4187G67Q3p00p57K00P55N31o72r03J78Q80M06m03p72j7Q92O57n50q23l07P58N54
4208G57m58m08n41O26R54l44o56o92P79M34K60p56l41M08O84K78r61q65R95P81
4228I34k5j030n90L11R00K55p06n97J17P84L14m98q53L05P19K76n43m92k62Q58
4248A77N12q04p80j0J428L85m82j220J11N24R31k69j072m06Q55Q22o67r07P3M85
$$ plain form
4268 -314 438 557 -425 -954 -248 525 292 -164 -968 -142 371 609 -98 -1192 -891 500 449 -150 -903 -685
4288 -685 336 496 -113 -792 -720 365 721 103 -454 -559 70 793 399 -525 -224 103 1049 435 -238 -590
4308 -590 116 1039 662 -223 -678 27 825 573 -481 -641 58 787 623 -350 -541 -127 708 707 64 -532
4328 -532 -118 724 825 -287 -245 -281 869 433 5 -400 -112 404 848 236 -328 -303 312 650 55 -545
4348 -545 -347 323 782 73 -518 -415 16 704 475 -518 -698 309 690 448 -322 -678 443 1018 432
4367 432 -223 -817 103 845 424 -387 -464 -307 691 573 -177 -796 -294 459 456 -237 -766 -595 350 605 -77
4388 -77 -719 -506 427 521 46 -719 -764 20 573 81 -725 -643 268 569 79 -631 -731 34 440 205 -377
4409 -377 -536 -66 482 300 -144 -586 -218 526 322 -159 -603 -150 354 462 -339 -227 -465 560 658 -199
$$ packed form
4268c14P52J19r82n29P06P73k33m56q04Q26N13K38p07j094L01J391n1n99p53K18
4288f85J021J60o09o79P2J085L56o18n57j05O29P23l94r24L01L27R46o14o73l52
4308e90P06R23l77q85m55P05P98k52j054j60O99P29j64r73j91M14Q35jo43n96
4328e32M14Q42J01j112M2l6J150m36m28m05K88N16M44o12n64K5O15L38n95o00
4348e45J98O70M59p09n91J03M31O88k29r93j80J007L81k42p70l56J121N75n86
4367D32o55n94R20P42m21q11p7J57R98j18p50o19N02P53lo93n29J71R45K55o82
4388g7o42K13R33R4m75p65m5P84N53m92q06Q2R11L01m90p10j00P65M06k35n82
4409c77j59M70N48j82m44m42L68P44k04m81m44M53N04J08q01J12k38J025R8q57
$$ plain form
4429 -199 -561 -84 579 425 -167 -882 -386 401 418 -200 -404 -282 494 576 156 -707 -346 421 743 295 -715
4450 -715 -668 426 370 121 -127 -359 161 863 313 -684 -820 233 817 1122 -215 -524 -135 805 633 -49
4470 -49 -652 -536 609 566 -230 -411 -458 857 353 -85 -326 -327 498 638 -179 -657 -253 234 808 313 -337
4491 -337 -595 252 581 77 -242 -814 46 553 -198 -352 -164 217 509 346 -661 -437 45 434 91 -699
4511 -699 -512 51 450 369 -391 -643 62 322 435 -417 -918 -386 284 452 -210 -828 -365 305 378 -277 -474
4532 -474 -276 196 759 -38 -855 -487 -29 590 -73 -608 -669 283 290 -253 -567 -342 154 377 124 -633 -558
4553 -558 -157 720 64 -282 -360 88 500 378 -220 -316 49 271 159 -149 -132 -194 373 481 -128 -320 -40
4574 -40 376 206 138 -309 -63 209 429 -68 -347 -215 256 581 267 -361 -80 402 570 -3 -288 -234 266
$$ packed form
4429a99l62M77O63j54n92p15M96P87J7o18k04J22P76Q2m20q63L61P67L22m48j010
4450g15M7J094n6k49k48k32N20P02n50r97j36J053N84L05j337l09L89R40j72o82
4470d9o03J16J145m3p96j81m7J315n04m38k41jQ25J40q17m78M04M87N74m95o50
4491c37k58Q47L29n04l19n72Q60N07p51j54J88L81K92j63j007K24M82L89l43p90
4511f99J87N63L99q1p60k52P05K60J13q52n01N32O70J68o62o18M63O70P3o55j97
4532d74J98M72N63p97q17L68M58O19o63n35o1R52Pn43l14K25M96K23k53p57P5
4553e58M01Q77o56l46p8M48M12j22n98r6L65K22j12l08J7o2N67J08o09j92K80
4574d0M16j70o8m47K46K72K20m97k79J32M71L25l14o28K81M82J68n73k85N4N00
$$ plain form
4595 266 661 87 -243 -433 160 373 228 -267 -364 543 788 313 224 -341 -276 680 395 -247 -603 -60 447
4616 447 368 -64 -766 -72 589 164 -73 -543 -218 194 620 90 -408 -272 175 640 28 -514 -233 -81
4636 -81 311 20 -680 -438 474 339 168 -489 -371 94 296 143 -434 -530 -177 435 182 -612 -598 -362 319
4657 319 260 -257 -561 -147 407 -299 -177 -322 -130 93 332 -142 -592 -139 432 272 -249 -572 -223 199
4677 199 198 137 -282 -524 124 516 -100 -465 -157 278 374 8 -156 -445 162 317 37 -401 -263 323 536
4698 536 250 -132 -210 355 565 190 -551 -345 30 400 535 -96 -197 134 311 237 -180 -1 242 546 668
4719 668 144 -267 -35 431 395 -24 -255 11 129 443 41 -329 -360 294 312 36 -460 7 108 335 -156
4740 -156 -69 -72 4 231 297 -265 -80 161 453 62 -376 -346 87 414 191 -233 -412 -219 136 -85 -436 -330
$$ packed form
4595B66L95n74l30j90N93K13j45m95r7R07K45m75q9n65O5R56k85o42l56N43N07
4616D47p9m32p02O94O61m25k37m70L25M12M26n30m98J36M47M65o12n42K81J52
4636h1L92k91p00K42R12j35j71o57J18M65K02j53n77r6L53O12k53p94J4K36O81
4657C19n9n17l04M14N54p06J22j45J92K23K39m74m50M53N71j60n21l23L49M22
4677A99jo1m19k42O48L92o16l65L08M35R6l66j64k89O07J55k80m38J38N86K13
4698E36k86l82p8N65K10l75p41K06L75L70J35o31j01L31J77p4m17J79K43L04J22
4719F68n24m11K32M66l6m19k31K66J18L14m02l70l1O54J8k76m96M67J01K27m91
4740a56Q7lP6K27O6n62J85K41K92l91m38L0M33L27k23m24j79J93L55k21l51J06
$$ plain form
4762 -330 -50 179 -25 -431 -454 30 332 131 -53 -312 -136 64 231 78 -378 -291 -33 182 -108 -579 51
4783 51 -87 467 -49 -392 -257 336 265 30 -442 -199 152 231 40 -514 -433 -19 329 192 -280 -193 -420 396
4805 396 458 -398 -6 1 596 400 -212 -314 -343 472 400 -25 -616 -286 141 370 72 -278 -211 180 609 100
4827 100 -574 -74 262 212 170 -378 -237 7 200 166 -303 -321 310 473 44 -375 -35 228 536 245 -32
$$ packed form
4762c30K80K29k04m06k3M84L02k01j84k59J76K00J67j53m56Q7K58K15k90m71O30
4783E1j38N54n16l43J35N93p1k35m72K43L51P9j91n54Q1M14L48j37m72Q7k27Q16
4805C96O2q56L92PN95j96o12j02k9Q15p2m25n91L30M27K29k98l50O7L91M29n09
4827A00o74N00L36n0m2n48J41K44J93l4m69j8O31J63m29m19L40K63L08k91k77
$$ [...]
8191a67
##END NTUPLES=NMR FID
##END=
