##TITLE=1H_EC-3099(VII-2)
 CDCl3, 8 sc, 
 13.11.2019
##JCAMPDX= 6.0         $$ Bruker NMR JCAMP-DX V2.0
##DATA TYPE= NMR FID
##DATA CLASS= NTUPLES
##ORIGIN= UXNMR, Bruker Analytische Messtechnik GmbH
##OWNER= root
$$ XWIN-NMR		Version 3.5
$$ Wed Nov 13 14:10:38 2019 Russian Standard Time (UT+4h)  she@DPX200
##.OBSERVE FREQUENCY= 200.1315
##.OBSERVE NUCLEUS= ^1H
##.DELAY= (6, 6)
##.ACQUISITION MODE= SIMULTANEOUS
##.ACQUISITION SCHEME= undefined
##.AVERAGES= 8
##.DIGITISER RES= 18
##SPECTROMETER/DATA SYSTEM= spect
##.PULSE SEQUENCE= zg30
##.SOLVENT NAME= D2O
##.SHIFT REFERENCE= (INTERNAL, D2O, 0, 15.7039)
##AUDIT TRAIL= $$ (NUMBER, WHEN, WHO, WHERE, WHAT)
$$ ##TITLE= Audit trail, XWIN-NMR		Version 3.5
$$ ##JCAMPDX= 5.01
$$ ##ORIGIN= Bruker BioSpin GmbH
$$ ##OWNER= she
$$ F:/spectra/data/she/nmr/H-F/1/audita.txt
$$ ##AUDIT TRAIL=  $$ (NUMBER, WHEN, WHO, WHERE, WHAT)
(   1,<2019-11-13 14:09:25.39 +0400>,<she>,<DPX200>,
      <created by zg, POWCHK disabled, PULCHK disabled
       configuration hash MD5:
       00 E9 B6 7A A2 85 ED C7 34 08 36 98 17 FE 4E 26
       data hash MD5: 16K
       31 8D 1B 40 DC 48 06 7A 8B A7 80 7E 9C 6B 7D E9>)
$$ ##END=
$$ 
$$ hash MD5
$$ B2 DC 00 7D FD BD F1 B3 C2 BB 79 9C E6 28 99 6B
##$RELAX= 
##$RELAX= 
##$RELAX= 
##$RELAX= 
##$RELAX= 
##$RELAX= 
$$ Bruker specific parameters
$$ --------------------------
##$DU= <F:/spectra>
##$EXPNO= 1
##$NAME= <H-F>
##$PROCNO= 1
##$TYPE= <nmr>
##$USER= <she>
##$AMP= (0..31)
100 100 100 100 100 100 100 100 100 100 100 100 100 100 100 100 100 100 
100 100 100 100 100 100 100 100 100 100 100 100 100 100 
##$AQSEQ= 0
##$AQ_mod= 1
##$AUNM= <au_zg>
##$AUTOPOS= <>
##$BF1= 200.13
##$BF2= 200.13
##$BF3= 200.13
##$BF4= 200.13
##$BF5= 200.13
##$BF6= 200.13
##$BF7= 200.13
##$BF8= 200.13
##$BYTORDA= 1
##$CFDGTYP= 0
##$CFRGTYP= 5
##$CHEMSTR= <none>
##$CNST= (0..31)
1 1 145 1 1 1 1 1 1 1 1 1 1 1 1 1 1 1 1 1 1 1 1 1 1 1 1 1 1 1 1 1 
##$CPDPRG= <>
##$CPDPRG1= <>
##$CPDPRG2= <>
##$CPDPRG3= <>
##$CPDPRG4= <mlev>
##$CPDPRG5= <mlev>
##$CPDPRG6= <mlev>
##$CPDPRG7= <mlev>
##$CPDPRG8= <mlev>
##$CPDPRGB= <>
##$CPDPRGT= <>
##$D= (0..31)
0 1.2 0 0 0 0 0 0 0 0.06 0 0.03 0 0 0 0 0.0002 0 0 0 0 0 0 0 0 0 0 0 0 
0 0 0 
##$DATE= 1573639764
##$DBL= (0..7)
120 120 120 120 120 120 120 120 
##$DBP= (0..7)
150 150 150 150 150 150 150 150 
##$DBP07= 0
##$DBPNAM0= <>
##$DBPNAM1= <>
##$DBPNAM2= <>
##$DBPNAM3= <>
##$DBPNAM4= <>
##$DBPNAM5= <>
##$DBPNAM6= <>
##$DBPNAM7= <>
##$DBPOAL= (0..7)
0.5 0.5 0.5 0.5 0.5 0.5 0.5 0.5 
##$DBPOFFS= (0..7)
0 0 0 0 0 0 0 0 
##$DE= 6
##$DECBNUC= <off>
##$DECIM= 24
##$DECNUC= <off>
##$DECSTAT= 4
##$DIGMOD= 1
##$DIGTYP= 9
##$DL= (0..7)
0 120 120 120 120 120 120 120 
##$DP= (0..7)
150 150 150 150 150 150 150 150 
##$DP07= 0
##$DPNAME0= <>
##$DPNAME1= <>
##$DPNAME2= <>
##$DPNAME3= <>
##$DPNAME4= <>
##$DPNAME5= <>
##$DPNAME6= <>
##$DPNAME7= <>
##$DPOAL= (0..7)
0.5 0.5 0.5 0.5 0.5 0.5 0.5 0.5 
##$DPOFFS= (0..7)
0 0 0 0 0 0 0 0 
##$DQDMODE= 0
##$DR= 18
##$DS= 0
##$DSLIST= <SSSSSSSSSSSSSSS>
$$ [...]
##$SUBNAM2= <"">
##$SUBNAM3= <"">
##$SUBNAM4= <"">
##$SUBNAM5= <"">
##$SUBNAM6= <"">
##$SUBNAM7= <"">
##$SUBNAM8= <"">
##$SUBNAM9= <"">
##$SW= 24.0689530833862
##$SWIBOX= (0..15)
0 0 2 0 0 0 0 0 0 0 0 0 0 0 0 0 
##$SW_h= 4816.95568400771
##$TD= 16384
##$TD0= 1
##$TE= 0
##$TE2= 300
##$TE3= 300
##$TEG= 300
##$TL= (0..7)
0 120 120 120 120 120 120 120 
##$TP= (0..7)
150 150 150 150 150 150 150 150 
##$TP07= 0
##$TPNAME0= <>
##$TPNAME1= <>
##$TPNAME2= <>
##$TPNAME3= <>
##$TPNAME4= <>
##$TPNAME5= <>
##$TPNAME6= <>
##$TPNAME7= <>
##$TPOAL= (0..7)
0.5 0.5 0.5 0.5 0.5 0.5 0.5 0.5 
##$TPOFFS= (0..7)
0 0 0 0 0 0 0 0 
##$TUNHIN= 0
##$TUNHOUT= 0
##$TUNXOUT= 0
##$USERA1= <user>
##$USERA2= <user>
##$USERA3= <user>
##$USERA4= <user>
##$USERA5= <user>
##$V9= 5
##$VALIST= <valist>
##$VCLIST= <CCCCCCCCCCCCCCC>
##$VD= 0
##$VDLIST= <DDDDDDDDDDDDDDD>
##$VPLIST= <PPPPPPPPPPPPPPP>
##$VTLIST= <TTTTTTTTTTTTTTT>
##$WBST= 1024
##$WBSW= 4
##$XGAIN= (0..3)
0 0 0 0 
##$XL= 0
##$YL= 0
##$YMAX_a= 47269
##$YMIN_a= -95507
##$ZGOPTNS= <>
##$ZL1= 120
##$ZL2= 120
##$ZL3= 120
##$ZL4= 120
##$ABSF1= 10
##$ABSF2= 0
##$ABSG= 5
##$ABSL= 3
##$ALPHA= 0
##$AQORDER= 0
##$ASSFAC= 0
##$ASSFACI= 0
##$ASSFACX= 0
##$ASSWID= 0
##$AUNMP= <proc_1d>
##$AZFE= 0.1
##$AZFW= 0.1
##$BCFW= 1
##$BC_mod= 2
##$BYTORDP= 1
##$COROFFS= 0
##$CY= 11.3945322036743
##$DATMOD= 1
##$DC= 2
##$DFILT= <>
##$DTYPP= 0
##$F1P= 16.9975609425685
##$F2P= -3.02152046262296
##$FCOR= 0.5
##$FTSIZE= 0
##$FT_mod= 4
##$GAMMA= 1
##$GB= 0.15
##$INTBC= 1
##$INTSCL= 1
##$ISEN= 128
##$LB= 0.24
##$LEV0= 0
##$LPBIN= 0
##$MAXI= 10000
##$MC2= 0
##$MEAN= 0
##$ME_mod= 0
##$MI= 1.114404
##$NCOEF= 0
##$NC_proc= 0
##$NLEV= 6
##$NOISF1= 3.799351
##$NOISF2= 2.8
##$NSP= 1
##$NTH_PI= 0
##$NZP= 0
##$OFFSET= 15.70392
##$PC= 1
##$PHC0= -9619.241
##$PHC1= 22.80088
##$PH_mod= 1
##$PKNL= yes
##$PPARMOD= 0
##$PSCAL= 0
##$PSIGN= 0
##$REVERSE= no
##$SF= 200.130013532006
##$SI= 16384
##$SIGF1= 3
##$SIGF2= 2
##$SINO= 400
##$SIOLD= 16384
##$SREGLST= <1H.CDCl3>
##$SSB= 0
##$STSI= 0
##$STSR= 0
##$SW_p= 3612.71676300578
##$SYMM= 0
##$S_DEV= 0
##$TDeff= 0
##$TDoff= 0
##$TI= <>
##$TILT= no
##$TM1= 0
##$TM2= 0
##$TOPLEV= 0
##$USERP1= <user>
##$USERP2= <user>
##$USERP3= <user>
##$USERP4= <user>
##$USERP5= <user>
##$WDW= 1
##$XDIM= 8192
##$YMAX_p= 0
##$YMIN_p= 0
$$ End of Bruker specific parameters
$$ ---------------------------------
##NTUPLES= NMR FID
##VAR_NAME=  TIME,          FID/REAL,        FID/IMAG
##SYMBOL=    X,             R,               I
##VAR_TYPE=  INDEPENDENT,   DEPENDENT,       DEPENDENT
##VAR_FORM=  AFFN,          ASDF,            ASDF
##VAR_DIM=   8192,          8192,            8192
##UNITS=     SECONDS,       ARBITRARY UNITS, ARBITRARY UNITS
##FACTOR=    0.0002076,     1,               1
##FIRST=     0,             0,               0
##LAST=      1.7004516,     0,               0
##MIN=       0,             -95507,          0
##MAX=       1.7004516,     47269,           0
$$ Real data points
##PAGE= N=1
##DATA TABLE= (X++(R..R)), XYDATA
$$ [...]
2370e1j659K130J964l802r82L433J9j547J017j242j171L447N69l969L19K707j077
2387A05j8R23k409l0L690r00l332J585J309j232J137l1k977J543L458k334k173
2404a686J954%n20K178j626k697K869K194l145k93J528j134P76J809k816j544
2420b153L732L77k837P69M37j144K166P21l862K73L503r66j752J218p38o08K788
2437A924p40l656J680K746j813o56P82j440Q55K770k445k840K973J422j825L30
2453F7k48j841K469K007l585j231L140p9j117P65j520q17L562M32m088L85K691
2470I92p11j91O38k630M61L956j402l380J635J484j054R07k09k797J834L247k792
2487a2k097K219R4q8J420j927k358L395J662l229l34J598p14N51J374k876q00
$$ plain form
2370 -51 -1710 420 2384 -1418 -2400 1033 1052 -495 522 -720 -1891 1556 2125 -1844 -1525 1182 105
2387 105 87 1010 -1399 -1429 2261 1361 -1971 -386 923 -309 828 797 -2180 -637 2821 487 -1686
2404 -1686 268 268 -252 1926 300 -2397 472 2666 -479 -772 756 -378 398 2207 -609 -2153
2420 -2153 1579 1956 -881 -112 325 -819 1347 2068 -1794 -1521 1982 1016 -736 482 -256 -864 1924
2437 1924 1184 -2472 -792 1954 141 -515 267 -1173 -318 2452 7 -2833 140 1562 -263 67
2453 67 -181 -2022 447 2454 -1131 -2362 778 699 -418 347 -1173 -1990 1572 2004 -2084 -1699 992
2470 992 281 90 728 -1902 -1441 2515 1113 -2267 -632 852 -202 705 496 -2301 -467 2780 -12
2487 -12 -2109 110 204 116 1536 -391 -2749 646 2308 -921 -1255 343 -371 180 1554 -1322 -2122
2504b122L653K1l022R28Q42j285K034K94l489R34L489j633j872J411n68l68K527
2521A774r95l005K024K368k344m97J149j259Q39K332k469k274L089R73k257Q43
2537B91N4j613J958J604l291o80L007n39j122J314j284j129K921J66l343J036
2553f50K152j368o2Q75k256J99L253j269k596J743P53j404J347R0k683J535K691
2570B350k513j282K003n53n05J944j415k192K779J488l029k5J348j078Q70J597
2586A787k641j323L334J3k332J122L35j314J894M14l269O36L008j160j518J205
2602A91q19m90K739r85l094J955K026j857k71P46j529Q67K567k350k107K839Q20
2619A248j966O96j30j524K263J724l485q08K868l48q60J087j505p44K874K65l367
$$ plain form
2504 -2122 1531 1552 -1470 -542 300 -985 1049 1343 -2146 -1212 2277 644 -1228 183 -385 -753 1774
2521 1774 779 -2226 -202 2166 -178 -675 474 -785 54 2386 -83 -2357 732 1705 -552 291
2537 291 345 -1268 690 2294 -997 -1677 1330 791 -331 983 -301 -1430 1491 1657 -1686 -650
2553 -650 1502 134 72 947 -1309 -1110 2143 874 -1722 21 774 -630 717 807 -1876 -341 2350
2570 2350 -163 -1445 558 5 -500 1444 29 -2163 616 2104 -925 -950 398 -680 190 1787
2586 1787 -854 -2177 1157 1170 -1162 -40 295 -1019 875 1289 -1980 -1344 1664 504 -1014 191
2602 191 -628 -1118 1621 636 -2458 -503 1523 -334 -605 141 -1388 -521 2046 -304 -2411 428 1248
2619 1248 -718 -22 -152 -1676 587 2311 -1174 -1982 886 538 -322 765 -740 -1484 1390 1655 -1712
2636a712O97K270j206J47O33k243M40L198j471k652J886Q79j052J096m36k474
2652b000J833K538k247j554K151m08p22J687j326j835K790J128k946N2J576j049
2668c32O46J358k651o55L389m76k554J270M37j181J818L69l060Q61K784j654j475
2685a106J676o17m64K041j123k504K070J752k082r7J055j490N34K142k060j650
2701a923K689L08j930J034J68j709J942J112k970K5K433p07j069J204j158q68
2717a419K677J5l020J093J688j501L24J057k196R5K952j357k281J821N52j329
2733h29J374L0k534J576K256k394r84J889o95l96J974j387j863K299R69k345L92
2750f68J255j284N78J572k377p99K904l74j920J144P8j105J872L31k883O83K560
$$ plain form
2636 -1712 -1015 1255 49 196 829 -1414 -974 2224 753 -1899 -13 866 -186 910 474 -2000
2652 -2000 -167 2371 124 -1430 721 313 -409 1278 -48 -1883 907 2035 -911 -859 717 -332
2668 -332 314 1672 -979 -1634 1755 1279 -1275 -5 432 -749 1069 1438 -1622 -761 2023 369 -1106
2685 -1106 570 -47 -511 1530 407 -2097 -27 1725 -357 -454 601 -889 -355 1787 -273 -1923
2701 -1923 766 1074 -856 178 346 -1363 579 1691 -1279 -1254 1179 472 -597 607 -551 -1419
2717 -1419 1258 1273 -1747 -654 1034 -467 -143 914 -1282 -1187 1765 408 -1873 -52 500 -829
2733 -829 545 575 -1959 -383 1873 -521 -1505 384 -311 -707 1267 -120 -1983 316 1285 -1060 -668
2750 -668 587 -697 -119 1453 -924 -1723 1181 807 -1113 31 109 -996 876 1207 -1676 -993 1567
2767A567j438r25J627j072n92K317r75k315J998J506j990M1Q34j667J014K137
2783B067j985j825K679J74j883J144o8j593K010J334k975j69K262q57p80J463
2799I98j274q97K657k52k889J047J755j389N06Q99k347K34K677j299k011K011
2815D26M23j259J173m02k191J729K114k312q00J771o89m90J575j357j610K761
2831H62P43k589N24J105j741R21J620k399l23K677r64j827J313K53j238J817K46
2848A000k657P94K075j547o53J519q71m48K001r01k281J952J133j853M09J032
2864G04j626M72J787j858j068K291K21j844J294k00j644J857J158k611J02K200
2880A235j323n99J550j231q05K442j14k530J066J386j636N64R92j938K80K329
$$ plain form
2767 1567 129 -796 831 -241 -833 1484 509 -1806 192 1698 -292 -251 583 -1084 -70 2067
2783 2067 82 -1743 936 1110 -773 371 303 -1290 720 2054 -921 -1090 1172 315 -465 998
2799 998 -276 -1173 1484 1232 -1657 -610 1145 -244 262 1161 -1186 -952 1725 426 -1585 426
2815 426 849 -410 763 361 -1830 -101 2013 -299 -1099 672 -17 -507 1068 -289 -1899 862
2831 862 1605 -984 -460 645 -1096 -175 1445 -954 -1277 1400 436 -1391 -78 175 -1063 754 1000
2848 1000 -1657 -863 1212 -335 -988 531 -340 -788 1213 312 -1969 -17 1116 -737 -328 704
2864 704 -922 -450 1337 -521 -1589 702 923 -921 373 173 -1471 386 1544 -1067 -965 1235
2880 1235 -88 -687 863 -368 -1173 1269 1155 -1375 -309 1077 -559 5 997 -941 -661 1668
2896A668j386j767J715J99j143J492J10k346J374J635k043m61J818r70l90J836
2912A341j356j620K259O73k117P45Q18j412O91J510k152o19K636p87j435J446
2928F21k18j400J709M63k370Q23K011j627n49J251r75m79K328r37k149J808Q17
2945A127j846O24Q12j682P36J905k095j044K265l20j271J196j28j658J854R68
2961A443k504J06J807r96m84J539j443q01K360k66k255J321R97j645Q07R35k120
2978a199L17K332j386j458J763n6j181J588j66k150J229J665j867l05J545j116
2994d45l05J882j215j459K137M26j994O90Q00j498Q14J319j955n01K483q30j405
3011a056J484j83j335J717L89k285P80J715j586l90J712j197n48K006q15j841
$$ plain form
2896 1668 282 -1485 230 429 -714 778 888 -1458 -84 1551 -492 -953 865 -105 -495 1341
2912 1341 -15 -1635 624 1297 -820 -75 743 -669 22 1532 -620 -1239 1397 610 -825 621
2928 621 403 -997 712 1175 -1195 -372 1639 12 -537 714 -261 -740 1588 651 -1498 310 1127
2945 1127 -719 -95 717 -965 -229 1676 -419 -1463 802 482 -789 407 279 -1379 475 1443
2961 1443 -1061 -955 852 -144 -628 911 -532 -1333 1027 761 -1494 -173 824 -821 -14 921 -1199
2978 -1199 -882 1450 64 -1394 369 313 -868 720 554 -1596 -367 1298 -569 -874 671 -445
2994 -445 -750 1132 -83 -1542 595 1021 -973 -283 517 -981 -167 1152 -803 -1304 1179 349 -1056
3011 -1056 428 245 -1090 627 1016 -1269 -489 1226 -360 -750 962 -235 -783 1223 408 -1433
3027a433J717P57j616O65Q57j909P52J713j753r43K129k80j442J585j96j729J572
3044D46J122k277N2J728j090k18J385j448q33K345j92k089J093Q53j491Q92P52
3061A030k005K76K087j191j302J618k69j001J457l7j990J183J538j919j51J311
3077F35r77j61J737j282j479K042L43j887Q71O85j409Q05J301k039l64K162p14
3094B69j021J305n49j194J681M94k283Q46J626j561k58J399j224l96J949o43j876
3111a436J516P79j647O76P26j614N93J761j775q64J912l64j170J620l40j844J551
3128H0R54k006L42J478j241j41J463j384o27K025l62j758J312N20j315Q36Q46
3145A022j873J25K088j301r19J515m92r45J604j64j764J221J174j700N1R94j037
$$ plain form
3027 -1433 284 1041 -575 90 947 -962 -210 1503 -250 -1193 936 656 -786 799 603 -1126 446
3044 446 1568 -709 -657 1071 -19 -237 1148 -300 -1133 1212 1020 -1069 24 877 -614 278 1030
3061 1030 -975 -699 1388 197 -1105 513 244 -757 700 663 -1327 -144 1394 -525 -676 635
3077 635 -342 -503 1234 -48 -1527 515 858 -1029 -158 527 -882 -77 1224 -815 -1179 983 269
3094 269 -752 553 4 -1190 491 985 -1298 -452 1174 -387 -645 754 -470 -866 1083 440 -1436
3111 -1436 80 859 -788 -112 614 -1000 -407 1354 -421 -1285 627 263 -907 713 373 -1471 80
3128 80 1034 -972 -630 848 -393 -534 929 -455 -1082 943 581 -1177 135 655 -660 176 1022
3145 1022 -851 -726 1362 61 -858 657 165 -780 824 660 -1104 117 1291 -409 -358 636 -401
3162d01q6J704j117j170J477N49j700R72M50j564J065J229j779n58J868p13q37
3179f11J280m80j116J658L50k092P04J345j271N9J088j285m28J943p03j618J490
3196C13L16j350Q95M75j650O52J730j605p90J468m58o30J344n68j421J538P44
3213A003j814K38J312j246N8J300j328p31K092l36j485Q82L94j121J025O67j992
3230a082K27J897j076q76J417o16p39J509k25j776J162J249j647R4J012j195J61
3247e04J698j336j219J759K53j311Q18J98j495J174J230j833j79J426o25n97J273
3264G30q44q85J730J13j744O36J173j278J93J009j333k28J860p27j394J349K54
3281F14j212J064L97j742O95J491j467n26J387o33n19J318n12j518J668O38j705
$$ plain form
3162 -401 -487 1217 100 -1070 407 956 -744 228 678 -886 179 1408 -371 -929 939 226 -611
3179 -611 669 189 -927 731 1081 -1011 -307 1038 -233 -174 914 -371 -799 1144 441 -1177 313
3196 313 629 -721 174 649 -1001 -349 1381 -224 -1014 454 -4 -634 710 142 -1279 259 1003
3213 1003 -811 -573 739 -507 -449 851 -477 -1208 884 548 -937 -55 339 -782 243 910 -1082
3230 -1082 -855 1042 -34 -910 507 -109 -848 661 436 -1340 -178 1071 -576 -482 530 -665 -504
3247 -504 1194 -142 -1361 398 651 -660 158 356 -1139 35 1265 -568 -747 679 54 -543 730
3264 730 -114 -999 731 844 -900 -264 909 -369 -176 833 -500 -728 1132 405 -989 360 614
3281 614 -598 466 863 -879 -184 1307 -160 -686 701 68 -451 867 355 -1163 505 1143 -562
3298e62J96J041j160L24J184j416n33J837l84j230Q45L02j076J106N10j838K88
3315e66J755j141o42J086o72m86J583k78j923J194J014j393L50O76j169Q1J619
3332A088j119j259J867l5j166Q56J45j488J139J193j900l14J645n84m82J054q37
3349a97j009J752K60j882P43R15j096L73Q66j609J15J726o66j332J117K89j024
3366f59J092K2j662P80J491j251n57J144n74n87J546p39j214J474O68j638L39
3383c25R08j154M26J231j559n86J937l14j263Q01J09q61J118M15j882L98J686
3400A085j176l98J026o35m91J667o37j646J234R20j139K25N98j194K08J679j227
3417I9j050J481Kj094R14J11j451J193J057j771q7J424o96l23R95r80p69J878
$$ plain form
3298 -562 -366 675 -485 -161 1023 -393 -926 911 527 -703 142 444 -632 474 984 -854 -566
3315 -566 1189 48 -594 492 -180 -666 917 639 -1284 -90 924 -469 -119 557 -612 -531 1088
3332 1088 -31 -1290 577 542 -624 232 377 -1111 28 1221 -679 -993 652 68 -414 640 -197
3349 -197 -1206 546 806 -1076 -333 582 -514 -141 725 -884 -769 957 291 -1041 76 365 -659
3366 -659 433 455 -1207 -427 1064 -187 -744 400 -174 -761 785 46 -1168 306 974 -664 -325
3383 -325 583 -571 -145 1086 -473 -1059 878 564 -699 102 211 -650 468 883 -999 -601 1085
3400 1085 -91 -489 537 -98 -589 1078 441 -1205 29 949 -190 35 633 -561 -353 1326 99
3417 99 -951 530 532 -562 352 463 -988 205 1262 -509 -596 828 132 -191 804 -176 -945 933
3435I33k6j728P46P34r79M93Q01j484j49J751p56j155J170lp70Q25J47j643P71
3454c22J475j438l96J199p48k79J381q57j409J638O01j525M97O16j123N96R33
3471H39j458l90J687k46j086P58j35q39J297M52j989N01J533r37o09R61p01l28
3489f90J663p27j531J047R71j154K84M18j104N20J633j525j054J634k6o62N52
3506B49l8j348J410Q37j786lJ270o10j75Q86r08p76J753J46j724O06Q40q56L17
3525I0O38j539J61J780q05j205J141N9p43Q77n3j506J055J305j370n18J102n45
3543g6j63J155r21j002J484M96j392K27O19q80N49R71j505n25J841l56j135P34
3561A21p4o12J225K39j854L86J388p33l36O46p13k72J438n59j543J205Q54j029
$$ plain form
3435 933 907 -821 -75 659 -320 173 974 -510 -659 1092 336 -819 351 348 -422 403 550 -1093 -322
3454 -322 1153 -285 -681 518 -230 -509 872 15 -1394 244 845 -680 -183 433 -690 -94 839
3471 839 -619 -1009 678 432 -654 104 -31 -870 427 879 -1110 -609 924 -13 -622 339 -362 -690
3489 -690 973 246 -1285 -238 733 -421 -137 281 -823 -303 1330 -195 -1249 385 359 -303 249
3506 249 211 -1137 273 1110 -676 -679 591 -19 -194 692 -216 -992 761 907 -817 -211 629 -227 90
3525 90 728 -811 -650 1130 325 -880 261 320 -423 454 401 -1105 -50 1255 -115 -633 469 -76
3543 -76 -239 916 -5 -1007 477 973 -419 -192 427 -453 96 1067 -438 -963 878 522 -613 121
3561 121 47 -565 660 899 -955 -569 819 86 -250 396 -317 -589 849 290 -1253 -48 806 -223
3579b23K02L02r41L55J319j181r56J467Qq62Q51l10j028J179Q95j677n3J199o37
3598i1j82P93r27n00J661j0j549M09Q11r48O44N48j473J39J639q41j039J047j0
3617A21o53J078n4j679R02J273j444j47J055o55l0R24p54j184J561N37j223J51
3635b21L67o94O21R38j642j92J739l13j172P22j60o34J307K49j855N23J367q98
3653E2k61N75o57q8J521n75j583P90Q33q11K89L75j039O52J287j591r07J469K38
3672E69o10N98m73j022J263R22j766q0J123k46k55N06j047m51J784P1j557O35
3690c6O27q23N02L44j521L43J699q49j005Q64j8l69Q24k25j387R44J097j263l89
3709f41R92n88mR85r23q27J331N41j464K01O19o17O70N08j607j44J603k75r01
$$ plain form
3579 -223 -21 281 -660 -305 1014 -167 -1123 344 352 -510 341 31 -997 182 1077 -600 -653 546 -91
3598 -91 -273 520 -407 -907 754 744 -805 -396 415 -533 111 659 -814 -675 964 123 -916 131 121
3617 121 -532 546 492 -1187 -285 988 -456 -603 452 -203 -233 691 -63 -1247 314 851 -372 -221
3635 -221 146 -548 73 1011 -631 -823 916 603 -569 153 -7 -641 666 915 -940 -417 950 52
3653 52 -209 366 -291 -379 1142 567 -1016 -226 607 -204 85 460 -579 73 1360 -231 -1138 331 569
3672 569 -41 557 84 -938 325 1247 -519 -599 524 278 23 529 -518 -969 815 886 -671 -36
3690 -36 591 -232 270 614 -907 -564 1135 286 -719 145 127 -242 582 357 -1030 -86 1011 -252 -641
3709 -641 351 -237 -241 744 -179 -1006 325 866 -598 -397 222 -395 275 783 -824 -968 635 360 -541
3728e41O21p6o05J193j35j563O14J335q71k59M01o01M3J458p80j414J154O72j062
3747d16K63K94r25P52J078j247r52J542p7n97N34l24q65J204P73j621j43J189
3765D62n57M0P03j027n10J728j71j342M46P09o51M44M12j526L45J558q41q73R41
3784B90j65l75Q66k67j470J259J007j280m10Q91n66J27Q61q68r79J647L71j261
3802c22K32K81n30O94O61j630j11J610l94r51P02l79l66J200oj697N82J356q35
3821I7l18L72p09J39J550q20j538J212P72q20K28j2q97O37J282j467p82J461j23
3840B64n72P15o32p36J261N85j519nJ056n35m4O97j136j72J582l46j388P26M50
3859B51n41N24J78j297M26J544j028q17Q19l9m86J040m71j156J216Q65j379k32
$$ plain form
3728 -541 80 4 -601 592 457 -1106 -492 843 -28 -287 114 -487 -444 1014 234 -1180 -26 646 -416
3747 -416 -153 141 -784 -32 1046 -201 -1153 389 312 -285 249 -75 -940 264 1037 -584 -727 462
3765 462 -95 -55 648 -379 -889 839 668 -674 -228 481 -170 274 686 -840 -495 1063 222 -651 290
3784 290 125 -250 616 349 -1121 138 1145 -135 -545 346 -220 -93 768 -100 -1079 568 939 -322
3802 -322 -90 191 -339 355 1016 -614 -725 885 491 -460 242 -137 -503 697 691 -1006 -424 932 97
3821 97 -221 151 -558 -419 1131 311 -1227 -15 757 -63 165 153 -744 -107 1175 -292 -1074 387 264
3840 264 -308 407 -225 -961 300 885 -634 -639 417 -118 -162 535 -601 -773 809 463 -925 -199 251
3859 251 -290 234 412 -885 -459 1085 57 -760 59 20 -466 574 103 -1053 163 1028 -351 -583
3877e83P93l38J79P15j171p68J701J80j278L38L57m42P05M09j630J03J604m70
3895D04p85N75k41m19J278j60j713Q33J137p20m10N01p50J36J449q34j322J253
3913B12N47q46K14J54j137R23J171j445n14J079n1n01P31n46o93J382K45j588
3931f63K2J186n30N1O36j124p5J356j89j502Q21M85p20O10R4j307M25J476r89
3950F3p93J092k53l79Q16n13j089J222P60j225j82P38m75J50O91j008o44J607
3968E78J20j185K13L89o51Q36M50j526k2J480m58q85O27j38k81J302m12j490P12
3987c41J150q37k71M42p03L05J261r93j126J264M95q50L55K5r47Q15Q90j362l14
4006g42J049Q7p22O02n91n88J413M98j653Q2J009n92J16M87r05j22J610n01j449
$$ plain form
3877 -583 210 -128 51 766 -405 -1173 528 708 -570 -232 125 -317 388 797 -833 -730 874 404
3895 404 -381 194 -47 -466 812 652 -1061 -228 909 189 -221 280 -470 -334 1115 281 -1041 212
3913 212 759 -87 127 281 -856 67 1238 -207 -721 358 307 -194 537 -9 -702 680 925 -663
3931 -663 -641 545 15 66 702 -422 -497 859 670 -832 -11 474 -246 364 458 -849 -424 1052 63
3950 63 -730 362 109 -270 546 33 -1056 166 926 -299 -481 257 -218 -68 623 -385 -1029 578
3968 578 698 -487 -274 115 -536 300 750 -776 -798 682 224 -661 -34 -172 -453 849 437 -1053 -341
3987 -341 809 -28 -299 143 -560 -255 1006 13 -1113 151 646 -204 151 176 -771 44 934 -428 -742
4006 -742 307 394 -328 274 -317 -905 508 1006 -647 -565 444 -148 -32 455 -450 -572 1038 537 -912
4025i12P71O00p33P40q9j135O29J210j136p66J016o5k12P90p62r66J177P30j238
4044c51K1O83m56L09O82j312m91J545Q3j265N69K94o01P77K28j409J86J481n80
4063C93q28M99j59j95J024j60j516Q26R38q26j66M29p75M53J085j006j074J234
4081A76M18r10M40M0q20Q11P45j323k94J214l70n00P67o76l76J254J25j458K71
4100d66P78m03nM40q88m2J424n72j173Q42K06m81M86R8j155O94J196j183n65Q43
4120G4j75j61P24n07r26J189O17j247j12Q50n75J55P00j063m03J459o9j074M46
4139i8K56n17Q13K38j552L26J370o52n69O35l42k11R92l32j224Q26R18r28j67
4158b18M83n91K53J154j073r31J130M11p34M08j41p84R68O74j527r6J139j33o08
$$ plain form
4025 -912 -141 459 -274 466 377 -758 -129 1081 -55 -821 195 130 -82 708 -54 -1020 157 887 -351
4044 -351 -330 353 -103 206 888 -424 -915 630 713 -552 17 311 -290 487 715 -694 -508 973 393
4063 393 -435 64 -95 -290 734 574 -942 -116 822 -4 -170 259 -516 -63 1022 16 -1058 176
4081 176 594 -316 124 164 -656 155 900 -423 -717 497 127 -373 394 -282 -658 596 721 -737 -466
4100 -466 312 -91 -96 344 -544 -586 838 266 -907 -65 141 -340 146 244 -911 -217 979 -204 -769 74
4120 74 -101 -262 462 -45 -971 218 835 -412 -524 326 -249 -94 606 -457 -860 599 530 -544 -98
4139 -98 158 -359 454 692 -860 -534 836 184 -385 250 -92 -303 689 357 -867 -41 877 -51 -218
4158 -218 265 -326 -73 1081 8 -923 207 618 -116 292 151 -633 335 1009 -518 -614 525 392 -216
4177b16O27m44n41J272m4j309L75P94o77L13K81j049L01J178o42r95Q28L80o84
4196b52N14Kj080Q65Q97j070n09Q97k09l31P56o71q37J346L81j328J76P50m69
4215a72J62N90j155k15J457l27j056N73O5l31P19J29j252L58J279p82m85O35l67
4234a75k08J036m31j192Q26Q13q07k9L65o82L37J050j061q15J264P9n84L04j12
4253b2o82R05O65j329j95R96l04k08M06n36k85J115J83j390N01O61n80K36L82
4272E19j189L05J226p23r17R42P1n43P12n9j133P67R74j110l90Q33j36k45O63
4291E67o40p13J195M75j226n6O41l77K30O75j189k59J429k68q97M20O0l61Q87
4310E93q1j223L92J201o53n66L92k35j32J026m50r73O95O61p94j1M56p70L51J016
$$ plain form
4177 -216 411 -33 -574 698 654 -655 -280 514 -163 150 431 -618 -317 861 219 -776 52 432 -252
4196 -252 262 264 -816 49 946 -124 -633 264 55 -276 480 -191 -1028 318 699 -629 -453 297 -172
4215 -172 -10 580 -575 -790 667 340 -716 -143 -78 -409 310 439 -813 -455 824 42 -443 192 -175
4234 -175 -383 653 222 -970 -144 669 -138 -167 198 -484 -147 903 -158 -973 291 370 -214 90 -22
4253 -22 -704 201 866 -463 -658 338 34 -174 232 -304 -589 526 709 -681 -180 481 -99 137 519
4272 519 -670 -365 861 138 -779 163 234 -309 403 344 -789 -22 952 -158 -548 285 149 -96 567
4291 567 -73 -786 409 884 -342 -398 243 -134 96 771 -418 -677 752 484 -413 7 67 -294 593
4310 593 512 -711 -319 882 229 -337 55 -180 -312 714 264 -709 -14 647 -147 -158 298 -472 -121 895
4330H95j063p34J274Oo75L07O6q29J060N25j477J8J082k33m79O00o02k82J198
4349F57j99j213N33O41n70J64L38r13J17J307q25q16P64L17o22O54k21q99Q45
4368E9P85j123l53R64l89j10O05o05n34J213M5j156K54P72o15K94L30r69q0J182
4388E69j76q04M04j3k73P26J6j171M56J004o78m09N56l67k3P41m39r41Q84O69
4408G31q64P5K86n92K17R54q86o40R79J35o11M50j56o43Q54M61j254rJ078m64
4428A01k56M63m43k63J082j28j257N76N28n09K59J90p85J24J088o73o25P90K0
4447B82m73M99p7q79P49P50j069k26O49k30j14O11n90p40J295M06j309L62K76
4466A72m75L54M82j130OJ271l73p66N35j10l17P97o7j226N42J079q21m00O06m11
$$ plain form
4330 895 -168 -902 372 378 -297 10 76 -753 307 832 -645 -627 455 222 -257 343 -259 -541 657
4349 657 458 -755 -222 419 -151 13 351 -562 -445 862 37 -779 -15 302 -320 334 113 -786 59
4368 59 844 -279 -632 332 -57 -167 438 -167 -701 512 557 -599 -345 427 -188 106 436 -533 -613 569
4388 569 393 -411 -7 -20 -293 433 449 -722 -266 738 60 -349 207 -160 -183 558 119 -822 62 731
4408 731 -133 -58 228 -364 -147 807 -79 -719 260 395 -216 234 78 -565 289 750 -504 -513 565 101
4428 101 -155 308 -135 -398 684 556 -701 -125 403 -106 153 343 -442 -318 770 97 -528 262 282
4447 282 -191 308 231 -648 101 851 -218 -444 205 -25 -139 472 -118 -858 437 843 -466 -104 172
4466 172 -303 51 533 -597 -591 680 307 -459 76 -34 -351 446 379 -847 -305 774 -47 -447 159 -252
4486b52K1P92m72q95Q18N45q36K38R5o63N94O26q28m75J070j8n39M18j91o98R53
4507C03L69j268K17Q67m00k74N59n91l31J153l44q90M84O04o37L06K23q71K24
4526b97J081o15p19Q22j6m64N54k97p69Q01O94j066k9O68k65j96O12n93n45J133
4546D94P6r11J55N13m70L62M12j046RJ106l39o82M60j5l91P42j78r22N71P33o38
4567D1k71N04n47o1R18m90q90R81K60o87K54K05o80N35O63j081k20R94j83m96
4587b51L62o4o05Q04L71j188K23P91l71k46N12o05j93J040k02j196Q22L13o53
4606c36K85L70q53K82Q64o57n09P25K0l92N55k63q59Q80N80j053j71P98m14l0
4626a78N78o22l75J068J10j106L68M31n59M60K60q64j8J100l33p25M07n7j78P91
$$ plain form
4486 -252 -231 561 89 -806 12 557 -279 -41 54 -609 -15 611 -217 -692 378 360 -179 239 48 -650 303
4507 303 672 -596 -379 488 88 -186 373 -218 -549 604 260 -630 -146 458 -179 127 350 -521 -297
4526 -297 784 169 -550 272 256 -208 346 49 -720 81 775 -291 -320 348 83 -113 499 -94 -639 494
4546 494 570 -341 -186 327 -143 219 631 -415 -406 700 361 -321 139 124 -267 475 297 -625 -54 679 41
4567 41 -230 274 -273 -334 584 94 -796 185 445 -242 12 217 -463 72 735 -346 -566 428 245 -251
4587 -251 111 47 -558 246 617 -571 -348 443 72 -174 338 -267 -460 580 378 -818 4 317 -336
4606 -336 -51 319 -534 -252 612 -45 -554 171 191 -201 354 91 -768 112 692 -361 -532 266 -148 -178
4626 -178 400 -222 -597 471 581 -525 -157 274 -285 175 435 -429 -447 653 320 -405 2 -55 -233 558
4646E58k34r38N02Q05o85k42N52n29P5P06n77o48P57M30p43K69K15p56M50P49
4666G16r91k63R65k87l85M86j94m57O86J90q61K03O00m07k4L46m84k76R56j35
4686C84j070O72M69o38K15K48o61L04P49o93n04Q09p7l80N59k67p00P63M42q79
4706b55k0N75l96n6N23o65k11R29K8q83L27K52l76L07L70r26K0R94m26n42M94
4727F3q5l18O29M4r80M91O92p70p2M25k95o4Q22n18q05P97J95n41K37J79o18M18
4749g4N30o80k85P94o2n28K96j9m48O41K64q74J84O10l93j13N56o69m0Q45j99
4770C36q00N96K79n85K75K37n90K12O79p02m68P60j07l37N37k26m92N84M08r38
4790c42J33N78l31L7N04p07l48R92np96L05K64n54M19L02q24J81P63l66o05O57
$$ plain form
4646 558 324 -614 -112 693 8 -234 318 -211 -136 570 -7 -655 102 532 -211 58 273 -483 -33 716
4666 716 -275 -538 427 140 -245 241 47 -410 276 466 -395 -192 408 1 -23 323 -161 -437 519 384
4686 384 -686 -14 455 -183 32 280 -381 -77 672 -21 -525 284 207 -173 386 119 -581 182 624 -255
4706 -255 -275 300 -96 -152 371 -294 -505 424 452 -431 -104 148 -228 79 449 -477 -457 537 111 -431 63
4727 63 -22 -340 289 333 -647 -156 536 -234 -306 119 -176 -240 582 64 -741 56 251 -290 -53 126 -492 -74
4749 -74 456 -224 -509 285 223 -305 -9 -28 -476 165 429 -445 -261 349 -44 -157 399 -270 -310 535 336
4770 336 -464 132 411 -174 101 338 -252 -40 639 -63 -531 229 122 -215 322 96 -396 188 596 -342
4790 -342 -209 369 38 75 579 -128 -476 516 511 -285 20 284 -270 149 451 -373 -192 571 205 -400 257
4811B57k35k45O43n9q43N47N19o22k13L69m76J97O41m99n62Q12R2n97L26l1k76
4832b55L66L75p53j54Q36l76m17N93j18m87O86Np49K25N33l87j08N46o65K3P43
4853D62k67o99P10J80o88K29K57p03M92N18p21k37N69J15m43M09j43n55O95K29
4873D09p68N5N59m03K5N52p02k94J068k10p17M21J28l89M58K88r44K54O93l23
4893A60l71L71p1l06O25k70p77O29N40o01M4L52n78L7P69n50m15P10J68n66J59
4914E9J44n41N13L24q11k1P12k08l19L22j55m02P51J4p25K02M92m71PM23n81R2
4936a79P44m43n22M64J69l46L37J5o17K46O35p70j23O73l41k04N91k99n90O48
4956H8L03q14K21M51m01J47L00m81l21Q38r4n81L78Q3l66L50K66p93J06P84m27
$$ plain form
4811 257 22 -223 420 361 -482 65 584 -38 -251 118 -358 -161 480 -19 -581 231 323 -274 52 21 -255
4832 -255 111 486 -267 -421 415 39 -378 215 97 -390 296 301 -448 -223 310 -77 -185 361 -304 -281 462
4853 462 195 -504 206 386 -302 -73 184 -519 -27 491 -230 -467 102 217 -226 183 40 -515 180 409
4873 409 -359 -304 255 -148 -123 429 -273 -567 501 291 -426 -5 123 -266 192 480 -464 -210 483 160
4893 160 -211 160 89 -217 408 138 -639 -10 530 -71 -27 325 -253 -216 553 3 -412 298 466 -100 59
4914 59 203 -338 175 499 -312 -333 379 171 -148 174 19 -383 368 382 -343 -141 351 -120 -113 310 -271 -179
4936 -179 565 122 -400 64 233 -113 224 239 -378 -132 503 -267 -390 283 -58 -262 329 30 -560 88
4956 88 391 -423 -202 249 -152 -5 295 -186 -507 331 237 -344 34 117 -249 101 367 -426 -320 464 37
4977C7l51M26k92k19P04j59p48M71M18n44J70K04l98L0P81o21m17N80K48o86L66
4998@J26n96M52L38n31j62P53l26l37N73k41m78O57n3o35L52L82m93J26L76n05
5019b22J6O43k28n48L51K45n35M78R7p50L72O29n84l71N49L3k54M09j40o50O24
5040A64M06q28K9M38k93J21L97n94j88O70n7o27M62P4l92N45P1q02J53O13k26
5061A36l53L82k71j28O33j22p52M80L56l08k33M53n17R1O24m91l47O05J1n59M14
5082A04M6n16M56L69p44j11N82r8l14M83l16l41P06J7p35L30M29n46J56K92l98
5103a49j89P94l61m43L37P7l54M79Q2p42M06L77m54k47O12m15j82N95j60m90O27
5124B00J96o52Q6L90m85Q5M97n06j35O43j06n31L51K42n18L36K85p65K22N22l91
$$ plain form
4977 37 -314 112 -180 -399 305 146 -602 -131 287 -257 -87 117 -281 -251 530 -91 -508 72 320 -366 0
4998 0 126 -470 -18 320 -211 -373 380 54 -283 290 49 -429 228 175 -460 -108 274 -219 -93 283 -222
5019 -222 -206 437 209 -339 12 257 -278 200 297 -453 -81 548 -36 -407 142 175 -79 330 190 -460 164
5040 164 570 -258 -229 209 -84 37 434 -160 -348 322 265 -362 100 174 -218 327 398 -404 -251 362 136
5061 136 -217 165 -106 -234 399 277 -475 5 361 53 -180 273 -244 -153 471 -20 -367 238 249 -310 104
5082 104 150 -366 90 459 -285 -396 186 88 -226 257 -59 -400 306 323 -412 -82 347 -199 -43 249 -149
5103 -149 -338 456 95 -348 -11 66 -288 191 273 -469 -63 314 -140 -387 225 -190 -372 223 63 -427 200
5124 200 396 -256 -170 220 -265 -180 317 -189 -324 319 213 -318 33 275 -243 93 378 -387 -165 357 -34
5145c4k13M09k53j92N82m3p27N69K37n02J97K23m66J88M66m60m13O08J39m09K43
5166A49O5n58M90K24m99j22M33j02k34M38l37k46O19M8o60K77L03l38NL98o38
5187b85J64O63m95l35M30j19q6J16J75m77K17M59n25j60N24k44j68M40l47l98
5207d51N28L63o82J59J61k61J24L41n63j43Q03k68m00L07O1m71N25J65o27R6N37
5228C04m19j65L06j77j98O20j19n97M98K63o10L13J31m08J54N38m66l67O90j23
5248A68m64L08O9l93L92L47o94M1N32l21k48M48k81l79O27J30n95K71K96m07Q0
5269g3N11p34J38N79k46l58L30J02k79K22l8o41M63N33n00l55M59k24o6M08j06
5290A25m83N42J60o24J83L18l83L01K75m99k11O66k14k91L21j34m08N43J81o82
$$ plain form
5145 -34 -247 162 -91 -283 299 256 -471 98 335 -167 30 253 -213 -25 441 -19 -432 176 315 -94 149
5166 149 214 -344 146 370 -129 -251 182 80 -154 284 -53 -299 320 368 -292 -15 288 -50 -45 353 -285
5187 -285 -121 542 47 -288 142 23 -63 53 228 -249 -32 427 -98 -258 266 22 -146 294 -53 -451
5207 -451 77 440 -242 -83 78 -183 -59 282 -281 -424 379 111 -289 18 79 -392 133 298 -329 -233 304
5228 304 -115 -280 26 -151 -349 271 152 -445 53 316 -294 19 150 -258 -104 434 -32 -399 291 168
5248 168 -296 12 81 -312 80 427 -267 -226 306 -15 -263 185 -96 -475 152 282 -313 -42 254 -153 -73
5269 -73 438 -296 -158 421 175 -183 147 249 -30 192 154 -487 -24 509 9 -346 113 -111 -177 231 125
5290 125 -358 184 344 -280 -97 221 -162 139 414 -85 -296 370 156 -135 186 52 -356 187 368 -314
5310c14J72L94k85k19N17m01j11O95k89n93N58P9l54J25K58m15K0O57n23k53M71
5331A89j03k27L54k54k04K88M21p67K6M95k83j8K56k40k95O14J07p08J89L07l42
5352a95L05J89o78J46O07l39l01M19r3l66N89j62n42L27M39m72l9M00l65M3L30
5373B42l26l40N15J87n31K65J1l80M20K93n02k67O83j17n25M63J02m49M93l5m87
5394b85J75N09l98k23M19l41k3M96k16n57M94K06l48J32J03l70P6O32m25m43N08
5415A21pk63M95k46m61M54K75m54K2L11l07oM59n53j54O62j28n88L83K21l98K81
5437A19J53n86J18N94j88m99L78P6l06M34j36n73L48M56m51m1K74l77J00N23l61
5458E5m80N80J04l65pL71n91M20K44n58j93O29p5m32M66k46l18O41K2p31K58M63
$$ plain form
5310 -314 -142 252 -33 -252 265 -136 -247 448 159 -434 124 203 -151 -26 232 -183 -163 494 -29 -282 189
5331 189 86 -141 213 -41 -245 43 464 -303 -277 218 -65 -83 173 -67 -362 252 359 -349 -160 147 -195
5352 -195 110 299 -379 -233 374 35 -266 153 60 -306 283 121 -421 -94 345 -127 -166 234 -131 -88 242
5373 242 -84 -424 91 278 -253 12 23 -357 63 356 -146 -413 270 153 -372 91 193 -256 237 202 -285
5394 -285 -110 399 1 -222 197 -144 -167 329 113 -444 50 256 -92 40 143 -227 -151 481 56 -387 121
5415 121 114 -149 346 100 -361 93 368 -86 -64 247 -60 -66 393 -160 -314 348 220 -368 15 236 -162 119
5437 119 272 -314 -196 398 210 -289 89 165 -141 293 157 -416 -68 388 -63 -104 170 -207 -107 416 55
5458 55 -425 155 259 -106 -113 258 -333 87 331 -227 -420 209 134 -298 168 -78 -396 245 267 -464 -206 257
5480B57l73p8L90l35k44P38j64o28N56J09m08K06J47n43K16N01m24k97N76j43
5500E9l06M91k64m81N33K71l96j14L97k53o2M84m47k08O23k08l61J88J83k67K87
5521A49J08n43J04N66l43l02M40j08j75L73k0n86K70M32n38l0M41l01n5N47m25
5542Dl26N20K7k66K0K78m78L34L68o10j69N81Jo24N32k21l27O68L4p89M29L18
5564C04m17J27J81l69k5N02l22m06N26J17m07K84O5n02L62L41l98k14L37p7j38
5585a29L21k21k80M95O4m60Q3K43j93O3K99m28k37N97j23l65L72K3k44J54K50
5606B84n67K0O56l81k89M29j74j95N56k27n74M50L48m34J8J90k67o4N70m28l23
5627d02N37J40m11J26K22m56K46J83l58j67N19m6k23K02j53k20N03O7p15L00L78
$$ plain form
5480 257 -116 -194 196 -139 -383 355 191 -437 119 228 -180 26 173 -370 -154 347 -77 -374 202 59
5500 59 -247 244 -20 -501 32 303 -93 -207 190 -63 -125 359 -88 -296 327 119 -242 -54 129 -138 149
5521 149 257 -286 -182 384 41 -261 179 71 -104 269 249 -337 -67 365 -173 -203 238 -63 -118 429 4
5542 4 -322 198 225 -41 -21 257 -221 113 481 -129 -298 283 284 -340 192 -29 -356 312 346 -443 -14 304
5564 304 -113 14 195 -174 -199 303 -19 -425 101 218 -189 95 160 -342 20 361 -37 -251 86 9 -129
5585 -129 192 -29 -309 186 250 -210 -127 116 -77 -14 285 -143 -380 217 94 -271 101 124 -120 34 284
5606 284 -283 -263 393 12 -277 152 -22 -217 339 112 -462 -12 336 -98 -80 110 -157 -221 349 -79 -402
5627 -402 135 275 -136 -10 212 -244 2 185 -173 -340 179 133 -90 112 -41 -261 242 309 -406 -106 272
5648B72l07k2J94l41Q6N28l00l88L38K71m45J66O2l94J96N25m81k05K79K9l1K56
5670B88k02l34K66L66m95M1L80m43M0L44m31r4N47q2m06L15j2l11L10P2m17mO05
5693C43l81k11L85k79j03N31k13m70M73K51m81K6L01k86Q1L97m00m46N49J84l72
5714a21J32L2l06L44K53o34K5M55m8k98L12k70j25N89j03n81K32K20l02Q6L65
5735B57m73o4N59j95m37L62J60l53L03M6o20L94M68n34k56N44k46m4L50k45l95
5756d19N16J72n11J09K26k17J85K27l88j85O72l06l72L06Q6k11L09ln03J42M01
5777B36k16j61K81m2k45K97j8n09L99K68m94K19J27l05N3M59l60l21M68Q4j76
5798D4L5j53k32M64K59o41r7N48k66j31K63n4l09M89N2m98K05M44m94P9K07l12
$$ plain form
5648 272 -35 -57 137 -204 -118 410 110 -278 60 331 -114 52 114 -280 -84 441 -40 -245 34 63 32 288
5670 288 86 -248 18 384 -111 -70 310 -133 -93 251 -180 -274 273 191 -215 100 88 -223 87 159 -258 -262 343
5693 343 -38 -249 136 -143 -246 285 72 -398 75 326 -155 -129 172 -114 -33 364 -36 -482 67 251 -121
5714 -121 11 43 -263 81 334 -300 -275 180 132 -166 146 -124 -249 340 237 -344 -112 108 -194 -108 257
5735 257 -216 -280 279 84 -353 9 169 -184 119 165 -455 -61 407 -127 -383 161 -85 -129 221 -24 -419
5756 -419 97 269 -242 -133 93 -124 61 288 -100 -285 387 81 -291 15 101 -110 199 196 -307 -165 236
5777 236 20 -141 140 98 -147 150 132 -377 22 290 -204 15 142 -163 -110 349 -11 -332 136 220 44
5798 44 79 -74 -306 158 417 -224 -321 227 -39 -170 93 39 -270 219 271 -227 -22 422 -72 7 214 -98
5820i8O5M26k87m55M42J46l33K55N6m26J54L39m23r9K64J15k55L75k89l34M56
5841I4J37m94P7K22j34J90ok72j73N31j43l18J59J80j88K71J21o45K60N58n24
5862i7j60L06j54j02M05j99l59L76K90m82N2K73k64J2L69l88l01N52J01l23J62
5883F9q5k59M64O5n90J77L44r3j61K65k84j64N01k3m43J33L30k84k0K79l93M9
5905a23N03k94n15N23k9j35K02j1l46L61J15k89j31M57k81m6L13j94l57N31N5
5926C09n98L08J64k88P2L91n09j13N70j51l71L64p7l26L88Nn04K34N48m02o3K47
5948A98k95l6L88j29m88N30J21l79P8O4l14J37M75m71k77M75N3k39J13P5k47L28
5970A60O8n12J08M14l07p2K70k80r8M22j14l92L39K87l40N1J50l61N1N30m54k40
$$ plain form
5820 -98 -33 393 106 -349 93 239 -94 161 217 -209 -55 284 -139 -238 26 141 -114 261 -28 -362 94
5841 94 231 -263 -186 36 -98 92 86 -186 -359 172 29 -289 -130 50 -138 133 254 -391 -131 427 -97
5862 -97 -257 49 -105 -207 198 -1 -360 16 306 -176 -124 149 -115 -103 266 -122 -423 129 230 -93 69
5883 69 -16 -275 189 254 -336 -159 185 92 -69 196 -88 -252 249 226 -217 -84 246 -38 -58 221 -172 -123
5905 -123 380 86 -429 94 65 -70 132 121 -225 136 251 -38 -169 288 7 -39 274 80 -277 254 309
5926 309 -289 19 183 -105 -33 358 -151 -264 306 155 -216 148 71 -255 133 138 -366 -132 416 14 -49 198
5948 198 -97 -133 255 126 -362 168 289 -90 -12 52 -262 -125 350 -121 -398 77 130 -109 4 79 -168 160
5970 160 228 -284 -176 238 -69 -141 129 -151 -249 173 59 -333 6 293 -47 4 154 -207 -156 374 -80 -320
5992c20L96pj28J29K6m27L29L41l98k80N06j77j16L58l41j18L68J72n64J61K10
6013A20k47J40J31k59k27M87pl83K64N9k36N75k35n21J39N25l58j38K88j36m7
6034f6L76j97m15K81L69m77J25J80k40J01K21l12k51M91o0l12K89jl79M82M8m24
6056a71J6L95k24r6K31l29n3M27l5l60J17K73k30lJ57k27J55M02m25l94M29J5
6078G0k73K99J02l51J54L25m71p8K64%n0N6j51j57N84q4m42J09K95k64J79J67
6100B83m17r0M67j05l95K89n4o0K08J0n26K77L27k36j78K98j86P7J99j38n58O58
6122A50M4l03M7K32l46J02K56m15k3L22J00l66K28k0j75K86J79m28k4K28n6n0
6144c2J43j95p9L40m2m01J97K15k57P1K16m48K08L46k99k70L86Q3k65K05l2m18
$$ plain form
5992 -320 76 69 -59 70 96 -331 -2 339 -59 -339 167 -10 -126 232 -109 -227 141 313 -251 -90 120
6013 120 -127 13 144 -115 -342 145 138 -245 19 78 -158 417 182 -339 -200 325 -33 -171 117 -19 -66
6034 -66 310 113 -302 -21 348 -129 -4 176 -64 37 258 -54 -305 186 126 -186 103 102 -277 205 253 -171
6056 -171 -155 240 16 -80 151 -178 -231 196 161 -199 -82 191 -39 -42 115 -112 43 445 20 -374 55 70
6078 70 -203 96 198 -153 1 326 -145 -223 41 41 -9 47 -104 -261 323 239 -203 -94 201 -63 116 283
6100 283 -134 -224 243 138 -257 32 -22 -82 126 136 -390 -113 214 -22 -200 98 -88 -11 188 50 -508 150
6122 150 194 -109 -62 170 -176 -74 182 -233 -256 66 166 -200 28 8 -167 119 298 -130 -154 74 18 -32
6144 -32 111 -84 -163 177 135 -266 -69 146 -111 -40 176 -272 -64 282 -17 -287 99 182 -83 122 90 -328
6166c28L00J28j78j11L93k06QK64l51j71M19O0m09K26J50k55J40J05l14l1M84
6187C23k69l51L94j01j47L08ql12J93J31k56qJ97j33L3K01k11k48L85Q7m28J24
6209i6J83k79J86K50m42RL70j64j66J48Mk38M28n6m66J20K96j12j14K12k10j64
6231c01M95j16k86J18L06l51J82K0l01J74K88l02j40K42m0j32J44O7k92K62J34
6252A71k80r1L67j64j71L58k40j82M35q9k53J3L62l08J60P9l32j32N06r4l42L09
6274H2j32q8L19n7m33L18J81k37j36K75j83Q5L39k54k19K96P0j83j19J42k23K53
6296I6J64l81K1L56o2k80J47l1j48L34o8k61Q4J84q0j06K47k46j14K62m0k62J57
6319b7J48k64K74Rl08J83J59k45k29K35J24j54K63p6m38M23K10l71l7K19Rk78
$$ plain form
6166 -328 -28 100 -78 -189 204 -2 6 270 -81 -252 167 227 -182 44 194 -61 79 184 -130 -161 323
6187 323 54 -297 97 -4 -151 157 149 -163 30 161 -95 -103 94 -39 -6 195 -16 -264 121 208 -220 -96
6209 -96 87 -192 -6 244 -198 -189 181 17 -149 -1 3 -235 193 137 -329 -209 87 -25 -139 73 -137 -301
6231 -301 194 78 -208 -90 216 -135 47 67 -234 -60 228 -74 -214 28 -12 -144 0 67 -225 37 171
6252 171 -109 -200 167 3 -168 190 -50 -232 203 114 -139 -126 236 -72 88 167 -165 -297 209 115 -227 82
6274 82 -50 -138 181 124 -309 9 190 -47 -183 92 -91 -6 333 79 -140 156 226 43 -76 66 -157 96
6296 96 260 -121 -100 256 194 -86 61 30 -118 216 148 -113 -29 155 75 -31 216 -30 -144 118 78 -184 -27
6319 -27 121 -143 131 140 -168 15 174 -71 -300 -65 59 -95 168 92 -346 77 287 -84 -121 98 107 -171
6341a71K55k29j20L83O3l62R9J86j48q5K09k39j9N25k84k86J68J14m6R7j20k77
6363b87K01M26l78p4K08k05J58J72l69j96N25J0l86P2J80j96J94K08l62j29K66
6384C8O7k27K04q0n9J90k6k70j8L32k10R0J58k67n6L98j84l41L11R8k68K80L6
6407A96m23K93J45k19j41K70j19j29K40k51j9J88J96m40J78J79k97K02J85l82
6427a48l4L51o6l25J80J48k09K25m5j75m9L17j35l3J41k17l5K57k9l00R9K68k11
6450b5Q5Q0j46p6K30j48k55K83J48j89%L2j67J60J44l90rL15j6j59K47j55j99
6473b10L96o7j64q3K89j82j20K25k20J39J49j40l11J78K01j65M5J10l02K85J93
6494B46k12k78L07Pj47K33j69n2J37K19m11J4K25j9j25Q4j24j50M17Ll18O4K79
$$ plain form
6341 -171 84 -145 -265 118 181 -181 -82 104 -44 -129 80 -159 -178 347 63 -223 -55 59 13 110 -10 -287
6363 -287 -86 340 -38 -112 96 -109 49 221 -148 -344 181 191 -195 -123 57 -139 55 263 -99 -228 38
6384 38 105 -122 82 2 -57 133 107 -163 -181 151 -59 31 189 -78 -134 264 80 -261 50 148 -120 160 196
6407 196 -227 66 211 -8 -149 121 2 -127 113 -138 -157 31 227 -213 -35 144 -153 49 234 -148
6427 -148 -182 169 103 -222 -42 106 -103 122 77 -98 -147 170 35 2 143 -74 -109 148 119 -181 -82 186 -25
6450 -25 60 140 -6 -82 148 0 -255 28 176 -13 -13 19 -148 12 156 -234 -243 72 56 -103 144 -11 -210
6473 -210 186 119 -45 -128 161 -21 -141 84 -136 3 152 12 -299 -121 80 -85 -40 70 -232 53 246
6494 246 34 -244 63 70 -77 156 -13 -65 72 291 -120 -106 119 100 -25 59 -65 -215 202 205 -113 -49 230
6517B30k63J90q6k78J31K03j36j99L34r4j00J98l1l82K70J26k01m5K50j83KK25
6539A61j94r0L04j06k81L09L8j44J0J15l14J92J02j31r9K53r2j4J41jl29n0M57
6562B37k49K4m3jl7L16k51j64J48J58k34K78j12k34J91J76k01j25K00L8o9L4m8
6585C2j46J33K26l24J12q4P0m2Q1j01j18L24j08j21%J19k56K82K0k52l3L64j11
6608F7j57J46m4m4L36l28l05L11R4r9o9K35k43J70J31k41k12K82J26k73J90J07
6630A80l89K57J40l53P6J70k8j22J92k20k0K31K9k60J02J10j41LQ6j67n3L78k05
6653dj85J39k0r3K11p1p4k2K23r7j30J61L2j14K13m7j58J3J59k15J2J65q7qR7
6678A00q2j33L37k63j07J73j02L1O0n4j60K9M18k16j80K45j03j04J71K1k81K02
$$ plain form
6517 230 -33 157 71 -207 -76 127 -9 -208 126 32 -68 130 99 -283 -13 113 -88 -133 117 -66 -64 161
6539 161 -33 -123 181 75 -206 103 141 -3 7 122 -192 0 102 -29 -128 125 33 19 160 159 -170 -220 237
6562 237 -12 12 -31 -32 -69 247 -4 -168 -20 138 -96 182 70 -164 27 203 2 -123 77 115 46 80 32
6585 32 -114 19 245 -79 33 -51 19 -23 58 -43 -161 163 55 -66 -66 53 -203 79 99 -153 -186 178 67
6608 67 -90 56 12 -32 304 -24 -329 -18 76 -23 -92 143 -100 70 201 -40 -252 30 156 -117 73 180
6630 180 -209 48 188 -165 -89 81 53 -69 123 -97 -117 114 143 -117 -15 95 -46 -43 43 -124 -177 201 -4
6653 -4 -189 -50 -70 -163 48 -23 -97 -119 104 7 -123 38 70 -44 169 122 -36 -23 136 -79 -67 98 11 3 100
6678 100 18 -115 222 -41 -148 25 -77 -46 14 -40 -200 -171 247 31 -149 96 -7 -111 60 81 -200 2
6700BJ99k02n0R4n2NJ66k52j85M56n8j99P3R8k85K60J55l72L3J91o7r0J08k1n7
6725e0N0L8k11K10J19k06RJ72k51k8L29k55j39K53l3j11J41J9k88K43J04o7k18
6748a70K23j74N1J71j83m0K48K7m68K31J84q0MJ46l02mK74Q1l34Q5l2l6J16P8
6772I6k51J4K30r8r5K64j44j21K25l2l18K05J98j39k4R4j49J5J89k33n2K35Kj23
6796a2P5J4k93K94J40l63O7K41k13j6J45j06j04K76N9k60Q6J2k37K6K40j15l0
6819g4L52l20k38L83r9q2J03j9j14J6K70j23j88R1J21p5J26k38LJ77pj79J86o
6843F6l6j8N3k15J41J17k48o2J55J52j55P8Lj84P6K26j45n8J65n4m8N5M7m05L49
6868E5l8j49Q2O2q8KK49k82nJ99n8M3r4k8j42L22m1k34P3K18q7j87K27j74q2L61
$$ plain form
6700 2 201 -1 -51 43 -9 -4 162 -90 -275 181 123 -76 -3 95 -190 70 225 -147 -114 77 10 -80 28 7 -50
6725 -50 0 38 -173 37 156 -50 -41 131 -120 -148 181 -74 -213 40 7 -104 37 56 -232 11 115 48 -170
6748 -170 53 -121 -70 101 -82 -122 126 153 -315 -84 100 20 24 170 -132 -136 138 219 -115 -30 -62 -98 18 96
6772 96 -155 -141 89 -9 -104 160 16 -105 120 88 -230 -25 173 34 10 104 -45 -30 159 -74 -126 109 111 -12
6796 -12 63 77 -216 78 218 -145 -78 163 -50 -66 79 -27 -131 145 204 -56 30 42 -195 -169 71 -44 -74
6819 -74 278 -42 -280 103 4 -78 25 6 -108 -92 178 55 -133 -42 79 4 130 -108 -105 72 65 -114 72 66
6843 66 30 12 65 -150 -9 108 -140 -202 -47 105 -50 28 31 -153 -77 149 4 -54 111 57 9 64 111 -294 55
6868 55 17 -132 -50 12 -76 -74 175 -107 -112 87 29 72 -22 -50 -192 130 89 -145 -72 146 59 -128 99 -75 -157 204
6894B04r8l64K12K06k69Q1J62l20Q8K68m9k93J48J38r8o0N9j98K12J28j56RQ9
6917I9q2K7P5j01r1K08j06k33K39j6m5J30k8j69r2M67j98l14J98J19k06J78J23
6940A82l44J04K94m00J86R1j97Q0Q1j17q6L01q1j13J54M3k10m7J35k4j09J55j1
6963F7k57J93N7j26K02M6l07J7J56Jj59J91j61L9K19p9k51J28J42k84J47M5j54
6986a28NK01p2j38K56l4k16J02J04k56J15J84k36l2J78o7OL7m3l0J30P3k42Q6
7010a7J45j49RJ00j73k8K16j02j3M0Q9k21L28j57j96K21L5j80J6Q7r8K4K45k71
7034e0j37L19O7k39R0J50k14j3J61j83r3J98J2j57K24k28J1J67J42l71P0J90j28
7057a2p8R8K6J5N2kk54K14J20k54K3J28r0q5K57j06k05K15J7j36Q7l3j76Q5K07
$$ plain form
6894 204 106 -258 -46 160 -109 -28 134 -186 -98 170 121 -172 -24 114 16 -44 15 -183 29 157 1 10 99
6917 99 17 44 119 18 -73 135 29 -204 35 19 -26 104 76 -93 -185 282 84 -230 -32 87 -119 59 182
6940 182 -162 -58 236 -164 22 113 -84 -4 77 -40 -126 175 94 -19 135 178 -32 -79 56 32 -77 78 67
6963 67 -190 3 60 -66 136 182 -125 -108 48 49 -110 81 -80 -41 178 99 -152 -24 118 -166 -19 26 -128
6986 -128 -123 78 6 -132 124 90 -126 -24 80 -176 -61 123 -113 -145 33 -34 -28 9 -34 -64 66 139 -103 -17
7010 -17 128 -21 -12 88 -85 -113 103 1 -12 28 117 -104 224 67 -129 92 127 -53 -37 50 -48 -24 221 -50
7034 -50 -187 132 199 -40 50 200 -14 -27 134 -49 -142 56 68 -89 135 -93 -82 85 227 -144 -74 116 -12
7057 -12 -90 8 34 49 101 99 -155 59 179 -75 -52 76 -14 -99 158 52 -153 62 79 -57 30 -3 -179 -94 113
7082A13j65M7J70j28j13K37k48r7K65n1j92J3K40j76R2K00k03p6J61q4j13J90
7104H2l0j03R1L6k76K10J09j75j42K68p5m7O9kk22L22K9l20J54O3j24n1M57l70
7128d7n0K11o7n5J7K2j81K05R4k69n9K28N3j79J35r3j32L68n0l39K43K1k8p5J48
7153A21l00O3K01j67L9L8R4k58J73r1n5K52J3k67J18J37j16p1J89j80j7K66q5
7176I7k50K07L2k16J51P6j86K5K60l0j58O6p6pR2O5k69R8J21j35rJ34p3k23K62
7201E4k1j71J98R2j80lR2r3j2J50k41K1J45K4j64J43k3j8J11j15j89J60J25j19
7225c4j00J50l6j90L36k03l8J46O9r3j04L38l35J23nj39J15rQ3j71R3N2j55L4
7249g3J71j19j5R5j62K11m5j59j08K77l1m9lJ2Ok5K5r1r3K40K9k04K18j53j41
$$ plain form
7082 113 -52 -5 165 37 -76 161 -87 -184 81 30 -162 -149 91 -85 7 207 4 -72 89 5 -108 82
7104 82 52 -51 40 76 -200 10 119 -56 -198 70 -5 -52 17 15 -207 115 144 -176 -22 41 -83 -134 323 -47
7128 -47 -97 114 47 -8 9 31 -150 55 149 -120 -179 49 102 -77 58 -35 -167 201 151 -188 55 76 48 -27 121
7153 121 -179 -116 85 -82 -43 -5 89 -169 4 -87 -142 110 123 -144 -26 111 -5 -76 113 -67 -84 182 97
7176 97 -153 54 86 -130 21 97 -89 -64 196 166 8 74 -2 -9 83 148 -121 -23 98 -37 -46 88 15 -208 54
7201 54 33 -138 60 152 -28 -31 61 -32 -44 106 -135 -114 31 55 -109 34 11 -7 104 -11 -200 -40 85 -34
7225 -34 -134 16 -20 -210 126 -77 -115 31 100 7 -97 241 -94 29 24 -115 0 -9 74 -97 -4 48 -107 -73
7249 -73 98 -21 -36 59 -103 108 63 -96 -204 73 42 -7 -10 2 8 -17 8 -83 -176 64 93 -111 107 -46 -187
7274a87J76N1j25N4J37L8k56J49pk5O0m4n3K46j79o3N3O1j77L4L30l81K9K11Q
7299A40p0K3r0j30J74P9j35J12l5j47J36J15j35p6J30l0j74N5P9Qo3J52j73J09
7323E4Q3j38j88L08q8k02L17j37j85R6O3r5J6J38rj13J77j98n7J82j0l2J13o7
7347B8r4J93N3l43J27K27j22k16J82Oj33L4J2r0L3J06Pq7M6M2j12K49o2j52k6
7372i2J46k20K12p0j24K10J3j02j80K52q1n7Q8Pj71J85J39j10j09J48q3l2J52
7395A21k59K6K34o0j00MJ04k53K44Q4k43N0J63n9j72J51Kn3J02jk19J96j25m3
7419a06K08m8p0mJ07q7j44L14M1k19q3J59j44J11M9k11M7P1j7O1R6j22j24R0J17
7444I2k06J66Q4j29pK9j17R0R4j33q1K28Pj94P2j3l0Q3Kl4j52K35k5k36K23r7
$$ plain form
7274 -187 -11 40 -85 -31 106 144 -112 37 30 5 65 21 -32 214 35 -28 25 86 -91 -57 273 -108 -79 132 140
7299 140 70 93 3 -127 47 126 -9 103 68 -79 57 172 37 -39 91 61 -113 -58 21 29 -34 118 -55 54
7323 54 137 -1 -189 119 31 -171 146 9 -176 -80 -17 -112 -96 42 33 -80 97 -101 -158 24 14 -18 95 28
7347 28 -66 127 180 -163 -36 191 69 -147 35 41 -92 -58 -46 -136 -103 3 10 -77 -31 11 -101 148 86 -66 -92
7372 -92 54 -166 46 -24 -148 62 75 -27 -207 45 -36 -93 -5 2 -169 16 155 45 -64 84 1 -31 121
7395 121 -138 -112 122 62 -38 -34 70 -183 61 145 -98 -48 115 56 -116 35 37 -16 86 85 -134 62 -63 -106
7419 -106 102 54 -16 -20 87 0 -144 170 211 -8 -91 68 -76 35 84 -127 -80 -9 -26 35 131 9 -115 -25 92
7444 92 -114 52 136 7 0 29 -88 2 96 -37 -118 110 117 -77 -5 -18 -48 35 37 3 -149 86 61 -175 48 -49
7470d9j14K69Kk61J56R6J2j37M8j08mK20k11p1P2J01m1O9J0q3K0R6j20JRM5p5
7497d8J28j57p7K32J35k65m5J45r6L0J67j38MQ3r4j41K16qj31J22K0j23L8J73
7521A70j85M5L7n3j36J45L1m7L6M3n4QO6j59K2Q0n9j47K48j07j04J16%m6J0M0
7547@J19j81J71m9n2J31q4p3L7m0j82J77J55j15j7Q5p2J8J03j53m7J21q5k2R3
7572C8M9k37R6Q9l7kM2n4k4J32q8j13J53k3j14N0M9j36J10J47j72K0J11j09Q9
7597F6k9m2J4mJ43l23J27J10L7j21Ok4j37J00L3k29K01J57j06n8J89k93J95J07
7621A19q3k09J64K0m9J13l2j69N7J36j58J9L20k11j02J29p9J1J48j39j21Q0Q1
7644D5K3j78J98j62K5P5O9k40J78K6j94J69Q9j15N6R4j33j0j2j53K40R2j79r7
$$ plain form
7470 -49 -163 106 108 -153 3 99 111 -26 22 -86 -90 130 -81 -152 -80 21 -20 49 59 -24 -4 92 -28 -27 -18 27 -48
7497 -48 80 -77 -154 78 213 -52 -97 48 -48 -18 149 11 15 98 4 -137 79 71 -60 62 82 -41 -3 170
7521 170 -15 30 67 14 -122 23 54 7 43 86 32 40 106 -53 -31 49 -10 -157 91 -16 -120 -4 -4 -50 -40 0
7547 0 119 -62 109 60 8 139 55 -18 19 -21 -203 -26 129 14 -3 82 10 28 131 -22 -69 52 -33 -55 38
7572 38 87 -150 -54 35 -2 -4 38 -16 -40 92 4 -109 44 21 -93 -43 6 -130 -20 127 -45 -25 86 -23 66
7597 66 37 -5 9 5 148 -175 -48 62 99 -22 -16 -40 -177 -77 -44 -273 -72 85 -21 -79 110 -183 12 119
7621 119 36 -173 -9 11 -38 75 43 -126 -69 67 -91 -72 248 37 -65 64 -15 -4 144 5 -116 -36 45
7644 45 68 -110 88 -74 -49 26 95 -145 33 59 -135 34 123 8 64 158 25 15 3 -150 90 182 3 -94
7668i4J51K7m5m4N8j88JK74j61k05K09P6j49O9J11j93J15J16k00PJ50j38N5J47
7692A49j38L2J25j01k64J63J63j52j9J49j78J18M8j3j60M0N1q1K01j12p0L8O8
7715E7j00K4J25j15o1J46j5j72J26l5p1J69J3j66J30r1j0K9K09j88K1J7J6j29
7739g1K1J88o3j31R9O9j42J05k02R2P5n2j37J91J7o6J3%n9Q5M3j55P2Q3L6j98
7765h7L2oJ9J11J3j73J0K08j28j7M1m9m5R9Q2j84R7P5j16J5l6l1J9K01j38j63
7791a51K06L5j88M0Q5o2l2K44k33R1P2jk25K08j11r9J91K3r1mJ14j39l1J59j63
7816f2m1J28l1n2J20n3r2J86K3k29o0K93j19p8J10r8QJ85j75o6J53j1q5Q3j7p4
7842e4j2P4K5j61J53k4j0q0J03j1J05N9k20M6L8n7NJ10o4j02J81q4j75K34j4j67
$$ plain form
7668 -94 57 84 39 -5 53 -135 -134 140 -21 -226 -17 59 -90 -21 90 -103 12 128 -72 -65 85 -53 2 149
7692 149 11 43 168 67 -197 -34 129 -23 -42 107 -71 47 95 82 -78 -38 13 -68 133 21 -49 -11 57
7715 57 -43 -19 106 -9 -70 76 61 -111 15 -20 -91 78 91 -75 55 -36 -46 -17 192 4 25 42 58 -71
7739 -71 -50 138 75 -56 43 112 -30 75 -127 -35 40 -12 -149 42 59 -7 6 6 -53 32 75 -80 -8 75 111 -87
7765 -87 -55 -61 -42 69 82 -91 -81 127 -1 -18 23 -26 -71 28 110 -74 23 98 -18 -3 -39 -70 -51 150 12 -151
7791 -151 55 90 -98 -58 27 -35 -67 177 -56 35 107 106 -119 89 -22 -121 70 93 2 -2 112 -27 -58 101 -62
7816 -62 -103 25 -6 -58 62 9 -83 103 126 -103 -163 130 11 -67 43 -55 -47 138 -37 -103 50 39 -46 37 20 -54
7842 -54 -66 8 33 -128 25 1 -9 -89 14 3 108 167 -53 -7 31 -26 -21 89 25 -77 104 20 -155 79 65 -102
7868a02Q1J12rp1R5k09O9m8J05k73K28J15j68J21P7k19%%p9R0K01j96l6J01L6
7893B1l2M2j37o6J71R1j98R8J5pl7j1J46k12K05j26l9N8m2Q6m4M4j33N7L0O2j83
7920a41K15o7j26K40p8K4m6O2j17RoM1j17J40Oj41J55j0o0m9K86j90O1n3k77K06
7946c3R8kj11R4q3n4R1P9j11J8J44j14r4Q9J44j30Rk9q4P8OJ8l4R8j01j33K59
7973A12j48j07R1J28j51K7M4N4N0o1J6j22K83l26N6J7J52k42J58k1k08J40J82
7996A24k30M0J36q2p7J38l6n5O8l5Mn0m5M1J40M7o3j64J42J6j19PN7n3J2o9L3
8023g3J13M6j61J23o2k8OJ25m2k5l5J81k41P5L8r5L6k6n5kJ40o6L0M4o9p2P3j8
8051d0Rj6%KMJ14L0j92J05P3j60K4J39m1M8p7l8j00K22l1j03R1l4j5kO7j17M3
$$ plain form
7868 -102 -21 91 82 11 106 -103 -34 -82 23 -250 -22 93 -75 46 123 -96 -96 -96 -175 -85 116 -80 -116 -15 21
7893 21 -11 31 -106 -172 -1 90 -108 -10 5 -2 -39 -50 96 -116 89 -37 -76 -18 -60 26 -18 26 -107 -50 -20 42 -141
7920 -141 74 7 -119 121 43 67 21 83 -34 -25 -31 10 -107 33 39 -102 53 43 -17 -66 220 30 91 38 -239 -33
7946 -33 65 63 -48 46 -37 -91 0 79 -32 -14 130 16 -78 11 155 25 34 5 -79 -1 5 23 -11 87 -14 -147 112
7973 112 -36 -143 -52 76 -75 -48 -4 50 100 39 55 -67 216 -110 -54 -37 115 -127 31 10 -198 -58 124
7996 124 -106 -66 70 -12 -89 49 13 -42 26 -9 -5 -55 -100 -59 81 128 65 -99 43 59 -60 -53 4 -49 -37 -106 -73
8023 -73 40 86 -75 48 -14 -42 -36 89 47 22 -13 168 -73 2 40 -55 -19 -45 -100 -102 38 -28 2 46 -23 -95 -22 -40
8051 -40 -31 -47 -47 -45 -41 73 103 -89 16 89 -71 -47 92 51 99 22 -16 -116 106 75 -28 63 29 14 12 79 -38 5
8079EJ27j07j40J03L1m7J55j50J9m2J20j59N9O5r1J16m7M4j30KJ10o8Q4O1j23
8104cQ6jn6j61K35r5n9J07j29j31J80K7n2J40m1o9J09j49QN6J2n7L7O3q3Km4O4
8132dN1j70J36j23Q2l0J41Rj67O0n7K36K4k60O5Q8p0k1nm8PM4J9r2O0rP6o6l4
8161e8KJ08Rp2m0QM0j17J30km4L5K4p1p3J78k56K11P5j93J16N0m5J7l5k9m4K08
8189A32j54J7
$$ plain form
8079 5 132 25 -115 -12 19 -28 127 -23 -4 -46 74 -85 -26 39 -52 64 17 61 -69 -67 43 -25 59 120 -3
8104 -3 83 82 26 -135 100 5 -54 53 -76 -207 -27 0 -52 88 47 -22 87 -62 -54 2 14 -43 -6 57 -26 -24 -68 -4
8132 -4 47 -123 13 -110 -28 -58 83 92 -75 -15 -72 164 188 -72 -7 81 11 -10 -15 -63 -56 -12 7 -85 -25 -34 42 -24 -58
8161 -58 -56 52 61 -11 -51 -43 -3 -120 10 8 -36 -1 23 -48 -121 57 -199 12 87 -106 10 60 15 32 -3 -32 -76 132
8189 132 -22 -5
8191e
$$ Imaginary data points
##PAGE= N=2
##DATA TABLE= (X++(I..I)), XYDATA
0@%%%%%%%%%JrJ6j6J6k4L2l2M0m8N6o4P2q8R9j10J28j49J68j87K11k40K72l04
33a60L39l79M22m71N24n81O45p13P89q74R67j071J187j319J470j641J836k066
51a096K346k686L110l657M395n456P113j0087J7068o2967m3590J16535K0878l1188
65A0718m0437j7206K4412N0790l3860n5138K7697N8638j281k4249l6111j7013
77e3040M8964M5228m5296l5288L8252K4245j5988j0663k3557p060N2556K8916
89D7269m1708j8465J4926j0466j650K2390l165K159K3341k5394m3933K3965L5817
102B5086r791n239J108j5687J1011J7266l2291j6547L9298J4567j9556k539j1198
115d512j2367L1164J0542m3798j326M6769L748k5048j4432k1524R161N5351Q457
$$ plain form
0 0 0 0 0 0 0 0 0 0 0 1 -8 8 -8 8 -16 16 -16 24 -24 32 -32 40 -48 51 -59 69 -80 88 -99 112 -128 144 -160
33 -160 179 -200 222 -249 275 -306 339 -374 415 -459 508 -563 624 -695 775 -866 970 -1096
51 -1096 1250 -1436 1674 -1983 2412 -3044 4069 -6018 11050 -51917 -95507 21028 41906 10718
65 10718 -29719 -46925 -22513 28277 -5583 -60721 -33024 25614 24333 84 -36027 -53040
77 -53040 -4076 41152 -4144 -39432 -1180 23065 7077 -3586 -27143 -34203 18353 47269
89 47269 5561 -12904 2022 -8444 -10094 12296 9131 11290 34631 9237 -34696 -10731 25086
102 25086 15295 10056 11164 -4523 6488 23754 -8537 -25084 14214 28781 9225 6686 -4512
115 -4512 -16879 14285 24827 -18971 -20297 26472 30220 5172 -9260 -30784 -21623 33728 42185
128D2185m6815j4104J1030K021J7732L878l2237N519L9738j3158l3950N649O150
141f362M294K7990p342m4285O887L5060o271j3529k576j5373J4892M1382j7105
154A7662m7902L620K1175O689J7177o952l8179O152L3147j2802j8909J3114L801
167b207K061J3951k2233k8820K9619K9423k0740j1953N698q251J1727K0988k3808
180d545k0391K7015J0744j6157O139L030j3611R198N450j9122J3556K9531k2194
193H643k8066J4584J1267K938J2828j7852k7420K6826K7416k7801j8662J5802
205E03Q524P831n60l5430p958N0532J4724m3618k0537J2283J9013K6735j0605
218B1437n5054l195N5253J2535l1571j6813l499J6805L2449j7422m6985J5048
$$ plain form
128 42185 -4630 -18734 -7704 -5683 12049 15927 -16310 -10791 28947 15789 -18161 -12512 -6362
141 -6362 -2068 25922 18580 -25705 -18818 16242 9971 -3558 -6134 -21507 -6615 34767 17662
154 17662 -30240 -26620 -5445 1244 18421 11469 -26710 -20558 12589 -213 -19122 -6008 -2207
167 -2207 -146 13805 -8428 -37248 -7629 21794 1054 -10899 -5201 -13452 -1725 19263 -4545
180 -4545 -24936 2079 12823 -3334 2805 5835 -7776 1422 6872 -12250 1306 30837 8643
193 8643 -19423 -4839 6428 9366 22194 4342 -23078 3748 31164 3363 -15299 503
205 503 9027 16858 16298 -19132 -27090 23442 38166 -5452 -25989 -13706 5307 32042 21437
218 21437 -33617 -36812 18441 30976 -595 -17408 -20907 -4102 28347 10925 -36060 -21012
230b1012M3327o867k4196q150l418K4089K8776l1106m0540K3688L3225m660r361
243C795j3732j3858K4296K2406k6327j3554K4428J213j4946M822k207l416K2134
256A5054n74l1978N380K6901p501j1372M454o503M565J9811j4976k2190K1214
269B285J4593k0498m855Q756r69J3497N782l4602j2532L6666J6185j6367r548
282a607j1775k499L0488Q220l3797m959K5105L65o829L99j5725J402L1353k612
296A7529l1221K850J6514o21N153m864k5317Q785L3741n835k2567o89m168K554
310h156K6906o64l0353J399J7216o503n78O046j3114K355K1886j1352k2488J1160
324f240J0666m229P655n001k1940J2036K4132j4303j5680Q302k17K603J5902j0623
$$ plain form
230 -21012 22315 15448 -8748 -16898 -20316 3773 32549 1443 -39097 -15409 17816 13156 3795
243 3795 -9937 -23795 501 22907 -3420 -16974 7454 8667 -6279 -1457 -3664 -7080 15054
256 15054 14480 -17498 -12118 14783 7282 -4090 364 -6139 -1574 18237 3261 -18929 2285
269 2285 16878 -3620 -8475 281 -688 12809 18591 -16011 -28543 8123 24308 7941 -1607
282 -1607 -13382 -15881 14607 22827 -10970 -15929 9176 9541 2712 3111 -12614 -11212 20141 17529
296 17529 -13692 -10842 5672 5051 10204 5340 -19977 -11192 22549 16714 -5853 -6542 -10710 -8156
310 -8156 18750 18086 -12267 -10868 6348 -155 -733 5313 -7801 -5446 16440 5088 -17400 -6240
324 -6240 4426 197 7852 2851 -19089 -7053 17079 2776 -12904 -4602 -4819 -2216 13686 3063
338C063k1502J2590J1267j2134M447J0426j1582j893P612j3542q76K4819k739
351I956k1722N205P668n712P153J084j6022R854J8972j7337j5749J5571P276k923
365C274K787j3945j0043K9046J5635l1494j7317J5365J3830J1485j936l2144q885
378b4342L6014J1870k5076q188P301O466J4209q155l2816O971L9503m78k7181
391c902q237K504J4134K1087j5860l3554J2685L0095m493j3362n478p851J2476
404B44K0125j6292j9159J7954J0438j4840l358K584k014J4367N825k4795o820
417a5741K1771J360j0016M664k532n113J1934k779j7683J1434J7825j4685j1744
430a1305Q103J943M884P441j8837j4600K4021J5242j5892q854k73l056J4909R670
$$ plain form
338 3063 -18439 -5849 5418 -6716 -2269 8157 -3425 -5318 2294 -11248 -12124 12695 9956
351 9956 -11766 -6561 1107 -4605 2548 3632 -12390 -2536 16436 -901 -16650 -1079 6197 3274
365 3274 6061 -7884 -17927 11119 26754 -4740 -22057 -6692 7138 18623 16687 -15457 -24342
378 -24342 11672 23542 -1534 -9722 -2421 4045 18254 10099 -22717 -15746 23757 23279 -3902
391 -3902 -12139 -9635 4499 25586 9726 -23828 -11143 18952 14459 1097 -4381 -12232 244
404 244 20369 4077 -15082 2872 13310 -1530 -4888 -2304 -4318 10049 15874 -8921 -15741
417 -15741 6030 7390 -2626 2038 -494 -5607 6327 3548 -14135 -2701 15124 439 -11305
430 -11305 -3202 -1259 3625 11066 -7771 -22371 1650 16892 1000 -7854 -8127 -11183 3726 13396
444A3396k2235q498K1953L044j4228q75j372J152J9174p02k7901j222K0841K194
458D721k639j021j5363M21K4830j47k1030J619P116k462J0071L155j8748L75J7275
473H173m810p974P770k604k586J3621m198j9459P733J5903m398q85M08j4839K467
488e678K1230l815j4678M622J714l640J0399l22j6552N324J3436r734m354R337
502G289n142m291Q992o000r284J3814N694j4665k86O040o938L159Q706j0175k722
517e809J2593p749j3271J2357R194p513p30l787r698J3868J6077j7543j5069J1510
531e570Q443J510J631j4805r570K2534J1689k0684q186J1333M620L962k422k0057
545a5572L58K9737L856k4439p671O380Q381J4143n653k5861L413K4994k068j4265
$$ plain form
444 13396 -8839 -17337 4616 7660 -6568 -7443 -8815 -7663 11511 10809 -17092 -18314 2527 4721
458 4721 2082 1061 -14302 -13881 10949 10802 -10228 -8609 -1493 -3955 6116 9271 -9477 -9102 8173
473 8173 3363 -4611 3159 555 -2031 11590 7392 -12067 -4334 11569 7171 6286 6694 -8145 -5678
488 -5678 15552 11737 -2941 1681 3395 -245 10154 9832 -6720 -1396 12040 2306 -2048 7289
502 7289 2147 -2144 6848 848 -8436 5378 11072 -3593 -3879 2161 -4777 -1618 7088 -3087 -5809
517 -5809 6784 -965 -14236 -1879 7315 -198 -928 -4715 -14413 -545 15532 -2011 -17080 -5570
531 -5570 2873 4383 6014 -8791 -18361 4173 15862 -4822 -13008 -1675 2945 6907 4485 -15572
545 -15572 -15214 14523 18379 -6060 -13731 -7351 1030 15173 9520 -16341 -12928 12066 9998 -4267
559d267j90j28M259J2610r131j8202J2305J5625j0411p741K875j589P999R160
573A3174j5651j1352J6188O681j0260K280K266o860N392L590j1974L979J5791
586A3244q186j3359O284M280L01P039p930j4314J2886J4135j2549q322O144j98
600e45L308O434j3077q305J7781O045j5710l687M432J189J0019J515k1159m334
614a6094K0087L685q824m76n715k988J4976K632j6697R18J1121l987r74L941q743
629g138o68J4639l223j2486O248M404m828O626K067j3953J667J4237k806m429
643C57L817p597l619J5024K596j2317J853M020n960N369O089j1398j109J2777
657I902m446q746O096O72m057P720j060j2469N565J0203p931l407N539n529j024
$$ plain form
559 -4267 -4457 -4585 -326 12284 3153 -15049 -2744 12881 2470 -5271 -2396 -3985 4014 13174
573 13174 -2477 -13829 2359 9040 -1220 1060 3326 -3534 1858 5448 -6526 -2547 13244
586 13244 5058 -8301 -2017 2263 2564 9603 1673 -12641 245 14380 1831 -6491 -347 -545
600 -545 2763 9197 -3880 -12185 5596 11641 -4069 -7756 -3324 -2135 7884 9399 -11760 -16094
614 -16094 3993 7678 -1146 -1622 -7337 -10325 4651 7283 -9414 -8496 2625 -1362 -2336 1605 -7138
629 -7138 -7806 6833 3610 -8876 -2628 1776 -3052 3574 5641 -8312 -6645 7592 4786 357
643 357 4174 -3423 -7042 7982 10578 -1739 114 4134 -1826 3543 9632 -1766 -2875 9902
657 9902 5456 -3290 2806 3478 -579 7141 6081 -6388 -823 9380 1449 -1958 3581 -1948 -2972
672b972J0321m312q888P942R16j0421N540Q592o658j852K162q279K920J4087o353
687B745j2640P111N328m491K927k548q917J0345J1484j4003r735J0611M825j070
701A972Q57j0720m829J9245P198j8639p366P971M149P187J080j7732l400J9156
715F129J980j3830P9M640J025O884m134j6388N922J8002m427j0509J541p58K342
730a502R838o708j3088R731J0264q128k413L532m785K018P041p603k661J2956
744H492j601j3048L050N812j951N380Q85j1952K097J2055o596q151P725L014k319
759B892L362o380q825J1985R381j2358n236O967l1K230L539j2264o737J6034O435
774A0994j0806k022M74l966O783M919j1073n63J1954l499q387L145j407j640J1199
$$ plain form
672 -2972 7349 3037 -5851 2091 3007 -7414 -1874 6718 60 -1792 370 -7909 -4989 9098 2745
687 2745 -9895 -2784 2544 -1947 980 -1568 -10485 -140 11344 -2659 -12394 -1783 3042 1972
701 1972 2829 -7891 -12720 6525 13723 -4916 -12282 -4311 -162 7025 8105 -9627 -13027 6129
715 6129 8109 -5721 -5642 -1002 23 6907 2773 -13615 -7693 10309 5882 -4627 -3086 -3844 -1502
730 -1502 8336 1628 -11460 -1729 8535 407 -2006 1526 -3259 -1241 5800 -1803 -4464 8492
744 8492 6891 -6157 -3107 2705 754 6134 7019 -4933 -2836 9219 2623 -5528 2197 5211 2892
759 2892 6254 -126 -8951 3034 12415 57 -5179 1788 1757 3987 7526 -4738 -11475 4559 10994
774 10994 188 -1834 -1360 -5326 1457 6376 -4697 -5260 6694 3195 -5192 -2047 -3454 -5094 6105
789F105M99j3409J566P284m984J049O050p262k635J0185j959p693M907k86o136
804f719Q546O117j0107k089N698m899K14Q260m668m751R209q75j0579L002M840
819A199k474N631K616j2485k134J1466j820n280N259j600m299P588q5j0737L636
834c519P779n730lO129n613l153N874m160m054J0899J804j0034J856L842o232
849d315K266N783n662J071Q857p690j0002Q097N779k701K548l395q546Q778R323
864A0191j1287o810Q094L083P75K707r810p109J3206O219j1001j418N753j388
878A205K296O74j1910R9J6925M60j1991l93O37j012Q230N90j1564K961J0161n724
894A644n634M342j579n89P620l903q193P763L918r575L21O433l187J165M678q032
$$ plain form
789 6105 6604 -6805 -5239 2045 -2939 -1890 4160 -3102 -5737 4448 2489 -5204 -297 -583 -6719
804 -6719 1827 7944 -2163 -4252 1446 -3453 -3239 5021 353 -4398 4811 3936 -6643 -3641 1199
819 1199 -1275 4356 6972 -5513 -7647 3819 1999 -3281 1978 378 -3921 3667 3582 -7155 -3519
834 -3519 4260 -1470 -1473 4656 -957 -4110 1764 -2396 -6450 4449 6253 -3781 -1925 1917 -4315
849 -4315 -2049 3734 -1928 -857 8000 310 -9692 -1595 4184 1483 4031 636 -7910 868 10191
864 10191 -1096 -7906 188 3271 4046 6753 -3057 -10166 3040 9259 -1742 -3160 2593 1205
878 1205 3501 4175 -7735 -7636 9289 9749 -2242 -2635 -1998 -3010 5220 5810 -5754 -2793 7368 1644
894 1644 -3990 352 -1227 -1816 5804 1901 -6292 1471 5389 -4186 -3865 2568 -619 546 5224 -2808
910b808l594R703j290p396O040L913n786O86J60o745N969J0060q118p692O415
925d83J475k268M437m122o737R398O257j0476k674N947k128J235N037p366l660
940f128J0859K76r931K144L584k766N378K557j0685j213R282j965l396N582l107
955D71n519P011J494p310L586M163o927J609O880o313l672P322j496m250N772
970B821j536o649O887M445q954j035N748k457J624M808q408n116J0661K506p515
985b170J433R50m257N903L997r874q00R203k959m758M752j637k848P125j195r317
1001f452M508O783n621p20M443n150r20O855l619m419P740j57q244L866M770n062
1017a399J512K615p289K081J0040n269q011N167K339k249M191j768p783O636P021
$$ plain form
910 -2808 -6402 3301 2011 -5385 655 4568 -1218 -532 -372 -7117 -1148 8912 794 -6898 -483
925 -483 992 -1276 3161 -961 -7698 1700 7957 -2519 -5193 754 -1374 -139 4898 -2468 -6128
940 -6128 4731 5007 -4924 -2780 804 -1962 3416 5973 -4712 -5925 3357 1392 -2004 3578 471
955 471 -5048 1963 3457 -3853 -267 3896 -3031 -1422 5458 -855 -4527 2795 1299 -2951 2821
970 2821 1285 -5364 1523 5968 -2986 -4021 1727 -730 894 5702 -2706 -7822 2839 5345 -2170
985 -2170 -737 213 -4044 1859 5856 -4018 -4818 4385 1426 -3332 1420 -217 -3065 4060 2865 -6452
1001 -6452 -1944 4839 -782 -1502 2941 -2209 -3129 3726 107 -4312 3428 3271 -4973 -1107 3663 -1399
1017 -1399 113 2728 -4561 -2480 7560 2291 -5720 -553 1786 -463 3728 1960 -5823 813 7834
1032G834r220m009P227M97J07L328q020n623J1486M680r425q30L590k553L648
1047B717K922r657j377J1147r15p125L130k09l723N724P98q403L682P712o122
1062C01l844M329k922j330P623k084o621M781J102p461L691O213n296p02L878
1077A658n295j136P773l221o650O644L251n581J584P21o278M349P372o711l547
1092e067P181j329m490L848j662l739Q560L383r834j079N420l063J347N829n447
1107a42l251P182j852o450N307K727n288L285L777o898RN496n238j343Q282j822
1123C781o190M335L94n342M138K425o220L883O896p854n432N401L55j16O041m528
1139A967q021O808M876p588n03M480k169K411L731q991m221J0013J679o382K269
$$ plain form
1032 7834 -1386 -5395 1832 2329 2436 5764 -2256 -7879 3607 8287 -1138 -1968 1622 -931 2717
1047 2717 5639 -4018 -5395 5752 4837 -2288 842 633 -3090 2634 3432 -4971 -1289 6423 301
1062 301 -3543 786 -2136 -3466 4157 2073 -4548 233 1335 -6126 -2435 3778 -1518 -2220 1658
1077 1658 -3637 -4773 3000 -221 -6871 -227 3024 -2557 -973 -252 -6530 -2181 5191 -1520 -5067
1092 -5067 2114 785 -3705 143 -1519 -5258 3302 6685 -3149 -4228 1192 -1871 -524 5305 -142
1107 -142 -3393 3789 1937 -4513 794 3521 -1767 1518 5295 -1603 -1594 3902 -1336 -2679 5603 3781
1123 3781 -2409 1926 2320 -3022 1116 3541 -2679 1204 8100 246 -5186 215 570 454 6495 1967
1139 1967 -6054 754 5630 -1958 -2461 2019 -150 2261 5992 -2999 -7220 2793 4472 -1910 359
1154C59R27l414M528R08r605J407J0206k207m602K295l341k330P272m65o626N464
1170G76M170p895j222M319k707J203N957n398m495P418l12p403L435L923l212
1185a443K902J535q264R53Q592m256m935O095J124k980L179l325p175P493Q013
1200G508o588l147L485l105M11N720n137m135R064J885q214N02K272l269M355
1215A607M446p799j482P425k634m950M197k59l101O397Q27q622J530M615m812
1230b615J039O332m266l538N015k496m523O390J470n929L464L244o537l14M937
1245A673l350O0O198m272n481O351J074n986L193K591m391L424L788p844j857
1260d829P420j377k998N044j732m960N093O84o568M037N870n517j455M071l995
$$ plain form
1154 359 1286 -2128 2400 3308 -6297 -4890 5316 3109 -1493 802 -2539 -4869 2403 1938 -4688 776
1170 776 4946 -2949 -4171 148 -2559 -1356 4601 -797 -5292 2126 1814 -5589 -2154 1769 -1443
1185 -1443 1459 2994 -5270 -4317 4275 19 -4916 1179 2303 -677 2502 -823 -7998 -505 7508
1200 7508 920 -2227 1258 -1847 -1436 4284 -853 -4988 4076 5961 -2253 -1751 521 -2748 1607
1215 1607 6053 -1746 -3228 4197 1563 -3387 810 551 -2550 3847 4674 -3948 -2418 2197 -2615
1230 -2615 -1576 4756 490 -3048 1967 -529 -5052 1338 2808 -3121 343 3587 -2950 -3264 1673
1245 1673 -1677 -1617 4581 309 -5172 1179 2253 -3733 -540 2051 -2340 1084 4872 -2972 -4829
1260 -4829 2591 1214 -1784 3260 1528 -3432 1661 2345 -4223 -186 5684 167 -1288 2783 -1212
1275a212j348O506k728m314O426Q03p421K312L821m158J961L545o121n72P838
1290E338l502o771M596K525k188L566j555q126M353P543n712l556M770r00o41
1305b60L843n208n552Q931M629p837j590K774j886L098L352q074k280R898R1o827
1321b898J218M65j967N742Q66q713J931P715m151m182L761j148k84N733l528p318
1337f758N980M752n944j12L394l310J287M400o159k738Q445j51o484K664J806
1352A072k920L846Q88p627K113Q095l702m687L567r03j154N680k538o940N597
1367C87N313o293j330L482k674J521N149o114m502P619J643n379J789N87m035
1382b837M371L769p196j207O391k242k645M201k243l524N881P19o765K436L870
$$ plain form
1275 -1212 -2560 3946 1218 -3096 3330 4133 -3288 -976 2845 -1313 648 4193 -1928 -2500 5338
1290 5338 1836 -4935 -339 2186 -2 3564 2009 -6117 -1764 5779 67 -3489 1281 381 -260
1305 -260 3583 -1625 -7177 1754 6383 -1454 -3044 -270 -2156 942 4294 -3780 -6060 3838 3929 -2898
1321 -2898 -1680 -1215 -3182 2560 3426 -5287 -3356 4359 208 -3974 -213 -1361 -1645 4088 560 -6758
1337 -6758 -778 3974 -1970 -2082 1312 -1998 -711 3689 -2470 -5208 3237 3086 -3398 -734 1072
1352 1072 -1848 1998 2886 -4741 -2628 5467 1765 -2922 645 -258 -1412 4268 1730 -5210 387
1367 387 5700 -593 -1923 1559 -1115 406 5555 -559 -5061 2558 4201 -1178 611 1198 -2837
1382 -2837 1534 5303 -1893 -3100 3291 1049 -1596 2605 362 -3162 2719 3438 -3327 -891 2979
1397B979m479R73M084n190j795O328j516m265M207k78m579M786K470o501L48M869
1413B441l531k62M478l964k829O220p71n775L934K484m374K318K375o249R92O491
1429C978l914l527N108o75l430M131p43n302M763L721o437l42N291k844j442L477
1445A813l428j941P386l68p786K212L885k848J831J558o157J344P513m017o087
1460e090M480K131j884K911k449o306N762O314o689l368M432k07N89K971n892
1475b295m248Q587L556p349o10K753j742K754J897p178l86Q949p67o803J481Q31
1491e70o93N109r65p834L151P081m366l481L086j060L65M957m355n659O374L581
1507D721o011k49L075k183K136K780o899j824Q013J42n578K093O00k391M088K32
$$ plain form
1397 2979 -1500 -527 3557 -1633 -3428 2900 1384 -2881 1326 1048 -3531 1255 3725 -2776 -2428 2441
1413 2441 -1090 -1352 3126 -838 -3667 2553 1782 -3993 -59 2425 -1949 369 2744 -3505 -2513 3978
1429 3978 64 -3463 1645 970 -2460 1671 928 -4374 389 4110 -2327 -2669 2622 -222 -1664 1813
1445 1813 -1615 -3556 3830 3462 -4324 -2112 1773 -1075 756 2314 -3843 -2499 5014 997 -5090
1460 -5090 -610 1521 -363 2548 99 -6207 -445 5869 -820 -4188 244 37 626 3597 -2295
1475 -2295 -6543 2044 5600 -1749 -2359 394 -1348 1406 3303 -3875 -4261 4688 3921 -2882 -1401 -570
1491 -570 -1263 3846 2881 -4953 -1802 5279 913 -2568 518 -542 -177 4780 425 -5234 1140 4721
1507 4721 -1290 -1539 1536 -647 1489 4269 -2630 -4454 3559 3701 -1877 216 816 -1575 2513 2745
1523B745o850K320P069l731l925K727j320j04N582l255o511N207M362m763r14
1538a361J738l031K424N136n565m291N976J060l726K249m46l456M493K881p012
1553b931q60N616j502j266L211l571k963O196R31o008J972K706l387J810K862
1568B816n518o36O297j958l739L562l13l161M221O68n874K277M803l704j325L134
1584A550l088o20N528k065n110M270K153m257J588J710m182K209M503n248k579
1599c638N653k94l267K678j026l171N242J777o913K54N272j966j240K284l579
1614a934p13O648j625o818L096L995k221L31k6m891L141O633m787n472M266J944
1630A567j367K162l021m374O271M353o660k748M499L9L96J765n432k054Q083J302
$$ plain form
1523 2745 -4105 -1785 5284 1553 -2372 355 -965 -1069 4513 1258 -5253 -46 4316 -447 -1361
1538 -1361 377 -2654 -230 4906 -659 -4950 1026 2086 -1640 609 163 -3293 1200 4081 -2931
1553 -2931 -3791 1825 323 -943 2268 -1303 -4266 1930 2861 -3147 -1175 1531 -1856 -46 2816
1568 2816 -2702 -3338 2959 1001 -2738 824 511 -2650 1571 2239 -3635 -1358 3445 -259 -1584 1550
1584 1550 -1538 -2158 3370 1305 -3805 465 2618 -1639 -51 1659 -2523 -314 4189 -1059 -3638
1599 -3638 2015 1721 -1546 1132 106 -3065 2177 3954 -2959 -2705 2567 601 -639 1645 -1934
1614 -1934 -2647 4001 2376 -4442 -1346 2649 428 759 733 -4158 -1017 5616 829 -4643 -377 1567
1630 1567 200 2362 -659 -5033 1238 5591 -1069 -3817 682 721 1117 2882 -2550 -4604 3479 4781
1646D781p163j30L049p54K612O31o870Q05P853k103n389K198Q35n36L306j807
1662A318n936M297N597m820l312L101o95J095L292m576m183O530K430n604K1K171
1678G26j729K500J706o283o41P210r40m852J694L43j124M139r10o536K394O246
1694C943l076k858J796j728N64M914l091n449M711L302m193j95J095k856L022
1709i9M120n524l340N449Q34k781J792j243k952M824K303o065m50M448j441m96
1725f21K485l408j754N834j35n367J939K670k381J949J064n104M46N930k026l309
1741a788K690l14j839L750n60n267L097M278l668j382K501k064J45M327l443l882
1757c419M911K040m161N46R55k819L230K976n640j725N340l46k884J648j055j506
$$ plain form
1646 4781 -2382 -2512 537 -217 2395 3026 -3844 -3039 4814 2711 -2678 -480 355 -181 3125 1318
1662 1318 -4618 -321 5276 456 -2856 245 -450 645 3937 -639 -4822 1708 4138 -1466 -1445 726
1678 726 -1003 1497 3203 -3080 -3721 3489 2549 -2303 -609 -266 -1390 2749 1839 -4697 -2303 3943
1694 3943 867 -1991 -195 -1923 -1359 3555 464 -4985 -274 3028 -1165 -1360 -265 -3121 -99
1709 -99 4021 -1503 -4843 606 1440 -1341 451 -792 -3744 1080 3383 -2682 -3132 1316 -125 -621
1725 -621 1864 -1544 -3298 2536 2401 -2966 -1027 1643 -738 1211 2275 -2829 -2383 3547 1521 -1788
1741 -1788 902 588 -1251 2499 1939 -3328 -231 4047 379 -1003 1498 -566 -421 3906 463 -3419
1757 -3419 1492 3532 -629 -83 872 -1947 1283 4259 -1381 -3106 2234 1888 -996 652 -403 -1909
1773a909M901J27o702J082N197j629j235Q46l127Q53N876k760n991L185L624j951
1789C87L14q96l717L453N175n174m228M543J772j376J004k981k804O185L104o796
1805b035j804M154J87K33Q03m469p94P033k24o346Q88K986n15J573p52n174K236
1822b020O567l301m910K451J429k31K595k516m757M756M422n004k363L155l96
1837a23Q48K229m617k529O435J642n557p5K045p60K430Q97n942J40O411j059m120
1854a705J475J15n74L371j231n658L072N212l246k447J597j429J047L997l398
1869A98m415M471K736l500l3L59k151K988L147m895k386M659M07k577J513r37
1885d16j936M473J202n718j77M091j086j57J662l419q68N045o67m770K146K218
$$ plain form
1773 -1909 2992 3119 -3583 -2501 2696 1067 -168 678 -2449 -1596 4280 1520 -4471 -1286 2338 387
1789 387 701 -195 -3912 -459 4716 -458 -4686 -143 1629 253 1257 -1724 -4528 1657 4761 -2035
1805 -2035 -3839 315 502 735 1538 -2931 -3725 3308 3084 -3262 -2374 612 97 1670 918 -4256 -2020
1822 -2020 4547 1246 -3664 -1213 216 -15 2580 64 -4693 63 4485 -519 -2882 273 -123
1837 -123 725 2954 -1663 -4192 2243 3885 -1672 -1747 298 -462 1968 2865 -3077 -2937 3474 2415 -1705
1854 -1705 -230 -115 -689 2682 1451 -4207 -1135 4077 831 -1616 -19 -1448 -401 3596 198
1869 198 -4217 254 2990 -510 -543 -184 -2335 653 3800 -1095 -3481 1178 1585 -992 521 -416
1885 -416 -2352 2121 3323 -2395 -2572 1519 433 276 1938 -1481 -2349 2696 2029 -2741 -595 1623
1901A623j794J405N17m514J310M957k485l012K731j3j296K754j631m260L955L758
1917D005l783j384J726j735Q10L334l393k740M890J089m181K62P65j321L067J829
1933C240n377r96M998p25k699J362p88m58M380j045n951J339M696j436r60P06
1949B86k472J332M071l335m601L956L438k097l83j143k806L914L867m953k641
1964c567M300R01j576J99k390j313N903J720o209r92L924k77l29M23l325O23O070
1981D085j285o141J141K915j59J417q55m258K440M691l651l658L100J507k45J365
1997B409k859l535M662L358m539j359K711j80M02J107m358j163O131P88m690L1
2013a084J543j069K165K38m562J384N425j998m125J170M19J37L372j499m880K792
$$ plain form
1901 1623 -171 1234 1751 -2763 -1453 3504 1019 -1993 738 725 -571 2183 552 -3708 247 4005
1917 4005 222 -1162 564 -1171 -361 2973 -420 -3160 1730 2819 -1362 -1100 -335 -1656 1411 3240
1933 3240 -2137 -3133 1865 1140 -1559 -197 -985 -1443 2937 1892 -4059 -2720 1976 540 -420 286
1949 286 -2186 -854 3217 -118 -4719 -763 2675 578 195 -948 -3754 160 4027 -926 -3567
1964 -3567 733 1634 58 257 -2133 -3446 2457 4177 -2032 -3024 900 623 294 717 -2608 -1985 4085
1981 4085 2800 -3341 -2200 715 556 1973 1118 -3140 -700 3991 340 -3318 -218 1289 1044 2409
1997 2409 -450 -3985 677 4035 -504 -1863 848 668 1070 2177 -2181 -3344 2787 3575 -1115 -1084
2013 -1084 459 -610 1555 1793 -2769 -1385 4040 2042 -2083 -913 -494 -357 3015 1516 -3364 -572
2029e72L872l246j694J599p46J346K911l753l706M265J973k916M10L63j613K572
2045A065J726m809j453M869M93k252J015j683j404L997P41m799P55L681j522q27
2061d07R82k895M58M896j511m115J957J614j581J186Ql457K179M020l252k600
2077b518K333N0n85K553j872l150L668K297l954o96K256r91R63J818l713j712
2093c253M570Q16l519O62N95j068K676N18m719L09M842j216k464J039o96k6L607
2110B673j381m933K515L891j925j427M66j711J827L529l495l595L828K206k184
2125B84J17q40j643L553K252m873j790M390O51j680K20j957n62M728N16n499K89
2142a844L489n50m02L9k720J054M730k128m509J767K494p87P14j077l081K857
$$ plain form
2029 -572 3300 54 -1640 -41 -787 559 3470 -283 -3989 276 2249 -667 -257 106 -1507 1065
2045 1065 2791 -2018 -3471 1398 1891 -361 654 -1029 -2433 1564 2305 -2494 -1739 1942 420 -407
2061 -407 575 -2320 -1862 3034 1523 -2592 -635 979 -602 584 592 -2865 -686 3334 82 -2518
2077 -2518 -185 -135 -720 1833 -39 -3189 479 2776 -1178 -1874 382 -609 354 2172 -1541 -3253
2093 -3253 1317 2133 -1386 -724 -129 -1197 1479 1997 -2722 -2413 2429 1213 -1251 -212 -908 -934 2673
2110 2673 1292 -3641 -1126 2765 840 -587 -121 -1832 -5 3524 29 -3566 262 2468 284
2125 284 401 -439 -2082 1471 3723 -1150 -2940 1450 2101 421 641 -1316 -1878 2850 3366 -2133 -1844
2142 -1844 1645 1095 693 732 -1988 -934 3796 1668 -2841 -1074 1420 633 1347 270 -2811 46
2158D6L793l917k914K855R07k03J191k746k406M313K171m380p55K607m24M91O01
2175A230l754m22N361p9m171O70J218q21J921j36m085J560M582k148k972J178
2191h68J73N4K734j754l643L081K922l178j164J449p76J451K360l395k870L896
2207D72J303k543N45K89j470K429J158m290m92M139j14j741P89j303j033L682
2223A820p5m198J145L117j322n64N39k484O52M199j672l325K231J062j611J035
2239E49l06k465K449L131l381k204K397J11k09J819k004k373L598J540l780k59
2255a387K027o53R61J247l355j389M328kl203J144P83r06K134l19m218J073M287
2272B552j265k250J161q42j13K833j407l681K829K953k670r00N92j277J718K659
$$ plain form
2158 46 3839 -78 -2992 -137 770 567 1758 -988 -3394 919 3090 -1290 -2045 562 138 629 1230
2175 1230 -2524 -2946 2415 2336 -1835 -1165 53 -768 1153 1017 -3068 -1508 3074 926 -2046 -868
2191 -868 -695 -641 2093 339 -3304 -223 2699 -479 -1643 -194 -970 481 2841 -554 -3424 472
2207 472 1775 -768 -223 66 -1404 1025 2183 -2107 -2599 1540 1426 -315 474 -829 -1862 1820
2223 1820 1745 -2453 -1308 1809 487 -77 462 -2022 -1370 2829 1157 -2168 63 1125 -486 549
2239 549 243 -2222 227 3358 -23 -2227 170 281 72 1891 -113 -2486 1112 2652 -1128 -1387
2255 -1387 640 -13 948 2195 -1160 -2549 1779 1777 -1426 -282 501 -405 1729 1410 -2808 -1735 2552
2272 2552 1287 -963 198 -644 -757 2076 669 -3012 -183 2770 100 -800 -208 -1485 233 2892
2288B892l278k684L857J299k480R1k59r91L112J538m746r02L798p8j363P21j464
2305i37l09L812m92m899J106L439j023l60R1k597J222L988k324l550K256J792
2321A215j128O00r95k648K915K949l534j971K755K92p26R33j880j662M175J176
2337B466m135k31K100o76P81Q40l144j81M381r58l336J165J147o57J624j98l496
2354b508J607L518k197k224J761j16PK139j702l062L131K083k644n43J208r91
2370e33Q39K033l130j541L671P38k704N18K73j273K526R77l854q5L380p70j561
2387d96J096j200m88L175m59l745J479K380j519j31O79k248Q95L351k096k953
2403b280K304J115j263J130m87k655K260K576k936j489K399m30l93J612j846j845
$$ plain form
2288 2892 -386 -3070 787 2086 -394 -303 -562 -1553 1559 3097 -1649 -2551 1247 1169 -194 527 -937
2305 -937 -1246 2566 2074 -2825 -1719 1720 697 337 428 -2169 -947 3041 717 -2833 -577 1215
2321 1215 87 687 -308 -2956 -41 2908 -626 -2597 158 450 -276 657 -1223 -2885 1290 2466
2337 2466 -1669 -1900 200 -476 305 1145 -1999 -2180 2201 1243 -2093 -928 219 -438 1186 988 -2508
2354 -2508 -901 2617 420 -1804 -43 -159 -152 1987 285 -2777 354 2437 -207 -750 458 -533
2370 -533 306 2339 -791 -2332 1339 2077 -627 -109 164 -1109 1417 2394 -1460 -1545 1835 1065 -496
2387 -496 600 -600 -1088 2087 1628 -2117 -638 1742 223 92 771 -1477 -582 2769 673 -2280
2403 -2280 24 1139 -124 1006 519 -2136 124 2700 -236 -1725 674 244 -149 1463 -383 -2228
2419b228L270J070l456J42J703q79P96J107l259m93M025o28k854J251N47q68J903
2436A149m00l360J466L409j938j968J566n44m7K534j826l137K969K404k604n75
2452i02P45j134J412K219l267j784L685O85k373L61J07j091K752P81m219M6L633
2469A656p72j183O47j495k3L387p22l895J538K570j521r9L05j956J197K943k420
2486A57k744K692J230j448P46o60k190K767K151l381j141K576l55m96J230j755
2502f21j210L434M07l508N52J894j028N37P97k777K25L670j242k885J598P16q83
2519c24J674k51l015J457K940k342j486J857l62k76J861j712k432L084J522k741
2535e46j21J297j490J172J729l015j132L312J18k181R36J6j470K268P58l418N31
$$ plain form
2419 -2228 1042 2112 -1344 -1202 501 -378 418 1525 -1734 -2227 1798 1170 -1684 -433 114 -754 1149
2436 1149 749 -2611 -1145 2264 326 -1642 -76 -620 -667 1867 41 -3096 -127 2277 -327 -902
2452 -902 -157 -1291 121 2340 -927 -2711 974 1659 -714 -353 -246 -1337 1415 2196 -2023 -1977 1656
2469 1656 884 -299 348 -1147 -1170 2217 1495 -2400 -862 1708 187 88 393 -1563 -366 2577 157
2486 157 -2587 105 1335 -113 633 -27 -2217 550 2701 -680 -1821 755 400 -96 1134 -621
2502 -621 -1831 1603 2010 -1498 -946 948 -80 457 1254 -1523 -1298 2372 1130 -1755 -157 559 -324
2519 -324 1350 1099 -1916 -459 2481 139 -1347 510 148 -128 1733 21 -2411 673 2195 -546
2535 -546 -667 630 -860 312 2041 -974 -2106 1206 1324 -857 79 95 -1375 893 1651 -1767 -1236
2552a236K881j321j205J215j165l85L100p24l379J627J750j572K11Q31k131Q34
2568f69K753k181k155K438M29j236J290o63k042K237J875l026q29K469o48k75
2584b33J484j974j561L348M76l073P40J433j337Q83J005k829J35L452j066k427
2600a544J420K46r37J849n8l131J584K731j969j360J417o60M5K341j826k436K838
2617E50J413k636J26J058j135J282J560l141j177L365K25j997Q47m31r60K449
2633A398L83l372L56L049j156j027J142j487j61K863r61l208J881K049j682q0
2649a3M71j979J240K693k283k098K390L76j229J019n13j691K266J537l157o49
2665a620K505n58o87J452j703j223L119J76l091P74J641j369P78Q45k396Q1L071
$$ plain form
2552 -1236 1645 324 -881 334 -831 -1216 1884 1160 -2219 -592 1158 -414 -203 628 -1503 -669
2568 -669 2084 -97 -2252 186 615 -621 669 6 -2036 201 2076 -950 -1779 690 42 -233
2584 -233 1251 -723 -2284 1064 1540 -1533 -793 640 -697 186 1191 -1638 -1503 1949 883 -1544
2600 -1544 -124 122 -815 1034 976 -2155 -571 2160 191 -1169 248 -412 -367 1974 148 -2288 550
2617 550 1963 -673 -547 511 -624 658 2218 -923 -2100 1265 1490 -507 340 -91 -1051 1398
2633 1398 1781 -1591 -1235 1814 658 -369 773 -714 -875 1988 1027 -2181 -300 1749 67 -13
2649 -13 458 -1521 -281 2412 129 -1969 421 797 -432 587 74 -1617 649 2186 -971 -1620
2665 -1620 885 327 -360 1092 -611 -1834 1285 1461 -1630 -856 785 -584 194 1039 -1357 -1276 1795
2682A795j262k321J880M93j304J500l30k499J714K339k181j111J710o76l01J898
2698A344j369k117K608J107k388J94J169j553R49J601k447q52K947k63k053J234
2714A11j71j298K149M92k801L86K448j354o95J430j327l78K532q71k611J667J487
2731A196j661M20P46k004Q71K488k107j735K276R7j161J474m24k245K103J579
2747A913k790j89K052r60k86J517j652j253K935K38k673R73J089j386Q77J047
2763A452k597J01L084j292j812J553j35j212J991k08k469J524K130k256o59J406
2779F01r17LK099j607k111K407R53k121L70R63j554J163J484k748p18K792l83
2796F76j507J194j52j478K134L69l060O94K596j448n24J199j567m76K694p17k558
$$ plain form
2682 1795 533 -1788 92 585 -719 781 451 -2048 -334 2005 -176 -1287 423 -253 -554 1344
2698 1344 -25 -2142 466 1573 -815 -621 548 -1005 -56 1545 -902 -1754 1193 930 -1123 111
2714 111 -60 -1358 791 1283 -1518 -1132 1316 -38 -733 697 -630 -1008 1524 653 -1958 -291 1196
2731 1196 -465 -45 701 -1303 -432 2056 -51 -1786 490 587 -574 900 476 -1769 334 1913
2747 1913 -877 -1066 986 26 -260 1257 -395 -1648 1287 1525 -1148 -175 914 -472 405 1452
2763 1452 -1145 -1044 2040 748 -1064 489 354 -858 1133 925 -1544 -20 2110 -146 -805 601
2779 601 -316 -313 1786 179 -1932 475 1428 -693 -323 640 -914 249 1733 -1015 -1733 1059 676
2796 676 -831 363 211 -1267 867 1236 -1824 -1130 1466 18 -506 693 -874 -1350 1344 627 -1931
2813a931J879J243j860M28O70k006J121K253k056j492K200m2j205J317n74j665
2829a720K136J353k772k25J924j098n8J603j663j044K635l78k348J224J231j430
2845f30R29Q41k443J92K628j198j550J688o1j285J700m7k362J452J805k014l68
2862g23J602j266j89J814j313j398K407N13k297O30Q67j531J106J562k367n38
2878a121K330o11j491J390l27j296K083N31k763N94J878j299l70J441j358m59
2894h48K528j119k215J684J117j658Q50M94j964O89K129j876j060K099l84j151
2910f85J453n50j728J808J568k690O7J661j117j48J512j510j204K687p1k149J021
2927g5Q37j609J021R91k316K96K299j328j397J686m20r50J885k68k221J201J635
$$ plain form
2813 -1931 -52 1191 -669 -241 429 -1577 -456 1797 -259 -1751 449 407 -798 519 -55 -1720
2829 -1720 416 1769 -1003 -1228 696 -402 -460 1143 -520 -1564 1071 693 -1655 -431 800 -630
2845 -630 299 1140 -1303 -1111 1517 319 -1231 457 396 -889 811 764 -1598 -146 1659 -355 -723
2862 -723 879 -387 -576 1238 -75 -1473 934 1447 -850 -220 647 -884 222 1784 -583 -1121
2878 -1121 1209 598 -893 497 170 -1126 957 1488 -1275 -681 1197 -102 -472 969 -389 -848
2894 -848 1680 561 -1654 30 1147 -511 339 833 -1131 -442 1687 -189 -1249 850 466 -685
2910 -685 768 218 -1510 298 1866 -824 -757 904 -213 -361 1151 -359 -1563 1124 1053 -1096 -75
2927 -75 762 -847 174 1165 -1151 -855 1444 116 -1281 405 -15 -965 920 652 -1569 -368 1267
2944A267j924r7J462j148k36J848j399j535K273M20j920O43P75j364R78J325k319
2961i51m17K420o54j285J345n63j128J815N68k558Q27J736j487j42J156j275l24
2978i17K200o72k201J767O56j359Q21L95j911Q02K051j857q78J949m70j114J527
2995G89l76j691J728R09k236K66J439j061m5J452j496q98K328j22j995J245N98
3012H34j560J089Q60k073J64K219j316j099J666m29j105J698j80k096J310J516
3028A498j889KJ326j476R5J753j252j410K107K50j781J023L32j663J184J392k145
3045f54m30K036p18r94J302n25j233J894L65k234O39J458j380q3J470j521m33
3062a041K154o96j922J515N49j384J002M61j943P88J801j617r16J873o65p99J697
$$ plain form
2944 1267 -657 -754 708 -440 -676 1172 -227 -1762 511 931 -989 -346 429 -935 43 1368 -951
2961 -951 -1368 1052 398 -887 458 -105 -1233 582 1150 -1408 -581 1155 -332 -474 682 -593 -917
2978 -917 1283 611 -1590 177 833 -526 295 690 -1221 -419 1632 -225 -1103 846 376 -738 789
2995 789 413 -1278 450 1359 -877 -611 828 -233 -278 1174 -322 -1220 1108 986 -1009 236 834
3012 834 -726 363 1223 -850 -686 1533 217 -882 784 355 -750 948 768 -1328 -18 1498
3028 1498 -391 -389 937 -539 -444 1309 57 -1353 754 1004 -777 246 578 -1085 99 1491 -654
3045 -654 -1084 952 234 -760 542 17 -1216 678 1043 -1191 -552 906 -474 -557 913 -608 -1041
3062 -1041 1113 417 -1505 10 559 -825 177 638 -1305 -517 1284 -333 -1249 624 -41 -840 857
3079H57o91j646J681R35k045L04J343j369K45J472j531r40K357k75j816J128M33
3096D42j279J054Q95k006J11J981j143r52J645q05q34J561l7k067J368J172j627
3113e21M2J273j394j1K049j288j459J917K62j591J116L39j707J007J306j860l12
3130h32K000q09r77J456p66j113J773K70k032Q26J360j502K72J082j591l12K153
3147A258o84j746J477L46j415J150N02j800O65J681j702o53J736p09p26J564o51
3164B93j592J533R08j846M15J060j253Q9J671j749q08K010k06j418J034K49j377
3181i87J263O45j946K01J798j062p09J387p19q91J786k15j646J027Q69j501L32
3198c68J025j462MJ901j164j286J677J01j239J023J85j541J050J243j788k96J609
$$ plain form
3079 857 166 -1480 201 1136 -909 -605 738 -631 -386 1086 -445 -1385 972 697 -1119 9 442
3096 442 -837 217 1112 -894 -783 1198 55 -897 748 -57 -891 670 633 -1434 -66 1106 -521
3113 -521 -479 794 -600 -611 1438 150 -1309 608 870 -721 395 734 -973 34 1340 -520 -832
3130 -832 1168 359 -618 838 72 -1041 732 1002 -1030 -204 1156 -346 -74 1008 -583 -895 1258
3147 1258 574 -1172 305 651 -764 386 888 -912 -247 1434 -268 -921 815 106 -620 944 293
3164 293 -1299 234 1142 -704 -289 771 -482 -393 1278 -471 -1279 731 525 -893 141 390 -987
3181 -987 276 921 -1025 -824 974 -88 -797 590 -129 -1020 766 551 -1095 -68 801 -700 -368
3198 -368 657 -805 -801 1100 -64 -1350 327 428 -811 212 397 -1144 -94 1149 -639 -935 674
3215F74p00n98J306q01j150J878L43j972P97J116j245L04Q93j629k01K133o47
3232E01j486J341N5j117J134L14j839P26J679j509o04J429o96m95J605o05j636
3249a203J583P62j807M59P67j024K88J493j537p71J762j83j276J116J44j395J242
3266D20O38j920J79J711q59o69J234q95n91J593j88j701J192Q03j391M69Q32j494
3284f37J63J619j074j192J643l5j177J174j38j427J239J091j848j85J416q40l16
3301e24J274q41j044J848J16j857P92Q27j140N77P64j461j15J770q01j182J126
3318A29P5r40J194J79j844P12J501j359l99J138p78l11J584p01j480J518N54j426
3336f54M23O94j195M54J448j558o87J742l29r59R66k60j002J249O04j701J33J520
$$ plain form
3215 674 -26 -624 682 -119 -1269 609 952 -1020 -223 893 -352 -48 845 -784 -985 1148 501
3232 501 -985 356 411 -706 428 742 -1097 -371 1308 -201 -805 624 -72 -567 1038 433 -1203
3249 -1203 380 1142 -665 -206 561 -463 -175 1318 -219 -990 772 589 -687 429 573 -822 420
3266 420 1058 -862 -683 1028 169 -500 734 -161 -752 841 653 -1048 144 947 -444 25 857 -637
3284 -637 -474 1145 71 -1121 522 487 -690 484 346 -1081 158 1249 -599 -784 632 -208 -524
3301 -524 750 -91 -1135 713 829 -1028 -236 591 -549 28 792 -669 -784 986 185 -997 129
3318 129 204 -736 458 637 -1207 -495 1006 -353 -752 386 -392 -703 881 180 -1300 218 772 -654
3336 -654 -231 463 -732 -278 1170 -388 -1075 667 338 -621 345 85 -917 332 936 -765 -632 888
3354H88j039l17J040q82o05J814l48j631J133P59j183L45O86j342L42J619j097
3371A82j143J355j1r99J158j02j440J472P02j822N8J262n75k89J091r80r54J857
3389H22M7j617P76N43r17M91Q83j777nJ946o25j252J003L4q56J239j43j823R84
3408b47J446j274m88J032r49OJ532q15j332J436M59j353N17N87j306P12J164j562
3426d35o32J822l55j087J039k82j065J395M53j790L74J181p29k69R42j035m85
3443i58J793m03j546R12P29j046M54L91j335N00J653j294q66J265p6o19Q51l41
3461F4j346J277J106j622k03J130o37n6R81r08q71J828J46j767O77O55r01P33
3479B86N83j656Q8J694o45r40Q74j25p96J256o4j668Q97J416j292k30Q43p69q5
$$ plain form
3354 888 -151 -468 572 -310 -915 899 551 -1080 53 812 -371 -26 660 -682 -340 1279 182
3371 182 -961 394 383 -616 542 440 -1000 472 1174 -648 -590 672 97 -192 899 -81 -1035 822
3389 822 869 -748 28 571 -346 145 1028 -749 -754 1192 567 -685 318 352 -504 735 592 -1231 -247
3408 -247 1199 -75 -563 469 -480 -474 1058 243 -1089 347 806 -547 -30 557 -749 -37 1127 -435
3426 -435 -1067 755 400 -687 352 70 -995 400 853 -937 -563 618 -111 -380 562 -473 -958
3443 -958 835 432 -1114 -202 527 -519 -65 326 -1009 -509 1144 -150 -1016 249 173 -446 405 64
3461 64 -1282 -5 1101 -521 -724 406 -231 -287 694 -214 -1085 743 889 -878 -201 454 -447 286
3479 286 869 -787 -699 995 350 -590 284 159 -637 619 555 -1113 -216 1200 -92 -322 521 -248 -333
3498c33J478j057j285J421P22j270M23K82j087P92J071j470n57J625k80p93O79
3515C61k77j033J586M31j809J52J448p69m1O60j122j89J640l13j702R33O56r80
3533c68M31L47j130L86J626j309r59J281q9p00J036m76j137J357Q62j599j15R58
3551D02o17K4R72j126o16J578L3j493O15N35p79O48M32j576R6J832p75q53R97
3570C29k63p33J123nj646R50J221j160l69Q86p26K6J428j112j113J509N13j361
3588e03L77K16r38R30J029j412o60J427k72p34P71l09q77J641J55j757L01J216
3606F01p64O6P42j135j51J514m71j450R90N31p53O06K60j524M95J584j098p36
3624f93J208j85o66J032n77j232J487P60j521j13Q24m76J57R34j209o56J818o0
$$ plain form
3498 -333 1145 88 -1197 224 946 -324 99 381 -706 86 1157 -313 -870 755 475 -318 361
3515 361 84 -949 637 1068 -741 -589 859 90 49 709 -413 -602 1038 725 -977 -44 612 -368
3533 -368 63 410 -720 -334 1292 -17 -976 305 216 -484 552 76 -1061 296 1158 -441 -556 402
3551 402 -215 -191 781 -345 -961 617 650 -843 -228 307 -472 176 608 -968 -872 960 185 -668 329
3570 329 66 -667 456 451 -1195 -245 976 -184 -553 333 -393 -367 1061 -51 -1164 345 858 -503
3588 -503 -126 90 -848 82 1111 -301 -961 466 194 -540 231 -78 -955 686 841 -916 -615 601
3606 601 -163 -97 645 -490 -641 873 402 -1048 -58 473 -280 326 586 -938 -443 1141 43 -693
3624 -693 515 330 -336 696 119 -1113 374 1134 -387 -500 324 -152 5 939 -270 -926 892 832
3642H32j494M45M46o72Q52N56j708R6J623p23r30R01k14m18J333l53j788R54J288
3661A026r98m78O49n94K03J308j184j239J598N17j061K21L8p98J016Q91j588n04
3679i77J490j06o66M75m48o63J686M1j786L32J186o65j58N81r21M6J470m96j477
3698a056Q30O70p86N04K55j446P55J271j259p87J278k4o36J014n34j154J388N83
3716H66j531k4J113n34M4O46j247k72J808j69j459N67L55o18P62K81j523M20J564
3735A049p19r17P59k98k73J264n04j411J017J060j113k31N82o82M22J094j047
3752E2j058J381L49j104M21K50r84R92P40j489l92J506j66o56N69n65n34J393
3770G05K41j688M80R46o71MM84q98m1J545n99j402J037N04q61N18R1j246O67J341
$$ plain form
3642 832 -662 -217 229 -443 409 965 -743 -647 976 253 -677 224 10 -408 925 572 -1216 -262 1026
3661 1026 28 -450 199 -395 -192 1116 -68 -1307 291 808 -253 -32 6 -792 224 1115 -473 -977
3679 -977 513 407 -259 216 -232 -895 791 832 -954 -622 564 -101 -259 322 -599 -553 917 421 -1056
3698 -1056 -226 444 -342 162 417 -1029 -274 997 -262 -1049 229 205 -431 583 49 -1105 283 866
3716 866 -665 -689 424 -110 -66 580 -667 -939 869 700 -759 -192 163 -455 307 588 -935 -515 1049
3735 1049 330 -587 172 -126 -399 865 361 -1050 -33 1027 -86 -317 265 -417 5 1099 52
3752 52 -1006 375 724 -380 41 291 -693 299 1039 -450 -842 664 498 -158 411 -154 -688 705
3770 705 946 -742 -262 684 13 17 501 -397 -438 1107 508 -894 143 647 -214 304 395 -851 -184 1157
3790A157j243p39J092j06l73Q65o94r76J386P30j721M5Q95n94L23N87j282l42
3808i90J664j1j359M61M08m24O35J64j614L04J786r68p58P91l01k63J309o03j570
3827a339J195J091j214j68M86p04M56J131j186q81J467L11j012K33R2q02R88P83
3845I27j518l55J577l63o56P13n09m47J365J53j785L59J178p00k0N53j050J38
3863d40J397p13j164R37N64p77N46l4j051Q10J031j333m39R80k7k96O06o90p83
3882h76J239P23j598J50P90m76K77O13j355j86J647k47j224M28L65n99Q36j1j292
3901g96M54J414q20q47Q34l48j36J224p08j306J068Q72j205q0O22o95M14J073
3919A034j199j063J621J04q26M06N8r29J171N30j649j46J528m02o60P52p12k88
$$ plain form
3790 1157 -86 -825 267 161 -212 653 -41 -1017 369 1099 -622 -577 318 -276 47 634 -648 -990
3808 -990 674 663 -696 -235 173 -251 384 548 -1066 -762 1024 56 -702 89 -212 -475 834 231 -1339
3827 -1339 -144 947 -267 -435 51 -653 -197 934 -252 -1133 334 645 -367 -134 -42 -844 144 927
3845 927 -591 -946 631 268 -388 325 -184 -631 734 887 -898 -539 639 -61 -81 472 -578 -440
3863 -440 957 244 -920 17 581 -196 350 316 -735 75 1106 -227 -666 314 287 -9 597 -93 -876
3882 -876 363 1086 -512 -362 428 -48 229 842 -513 -699 948 701 -523 -95 270 -329 507 496 -796
3901 -796 -342 1072 252 -595 239 -109 -245 979 271 -1035 33 905 -300 -380 242 -453 -39 1034
3919 1034 -165 -1228 393 497 -329 77 135 -794 377 907 -742 -888 640 238 -422 330 -382 -670
3937f70J200J38j556N15R66o76k1L57j013K26J471o78j266J089K10o26O26j80
3955A12r71Q90J043j324n97J117k49j21P04p57p87J437L67j595J34R10l54K37
3973A96N13j306k52J678l52j154O36K49l83N84K9j331N44J444r02o14O66m19j42
3992c16J177n54j327J164Q60j162r4M56n71M48J025j216q31J451J54r52L22K7
4010F1n88J100M06j677L7J345l76n34N75o16k50J377l24j559O66J055p33JL48
4029C14q75K23J274p77j035J157K07p79N92j81r24Q64J041j283n25J108l18k40
4047a57O12o81o37J526J17j440L50O90o07L18L87j011k05J626n37j108P84J38
4065A65m43O68K2j431P00J087q44o00P82m30J36Q57n88j179J030Q15j083J1M83
$$ plain form
3937 -670 530 668 -888 -373 593 -83 -104 253 -760 -534 937 259 -1007 82 292 -334 292 112
3955 112 -859 31 1074 -250 -847 270 21 -100 604 -153 -940 497 864 -731 -597 313 -41 196
3973 196 709 -597 -849 829 477 -677 -41 208 -175 409 438 -893 -349 1095 193 -421 245 -174 -316
3992 -316 861 307 -1020 144 1004 -158 -252 204 -367 81 1106 -110 -941 510 664 -288 34 61
4010 61 -527 573 979 -698 -661 684 308 -226 349 -267 -517 860 536 -1023 -357 698 -35 -34 314
4029 314 -561 -338 936 159 -876 281 488 -291 301 120 -804 60 1101 -182 -707 401 83 -157
4047 -157 455 -226 -863 663 780 -660 -310 380 -227 91 478 -533 -738 888 351 -757 27 165
4065 165 -278 390 412 -1019 -319 768 -76 -676 106 -324 -188 669 81 -1098 -68 747 -336 -325 158
4084A58p89O75Q15j121p57J407N9q65L32qn97J042L83j619J63J453n78o14P17
4103B56o01k67J275k37j327P45P58p01J80K10r88L35J483j073r57J077K85n81
4121a28N42j78j020R43Q67j400j69R33l79l3M71n98o54J389L67j426K07P15m86
4140c7L19K84j075QJ375m57j055O05K19l46O87o5j347P21J124r07o78R42l64j67
4160b14R62o71j045J154O15j135J62L48o68N90P99j321n63J505k9r41O12j84n95
4179f19J105K39j442J89J058m58m51O09o27j25J260m03j246O19Q63p61ML88q09
4198f07L75J178j106p75R93K40p10N49k36n99P97O84j306j62Q84j02k67N14p20
4217c76l38J228Q2j317M58N89n68L25K79r81N0J492o78r06O32R5l54P90j10j297
$$ plain form
4084 158 -631 44 859 -262 -1019 388 447 -418 -86 -94 -691 351 734 -885 -722 731 153 -461 256
4103 256 -345 -612 663 426 -901 -156 602 -99 81 291 -697 -362 1121 48 -909 168 453 -128
4121 -128 414 236 -784 159 1026 -374 -543 390 11 -22 449 -149 -803 586 953 -473 -266 449 -37
4140 -37 282 566 -509 -501 874 417 -638 -33 186 -160 527 462 -885 -164 960 53 -625 317 -47 -214
4160 -214 748 77 -968 186 801 -334 -172 176 -492 98 897 -424 -987 518 489 -452 160 -24 -619
4179 -619 486 725 -717 -528 530 72 -379 230 -397 -522 738 335 -911 -292 571 -190 -186 202 -607
4198 -607 -232 946 -160 -935 58 298 -412 137 -99 -698 99 783 -523 -685 199 97 -170 344 -376
4217 -376 -714 514 596 -721 -263 326 -242 83 362 -619 -569 923 245 -661 -29 66 -288 502 392 -905
4237i05O67J074q34m95O57l42l6R72p06j002J221N12j013N0M17n60M60P79j331
4256d15l52J388k00q33N94r5n72R67K07j504L36J097n12l27O18p57p8J162l24
4275D00j195Q47N29q04L25P4p98M12J135r94o65J044K7o78N49q1q43J001O09j275
4295c81k42R72k84k19O46r07l02J336J0j380L09P67n17L62L27j272K67J372o44
4314B20r39P24J27l73O98l27j170Q75R16r99j67N72m12K1Q08p14q68J236N11j234
4334d95K52L16n85M34Q70j171l87J277k10o69L60j52m64J071R9j203J76J180p42
4353d3k98O88n92j38J189o05j134R10M91p46L07J83q18O33P54j003n26J035J02
4372C89o37O36k26o94R26M80j393K4Q93l88n4M73o99l41J339j77j262O03M53n22
$$ plain form
4237 -905 -238 836 2 -493 164 -178 -214 758 52 -950 271 783 -230 -180 237 -323 137 916 -415
4256 -415 -767 621 421 -412 182 87 -485 482 689 -815 -479 618 106 -221 397 -360 -438 724 400
4275 400 -795 52 581 -223 102 176 -622 -210 925 -69 -734 310 337 -341 208 127 -716 285 894 -381
4295 -381 -623 349 65 -154 492 -415 -717 619 629 -751 -442 325 -192 170 497 -775 -508 864 220
4314 220 -719 5 132 -241 457 130 -1040 -165 751 -248 -415 157 -255 -234 574 -140 -1008 228 739 -495
4334 -495 -243 73 -512 -78 792 -379 -766 511 301 -368 -8 -160 -624 447 546 -657 -481 699 -43
4353 -43 -341 347 -245 -383 806 201 -933 -23 468 -278 29 212 -606 27 781 -222 -748 287 389
4372 389 -248 388 162 -532 394 874 -519 -495 398 10 -44 429 -270 -611 728 551 -711 -108 345 -177
4392a77K66L85j003K01J139n08q58O95Nk70N49k00r61O96Q47r55k05O28m31j57
4412c14J088r01q79J354L86j156K03M05n63N48N74j169j74J129l03o61O04j21
4430E0n59Q29J38j350O22Q94n24k53N13p18j6J002n37r36P45N97q00L02K14q81
4450f68M30J016r90n64J067o0m55M63l95n13Q60N51j231n3Q56k82j90P46j029
4469d41j76J203j43j089L82N21m82K99K50r85K95J123o64p86Q19k3l06P60l22
4488B35j125R48P59j026j51N10l54J35P86q55o61J219J25q52J30L99n82O59M56
4507G55j249p3J101k88o27N43j56l93P89J87j264M48P83m92j87M83o01K0J024
4526H03o51q47P52M52o96J64K34p61N08Q06r30l55Q87p5n43N89m60n33R81L10
$$ plain form
4392 -177 89 474 -529 -328 811 303 -555 140 145 -125 424 224 -737 -41 806 -149 -354 274 -157 -314
4412 -314 774 -127 -1006 348 734 -422 -219 186 -377 171 745 -424 -598 531 228 -433 171 50
4430 50 -509 320 458 -892 -270 624 100 -153 360 -358 -374 628 91 -845 -100 497 -303 -1 213 -668
4450 -668 -238 778 -212 -776 291 231 -224 239 -156 -669 191 742 -489 -542 314 32 -158 588 -441
4469 -441 -617 586 443 -646 -264 257 -225 74 324 -661 -366 757 93 -693 126 103 -203 557 235
4488 235 -890 58 817 -209 -360 150 -204 -69 717 -138 -799 420 545 -307 -177 222 -360 299 755
4507 755 -494 -567 534 246 -381 162 6 -387 402 589 -675 -227 556 64 -123 360 -241 -221 803
4526 803 152 -695 57 509 -187 -23 211 -550 -42 764 -166 -521 366 291 -252 337 -123 -656 325 635
4546F35r28p6R20n72j29N02o93j91J104k4j241M91L60m91M38K47r70L26R05n42
4566G1p01O98j1l39O59k75r68P19P82q57j33M47k23m6O20p59l39Q50L11r04L16
4587h2K48o46N55L36r11o9J122m18n11M94j80m67R56O0j025L87N83n52j69O65
4607C76p86N1J034m77q58Q05L71o47J91K41o51M87N70r23j89Q78l60l34M21j79
4627B1n61J001J93j085J75P35m79PL21n91k29J058j26j033O33L40o30N80O8q63
4647d65L13R17o29o05N99m0l27O59k53q32O10P63r46k4M94n18J55O86o05m90Q63
4668C25O6q44L46L92p77O38L21r11%Q84l01m97M72j19l52P73j04r38M96O82o99
4689a47j8M28o50P0Q76n72o23Q12K26p39L03K58p84M51P13r40k35R19k78l31M17
$$ plain form
4546 635 -293 -369 551 -21 -150 352 -341 -532 572 548 -693 -202 158 -333 105 352 -618 -292 613 71
4566 71 -630 68 57 -282 377 102 -866 -147 635 -222 -355 92 -131 -177 443 -316 -655 195 506 -398 -82
4587 -82 166 -480 75 411 -500 -569 553 135 -376 118 -62 -529 427 487 -538 -151 432 -120 -289 376
4607 376 -410 -359 675 198 -660 145 516 -131 60 301 -350 137 707 -216 -405 473 113 -221 200 21
4627 21 -540 461 654 -431 -256 479 0 7 328 -263 -492 566 440 -593 40 380 -250 330 398 -465
4647 -465 -152 765 136 -469 130 90 -237 422 169 -663 -53 710 -236 -260 234 -284 -129 557 -48 -538 325
4668 325 391 -453 -107 285 -492 146 467 -444 -444 440 139 -358 114 -5 -357 416 312 -626 -130 552 -147
4689 -147 -165 263 -387 -317 559 -13 -636 176 402 -337 -34 224 -560 -109 604 -336 -571 348 70 -261 156
4710A56k21n67R34K34j037K21N53l93J57K97n74j91R17k54q86O63J33m14M71N7
4730B56q64L70R19o70m95O70k38k35O66k38r03R50M05p67L5L74m98J07O67o86
4750a75l66Q59L8o92N05Lo20O54L54r12J9R67n98l71O77l40k73P63j38r21M79
4771h8O98o18l3M72o78J76Q12p11p00Q43J68n54L65K0o77O01N76j108OP34m5m93
4793b34M88k58n81R59K51j102J81O53m75JM20p14J3Q73j77q38M66J81m11M44J18
4814B58q99M94P95p14m28N89j85k21P72l37p97P09L53q23M5N15l77K46M57p36
4834b84j76Q29j99n31M12m8m37N35L62q96J07P74n60k31M87k00l01P14k17p25
4854e85M18N27n07j5M29m97J1P43o28n18Q91M8o99O09l2n80N58N04j001n2P40
$$ plain form
4710 156 -65 -632 302 536 -501 -280 273 -120 37 334 -240 -431 486 232 -654 9 142 -272 199 256
4730 256 -608 -238 681 11 -484 186 -52 -287 379 141 -762 188 593 -174 -139 235 -263 -156 511 -175
4750 -175 -541 318 356 -336 169 172 -448 206 560 -352 -333 634 36 -335 342 2 -271 492 354 -567 -88
4771 -88 610 -8 -41 431 -247 -71 741 30 -670 173 341 -213 152 172 -505 96 672 -436 -430 304 259 -234
4793 -234 254 -4 -585 374 625 -477 -296 357 -118 -117 303 -411 -398 475 298 -540 -74 107 -304 140 258
4814 258 -641 -147 648 -66 -494 95 -90 -311 461 124 -673 36 389 -434 -389 126 -251 -5 452 -284
4834 -284 -460 369 170 -361 51 3 -434 101 463 -433 -326 448 -112 -343 144 -56 -357 357 140 -585
4854 -585 -167 360 -147 -162 267 -230 -219 524 -104 -622 269 317 -382 227 195 -385 173 677 -324 -376 364
4875C64j75k43M42m73l70Q51O8q95L00N13l97k2M53p68j07R61k18o86N21K1l11
4896a71M99M7q70M84N98p03k08M95j55j17O36m99n26O63K66n93j9K76m18K45N53
$$ plain form
4875 364 189 -54 388 -85 -455 396 464 -431 -131 382 -15 -37 416 -352 -459 502 284 -402 119 140 -171
4896 -171 328 375 -495 -11 587 -116 -324 171 16 -101 535 36 -490 173 439 -154 -173 103 -315 -70 483
$$ [...]
8191a21
##END NTUPLES=NMR FID
##END=
