##TITLE=1H_EC-3099(VI-3)
 CDCl3, 8 sc, 
 26.9.2019
##JCAMPDX= 6.0         $$ Bruker NMR JCAMP-DX V2.0
##DATA TYPE= NMR FID
##DATA CLASS= NTUPLES
##ORIGIN= UXNMR, Bruker Analytische Messtechnik GmbH
##OWNER= root
$$ XWIN-NMR		Version 3.5
$$ Thu Sep 26 13:56:02 2019 Russian Standard Time (UT+4h)  she@DPX200
##.OBSERVE FREQUENCY= 200.1315
##.OBSERVE NUCLEUS= ^1H
##.DELAY= (6, 6)
##.ACQUISITION MODE= SIMULTANEOUS
##.ACQUISITION SCHEME= undefined
##.AVERAGES= 8
##.DIGITISER RES= 18
##SPECTROMETER/DATA SYSTEM= spect
##.PULSE SEQUENCE= zg30
##.SOLVENT NAME= CDCl3
##.SHIFT REFERENCE= (INTERNAL, CDCl3, 0, 15.7039)
##AUDIT TRAIL= $$ (NUMBER, WHEN, WHO, WHERE, WHAT)
$$ ##TITLE= Audit trail, XWIN-NMR		Version 3.5
$$ ##JCAMPDX= 5.01
$$ ##ORIGIN= Bruker BioSpin GmbH
$$ ##OWNER= she
$$ F:/spectra/data/she/nmr/H-F/1/audita.txt
$$ ##AUDIT TRAIL=  $$ (NUMBER, WHEN, WHO, WHERE, WHAT)
(   1,<2019-09-26 13:54:45.25 +0400>,<she>,<DPX200>,
      <created by zg, POWCHK disabled, PULCHK disabled
       configuration hash MD5:
       00 E9 B6 7A A2 85 ED C7 34 08 36 98 17 FE 4E 26
       data hash MD5: 16K
       9D D5 28 7F AB 8D AC 3F 03 F4 3A E4 A6 8A 07 30>)
$$ ##END=
$$ 
$$ hash MD5
$$ 1C C3 A4 3A E9 B2 31 21 B4 01 1F 9E A1 E4 10 1C
##$RELAX= 
##$RELAX= 
##$RELAX= 
##$RELAX= 
##$RELAX= 
##$RELAX= 
$$ Bruker specific parameters
$$ --------------------------
##$DU= <F:/spectra>
##$EXPNO= 1
##$NAME= <H-F>
##$PROCNO= 1
##$TYPE= <nmr>
##$USER= <she>
##$AMP= (0..31)
100 100 100 100 100 100 100 100 100 100 100 100 100 100 100 100 100 100 
100 100 100 100 100 100 100 100 100 100 100 100 100 100 
##$AQSEQ= 0
##$AQ_mod= 1
##$AUNM= <au_zg>
##$AUTOPOS= <>
##$BF1= 200.13
##$BF2= 200.13
##$BF3= 200.13
##$BF4= 200.13
##$BF5= 200.13
##$BF6= 200.13
##$BF7= 200.13
##$BF8= 200.13
##$BYTORDA= 1
##$CFDGTYP= 0
##$CFRGTYP= 5
##$CHEMSTR= <none>
##$CNST= (0..31)
1 1 145 1 1 1 1 1 1 1 1 1 1 1 1 1 1 1 1 1 1 1 1 1 1 1 1 1 1 1 1 1 
##$CPDPRG= <>
##$CPDPRG1= <>
##$CPDPRG2= <>
##$CPDPRG3= <>
##$CPDPRG4= <mlev>
##$CPDPRG5= <mlev>
##$CPDPRG6= <mlev>
##$CPDPRG7= <mlev>
##$CPDPRG8= <mlev>
##$CPDPRGB= <>
##$CPDPRGT= <>
##$D= (0..31)
0 1.2 0 0 0 0 0 0 0 0.06 0 0.03 0 0 0 0 0.0002 0 0 0 0 0 0 0 0 0 0 0 0 
0 0 0 
##$DATE= 1569491684
##$DBL= (0..7)
120 120 120 120 120 120 120 120 
##$DBP= (0..7)
150 150 150 150 150 150 150 150 
##$DBP07= 0
##$DBPNAM0= <>
##$DBPNAM1= <>
##$DBPNAM2= <>
##$DBPNAM3= <>
##$DBPNAM4= <>
##$DBPNAM5= <>
##$DBPNAM6= <>
##$DBPNAM7= <>
##$DBPOAL= (0..7)
0.5 0.5 0.5 0.5 0.5 0.5 0.5 0.5 
##$DBPOFFS= (0..7)
0 0 0 0 0 0 0 0 
##$DE= 6
##$DECBNUC= <off>
##$DECIM= 24
##$DECNUC= <off>
##$DECSTAT= 4
##$DIGMOD= 1
##$DIGTYP= 9
##$DL= (0..7)
0 120 120 120 120 120 120 120 
##$DP= (0..7)
150 150 150 150 150 150 150 150 
##$DP07= 0
##$DPNAME0= <>
##$DPNAME1= <>
##$DPNAME2= <>
##$DPNAME3= <>
##$DPNAME4= <>
##$DPNAME5= <>
##$DPNAME6= <>
##$DPNAME7= <>
##$DPOAL= (0..7)
0.5 0.5 0.5 0.5 0.5 0.5 0.5 0.5 
##$DPOFFS= (0..7)
0 0 0 0 0 0 0 0 
##$DQDMODE= 0
##$DR= 18
##$DS= 0
##$DSLIST= <SSSSSSSSSSSSSSS>
$$ [...]
##$SUBNAM2= <"">
##$SUBNAM3= <"">
##$SUBNAM4= <"">
##$SUBNAM5= <"">
##$SUBNAM6= <"">
##$SUBNAM7= <"">
##$SUBNAM8= <"">
##$SUBNAM9= <"">
##$SW= 24.0689530833862
##$SWIBOX= (0..15)
0 0 2 0 0 0 0 0 0 0 0 0 0 0 0 0 
##$SW_h= 4816.95568400771
##$TD= 16384
##$TD0= 1
##$TE= 0
##$TE2= 300
##$TE3= 300
##$TEG= 300
##$TL= (0..7)
0 120 120 120 120 120 120 120 
##$TP= (0..7)
150 150 150 150 150 150 150 150 
##$TP07= 0
##$TPNAME0= <>
##$TPNAME1= <>
##$TPNAME2= <>
##$TPNAME3= <>
##$TPNAME4= <>
##$TPNAME5= <>
##$TPNAME6= <>
##$TPNAME7= <>
##$TPOAL= (0..7)
0.5 0.5 0.5 0.5 0.5 0.5 0.5 0.5 
##$TPOFFS= (0..7)
0 0 0 0 0 0 0 0 
##$TUNHIN= 0
##$TUNHOUT= 0
##$TUNXOUT= 0
##$USERA1= <user>
##$USERA2= <user>
##$USERA3= <user>
##$USERA4= <user>
##$USERA5= <user>
##$V9= 5
##$VALIST= <valist>
##$VCLIST= <CCCCCCCCCCCCCCC>
##$VD= 0
##$VDLIST= <DDDDDDDDDDDDDDD>
##$VPLIST= <PPPPPPPPPPPPPPP>
##$VTLIST= <TTTTTTTTTTTTTTT>
##$WBST= 1024
##$WBSW= 4
##$XGAIN= (0..3)
0 0 0 0 
##$XL= 0
##$YL= 0
##$YMAX_a= 163945
##$YMIN_a= -270519
##$ZGOPTNS= <>
##$ZL1= 120
##$ZL2= 120
##$ZL3= 120
##$ZL4= 120
##$ABSF1= 10
##$ABSF2= 0
##$ABSG= 5
##$ABSL= 3
##$ALPHA= 0
##$AQORDER= 0
##$ASSFAC= 0
##$ASSFACI= 0
##$ASSFACX= 0
##$ASSWID= 0
##$AUNMP= <proc_1d>
##$AZFE= 0.1
##$AZFW= 0.1
##$BCFW= 1
##$BC_mod= 2
##$BYTORDP= 1
##$COROFFS= 0
##$CY= 11.3945322036743
##$DATMOD= 1
##$DC= 2
##$DFILT= <>
##$DTYPP= 0
##$F1P= 20.1720416913024
##$F2P= 0.152960286110954
##$FCOR= 0.5
##$FTSIZE= 0
##$FT_mod= 4
##$GAMMA= 1
##$GB= 0.15
##$INTBC= 1
##$INTSCL= 1
##$ISEN= 128
##$LB= 0.24
##$LEV0= 0
##$LPBIN= 0
##$MAXI= 10000
##$MC2= 0
##$MEAN= 0
##$ME_mod= 0
##$MI= 1.114404
##$NCOEF= 0
##$NC_proc= 0
##$NLEV= 6
##$NOISF1= 3.799351
##$NOISF2= 2.8
##$NSP= 1
##$NTH_PI= 0
##$NZP= 0
##$OFFSET= 15.70392
##$PC= 1
##$PHC0= -9570.828
##$PHC1= 16.20095
##$PH_mod= 1
##$PKNL= yes
##$PPARMOD= 0
##$PSCAL= 0
##$PSIGN= 0
##$REVERSE= no
##$SF= 200.130013532006
##$SI= 16384
##$SIGF1= 3
##$SIGF2= 2
##$SINO= 400
##$SIOLD= 16384
##$SREGLST= <1H.CDCl3>
##$SSB= 0
##$STSI= 0
##$STSR= 0
##$SW_p= 3612.71676300578
##$SYMM= 0
##$S_DEV= 0
##$TDeff= 0
##$TDoff= 0
##$TI= <>
##$TILT= no
##$TM1= 0
##$TM2= 0
##$TOPLEV= 0
##$USERP1= <user>
##$USERP2= <user>
##$USERP3= <user>
##$USERP4= <user>
##$USERP5= <user>
##$WDW= 1
##$XDIM= 8192
##$YMAX_p= 0
##$YMIN_p= 0
$$ End of Bruker specific parameters
$$ ---------------------------------
##NTUPLES= NMR FID
##VAR_NAME=  TIME,          FID/REAL,        FID/IMAG
##SYMBOL=    X,             R,               I
##VAR_TYPE=  INDEPENDENT,   DEPENDENT,       DEPENDENT
##VAR_FORM=  AFFN,          ASDF,            ASDF
##VAR_DIM=   8192,          8192,            8192
##UNITS=     SECONDS,       ARBITRARY UNITS, ARBITRARY UNITS
##FACTOR=    0.0002076,     1,               1
##FIRST=     0,             0,               0
##LAST=      1.7004516,     0,               0
##MIN=       0,             -270519,         0
##MAX=       1.7004516,     163945,          0
$$ Real data points
##PAGE= N=1
##DATA TABLE= (X++(R..R)), XYDATA
0 0 0 0 0 0 0 0 0 -8 8 -8 16 -16 24 -24 32 -40 48 -56 65 -78 89 -105 121 -142 162 -186 212 -242 274 -309
30 -309 349 -393 440 -492 551 -614 681 -757 840 -931 1031 -1143 1265 -1399 1550 -1720 1913
47 1913 -2129 2378 -2667 3009 -3416 3919 -4545 5366 -6486 8111 -10694 15467 -27244 116921
61 116921 92451 -181657 -91793 85967 163945 42859 -65309 -38263 104268 110644 -27805
72 -27805 -121155 -34053 92051 109079 -15711 -107838 -43118 68010 29434 -70882 -65679 23393
84 23393 66700 32275 -54809 -99151 -42007 28319 14817 -10933 5978 9413 -24843 -55901
96 -55901 -60286 -11025 59030 43690 -50125 -80363 -21220 21787 4126 -31455 -31495 17879 41490
109 41490 -18327 -72078 -39215 12717 22956 11392 -14277 -23356 22137 41528 -33096 -82722
121 -82722 -12604 73083 69451 1804 -61414 -59439 10493 60166 37106 -8335 -28890 -13653
133 -13653 23924 18414 -39093 -40823 34779 63897 12812 -34375 -41022 -11240 39985 39669 -23703
146 -23703 -42499 15760 57150 34105 -19055 -52229 -13711 65804 73658 2920 -40636 -23930
158 -23930 12190 43704 39900 1609 -8342 16996 18084 -2728 -12146 -12450 9119 40301 16613
171 16613 -39940 -31156 19599 22626 -6898 -25206 -32276 -11464 24848 12288 -36375 -44026 -10195
184 -10195 14960 11803 -15197 -31516 -10174 -1069 -29656 -26263 16896 20645 -14076 -29121 -24708
197 -24708 -6313 23527 11629 -39145 -38054 14652 27673 -8213 -31314 -14106 27175 32488
209 32488 -26811 -59810 4733 67940 30768 -45776 -61018 3627 81882 64278 -44446 -84130
221 -84130 7682 85756 46146 -40588 -65224 5487 85329 48913 -60103 -64946 37216 75762
233 75762 2883 -68869 -50847 36433 81809 8384 -85673 -61301 36066 67743 8872 -61324
245 -61324 -58361 16489 50306 -12055 -56046 -7101 38073 12416 -28556 -35914 -8998 27872
257 27872 18694 -32959 -37421 15466 36488 1928 -33133 -32323 5422 33467 2802 -35958 -12933
270 -12933 20737 289 -28211 -18879 10198 33100 16460 -41901 -60038 -356 46618 22040
282 22040 -24032 -39876 -13313 32187 28443 -30519 -47269 3965 35582 12752 -21163 -33858
294 -33858 -8324 31649 20908 -27572 -31346 10334 32148 13451 -28841 -52235 -6777 57886
306 57886 42024 -24856 -43488 -13517 17225 29593 7198 -25872 -11876 24704 19531 -9557
318 -9557 -15054 842 22468 26569 -4534 -24366 4133 26634 9077 -5111 -1746 2379 18618
331 18618 29079 2392 -22429 -9051 10085 16785 22670 10611 -11830 -9539 4327 6225 12658
344 12658 16092 -2991 -10628 3768 3194 -4380 6978 11717 205 -1230 320 -4959 966 5195
358 5195 -8461 -7334 9216 4450 -5896 2545 2006 -10325 -8341 -4595 -3237 15319 19002 -18746
372 -18746 -40868 -10212 28221 32410 -1418 -43206 -32004 25457 34923 -16704 -39803 -6386
384 -6386 29024 27647 -13812 -50967 -17215 48138 36374 -34973 -53802 133 51291 37495
396 37495 -32012 -65109 -1852 67590 38853 -33601 -49903 -6711 39677 37307 -14529 -35892
408 -35892 12049 44162 6022 -32828 -17293 22871 40830 10945 -34138 -22577 31911 38067
420 38067 -4526 -21471 -1853 19157 23187 1163 -19453 2061 29356 11321 -13469 1273
432 1273 24930 23773 528 -25283 -11737 38238 47201 -2622 -29123 -3457 24601 28551 9333
445 9333 -17524 -8912 27809 25020 -14487 -23888 3851 27742 23644 -11995 -38918 -9107 35295
458 35295 20491 -26150 -37721 -11363 24126 32764 -10523 -54329 -28496 24244 26253 -9688
470 -9688 -34547 -25925 9090 22628 -14359 -40652 -8825 25030 12752 -19651 -38255 -22818
482 -22818 20343 30771 -13555 -40912 -13268 18340 18019 -4444 -27824 -18674 16892 22225 -5687
495 -5687 -11609 2989 5420 3869 5365 2451 9651 20958 4608 -14008 2204 23313 20353 10395
509 10395 2948 867 12286 15064 -1322 457 20241 15262 -3640 -3726 3503 9675 16208 3071
523 3071 -19010 -8191 18424 15842 -3411 -14674 -15769 1683 22802 11210 -14730 -13971 -1602
536 -1602 2864 6441 189 -13080 -1999 17699 4825 -18372 -16222 1059 17418 16256 -15692
549 -15692 -36579 -5948 28620 14276 -19180 -30910 -14998 18055 26569 -14999 -45552 -16636
561 -16636 20334 15510 -11959 -27658 -14027 16318 12943 -25520 -32384 4401 24817 7588 -20440
574 -20440 -33194 -8678 29362 19933 -24180 -29553 2006 16259 4668 -12729 -18920 -645 17205
587 17205 634 -18812 -4912 11068 3529 -8336 -11914 -2902 18154 18669 -10178 -19020 6233
600 6233 19562 10751 1312 -3545 3217 17697 9802 -9535 1385 24055 17526 -1662 -9189 -5422
614 -5422 12681 26195 3733 -25152 -13473 15536 20557 2438 -21766 -27051 2474 23568 -178
627 -178 -27081 -19595 -477 8948 1803 -22470 -27359 7332 24298 -8852 -36694 -21312 10152
640 10152 25277 5540 -32512 -31682 12061 29735 29 -26118 -20563 5239 24038 5424 -27573
653 -27573 -17571 18613 18646 -9219 -18677 -4598 15782 18975 -9218 -28184 833 32509 17603
666 17603 -11333 -15391 -712 18257 19879 -3523 -12558 10496 20426 1040 -9606 430 14581
679 14581 18469 673 -19783 -5176 22352 13691 -11554 -13957 -725 11236 14190 -5294 -23642
692 -23642 -5323 17837 5872 -12998 -8954 4064 11487 4674 -15676 -16474 12412 25128 4712
705 4712 -14894 -15642 -1671 20821 21081 -7656 -18797 1794 14554 8034 -2240 -13288 -9500
718 -9500 13877 17403 -8013 -18837 -4961 6185 6309 -3323 -17787 -9843 14740 10998 -17092
731 -17092 -24280 -6398 13200 17951 -2753 -25914 -13739 11288 7725 -6495 -4972 599 4289
744 4289 5560 -7317 -15899 3001 17239 1570 -10945 -3379 4682 6212 1401 -10514 -7281 12485
758 12485 14909 -1006 -7477 -4674 -660 8117 7973 -1818 4425 14805 1527 -12864 -3293 10313
772 10313 15032 13873 -679 -13261 394 16028 6688 -4026 -1023 4582 9467 8113 -8669
785 -8669 -15561 2441 14155 4848 -3923 -7027 -4570 7085 5188 -15250 -15910 9783 20909 7672
799 7672 -11651 -24314 -11361 22408 26338 -7025 -21132 -1177 16266 11633 -7317 -18195 2665
812 2665 30584 17368 -17208 -21235 2853 20645 15101 -9482 -19183 9253 29695 2773 -26878
825 -26878 -14946 12435 22341 10478 -12896 -17239 5786 14228 -6300 -13034 6207 17630 7560
838 7560 -12266 -22336 -2960 22907 12422 -15005 -12909 6806 11121 -536 -15825 -15917 8785
851 8785 22788 -1823 -23262 -9023 9026 6213 -5734 -14717 -5992 17665 15448 -17393 -29016
864 -29016 -3425 19136 15800 -3403 -19259 -8591 13903 9092 -12177 -10173 6578 12956 7729
877 7729 -7081 -18147 -1966 19947 9661 -11071 -8206 4180 8723 6603 -6472 -15109 711
890 711 18102 10148 -5141 -10457 -7874 4029 12539 1209 -8166 1810 7454 -721 -4620 -3921 -1659
905 -1659 8603 10333 -5873 -11312 1804 6061 1014 191 -2612 -3416 5368 4750 -6231 -5315 2406
920 2406 -407 -2312 2476 1478 -601 -628 -6850 -7251 5563 7631 -3604 -5664 -1883 -3042 1120 4179
936 4179 -4457 -5972 4352 2288 -6255 -2440 1139 -1241 1138 955 -5438 -2108 4572 1052 -1250
951 -1250 -246 -5661 -3949 8529 7964 -3603 -5219 -2582 -1 8252 6894 -8277 -8207 7523 9519
966 9519 -377 -5551 -5857 2079 13077 4047 -13611 -5682 12605 10182 -4515 -12466 -6327 13501
980 13501 20544 -3141 -22368 -6174 15583 13230 -1839 -12568 -5806 14956 15243 -12447 -19521
993 -19521 5803 19855 6058 -11354 -14148 768 16816 5027 -19416 -13101 11835 14699 -2847
1006 -2847 -17080 -14769 4732 14873 -3674 -17853 -1670 11425 -1528 -15425 -13008 1068
1018 1068 15343 7704 -17913 -20108 5163 13835 -1932 -13031 -8248 6069 14414 -1519 -22322
1031 -22322 -10918 14154 13221 -4344 -11891 -5581 8293 11219 -8129 -19299 2044 21083 10340
1044 10340 -7503 -14234 -6598 11882 17154 -1307 -9835 5162 12231 1811 -5385 -3898 5181
1057 5181 16664 10760 -7336 -7226 6423 8372 2698 -295 -2060 4054 12470 2227 -12854 -6146
1071 -6146 6235 5570 2903 269 -5392 -3237 1603 -4742 -6564 4476 7861 236 -4847 -8004 -7141
1086 -7141 3890 7250 -2667 -3440 3908 1086 -4590 -3331 -3097 568 8042 3105 -7256 -3130 2922
1101 2922 -2433 -4115 -135 627 4215 5626 -6057 -12613 -1712 5517 2346 2363 1281 -3787 -1964
1116 -1964 -469 -4267 993 8913 2781 -2995 1680 361 -3988 713 3802 2447 5872 3753 -7020
1131 -7020 -4659 5917 3145 -3545 -1081 3483 6019 4192 -8873 -15409 1908 15568 5617 -6586
1145 -6586 -7047 -1918 5327 4582 -8161 -7358 11516 14512 -3848 -13158 -5973 6207 13649 4064 -11593
1160 -11593 -4426 12923 7110 -10088 -10827 756 11274 10031 -6347 -16326 -1263 10448 -1976
1173 -1976 -12100 -4042 6624 8236 -3283 -19788 -13353 12123 15228 -6250 -13884 -2501 6593
1186 6593 5543 -5580 -13160 1552 19108 7881 -12737 -11166 3683 11419 7607 -6213 -9390
1199 -9390 8812 17142 -2134 -15329 -4339 9787 13684 6041 -9518 -10104 7665 11099 -3889
1212 -3889 -7270 3686 10498 8798 -2156 -13459 -3737 15390 12424 -3616 -6072 825 5643 7021
1226 7021 -2062 -9460 1768 13197 4321 -6804 -5864 -2527 1903 4826 -2779 -7170 2566 4694
1240 4694 -6903 -10360 -3447 1042 3833 1353 -8491 -8531 1721 1297 -5674 -3349 1062 1944 2423 -3619
1256 -3619 -10929 -1390 9835 2476 -6446 -2458 1882 2988 2120 -6068 -8713 4546 10778 -332
1270 -332 -7152 -3928 -902 2673 2704 -4319 -3035 6182 2803 -6950 -4325 1966 2815 3904 1609 -4114
1286 -4114 -167 5750 -353 -2835 4722 4784 -216 1543 1759 -169 2964 2228 -3369 1260 8566 1955
1302 1955 -5074 -1799 1478 3283 3425 -2970 -4888 5385 6553 -5907 -7555 2195 5723 4540 -874
1317 -874 -9080 -3474 10655 6813 -8467 -7124 3620 7813 4072 -5239 -9467 2407 11830 42
1331 42 -10983 -3060 5936 5326 -1447 -10284 -7277 8467 9531 -7853 -12103 728 6405 1964 -5310
1346 -5310 -9599 -423 11457 2534 -12431 -6123 8261 7294 -1840 -7929 -4742 8646 12636 -3776
1360 -3776 -13394 58 11088 6776 -2307 -8043 -2766 11064 8359 -9342 -9961 5908 10374 1676
1374 1676 -5562 -8026 -179 10825 3849 -10316 -6246 6482 7185 505 -6266 -7497 2937 10450
1388 10450 454 -8393 -1315 4443 1888 -870 -4449 -3959 6050 7881 -5093 -9559 -252 3834
1402 3834 1728 -433 -5222 -3837 4843 2921 -7381 -6043 2002 2916 1354 -1423 -5938 -1967 4844
1417 4844 -269 -5908 -21 4316 1996 620 -3109 -5661 2517 8279 -46 -3783 2289 2523 -1015
1432 -1015 28 -1076 -505 6313 4882 -4264 -3689 2574 2231 1287 719 -2302 984 6595 420 -6378
1448 -6378 -310 4258 1582 2411 1696 -2214 -71 3148 -1824 -1820 5112 3670 -1746 -223 320 -1794
1464 -1794 884 1359 -937 2545 4014 -3925 -5266 1849 2711 263 -343 -2809 -1528 5018 1218 -8630
1480 -8630 -4386 5433 4091 -845 -3107 -5057 -563 5185 -1294 -7298 773 6872 1095 -4875 -5536
1495 -5536 -2193 5936 5599 -5613 -6843 3430 4783 -2087 -4098 -3158 1523 7660 1479 -9542 -3917
1510 -3917 7216 3729 -4135 -3925 -351 4937 5640 -4784 -9975 1275 9135 1966 -4408 -3788 -653
1525 -653 5079 3014 -6835 -5271 6713 6328 -3202 -4961 -2205 1485 5635 836 -7696 -2095 7227
1540 7227 2651 -4614 -3563 -792 2587 4997 -1248 -6656 244 4757 -349 -2790 -1499 -725 3037
1555 3037 3624 -4335 -6035 2629 4155 -617 -549 -1675 -2532 2895 4112 -3222 -3357 2982 2468 -11
1571 -11 835 -1308 -930 3855 2203 -3097 253 3766 658 716 268 -2194 1212 5616 231 -4117 1682
1588 1682 3141 -245 308 -463 -1925 2739 4351 -2911 -3668 3076 3155 -264 -503 -2155 -727 4948
1604 4948 2782 -4303 -1991 2480 955 692 827 -2622 -852 3565 -728 -4082 969 1483 -2263 -675
1620 -675 373 -2834 -1112 1390 -2786 -3030 1377 -749 -3205 -314 -369 -2754 -482 -364 -2433 931
1636 931 1848 -3840 -2732 2417 278 -1973 514 -245 -1091 2157 -117 -4703 376 4870 -119 -3337
1652 -3337 -985 -118 2034 2697 -3422 -4635 3501 5105 -1441 -3258 -1096 692 4360 2434 -4276
1667 -4276 -1416 6211 2676 -3327 -612 2310 3167 4384 -39 -4319 1946 6772 284 -3267 1043
1682 1043 2740 2653 1289 -3323 -3035 4595 3880 -3742 -3011 1131 1359 1405 -1143 -5804 -1344 5894 1558
1699 1558 -5364 -2307 702 602 1688 -653 -4284 338 4175 -1172 -3849 -325 840 641 1648
1714 1648 -2252 -3710 1904 2525 -2604 -1828 358 -992 481 1753 -3069 -3056 2478 1236 -2045 285
1730 285 402 -1400 1523 1829 -2527 -509 3667 1446 -368 1183 -336 261 4281 1787 -2278 795
1746 795 3110 670 1079 905 -2179 627 4552 -329 -3512 1496 2135 -912 -327 -973 -2050 2136
1762 2136 2883 -3090 -3175 1683 1000 -456 359 -1774 -1131 3597 1025 -4035 -394 2727 -162 -814 356
1779 356 -1739 61 3314 -1425 -4256 466 2051 -806 -597 -1416 -3344 67 1786 -2680 -2919 826
1795 826 -415 -1611 -1 -1954 -2764 1603 1562 -2415 -879 958 -1374 218 1978 -1507 -1657 2845
1811 2845 1766 -1416 355 -19 -1614 2067 2770 -1503 -809 1769 -404 -643 1362 -389 119 3396
1827 3396 376 -3079 601 2654 -104 608 1700 -602 1558 3829 -841 -2403 3139 3726 693
1842 693 850 330 -649 2644 2419 -2377 -552 3754 1495 -1292 -827 -1929 -954 3181 834 -3452 -803
1859 -803 933 -2064 -1753 197 -1478 -329 1674 -2047 -3785 305 331 -2046 124 496 -1662 -2
1875 -2 736 -2560 -1785 1677 71 -86 1752 -1581 -3549 464 1197 -1203 493 1278 -1682 -421 1166
1892 1166 -2791 -2644 2928 2467 -764 -652 -1690 -1717 2532 2277 -2358 -701 3247 1100 -640 -585 -2060
1909 -2060 633 4851 1521 -3194 160 2226 -830 -938 150 -185 2757 3064 -3620 -4878 1565 3184
1925 3184 -339 -751 -924 -480 2331 -11 -5224 -1604 4779 2965 -1296 -2062 -2394 667 4080 -312
1941 -312 -4144 1277 5245 434 -2339 -2116 -1579 2619 4768 -1114 -3834 856 1472 -1489 -1282 -370
1957 -370 129 3183 1297 -4495 -3371 1910 1230 -434 479 -1023 -653 2281 -476 -4498 -140 3941
1973 3941 1419 -24 -55 -2219 -262 2529 -251 -2143 1877 2698 -236 -745 -1424 -1869 2234 3983
1989 3983 -746 -1984 538 -387 -700 1168 -544 -1104 2686 1727 -3220 -1531 1254 -153 647 1399
2005 1399 -1233 -707 2022 -582 -3140 -178 1975 815 995 -943 -3475 -301 2240 -1215 -1875 1286
2021 1286 286 -1003 35 -2135 -2911 1614 2668 -1901 -1930 -4 -1403 -405 1336 -1169 -1719 1627
2037 1627 965 -1262 122 -405 -1773 1442 2433 -763 -762 833 -710 -79 1880 -290 -1217 2526 1998
2054 1998 -1876 -769 1015 148 1453 1626 -2005 -1171 3139 1714 -1778 -541 518 983 2492 -278
2070 -278 -3126 1185 3861 -262 -2434 -249 911 2174 2158 -2923 -3741 3133 4281 -1508 -2914 -311
2086 -311 1288 2736 637 -4260 -2186 4336 2585 -2541 -1955 66 1635 2178 -1903 -4772 1053 5646
2102 5646 252 -3951 -1721 425 2211 2148 -2725 -3246 3250 4111 -2631 -4223 -242 2308 3227 677
2118 677 -4289 -2236 4257 2506 -3040 -2561 919 2759 3298 -1379 -5540 -906 4749 1340 -2021 -792
2134 -792 -6 829 1279 -2691 -4038 1783 4631 -502 -3094 -1655 -1151 1134 1242 -2252 -1964 2429 1524
2151 1524 -2362 -2650 -1227 -94 2664 1476 -3142 -1506 1959 -636 -2597 -289 398 1109 2639 -1010
2167 -1010 -4626 -1127 2295 400 -256 494 -968 -349 1151 -1823 -2510 1846 2523 29 5 -774 -1904
2184 -1904 963 2056 -1104 -8 3012 935 -1130 103 -722 -602 3174 2784 -873 -218 1041 -985
2200 -985 -277 1734 567 915 2593 -13 -2224 41 507 238 2718 1756 -1986 -518 1804 -79
2216 -79 -694 911 163 1207 3781 147 -3745 -1009 2611 2019 1121 -180 -1946 999 2977 -1399
2232 -1399 -3429 893 3107 1547 -218 -3445 -3217 2576 3315 -2373 -3159 773 1156 -354 -1879 -3810
2248 -3810 -1165 4224 1659 -4463 -3134 1261 880 -780 -2656 -2816 1774 4321 -1944 -6076 -1275
2263 -1275 2441 1765 -383 -3555 -2596 3314 3118 -4021 -4654 1583 3684 1132 -1922 -4193 -1173 4725
2279 4725 2190 -4607 -2717 2880 3329 547 -2633 -3462 1807 5819 590 -4385 -504 3096 2277 188
2295 188 -2574 -2038 3694 4628 -2131 -4373 531 2740 1606 -418 -3158 -1770 3582 2836 -3364 -3306
2311 -3306 717 1879 1407 -886 -3411 -415 3733 815 -3293 -952 1340 1632 1669 -899 -2890 768
2327 768 3936 207 -2140 694 1208 642 1239 -957 -1904 2167 2492 -1260 -1138 1107 629 761 509
2344 509 -1959 -617 3277 1701 -1904 -605 394 33 1674 774 -2153 -406 2895 414 -1616 -19
2360 -19 -116 303 2169 386 -2345 -247 1503 -129 -271 12 -1331 297 2308 -556 -2669 -84 292
2377 292 21 1540 -349 -3021 -121 2196 -668 -1712 428 369 887 1123 -1847 -2879 1313 2427
2393 2427 -1132 -1688 -499 31 1566 455 -3752 -2314 2902 1976 -2238 -2497 -1713 -71 2214 -596
2409 -596 -4647 -1083 3557 249 -3224 -2889 -751 1938 2692 -2406 -4874 455 3593 4 -2549 -1533
2425 -1533 234 3492 1922 -3733 -3025 3186 3257 -979 -1954 -328 1733 3606 0 -4514 -564 5219
2441 5219 2854 -1977 -2128 -208 2930 3982 -1370 -3847 1852 5262 1051 -2366 -2025 659 4093
2456 4093 3234 -3079 -3474 3271 4264 -220 -2383 -1345 874 4051 1685 -4070 -2625 2948 2279 -994
2472 -994 -1566 -1317 987 2902 -724 -4197 -444 3191 920 -1206 -1897 -1579 1482 2841 -1350 -3138
2488 -3138 1316 2431 -216 -943 -989 -772 2029 2020 -2418 -2285 1540 1417 -582 -798 -1402 -511 2649 869
2506 869 -3183 -1539 1021 349 174 -153 -2163 -536 2180 -289 -2735 -109 862 -538 36 -585 -2157
2523 -2157 419 2160 -1160 -2197 186 374 66 841 -1404 -2039 1332 1945 -1212 -1030 10 -489 891
2540 891 1154 -1921 -1696 2053 1388 -1266 -1052 -471 -92 2325 1345 -2845 -1506 2324 1563 -58 -680
2557 -680 -1484 265 3355 928 -3113 -922 2090 1179 567 -788 -2431 906 3487 -613 -3238 195
2573 195 2095 850 78 -1808 -1744 2450 3076 -1884 -2736 985 1913 947 -463 -2056 -281 3901 1621
2590 1621 -3287 -1685 2113 2273 976 -1367 -2653 1102 4663 209 -4154 -852 2564 2122 658
2605 658 -2141 -2351 2188 3683 -1430 -3644 440 2593 1459 -600 -3461 -1782 3877 2618 -3147
2620 -3147 -3002 864 2103 1357 -1029 -3840 -363 4424 1008 -4008 -1963 1347 1734 804 -2341 -3451
2636 -3451 1114 3637 -669 -3877 -1311 1084 2063 934 -2864 -3493 2147 3054 -1523 -2691 -341 431
2652 431 1555 676 -2815 -1838 2804 1805 -1972 -1617 267 771 1633 -202 -2828 -368 2856 513 -1827
2669 -1827 -439 138 853 1759 -1030 -2594 1394 2844 -537 -1375 116 202 1545 1647 -2018 -2238 2255
2686 2255 2304 -578 -1139 -725 -356 1999 1581 -2012 -1491 2007 1328 -340 -495 -1169 -283 2959 969 -2658
2704 -2658 -952 1542 835 411 -252 -1634 343 2947 401 -2779 -587 1374 1103 1121 -594 -2226
2720 -2226 852 2871 -644 -2140 345 1151 1386 826 -2283 -2725 2310 2992 -1163 -1998 -331 805
2736 805 1660 666 -2938 -1547 3297 2321 -1898 -2026 -466 858 2319 -300 -3400 -344 3269 386
2752 386 -2738 -1559 -107 1766 2262 -1930 -3845 781 2923 -918 -2448 -739 493 2069 921
2767 921 -3687 -3119 2615 2973 -1341 -2517 -927 931 2610 -116 -4309 -988 4016 2274 -2026 -2613
2783 -2613 -1351 1478 3209 -882 -4035 205 3676 557 -2296 -2256 -566 2478 3021 -2186 -3951 968
2799 968 2842 -17 -1236 -1303 -85 2652 1757 -3059 -2430 2230 2208 34 -665 -1414 128 2825 491
2816 491 -3272 -767 2916 1699 -144 -856 -1856 803 3304 184 -2526 376 2324 720 19 -1138
2832 -1138 -1418 2066 3139 -1003 -2082 689 1221 727 767 -1285 -1132 2491 2327 -1836 -1900 726 785 1301
2850 1301 445 -2225 -1119 2298 828 -2322 -1148 529 743 1269 -906 -3405 -202 2950 94 -2486
2866 -2486 -1274 -96 1072 1619 -1768 -3670 764 3365 -112 -2110 -1436 -471 1798 1912 -2493 -3068
2882 -3068 1724 2969 -477 -1884 -1776 -217 2851 1603 -3199 -2233 2254 1806 -394 -1349 -1746 329
2898 329 3184 576 -3757 -1151 2374 1299 -853 -1384 -1492 1478 3105 -1202 -3656 62 2737 1078
2914 1078 -576 -2091 -1150 2532 2562 -2651 -3047 1353 2374 585 -1103 -2426 -645 3510 1764 -3283
2930 -3283 -1880 2351 2380 461 -1439 -2684 643 4268 768 -3204 -834 2108 1692 104 -1884 -1703
2946 -1703 2471 3893 -1235 -3362 127 2090 1614 255 -2500 -1549 3226 3104 -2633 -3018 577 2209
2962 2209 1693 -317 -2998 -1186 2985 1573 -2651 -1586 993 1808 2018 -1135 -3593 -63 3869 1093
2978 1093 -2103 -954 231 1103 1467 -1063 -2748 1279 3144 -211 -1833 -604 -15 1135 1295 -1746
2994 -1746 -1702 1896 1636 -1122 -1378 -471 210 2180 895 -2862 -1356 2024 982 -1041 -646 -535 361
3011 361 2078 -302 -3292 -806 2063 711 -1044 -1489 -1440 725 2211 -1153 -3392 29 2057 762
3027 762 -515 -2090 -2098 1611 2549 -1373 -2613 560 1860 476 -367 -2088 -1077 2916 2399 -2234 -2101
3044 -2101 896 1523 1197 -451 -2734 -272 3684 1160 -2896 -1607 1014 1752 1746 -1190 -2960 1082
3060 1082 3774 1 -2872 -834 1366 2259 1382 -2228 -2931 2054 3728 -484 -2366 -461 1169 2208
3076 2208 761 -2905 -1786 3038 2558 -1491 -1794 -101 1255 2242 -179 -3239 -221 3890 1255 -2354
3092 -2354 -1573 356 1867 2287 -1257 -3359 1308 3511 16 -2422 -1063 714 2584 1478 -2748
3107 -2748 -2878 2332 3096 -783 -2019 -1354 837 2835 777 -3661 -2189 2656 1939 -1261 -1447 -1328
3123 -1328 607 2331 -269 -3515 -762 2504 869 -1279 -1857 -1166 1232 2534 -1264 -3238 432
3138 432 1973 366 -917 -1455 -1172 1997 2010 -2118 -2395 1209 1570 38 -749 -1573 -601 2323 1004
3155 1004 -2563 -1732 1241 1149 297 -653 -2062 -292 2641 517 -2360 -471 915 681 676 -644 -2121
3172 -2121 426 2597 -404 -2196 -98 654 692 983 -1171 -2034 1479 2395 -783 -1682 -19 378 1430
3189 1430 777 -2050 -1590 2307 1915 -1389 -1204 74 814 2064 35 -2935 -865 3180 1951 -1352
3205 -1352 -1405 -606 1190 2635 -270 -3016 -85 3041 1111 -786 -1390 -693 2151 2868 -1569 -3016
3221 -3016 907 2675 347 -1149 -1409 -328 2511 1909 -2455 -2501 1552 2257 27 -1365 -1626 333
3237 333 3106 555 -3471 -1496 2261 1745 -525 -1905 -1836 1350 3249 -868 -3586 -179 2340 1016
3253 1016 -747 -1988 -1665 2004 2671 -1945 -3053 592 2000 417 -1059 -2209 -746 2763 1539
3268 1539 -2859 -2240 1177 1573 400 -1148 -2407 225 3007 368 -3145 -1044 1679 1291 264 -1556
3284 -1556 -2215 1201 2963 -531 -2971 -459 1582 1387 169 -2226 -1874 1852 2605 -1356 -2229 -154
3300 -154 1106 1362 449 -2314 -1432 2488 1744 -1694 -1557 155 931 1592 58 -2495 -482 2726 746
3317 746 -1536 -981 203 1027 1768 -501 -2307 448 2192 180 -1141 -437 114 1451 1592 -1473 -2130
3334 -2130 1356 2266 -312 -1004 -649 11 2078 1492 -1959 -1847 1643 1745 -275 -793 -1209 182 2302
3351 2302 747 -2308 -1079 1754 1099 -127 -819 -1475 737 2561 -150 -2567 -140 1722 701 -59
3367 -59 -1189 -1591 1294 2450 -991 -2482 289 1356 745 -239 -1900 -1168 2345 1788 -1844 -2254 536
3384 536 1350 1055 -594 -2762 -793 2828 1238 -2524 -1839 486 1373 1281 -1082 -3026 -138 3000 310
3401 310 -2854 -1247 517 1546 907 -2010 -2790 1033 2749 -609 -2256 -802 660 1589 548 -2532
3417 -2532 -1774 2313 2200 -1752 -2178 -291 1253 1943 -323 -2895 -583 3089 1092 -2101 -1546 79
3433 79 1706 2027 -1021 -2847 553 3202 449 -1704 -919 100 1914 1787 -1798 -2349 1397 2649
3449 2649 -51 -1613 -805 366 2240 1104 -2020 -1519 1937 1731 -568 -922 -738 567 2152 278
3465 278 -2391 -519 2387 951 -628 -878 -953 797 2317 -164 -2341 82 1934 724 -413 -1003
3481 -1003 -1067 1332 2220 -919 -2313 314 1282 556 -250 -1666 -1086 2074 1780 -1500 -1675 539 786
3498 786 632 53 -1872 -827 2093 962 -1939 -1247 574 823 822 -756 -2306 -57 2195 322 -1924
3515 -1924 -695 722 956 807 -1655 -2529 1057 2630 -406 -2014 -570 259 1086 620 -2011 -1901 1874
3532 1874 2076 -932 -1857 -980 529 1806 488 -2585 -1216 1982 1479 -975 -1553 -734 1116 2353
3548 2353 -251 -2938 -401 2180 1137 -1007 -963 -340 1507 1983 -1458 -2905 464 2777 647 -1150
3564 -1150 -1328 -418 2003 1571 -2004 -1900 1658 2319 160 -1302 -1612 349 2898 1016 -2478 -1386
3580 -1386 1886 1579 -344 -1380 -1376 1165 3159 36 -2875 -626 1861 1172 -233 -1303 -1000 1623
3596 1623 2147 -1458 -2443 511 2030 982 -339 -1604 -904 2323 1489 -1997 -1517 1450 1449 546 -879
3613 -879 -2014 -152 2543 1028 -2123 -898 1039 1174 387 -962 -1916 742 2592 125 -2095 -841
3629 -841 534 589 900 -1051 -1644 1017 1757 -667 -1984 -165 267 1250 724 -1381 -1696 994 1442 -980
3647 -980 -1094 -280 421 1229 239 -2003 -973 1555 948 -1034 -609 -545 220 1448 -455 -2431 -235 2022
3665 2022 728 -954 -871 -739 958 1994 -937 -2283 311 1861 464 -883 -1429 -838 1590 1929
3681 1929 -1303 -1841 789 1386 203 -654 -1279 -225 2188 1121 -1952 -1579 1186 1486 158 -615 -1287
3698 -1287 377 2583 256 -2305 -850 1583 1446 306 -1102 -1413 1227 2456 -551 -1995 88
3713 88 1776 1180 200 -1686 -1461 2008 2510 -1119 -2026 427 1352 1223 -88 -2124 -797 2573 1651
3730 1651 -1645 -1339 296 1112 1145 -708 -2022 414 2609 243 -1823 -1011 588 1290 939 -1186 -1964
3747 -1964 1041 2262 -488 -2087 -627 896 1559 437 -2167 -1499 1473 1800 -1077 -1600 -262 698
3763 698 1509 -28 -2703 -1073 2327 1304 -1103 -1318 -434 559 1160 -446 -2120 22 2089 423
3779 423 -1284 -1094 -486 800 1398 -881 -1836 636 1413 -462 -926 -826 -107 1349 1004 -1462 -1540 689
3797 689 686 -386 -448 -348 -86 1638 577 -1946 -906 1298 1065 -40 -379 -1003 -251 1648 291 -1535
3815 -1535 -343 1093 678 472 -587 -1503 485 2008 91 -1292 107 741 336 404 -908 -1329 1365
3832 1365 1941 -439 -1285 32 356 1000 506 -1145 -639 1793 1268 -1093 -1146 88 757 1319 -17 -2129
3850 -2129 -331 2145 713 -1175 -542 344 1165 1318 -795 -2258 173 2332 515 -1127 -633 -44
3866 -44 1231 1189 -1452 -1903 1218 1844 -262 -1387 -876 75 1553 871 -1961 -1251 1592 930 -918 -1184
3884 -1184 -613 517 1751 -70 -2323 -560 1556 605 -959 -1120 -510 1140 1786 -1316 -2675 72
3900 72 1778 413 -921 -1415 -657 1476 1314 -1846 -1983 887 1656 188 -1113 -1228 -328 1698 1031
3917 1031 -1764 -1026 1062 1086 -85 -842 -1262 531 2029 91 -2133 -413 1232 734 -41 -665 -971
3934 -971 953 1979 -984 -1932 511 1434 440 33 -1049 -697 1430 1533 -1040 -1445 584 923 573
3951 573 -134 -1320 -536 1728 1032 -1248 -649 519 616 703 -60 -1195 -129 2000 417 -1131 -253 293
3969 293 393 785 -154 -1162 467 1416 -145 -799 65 219 820 1049 -884 -1134 892 1071 -426 -467
3987 -467 -341 -130 1014 729 -1289 -1154 1219 1151 -403 -760 -783 59 1582 344 -1618 -789 1111 836
4005 836 -395 -839 -1171 448 1960 -222 -1929 -239 1093 460 -30 -938 -1200 869 1792 -813 -1945
4022 -1945 282 1234 41 -406 -1304 -715 1377 1041 -1628 -1589 671 1014 461 -642 -1822 -61 1995
4039 1995 569 -2149 -966 928 824 65 -934 -1702 518 2210 -189 -1945 -586 933 684 190
4055 190 -1144 -1347 1266 1833 -602 -1520 -201 812 795 148 -1448 -776 1954 943 -1292 -1057 415
4072 415 725 858 -319 -1795 -85 2027 520 -1406 -714 802 1018 859 -694 -1535 846 2069 200
4089 200 -1190 -209 565 1028 920 -1065 -1350 1303 1746 -370 -805 -278 399 1182 509 -1362 -1005 1442
4107 1442 892 -844 -486 -82 35 1113 167 -1514 -111 1323 171 -716 -485 -479 594 1050 -558 -1524
4125 -1524 377 1054 -353 -539 -245 -722 543 1013 -1007 -1556 420 774 -68 -282 -629 -596 1122 695
4143 695 -1293 -815 447 348 188 48 -1146 -619 1084 504 -1014 -403 454 282 533 -150 -1241 66
4161 66 1614 154 -1286 -138 220 401 582 -647 -1348 621 1400 -395 -1278 -208 200 782 555 -1208
4179 -1208 -1115 1092 1122 -966 -988 52 516 1166 520 -1901 -890 1672 1003 -587 -744 -278 470 1436
4197 1436 -127 -1971 106 1747 374 -823 -440 -227 623 1283 -630 -1402 857 1463 -239 -757 -383
4214 -383 -19 1219 819 -1342 -978 1380 1288 -494 -553 -514 440 1859 275 -1895 -684 1488 724 -258
4232 -258 -620 -754 531 1799 -344 -1891 79 1631 535 -339 -689 -724 788 1271 -814 -1442 667
4249 667 829 26 -185 -927 -654 1466 1030 -1323 -990 789 630 -173 -146 -1079 -140 1387 173 -1597
4267 -1597 -569 859 293 -53 -606 -1227 99 1520 -266 -1362 -95 442 300 212 -666 -1091 611
4284 611 1083 -712 -1017 301 281 359 341 -777 -989 838 783 -767 -478 75 8 377 70 -1114 -538 1085
4304 1085 446 -781 -217 -142 69 651 40 -989 104 1277 -224 -580 -173 -310 419 1155 -355 -1096
4322 -1096 325 1340 -67 -218 -144 -279 957 1086 -690 -1082 794 1086 182 -105 -552 -305 1260 870
4340 870 -1210 -621 914 805 221 -177 -801 25 1438 232 -1351 -270 934 600 105 -244 -886 514
4358 514 1490 -399 -1132 176 708 248 130 -970 -717 1176 1301 -994 -1311 439 620 420 13 -1186
4376 -1186 -518 1578 843 -1319 -727 348 489 523 -335 -1338 -150 1518 98 -1334 -496 476 357
4393 357 503 -767 -1400 433 1406 -747 -1183 86 464 620 287 -974 -895 1166 960 -937 -730 37
4411 37 317 514 59 -1172 -565 1321 530 -948 -637 -95 364 982 -73 -1330 2 1212 12 -783
4429 -783 -316 -186 249 950 -470 -1263 315 913 -276 -518 -118 -313 423 842 -977 -600 734 682 -239
4448 -239 -120 -184 -78 923 383 -1188 -340 1055 269 -263 201 -280 -138 1278 232 -990 -113 700
4466 700 179 341 -171 -798 461 1333 -31 -925 401 434 -16 160 -472 -848 783 1135 -482 -824 350
4485 350 154 364 363 -678 -528 1114 786 -814 -504 427 161 399 -56 -1025 -35 1289 232 -1101 -273
4504 -273 187 474 601 -436 -1784 154 1321 -52 -778 -287 -159 425 589 -723 -1280 660 1141 -392
4522 -392 -831 -378 -271 517 556 -1209 -721 943 694 -644 -678 -352 -159 1018 193 -1508 -264 978
4540 978 -87 -696 -224 -198 321 1109 -458 -1563 324 1141 -83 -416 -384 -278 608 733 -966 -842 646
4559 646 895 -190 -178 -717 -241 891 513 -1176 -406 957 680 -253 -175 -676 3 1217 163 -1221
4577 -1221 -2 663 -72 -50 -159 -235 528 1107 -242 -880 263 601 147 -28 -249 -647 718 904 -805
4596 -805 -837 519 497 210 154 -830 -377 1060 701 -833 -420 576 388 432 151 -989 -216 1341 317
4615 317 -597 -130 88 98 665 256 -1169 299 739 -3 -617 -20 -214 92 673 -161 -716 513 844
4634 844 -569 -376 26 -378 473 485 -684 -635 655 561 -409 -78 -225 -11 862 417 -1311 -458 942
4653 942 172 -300 -341 -549 59 725 -260 -1483 -249 737 29 -191 -655 -787 481 914 -451 -1070 377
4672 377 435 -191 19 -455 -618 636 726 -768 -788 487 419 102 -64 -673 -131 1036 261 -1113 -489 706
4692 706 361 246 -329 -879 332 1340 -236 -943 131 763 479 179 -368 -973 765 1267 -495 -690
4710 -690 321 225 396 269 -678 -394 1076 829 -575 -235 161 334 519 95 -770 -224 925 242 -701
4729 -701 -106 283 112 515 -209 -829 322 1035 -172 -696 137 113 367 333 -789 -851 666 667 -540 -503
4749 -503 -138 -116 521 437 -847 -688 643 456 -652 -245 -258 -238 450 256 -829 -384 700 122 -293 -117
4769 -117 -381 -19 652 -121 -907 156 691 -63 -23 -141 -596 252 631 -431 -873 260 497 -229 118
4788 118 -495 -713 364 582 -546 -848 213 311 41 81 -628 -500 728 597 -766 -310 171 -56 361
4807 361 81 -788 -234 888 178 -775 -181 220 108 506 -95 -849 146 946 -239 -675 44 74 383 435
4827 435 -611 -669 732 657 -700 -507 0 142 552 121 -901 -264 1067 717 -459 -340 160 332 684
4846 684 31 -965 -100 1071 149 -367 -114 -172 272 806 -277 -842 479 913 -42 -348 -179 -159 771 879
4866 879 -706 -559 633 435 -338 -269 -203 202 591 337 -979 -284 762 229 -141 -351 -274 257 668 -132
4886 -132 -1032 -116 401 64 -324 -150 -615 194 755 -554 -887 302 312 -225 -238 -260 -512 454 512 -720
4906 -720 -609 440 -63 -404 -37 -297 -280 594 169 -758 -170 258 -30 56 133 -554 -21 799 -108 -698 -95
4927 -95 274 -172 300 -172 -857 140 702 -272 -504 88 59 211 508 -460 -734 601 729 -147 -260 107
4947 107 -147 397 604 -526 -402 606 368 -56 -76 -185 -184 569 470 -425 -162 683 48 -264 114 -274 388
4968 388 883 -33 -746 81 459 63 -82 117 -99 723 558 -584 -824 439 414 12 84 -412 -119 569
4988 569 567 -816 -667 656 465 180 -170 -780 16 1013 456 -917 -248 495 136 -282 -411 -652 149 879
5008 879 -118 -789 -162 258 74 118 -476 -555 662 709 -576 -828 160 284 345 62 -596 -300 753 152
5028 152 -848 -443 378 321 338 -112 -693 -239 960 140 -627 -138 249 43 182 -196 -976 207 987 -129
5048 -129 -675 199 -32 61 243 -500 -560 424 353 -344 -342 38 14 234 416 -653 -353 581 218 -562 -137 243
5070 243 121 708 118 -786 -244 726 -78 -211 -110 -24 92 721 -142 -706 116 796 -33 -40 -137 -345 232
5091 232 580 -228 -475 530 600 134 -119 -322 -328 556 323 -421 -236 462 56 -106 25 -218 1 757 136
5112 136 -557 -244 314 -58 160 383 -401 -51 773 25 -545 21 184 208 336 -130 -772 269 566 -326
5132 -326 -477 35 -137 154 375 -365 -640 450 595 -479 -316 -25 103 305 341 -646 -379 680 193
5151 193 -373 -384 -40 135 400 -273 -822 -33 858 -232 -539 -251 -182 269 443 -510 -691 221 555 -434
5171 -434 -608 -47 -78 529 266 -855 -627 549 378 -268 -412 -253 -321 664 125 -878 -529 595 18
5190 18 -373 -40 -171 165 719 -42 -831 18 709 -16 -254 -60 -292 302 665 -420 -581 434 354 -164
5210 -164 36 -161 -303 678 350 -294 -295 401 100 -16 218 -455 -165 689 271 -533 -89 545 188 180 159 -259
5232 -259 132 934 29 -521 97 243 -32 199 -115 -636 432 640 -186 -443 278 69 70 233 -517 -467 412
5253 412 384 -505 -299 151 -174 116 218 -623 -333 547 200 -441 -109 -11 20 458 38 -989 -164 698 39
5274 39 -376 -19 -259 51 408 -265 -876 -151 401 -196 -177 -142 -369 156 309 -666 -550 438 361 -213 -139 -287
5296 -287 -283 410 204 -445 -363 414 106 -28 -60 -336 -16 676 49 -790 -3 349 49 -63 -275 -383 361
5317 361 699 -116 -605 23 610 281 226 -314 -460 637 530 -372 -403 396 374 -49 134 -512 -164 1010
5337 1010 369 -665 -221 369 256 297 -13 -562 145 1030 178 -627 159 376 179 318 -206 -504 300 922
5357 922 -310 -425 43 109 80 243 -380 -619 540 483 -301 -226 136 -119 170 206 -642 -299 395 15 -327
5378 -327 -150 -110 -374 230 55 -581 -36 448 -150 -300 -49 -71 69 535 -138 -401 204 480 -284 -90 118
5399 118 -285 167 690 -450 -588 467 262 -96 -141 -124 -335 422 375 -607 -297 319 221 -20 63 -332 -271
5420 -271 777 55 -509 -55 322 278 200 81 -667 298 625 -106 -598 126 251 -138 249 -333 -476 299
5440 299 409 -410 -582 302 182 152 125 -341 -564 681 465 -495 -212 114 271 98 208 -471 -162 651
5460 651 41 -576 27 298 -21 340 3 -648 8 680 22 -267 85 116 370 624 -334 -371 388 527 -380
5481 -380 -195 129 -48 515 467 -573 -267 712 393 -365 -329 -23 102 701 139 -662 -222 698 82 -320
5501 -320 -224 9 305 560 -123 -799 144 589 -145 -186 -11 -382 272 366 -569 -559 302 433 -245 -26 -277
5522 -277 -235 322 234 -645 -230 276 143 -123 2 -414 -20 520 -104 -851 -260 435 -195 -212 -322 -378 52
5543 52 338 -396 -657 -10 123 36 267 -139 -415 -30 476 -474 -377 130 -166 16 257 -126 -485 406 425
5564 425 -291 -190 199 -359 69 237 -581 -163 551 246 -218 66 -50 -5 438 67 -585 -62 629 -110
5584 -110 -213 162 -149 161 456 -57 -512 196 503 -404 143 166 -10 647 542 -467 -313 502 446 -156
5604 -156 -328 -104 -145 611 473 -473 -263 568 271 -136 -29 -226 78 571 33 -667 -9 503 -81 87
5624 87 -340 -281 235 573 -519 -605 222 330 -244 -49 -517 -361 485 366 -394 -552 193 34 -20 85 -484
5645 -484 -259 486 237 -839 -236 166 18 -71 -28 -632 -212 526 -264 -857 -230 254 -56 53 -64 -538
5665 -538 369 820 -450 -502 192 294 -112 117 -353 -386 691 485 -600 -314 370 244 236 205 -548 75 788
5686 788 42 -194 -138 207 -43 416 161 -773 243 678 90 -60 31 22 -56 397 -127 -393 433 435 -164 -175
5708 -175 60 -172 116 466 -450 -163 384 203 -5 126 96 -130 369 327 -644 -290 346 -12 -125 275 -143
5729 -143 -164 734 49 -572 193 203 -61 -81 -153 -627 56 694 25 -544 115 287 -50 245 -133 -382 230
5750 230 760 -386 -348 112 196 232 71 -511 -338 508 335 -340 -127 259 132 108 -121 -539 24 848 207
5771 207 -535 -143 49 390 524 -161 -640 49 663 -127 -519 -37 186 332 414 -336 -479 338 616 -59
5791 -59 -376 -21 -222 502 215 -502 -309 682 244 -341 -293 -131 -221 307 68 -653 -32 651 -24 -336 -145
5812 -145 -140 89 249 -155 -737 270 475 -149 -357 -34 -28 425 345 -636 -532 374 261 -354 -189 -94 28 544
5834 544 187 -812 19 510 205 -116 -86 -419 70 512 23 -531 132 361 -38 87 45 -138 180 659 -128
5855 -128 -418 203 339 -114 154 -15 -245 516 520 -279 -364 338 139 -58 117 -306 -79 574 161 -619 -208
5876 -208 175 68 174 150 -564 -124 463 -52 -436 41 41 -216 278 -97 -542 -41 470 -7 -139 187 -229
5897 -229 -139 337 -285 -376 215 392 -255 -219 58 -83 86 244 -649 -416 561 183 -357 -347 -78 -170 185 -8
5919 -8 -797 -352 298 52 -374 -284 -442 33 578 -52 -749 -65 392 -73 -44 -207 -334 339 550 -357 -535
5940 -535 360 298 -220 105 -222 -311 463 526 -691 -320 354 439 137 -37 -332 -133 759 211 -538 -102 298
5961 298 35 35 -52 -139 472 777 -192 -419 97 441 99 92 -200 -415 422 621 -304 -591 259 227 212 202 -379
5984 -379 -328 613 406 -482 -338 165 105 211 100 -634 -70 664 103 -531 24 213 83 210 -207 -449 319
6005 319 519 -352 -427 -6 -86 171 198 -513 -367 396 354 -254 -335 4 -10 275 20 -517 -334 314 194 -228
6027 -228 -60 -52 -77 427 -18 -514 -96 344 150 -255 57 -113 171 331 -246 -476 287 364 -48 -112 -59 -78
6049 -78 -47 391 -331 -354 275 106 -20 -135 -219 -114 390 549 -514 -117 345 227 -155 189 -297 -29 717
6070 717 245 -457 -210 445 105 65 23 -340 -64 613 -16 -379 -218 130 245 203 -347 -262 279 679 -359
6091 -359 -344 118 135 178 206 -488 -326 426 387 -297 -261 -21 26 328 -42 -501 -246 710 168 -391 -8 16 105
6114 105 441 120 -563 353 548 113 -226 -165 13 199 428 -300 -513 160 618 -255 -270 -201 -23 385 333
6135 333 -394 -309 542 521 -312 -160 -187 59 463 -68 -542 -236 627 15 -433 -12 -323 148 574 40 -639
6156 -639 6 363 -8 -150 -413 -218 87 268 -295 -391 297 309 -36 47 -412 -343 189 187 -354 -478 271 -18
6178 -18 -178 19 -423 -70 438 70 -549 -10 447 3 117 -37 -440 174 456 -5 -677 -61 232 2
6198 2 160 -59 -277 339 295 -243 -460 58 40 271 273 -153 -252 560 507 -41 -184 47 49 285 150 -503 -105
6221 -105 512 341 -224 162 91 -66 459 -45 -339 140 633 -89 -58 153 -4 221 502 -52 -157 310 396
6242 396 14 -36 -13 -139 351 417 -379 -425 332 329 -154 -78 -205 -138 667 294 -565 -333 271 255 -90 -170 -250 -17
6266 -17 565 9 -657 30 311 -45 -321 -150 -376 185 388 -345 -548 177 330 16 -90 -281 -231 470 286
6287 286 -470 -414 119 95 -100 -37 -438 -167 524 124 -492 -137 179 53 -40 -238 -238 61 582 -114 -479 -235
6309 -235 140 -51 200 -182 -507 285 488 -60 -42 147 197 130 251 -211 -246 287 289 -221 -175 124 -90 289
6331 289 204 -533 -225 609 341 -333 -112 123 153 541 -92 -481 75 706 74 -368 -27 -123 104 317 -62
6352 -62 -485 332 351 -130 -200 31 -167 184 438 -394 -367 368 52 -154 -7 -233 -15 360 83 -323 -196
6373 -196 334 48 5 -69 -292 -61 377 -101 -485 -78 331 42 -55 -250 -307 82 515 -188 -399 225 246 52
6395 52 -265 -143 -321 214 473 -265 -453 103 85 67 80 -400 -77 401 316 -324 -155 245 195 83 -34 -607
6417 -607 67 506 -7 -581 -205 189 -49 91 -127 -471 99 535 -176 -381 3 185 208 171 -473 -181 294
6438 294 384 -297 -256 66 -22 306 175 -274 -124 644 172 -275 -249 -210 318 304 61 -566 -10 539 148 -331
6460 -331 -174 -175 107 221 -160 -415 -69 141 -121 -140 88 -1 192 334 -356 -253 192 173 -126 -104 -208 150
6482 150 537 337 -366 -111 254 90 3 -116 -232 132 551 -104 -379 30 147 238 110 80 -248 -57 515
6503 515 -251 -355 -30 268 -42 37 -251 -353 148 304 -146 -294 169 176 12 129 -59 68 292 285 -406 -492
6525 -492 266 80 76 -81 -587 -132 617 -6 -214 -147 276 99 142 -305 -583 186 335 -150 -521 -200 -141 111
6547 111 166 -428 -374 308 304 -259 -288 -339 -1 221 126 -431 -139 476 14 -274 -177 -190 -62 296 -35 -414 35
6570 35 312 -81 -272 -167 -289 62 471 -243 -404 21 518 217 -166 -75 -77 287 415 -175 -622 258 291 20
6592 20 97 -86 -155 500 174 -423 -87 315 338 -241 134 -244 27 637 -96 -352 81 226 -42 -22 38 -385
6614 -385 303 642 -234 -444 122 381 142 128 -242 -69 243 403 -264 -450 9 188 320 -66 -388 -126
6634 -126 397 407 -481 -111 34 167 10 -27 -435 -226 302 101 -551 -209 116 -15 102 -103 -547 -88 382
6655 382 -134 -346 -32 -68 138 209 -272 -362 123 469 -117 -309 -325 161 258 222 -341 -401 317 198 -18 -58 -74
6678 -74 80 262 59 -337 -248 625 177 -103 -157 -91 -107 446 142 -239 127 260 123 -44 -140 -245 119 308
6700 308 -179 -277 192 471 180 -130 -36 6 428 519 -191 -58 329 277 233 124 -298 61 494 119 -331 -156
6722 -156 295 153 163 102 -310 114 406 64 -459 79 276 110 41 -152 -355 297 344 25 -275 -69 204
6743 204 123 38 -331 -172 465 480 -234 -208 70 40 43 141 -327 -110 426 88 -241 -41 261 163 364 -147 -541
6766 -541 -4 648 -79 -140 -9 -131 162 167 -296 -404 298 347 -156 -308 51 -30 170 221 -402 -346 376 255
6788 255 -42 -227 -23 85 5 53 -429 -9 287 45 -213 63 31 34 341 -198 -495 76 279 82 -105 -38
6810 -38 -66 76 468 -311 -318 227 98 -60 -56 -50 -246 430 297 -250 -24 106 39 -19 90 -182 -50 294 233 -270
6834 -270 -16 206 50 118 37 -434 17 269 36 -273 43 186 27 144 -95 -203 98 293 -137 -238 4
6855 4 124 32 126 -366 -185 13 274 -144 110 0 81 219 176 -327 -68 518 146 -115 53 -3 257 298 -248
6878 -248 -376 15 397 134 -319 -341 -132 97 257 -192 -536 99 318 60 -91 -28 -136 383 273 -425 -302
6899 -302 156 366 -140 -90 -169 -284 485 174 -511 -137 319 115 -126 -93 -39 -43 448 -168 -623 -107 545 -4
6921 -4 18 -139 -312 255 253 -427 -386 252 279 109 -166 -214 -124 495 176 -550 -332 155 421 116 -13 -231 199
6944 199 356 147 -572 -208 266 124 232 -55 -404 -44 733 90 -354 18 64 -35 60 -229 -305 269 496
6965 496 -244 -224 66 208 -90 121 -93 -170 129 255 -303 16 263 207 134 47 -186 -128 458 184 -92 13
6987 13 59 -38 168 17 -198 22 417 -8 -122 137 207 73 265 -5 -325 42 324 -117 -89 -107 -116 168 7
7010 7 -327 -350 200 172 -233 -55 -146 14 224 149 -175 -273 186 4 -5 80 -268 -15 324 84 -307 29 55 83
7034 83 38 85 -262 103 431 -63 -350 67 213 28 29 -280 -401 379 374 -343 -316 274 134 -4 82 -252 -241
7057 -241 423 211 -268 -136 116 148 208 39 -159 -38 421 -7 -328 64 138 177 164 59 -283 241 558 -136
7079 -136 -398 -15 168 -90 56 -209 -264 330 474 -77 -58 120 33 302 317 -280 -331 251 284 -325 9 231
7101 231 -8 358 107 -367 -57 316 190 -5 17 76 175 248 -217 -317 148 342 -82 -196 -43 147 255
7122 255 267 -212 -271 430 214 -121 7 52 113 337 156 -329 -185 409 -120 -49 -51 -120 -1 307 -49 -345 -77
7145 -77 377 -47 -105 -225 51 249 232 -134 -132 84 91 -172 52 -123 -260 212 135 -60 -470 112 36 -171 60
7168 60 -86 -73 219 263 -285 -151 65 -147 105 85 -361 -69 396 -148 -222 26 175 -12 152 40 -273 -47
7190 -47 307 -262 -215 -31 -65 82 162 -231 -314 162 101 -303 -166 -119 119 58 182 -295 -210 360 108 76 -52
7213 -52 116 93 208 -15 -220 42 318 5 -71 -193 -48 72 116 -41 -363 193 371 -95 -167 -95 -162 362
7235 362 417 -263 -249 352 311 69 -11 -75 -34 234 108 -459 -221 239 79 -44 -29 -104 48 359 78 -458 93
7258 93 9 13 92 54 -13 152 234 -90 -386 -10 70 249 -58 -284 -238 69 294 -269 -341 221 292 126 90 -316
7282 -316 -198 463 246 -199 51 111 11 8 -15 -495 -34 131 73 -237 -245 -102 -10 252 -144 -494 143 386 -252
7305 -252 -214 200 -58 42 199 -83 -195 220 51 -186 -150 -13 22 72 208 -335 -247 209 230 -100 -115 -191 70
7328 70 202 -127 -328 -98 285 137 -20 -104 101 52 276 54 -155 229 123 84 -116 191 -146 109 315
7349 315 -72 -435 266 165 -210 112 -125 -13 215 308 -212 80 346 36 -48 107 -214 -53 329 136 -558
7370 -558 -88 141 -49 259 -115 -87 -100 310 102 -56 186 246 -111 168 -131 -264 129 205 -171 -145 112 154
7392 154 -61 15 -146 -163 255 102 -214 -345 -161 26 179 122 -344 64 419 147 -318 181 276 10 235
7413 235 -175 -449 126 292 -123 -294 -69 -78 110 124 -249 -109 134 185 -158 -92 72 67 229 79 -379 -413 330
7436 330 200 -243 -85 -96 -67 143 -27 -367 88 334 33 -334 -77 -17 151 7 23 -188 128 323 13
7457 13 -127 6 -126 146 262 -95 -417 145 308 -86 -32 -16 -165 146 432 -279 18 309 219 -72 -128 43
7479 43 13 302 128 -130 124 284 -78 -39 125 -204 67 343 -169 -13 -56 33 -13 56 5 -294 212 233 -217
7502 -217 -127 300 80 63 88 6 -74 69 288 -276 -234 193 -20 226 48 -130 -36 244 147 -160 -121 104 -89
7525 -89 65 22 -247 19 231 -117 -203 59 -62 22 488 69 -349 52 151 -129 -92 60 -169 167 154 -136
7547 -136 -154 452 -26 -237 -37 -334 -157 299 107 -475 -297 199 63 -126 -69 -206 7 230 -121 -406 20
7568 20 107 60 -58 -24 -69 222 -42 35 -263 26 177 98 14 -40 -120 119 139 -282 -186 -12 37 -60 183 -395 -98
7593 -98 343 -8 -267 -81 182 23 -74 45 -213 61 415 -115 -163 -186 -41 -18 -46 -180 -147 248 331 94 -164
7616 -164 203 -184 75 153 -238 11 216 195 -368 -67 -13 47 -74 112 -264 -45 219 -50 -128 12 65 112
7638 112 48 7 -312 53 486 -116 -107 33 64 53 150 -220 -178 40 322 -106 -342 -8 -109 139 275 -150 -308
7661 -308 155 128 -158 28 -246 -69 178 28 -178 -161 95 -8 -48 -226 -70 -49 464 159 -415 82 111 -21
7683 -21 31 -4 -66 316 222 -78 -45 222 254 53 6 -186 -120 122 203 -268 -127 219 69 -107 -105 -83 117 14
7707 14 256 -243 -37 94 99 11 -18 -304 -61 25 -110 -84 39 231 -22 281 100 -234 189 34 -336 -181
7729 -181 69 1 58 74 111 -40 226 86 -62 -172 164 -49 157 61 -286 168 263 53 -6 -230 158 87 114
7752 114 -3 -303 203 273 78 -189 145 58 21 87 5 -190 121 297 -46 -107 133 87 84 17 -90 -122 57 165
7776 165 -52 121 40 65 258 7 -507 -116 184 12 -1 -145 -281 -27 243 -138 -431 -139 72 -91 -166
7797 -166 -81 -157 51 417 -217 -295 220 48 -87 71 15 -230 186 248 -114 51 152 146 -222 -43 -110 -111 365
7820 365 216 -246 -20 24 56 230 -75 -207 57 283 -224 -229 -11 74 2 1 -16 -66 164 385 -135 -58 63 127
7844 127 -4 230 -235 -167 212 467 -112 -134 -41 -94 218 51 -138 -28 98 108 -92 49 211 -85 73 194
7866 194 -299 45 185 51 -6 -45 -103 83 68 -16 -274 168 177 -49 -66 -95 -116 215 109 -151 -128 167 208 -64
7890 -64 -74 -179 -124 190 221 -226 -116 129 13 -52 -152 -43 88 176 33 -186 146 65 -20 -76 -77 -316 253 132
7914 132 -102 -337 67 175 53 -67 94 51 62 181 -295 -150 18 143 19 -36 -200 -90 110 163 -133
7935 -133 130 193 -177 65 -175 -304 -64 258 35 -313 -83 156 123 116 -23 -147 207 295 -162 -171 13 -139
7957 -139 261 52 -92 -202 205 213 -18 53 44 -17 -23 104 -110 -120 161 51 -70 41 -10 34 222 8 -155 -153
7981 -153 146 151 60 80 -36 132 180 -20 -186 119 158 131 -10 -56 13 55 237 -136 -14 201 120 -54 103 57
8005 57 -56 83 76 -160 -36 247 112 -260 69 -15 71 52 -5 -382 -125 156 -134 50 116 -303 -154 96 -83
8028 -83 -392 118 176 -52 -84 64 -191 41 163 -193 -248 -134 96 -41 116 -144 -280 144 173 -153 -217 61
8050 61 -116 -64 -127 -138 -218 277 71 -180 42 42 22 167 118 -180 -56 222 1 -127 -112 -26 -149 -27 -96 -263
8074 -263 223 216 3 -177 221 169 -56 173 -431 -148 122 37 33 142 62 128 500 -40 -161 109 265 -103 -294
8097 -294 -140 -50 152 143 -137 -260 -15 83 57 -44 -3 92 123 262 154 -114 159 92 55 -29 -143 -28 127 169
8121 169 -159 -1 227 166 23 249 -4 -147 220 148 -216 -72 28 -70 -51 -105 -88 106 373 121 -119 46
8143 46 113 54 69 -53 -110 174 128 -169 -267 -28 -134 21 214 -96 -176 82 67 -217 -188 19 140 29 166
8166 166 -314 -48 236 -47 2 -142 -48 125 63 19 -254 49 297 -132 -173 33 71 -63 74 87 -126 36
8188 36 -20 -52 -244
8191b44
$$ Imaginary data points
##PAGE= N=2
##DATA TABLE= (X++(I..I)), XYDATA
0 0 0 0 0 0 0 0 0 0 0 0 -8 8 -8 8 -8 16 -16 17 -24 24 -32 36 -40 48 -56 63 -72 80 -90 101 -117 129 -143
33 -143 162 -181 199 -221 246 -273 302 -336 372 -411 454 -504 559 -621 695 -779 878 -996 1139
52 1139 -1320 1548 -1857 2297 -2965 4101 -6402 12910 -68391 -270519 -113986 107016 120643
65 120643 -38335 -134585 -70816 57639 42167 -101050 -152577 -29540 85255 50356 -83246
76 -83246 -142770 -47412 62792 14747 -89348 -64543 34188 50934 -15412 -86803 -91590 -10715
88 -10715 59444 28434 -22021 -12943 -4675 -33575 -46298 -23046 23673 63120 26279 -63320 -72197
101 -72197 9530 52060 16833 -20705 -13370 27399 37483 -19926 -59170 -7261 52542 43540
113 43540 11154 -9065 -11483 21410 34476 -26471 -57620 22296 93341 50763 -34842 -69837
125 -69837 -32698 42769 71682 21714 -32621 -35481 -5749 25097 17449 -28123 -24092 45567 59222
138 59222 -10254 -52425 -28900 13740 46874 32928 -27188 -37372 26199 55764 11214 -38925
150 -38925 -43491 6459 66978 48736 -34966 -65881 -20190 24457 35226 13785 -26618 -35049
162 -35049 -4616 389 -23641 -27370 -15028 791 15735 -9385 -56163 -39091 17505 15013 -26603
175 -26603 -37201 -24534 -2695 21517 4190 -40405 -36790 8526 26978 9077 -18736 -27932
187 -27932 -3210 12588 -9321 -10002 27667 26662 -15951 -25589 -3807 14261 28450 12841 -29427
200 -29427 -21853 32960 39336 -5991 -23680 3196 34340 27680 -23125 -41280 23757 72785 17586
213 17586 -54990 -41720 32691 80355 35169 -64994 -77255 28093 89724 20422 -65896 -59019
225 -59019 22059 75992 19900 -79580 -64942 44081 65930 -24657 -80686 -32729 50066 63945
237 63945 -21025 -95043 -42651 59529 64400 -17682 -72013 -40898 35717 55361 -13351 -54200
249 -54200 2374 47616 8663 -35420 -25321 9847 33803 16229 -29793 -27459 26776 39096
261 39096 -7052 -36258 -17669 20250 35505 730 -35269 -8816 28308 7038 -22745 -5777
273 -5777 23343 27811 2069 -40285 -39319 25623 61604 16480 -33371 -29604 7704 40713 25541
286 25541 -28954 -35491 22565 47837 9314 -25027 -20051 10806 39240 20931 -25601 -21946 24863
299 24863 36820 4341 -28166 -28247 19696 66570 32753 -39092 -42121 9440 37758 30643 2983
312 2983 -22416 -4804 31838 21873 -12404 -11804 11403 24477 17941 -9931 -23443 7099 30171
325 30171 6476 -12718 -2096 6943 12844 14785 -9454 -28793 -6308 18850 16200 8332 -3947
338 -3947 -21324 -13876 7201 8006 4055 3995 -11107 -18090 108 5111 -5680 1007 6836 -6609
352 -6609 -10415 -3653 -5648 -2882 2765 -7123 -8161 8084 4698 -10032 -3361 1013 -9856 -7025
366 -7025 3119 3146 9608 9352 -20472 -32012 6545 38621 23027 -16099 -40592 -16671 36131
379 36131 36999 -19364 -36052 8316 37820 18902 -20381 -38500 1196 55058 30824 -40359
391 -40359 -42970 22890 58647 22993 -39660 -49708 20791 75047 25892 -49503 -43615 17186
403 17186 51615 29646 -21878 -34152 15993 43620 -642 -36651 -8033 32638 33118 -3484
415 -3484 -36890 -15617 36539 34087 -16608 -29341 2342 21983 14378 -7006 -20583 1055 26250
428 26250 6429 -20433 -3843 19537 9573 -14784 -26365 -6177 33149 29508 -24455 -44314
440 -44314 -5646 23537 12459 -12613 -29887 -16612 15603 9697 -29732 -32418 2518 18840
452 18840 1212 -30327 -42004 -7236 30689 7076 -40590 -37580 1766 26567 17327 -24735
464 -24735 -52751 -14731 37521 26250 -20156 -34467 -11606 19948 24295 -12145 -32192 4077
476 4077 35011 11423 -22990 -25379 1186 34783 32854 -13566 -33651 4432 36215 21619 -6095
489 -6095 -17846 -1755 30271 29771 -3634 -10942 10611 15193 7707 8084 6449 7800 13789 1006
503 1006 -14563 2810 23765 12818 -4803 -8776 -6534 2557 5590 -8670 -10000 7511 3056
516 3056 -17822 -15233 -1386 1362 529 -9951 -24906 -11878 14118 6764 -17907 -22095 -11853
529 -11853 4071 16696 982 -25008 -18972 1770 4513 859 -4256 -13480 -4976 11628 -1561
542 -1561 -23551 -14673 6966 13582 3047 -22415 -32733 1099 30404 6619 -29236 -27708 -1488
555 -1488 22760 18757 -20331 -40818 -2867 33634 16603 -16603 -22520 -1913 22128 14155 -20744
568 -20744 -21663 17978 31848 2957 -22391 -19764 8514 35678 18028 -25890 -24501 15291 26206
581 26206 4508 -11698 -9489 8979 22405 4711 -14825 554 19156 7808 -5767 -2513
593 -2513 8475 21003 16240 -10674 -15506 13086 24590 6893 -5836 -4841 2147 11998 4711 -13201
607 -13201 -4068 16505 5913 -17221 -18059 -5706 6884 11434 -10647 -33136 -14828 15803 11713
620 11713 -13541 -28806 -21879 7335 21853 -5431 -30645 -14010 10768 12574 -170 -16916
632 -16916 -15377 15696 26860 -8382 -30823 -4242 27838 27484 68 -27774 -16591 26592 36043
645 36043 -2552 -25569 -7398 19882 27318 4539 -22498 -8198 28102 22951 -9938 -14507 7082
658 7082 21991 16391 -8540 -19836 10512 36779 13040 -19057 -14390 8022 20794 14566 -8226
671 -8226 -15142 8266 17588 -4572 -15038 -8 11785 7609 -8813 -21790 -5170 19990 8130
684 8130 -20112 -16513 3923 11262 6041 -10374 -21664 -1296 21063 5863 -15626 -7046 9185
697 9185 10444 272 -13514 -9592 16291 22710 -4261 -21504 -10923 7353 19877 12121 -15710
710 -15710 -22649 2848 15564 1440 -10927 -13350 -5846 12124 11938 -14041 -21856 -871 10818
723 10818 4518 -5769 -13302 -4166 16227 9914 -17152 -17694 7459 21869 14574 -6834 -22130
736 -22130 -5229 21283 14804 -5466 -3058 6061 6760 4487 -3800 -8425 8555 20486 2250 -11934
750 -11934 -157 10253 7012 870 -5712 -1195 15271 14503 -4848 -9840 -112 5756 10033 8654
764 8654 -1839 -269 9439 -1251 -13733 -951 14350 11258 2348 -8941 -15687 -910 14322
777 14322 2386 -11177 -5016 2610 2778 -1046 -12332 -15009 4420 14570 253 -10543 -7934
790 -7934 -2362 5427 3866 -11698 -9895 14814 19981 -1521 -17907 -17043 1248 27110 22164 -13674
804 -13674 -24383 3002 19586 7049 -10792 -14069 6218 25846 7224 -26550 -21738 9523
816 9523 21250 6223 -15633 -18768 7729 23038 -5794 -31926 -10878 19600 18946 -2313 -20451
829 -20451 -17957 6589 14560 -6929 -14441 6012 13786 -2490 -18654 -17865 3264 22500 7426
842 7426 -21082 -15113 8418 9444 -6101 -15548 -8899 12136 19452 -6879 -25553 -5371 15431
855 15431 7158 -7475 -10114 582 16865 10385 -19223 -23103 8935 27393 12155 -10343 -17998
868 -17998 -2978 17623 10554 -11441 -8004 11387 12955 646 -10399 -13363 3461 21254 7061
881 7061 -15662 -9138 7614 8113 1035 -7878 -11194 4486 18028 4992 -13178 -12069 -2343 7206
895 7206 11093 -560 -10795 -567 7048 -2584 -6977 -1554 1618 6210 5747 -8515 -12671 2826
909 2826 8357 -904 -3474 -2500 -2848 2939 3523 -7135 -6357 3705 1684 -3009 1385 1066 -3029 -2367
925 -2367 -4116 -4045 6467 8002 -5341 -7776 329 998 1538 4388 -2859 -5448 4676 4253 -5028 -1812
941 -1812 4276 1143 861 1951 -2756 -769 6079 2390 -2558 -114 -1437 -688 8822 7226 -5969
956 -5969 -6739 1280 3556 6549 4405 -8220 -7542 8845 9768 -3975 -7716 -2784 4334 10078 1054
971 1054 -13841 -5023 13399 7777 -9401 -11661 -381 13886 13686 -9682 -23730 -2297 19495
984 19495 9699 -9194 -13744 -3454 12505 9281 -15788 -19321 8375 19103 -1827 -18186 -12739
997 -12739 3927 14184 291 -20484 -10858 14578 12386 -9801 -18345 -8090 9818 15027 -4036
1010 -4036 -17353 217 14252 -829 -13780 -4901 9938 15559 4429 -16826 -14077 13022 19152
1023 19152 -1753 -11599 -1171 11347 13197 -2586 -17826 -2665 21862 15075 -7172 -10638 1173
1036 1173 12048 10669 -6204 -12794 8812 24155 6914 -13256 -11235 2359 16266 15893 -4068
1049 -4068 -11935 4577 12175 -833 -7722 -1276 6986 11615 3218 -13249 -10867 5839 7186 -2519
1063 -2519 -5048 -3587 482 5204 -3520 -15854 -6570 8232 5166 -2901 -4697 -6806 -4321 1822
1077 1822 -1644 -4504 4800 7303 -3276 -7909 -5319 -1779 6390 8557 -2641 -5617 2956 1669
1091 1669 -5044 -2214 1216 2583 6501 1652 -8588 -4022 4784 234 -3073 2237 3378 2464 2375
1106 2375 -5853 -9861 2895 10699 4012 -118 128 -3305 -1597 2638 469 2638 8740 2055 -5507
1121 -5507 -710 1624 -2545 1082 5100 1425 1129 131 -7681 -5095 5912 3776 -4949 -1873 3730
1136 3730 2470 -1148 -8799 -10587 5805 16927 2366 -11780 -7331 1531 5973 3827 -5925 -5097
1150 -5097 10892 11233 -8749 -15022 -1370 10389 10662 -698 -13626 -6012 11095 4539 -13141
1163 -13141 -10228 5107 10482 3762 -10731 -15711 833 12304 -1016 -11477 -830 9361 5348
1176 5348 -5724 -14462 -4627 18192 16941 -8068 -13840 2983 11641 5578 -3939 -6969 6149 19230
1190 19230 4906 -15502 -8853 9683 13279 3843 -7491 -7555 8413 13904 -5682 -16435 -447
1203 -447 14237 10276 -1504 -12364 -8850 8581 11200 -5374 -8911 4242 8996 1928 -7502 -12204
1217 -12204 -1386 15111 8205 -10492 -10642 556 4155 1307 -5671 -10202 303 9780 -1159
1230 -1159 -13609 -8449 -524 1716 2049 -4042 -8234 340 3698 -7091 -9501 963 5413 3173
1244 3173 91 -6935 -5912 4848 5742 -2765 -897 4619 3607 1340 -2355 -6199 2508 12127 3392
1259 3392 -7203 -1712 4988 3061 443 -3745 -4506 6218 11152 -2006 -9221 -1591 3721 4278 3212
1274 3212 -2414 -2100 6375 3929 -6068 -2412 6434 5175 2457 940 -3090 -123 6044 798 -3360
1289 -3360 3764 4956 -2200 -1639 1135 -1274 592 1342 -3499 -791 5627 -601 -8257 -3024 2817
1304 2817 1991 417 -3840 -5036 3359 4803 -6811 -7472 4006 6722 927 -4001 -7503 -1712 9894
1319 9894 4947 -10255 -7371 6170 7157 -734 -7306 -7743 3127 10511 -2112 -12473 -2443 8016
1333 8016 3335 -4766 -8612 -3319 9378 8509 -9020 -11586 4424 9729 981 -5528 -5156 3215 11318
1348 11318 2503 -11553 -3410 11899 7590 -4252 -6709 -454 9303 9781 -5960 -13201 2523 13351
1362 13351 3913 -6662 -7480 -459 9465 5334 -10765 -9722 7855 9920 -2492 -8741 -5830 2288
1376 2288 9559 2112 -11357 -5477 8665 6675 -3566 -7255 -4623 4393 9581 -1122 -10294 -1594
1390 -1594 6136 1088 -3220 -3429 -1670 5085 5726 -6613 -9984 2234 6717 1053 -2272 -3710 -2004
1405 -2004 4898 3391 -6330 -4352 5577 5329 268 -1519 -3317 117 6448 2251 -4484 1346 6528
1420 6528 1702 -1182 -1698 -2441 4063 8504 -233 -5518 1680 3455 -1289 -621 638 498 4443 3070
1436 3070 -5496 -4567 3622 3241 -320 -386 -1667 341 4597 -667 -6878 -309 5801 1234 -1010 -187
1452 -187 -3161 -1833 2562 -1142 -2571 3535 2224 -4309 -2763 86 -1749 -384 1328 -1674 -344
1467 -344 1562 -4635 -6038 2131 3642 -1320 -2215 -1829 -1520 3104 471 -7734 -3122 7175 3790 -3753
1483 -3753 -4059 -2614 767 4909 -391 -6260 1263 7199 -180 -6343 -3495 1533 6376 4453 -5746
1498 -5746 -6525 4717 5727 -2981 -4161 46 3302 5601 161 -8894 -2888 8889 4065 -5510 -3433
1513 -3433 2214 4583 3097 -5020 -8013 3450 10326 533 -6641 -3119 1848 4536 2350 -5885 -3995
1528 -3995 7306 6005 -5288 -5714 535 3370 4210 -106 -6907 -1644 7844 2372 -6089 -2883 2095
1543 2095 3190 3306 -1710 -6145 845 5948 -153 -3639 -122 1414 2613 2442 -3635 -4753 4186
1558 4186 5875 -1147 -2017 100 -630 2912 4226 -2675 -3216 3799 3811 -1099 -140 -121 -613 2954 2077
1575 2077 -3180 -702 3564 362 -1912 -307 -1237 203 4144 -841 -5285 530 3504 -1681 -1920
1590 -1920 -537 -1561 1164 2775 -3478 -4607 2799 2958 -2272 -2328 -1392 -605 3138 1338 -5698 -3323
1606 -3323 2864 1081 -1579 -806 -2613 -1853 2346 -818 -4823 -50 2436 -2497 -1957 708 -1993 -1285
1622 -1285 1725 -1512 -2437 1988 1183 -2678 330 1466 -1285 398 1899 -509 1065 2524 -2029
1637 -2029 -1906 3956 2234 -1629 861 1632 -533 1832 884 -2894 1138 5689 183 -3787 264 2176
1653 2176 1992 2017 -2079 -3067 4263 5827 -1976 -3491 1135 2790 3588 1921 -3486 -1384 5912 2623
1669 2623 -4330 -1245 3404 2148 1340 -1518 -4674 869 5527 -1224 -5502 -74 2706 -324 -1796
1684 -1796 -4045 -3205 3371 2869 -5019 -4284 1884 1479 -554 -1954 -4245 -631 5715 1387 -6344 -2364
1700 -2364 3028 1433 547 -461 -3280 410 4561 -946 -4221 424 2497 573 359 -1612 -2995
1715 -2995 2187 3643 -2245 -2113 1865 761 272 1893 -1390 -2298 3198 2952 -1499 202 2180 -264
1731 -264 1320 2372 -1329 -606 4046 1613 -1730 343 295 -172 2811 849 -3664 -682 2845 -329
1747 -329 -1668 -330 -2420 -793 2786 -1168 -4892 240 2167 -2091 -1808 -582 -1659 955 2212
1762 2212 -3287 -3712 2235 1683 -1545 -673 -890 -914 2246 1084 -4018 -1161 3130 -275 -2168 -153
1778 -153 -1132 -465 2044 -1499 -4586 626 3061 -1251 -1741 -346 -1818 394 2976 -1313 -2322 2031
1794 2031 1743 -1055 818 446 -945 2693 3251 -1423 -678 2493 435 357 2667 -6 -1209 2933
1810 2933 2311 -1788 -265 1188 -597 1519 2805 -1273 -1671 2030 554 -1078 1427 1005 -167 2210
1826 2210 533 -3123 324 3722 165 -675 1170 -581 17 2255 -1164 -3073 2125 2989 -1653 -1932
1842 -1932 -724 -1512 384 986 -3459 -2273 2271 -73 -4050 -2490 -1625 -928 1920 -192 -4446 -1830
1858 -1830 1409 -1747 -2040 1018 -65 -719 1291 -1024 -3305 1113 2194 -952 271 1605 -1037
1873 -1037 -457 1256 -1323 -1084 2656 1685 -469 835 -718 -2781 1223 2815 -442 -168 1576 -939
1889 -939 -769 1586 -818 -1466 3634 3197 -1773 -1268 -161 -218 2485 2937 -1818 -1010 3265 1074 -2086
1906 -2086 -824 -170 935 3816 531 -4432 -1149 2603 -789 -1692 756 301 958 1026 -3978 -4856 2466
1923 2466 4212 -1018 -2136 -259 -92 1287 82 -3836 -575 5753 2680 -2943 -2724 -837 1369
1938 1369 3690 -101 -4055 1075 4636 -734 -4180 -1790 407 2621 3498 -1913 -4914 398 2324
1953 2324 -1392 -1386 758 874 1710 431 -4391 -2751 3401 2677 -862 -301 -44 -708 1569 172 -3347
1970 -3347 678 4695 1196 -1918 -942 -1161 -87 2947 437 -2295 1210 2244 -1536 -2251 -632 -711
1986 -711 2003 3367 -1510 -3408 243 513 -781 988 235 -1270 1338 1303 -3457 -1912 2248 727
2002 727 -422 822 -947 -1525 1403 -254 -3004 255 2611 108 -918 -1299 -2784 -80 2706 -532
2018 -532 -2271 1435 862 -1536 -422 -696 -1383 2087 3164 -1536 -2224 1066 347 86 1833 6 -1324
2035 -1324 2014 1801 -1188 48 876 -268 1482 2848 -712 -1594 1361 343 -258 1865 284 -1436
2051 -1436 1940 2029 -2205 -1290 1692 768 543 781 -1902 -1476 2910 1289 -2691 -954 1407 851 791
2068 791 -621 -3029 629 3735 -884 -3448 7 1856 1187 379 -2836 -3401 2825 3869 -2556 -3988
2084 -3988 599 1877 1176 -603 -3912 -1843 4162 2288 -3753 -2648 1219 1596 668 -1966 -3755 1624
2100 1624 5292 -496 -5163 -1195 2213 1998 685 -2389 -2855 2909 3849 -3336 -4369 1376 3285 2157
2116 2157 -764 -4008 -1819 4190 2407 -3978 -2475 2061 2608 1113 -2477 -4887 244 5416 1122
2131 1122 -3552 -1344 805 178 323 -2017 -2982 2135 4417 -1384 -4035 -1081 959 1530 1555 -1515
2147 -1515 -1765 2512 1913 -2904 -2324 738 1511 2384 1251 -2959 -1660 2603 603 -2090 543 2131
2163 2131 936 1633 -900 -3923 243 4162 1543 -786 350 -321 -234 1520 -296 -1341 2564 3259
2179 3259 -608 -1044 -232 -527 1336 2784 -329 -561 2589 649 -2176 -194 633 -8 2398 2053 -1971
2196 -1971 -1716 813 -447 -458 1723 531 -395 973 -699 -2832 -266 1558 374 1329 792 -2704
2212 -2704 -1764 1774 -103 -1244 532 447 -180 1337 -936 -4342 -1072 3285 1326 -1186 -1409 -2357
2228 -2357 -363 1808 -1828 -3828 753 2865 -475 -2646 -3672 -2366 2575 2861 -3073 -3956 1087
2243 1087 1513 -1487 -2344 -2419 -8 4049 1476 -4824 -2889 2520 1729 -875 -1743 -811 2456 3816 -1961
2260 -1961 -5259 523 4736 2221 -1178 -2406 -1225 3618 3337 -3272 -3784 3593 4987 268 -2448
2275 -2448 -2151 941 5259 2274 -4210 -2180 4278 3560 -831 -2600 -1746 2617 5307 -228 -4765 -210
2291 -210 3756 1155 -1205 -2201 -1254 3126 3473 -3194 -4972 1100 3376 350 -1646 -2570 -1003 3508
2307 3508 2406 -3825 -3133 2106 2742 423 -1112 -2247 139 3872 928 -3364 -658 2773 1618
2322 1618 476 -977 -2328 1122 3895 -105 -2928 416 1811 289 -115 -807 -1498 1710 2189 -1767
2338 -1767 -1859 1081 768 -306 -93 -1330 -699 2660 1016 -2856 -1112 1132 119 354 470 -2155 -904
2355 -904 2431 5 -2677 -147 597 -332 955 -244 -2788 -653 1686 -505 -1298 -239 -904 -392
2371 -392 1545 -805 -2927 112 1525 -138 478 -229 -2474 -136 2426 -707 -2137 783 1032 24
2387 24 326 -1590 -2242 1484 2466 -1468 -2567 -142 482 583 -95 -3163 -1688 3431 1789 -2815 -2407
2404 -2407 60 1061 2058 -212 -3390 -81 4594 950 -3433 -1239 1832 2968 2441 -1550 -3350
2419 -3350 1971 5019 510 -2147 80 2098 3256 1652 -2969 -2121 4219 3833 -1726 -2161 789 2075
2435 2075 2577 -334 -3895 6 5663 2102 -3512 -2472 1088 2884 2235 -1813 -3644 1447 4854
2450 4854 -423 -4063 -1607 1684 3147 1240 -4261 -3791 2881 3587 -2152 -3608 -984 1059 2477
2465 2477 3 -4802 -2682 3056 2308 -2456 -2608 -667 848 1704 -1166 -3987 -42 3676 263 -2529
2481 -2529 -1534 -134 1540 2124 -1735 -3299 1384 2944 -996 -1908 -774 -222 1731 1576 -2358 -2581
2497 -2581 1895 1491 -1535 -1254 -502 -147 2090 511 -3251 -1507 1936 841 -427 -380 -1016 -363 2097
2514 2097 86 -2565 95 1919 -171 -232 174 -1207 637 2419 -803 -2121 886 1574 -55 179
2530 179 -663 -1133 1692 2128 -1262 -1282 952 420 501 1017 -1109 -1382 2568 1981 -1606 -1028 611 676 1790
2549 1790 988 -2563 -1548 2879 1857 -1229 -1008 -563 404 2661 298 -3277 -767 2881 1099 -907
2565 -907 -1003 -1403 723 2892 -830 -3510 613 2874 377 -1226 -1330 -895 2234 2854 -2076 -2957 1768
2582 1768 2521 73 -932 -1412 226 3293 1107 -3811 -1764 2716 1803 -717 -1807 -1903 1114 3916
2598 3916 -426 -4834 -726 3325 1206 -1216 -2427 -1842 2062 3298 -1991 -4173 816 3069 340
2613 340 -1724 -2790 -1004 3506 1912 -4060 -3124 1885 2353 48 -2180 -2759 68 4057 583 -4500
2629 -4500 -1877 2538 1847 -425 -2093 -2368 1589 3801 -1156 -4109 -517 2868 1930 133 -2408 -2200
2645 -2200 2469 3460 -1806 -2576 707 1531 1114 429 -1958 -1171 3328 2013 -2340 -1502 1443 1274 1152
2662 1152 -50 -2154 103 3243 503 -2401 -297 1218 748 986 -564 -2096 1267 2902 -874
2677 -874 -1980 533 984 894 875 -1763 -1867 2212 2757 -1411 -1834 -100 406 1629 1017 -2169 -1682 2073
2695 2073 1307 -1166 -639 -233 162 2058 492 -3019 -1126 2307 922 -758 -397 -1164 164 2595
2711 2595 -251 -2987 -396 2211 795 -234 -1102 -1886 671 2570 -794 -2618 493 1387 385 -344
2727 -344 -2034 -1786 2559 3007 -2110 -3036 424 1155 692 -366 -2690 -1338 3363 1872 -2988 -2722 561
2744 561 1122 1185 -515 -2912 -209 3267 244 -3414 -1144 1275 1753 1069 -2148 -3569 1230 3424
2760 3424 -895 -2561 24 1314 1410 185 -2822 -1945 3456 3547 -1969 -2692 215 1785 1827 -500 -3469
2777 -3469 -243 4485 1714 -3070 -2328 436 2432 2636 -982 -3811 478 4191 206 -2930 -1096
2792 -1096 1136 2704 2101 -2175 -3736 1577 3804 -253 -1757 -530 784 2477 1215 -2954 -1844
2807 -1844 2975 2873 -746 -1195 -398 374 2295 212 -3193 -233 3606 1180 -1628 -1378 -900 1090
2823 1090 2873 -297 -3123 -46 2467 81 -1055 -1035 -978 1623 2324 -1672 -3010 563 1460 -259
2839 -259 -411 -1297 -1330 1690 1650 -2694 -2430 1085 1046 -271 -354 -2092 -1424 1801 814 -2823 -1292 1344
2857 1344 708 -33 -1073 -2530 27 3260 238 -2831 -592 1133 897 906 -1510 -2552 1506 3807
2873 3807 -475 -2671 -557 936 1614 1238 -1867 -2469 2446 3138 -1032 -2716 -720 1201 2470 1115
2889 1115 -3117 -1973 2874 2328 -1218 -1692 -574 962 2814 -67 -3653 -880 3244 1182 -1599
2904 -1599 -1222 -233 1634 2418 -1261 -3397 736 3459 760 -1677 -1411 -344 2370 2025 -2431 -2880
2920 -2880 2111 3209 -336 -1770 -1635 156 3206 1437 -3407 -1746 3397 2349 -806 -1804 -1639 1330
2936 1330 3778 89 -3959 -859 2620 1195 -809 -1653 -926 2189 2905 -2182 -3815 840 3016 576
2952 576 -1068 -2266 -1046 2835 2307 -2908 -3283 1407 2431 577 -1298 -2690 -725 3199 1460 -2965
2968 -2965 -1677 1913 1642 460 -1465 -2870 610 3899 514 -2951 -1033 884 1043 748 -1408 -2461
2984 -2461 1300 3117 -828 -2635 -315 798 686 649 -1595 -1810 1640 1545 -1748 -1810 386 549 1223
3001 1223 185 -2676 -1296 2418 1096 -1629 -1008 302 407 1254 -522 -3166 -461 3009 618 -1765
3017 -1765 -1111 -295 930 1980 -855 -2957 807 3042 427 -1168 -1376 -849 1939 2516 -1425 -2319
3033 -2319 1534 2356 -11 -815 -1129 -269 2887 1973 -2544 -2097 1970 2110 196 -762 -1725 359 3382
3050 3382 959 -3290 -1372 2291 1886 614 -1215 -2351 1157 3681 -294 -3469 -140 2393 1589
3065 1589 167 -2168 -2285 2199 3457 -1189 -3244 201 2032 1344 -39 -2488 -1070 3132 2411 -2291
3081 -2291 -2056 624 1383 1251 -917 -2854 -22 3822 700 -3491 -1694 1203 1709 837 -1738 -3135
3097 -3135 1192 3382 -734 -3310 -629 1527 1816 165 -2928 -2442 2600 3033 -1671 -3102 -579 1370
3113 1370 1860 -137 -3767 -1812 3510 1982 -2185 -2179 -306 1061 1786 -622 -3272 -311 3144 862
3129 862 -2123 -1188 91 1450 1829 -1357 -2998 970 2810 -19 -1531 -835 -224 1953 1736 -1958
3145 -1958 -2335 1654 2234 -521 -1144 -657 85 2153 1084 -2447 -1497 2200 1570 -285 -869 -988 196
3162 196 2551 693 -2408 -755 1731 949 -89 -446 -1281 835 2559 -536 -2244 363 1830 558
3178 558 58 -732 -1085 1680 2361 -1108 -1825 630 1324 949 99 -1540 -1021 2558 1871 -1676 -1506 646
3196 646 1122 1144 -217 -2591 -587 3313 1300 -2262 -1749 510 1257 1756 -557 -2959 66 3004 626
3213 626 -2188 -1242 2 1663 1887 -1740 -3109 1204 3012 -336 -2084 -1179 228 1884 1028 -3000
3229 -3000 -2661 2258 2306 -1019 -1996 -1038 666 2197 79 -3583 -1104 2751 1425 -1770 -2036 -764
3245 -764 1539 2593 -1144 -3868 23 2926 406 -2079 -1826 -610 1922 2264 -2122 -3371 1044 2514
3261 2514 -112 -1742 -1402 -13 2895 1237 -3019 -1953 2174 2075 -327 -1240 -1553 600 2888 150
3277 150 -3252 -681 2430 1592 -619 -1435 -1441 1297 2966 -885 -2995 358 2545 929 -787 -1762 -1218
3294 -1218 2276 2408 -1671 -2430 702 1661 804 -160 -1782 -773 2583 1739 -2151 -1513 938 1504 902
3311 902 -325 -1973 -151 2685 753 -2024 -867 835 1065 1196 -685 -2144 445 2423 -217 -1782
3327 -1782 -191 750 960 683 -1329 -2035 1518 2206 -864 -1632 -163 384 1212 558 -2132 -1655 1849
3344 1849 1914 -971 -1324 -511 359 1709 265 -2346 -861 2160 981 -1164 -1096 -794 737 2100 -394
3361 -394 -2971 -218 2134 403 -933 -991 -1010 1135 2021 -1221 -2737 490 1907 166 -1113 -1418 -552
3378 -552 2063 1496 -2392 -2417 1152 1918 189 -1101 -1954 -328 2756 1052 -2811 -1513 1622 1742 237
3395 237 -1419 -2322 684 3164 116 -2809 -982 1491 1500 128 -1780 -1958 1742 2943 -776 -2485
3411 -2485 -116 1412 1239 -53 -1912 -1094 2773 2282 -2092 -2035 838 1827 1249 -537 -2420 -37 3504
3428 3504 1142 -2365 -1389 1224 2053 1207 -1315 -2715 942 3056 30 -2443 -622 1171 1501 910
3444 910 -1997 -2194 1613 2752 -810 -2255 -322 917 1643 593 -2258 -1457 2223 1658 -1293 -1545
3460 -1545 -151 574 1519 1 -2392 -516 2494 783 -1354 -1015 -344 1024 1626 -851 -2885 -24
3476 -24 2337 70 -1348 -930 -404 943 1579 -1197 -2324 592 1823 -77 -888 -980 -612 1696 1112
3493 1112 -2150 -2003 940 1153 -59 -458 -1433 -652 1932 720 -2292 -1033 1389 904 -100 -864 -1571
3510 -1571 354 2236 132 -2260 -371 1138 870 120 -1441 -1519 1382 2528 -749 -2218 -29 1167
3526 1167 1152 369 -1624 -1420 2270 2420 -1466 -2082 309 1501 1767 258 -2125 -1135 2672 1502 -1758
3543 -1758 -1305 333 1340 1782 -837 -2782 14 2708 854 -1544 -727 326 1141 1382 -1224 -2369
3559 -2369 1175 2956 -89 -2127 -1088 272 1643 1076 -2203 -1636 2189 2200 -902 -1908 -882 839
3575 839 2560 507 -2844 -1309 2348 1490 -1217 -1541 -380 1293 2246 -536 -3213 -615 2398 796
3591 796 -861 -1237 -426 1368 1613 -1556 -2458 785 2289 154 -1215 -1532 -535 1862 1129 -2347 -1919
3608 -1919 1589 1707 -441 -1413 -1518 11 2500 612 -2562 -1469 1647 972 -344 -1253 -1394 796
3624 796 2229 -432 -2617 -605 1210 812 192 -1096 -1506 797 1974 -887 -2004 206 985 596
3640 596 364 -1498 -1423 1227 1503 -1212 -1251 402 737 637 -115 -1776 -760 1931 994 -1442 -936 163
3658 163 612 1173 -227 -2051 324 2592 673 -1499 -859 92 1073 1445 -784 -2053 737 2386 180
3675 180 -1335 -693 333 1849 1718 -1454 -1853 1358 1978 -38 -900 -483 437 2105 1011 -2176 -1254
3692 -1254 1685 1587 -304 -1098 -730 596 2198 142 -2455 -512 2204 1076 -541 -1300 -909 1187
3708 1187 2162 -1054 -2610 623 2188 452 -654 -1604 -929 2100 1941 -1538 -2261 708 1711 400
3724 400 -852 -1749 -431 2218 1245 -2165 -1784 766 1202 200 -1070 -1743 439 2525 -214 -2718
3740 -2718 -775 1409 1162 194 -1374 -1713 905 2048 -995 -2334 192 1312 894 -237 -1927 -1280
3756 -1280 1888 1507 -1471 -1793 240 1188 844 -589 -2278 -416 2509 1374 -1839 -1282 487 715
3772 715 1153 -309 -1915 363 2499 40 -1821 -815 606 1106 985 -819 -1596 841 1715 -546
3788 -546 -1062 -42 532 1141 686 -1427 -1244 1477 1382 -493 -403 -62 336 1023 360 -1649 -824 1818 1094
3807 1094 -406 -828 -595 129 1547 285 -1721 -155 1601 546 -234 -651 -1039 898 2241 -140
3823 -140 -1823 -8 962 340 -88 -646 -803 1215 1516 -1216 -1847 174 1051 649 160 -967 -692 1366
3841 1366 1014 -1516 -1325 1127 1086 426 -485 -1731 -176 2059 457 -1788 -872 653 752 440 -987
3858 -987 -2224 456 2480 -45 -1986 -818 383 833 374 -1429 -1553 1281 1915 -916 -1917 -407
3874 -407 547 1179 322 -1864 -1165 1909 1154 -1372 -1212 136 954 1271 -322 -2400 -513 2146 647
3891 647 -1485 -898 98 1056 1093 -1221 -2080 717 2433 180 -1318 -859 -58 1245 1019 -1504 -1730 1325
3909 1325 1987 -327 -1270 -692 335 1796 827 -1785 -1001 1795 1288 -438 -762 -386 646 1855 -179
3926 -179 -2130 -251 2030 626 -603 -496 -236 1161 1493 -801 -1929 800 1772 177 -650 -788 -424
3943 -424 1193 1365 -1106 -1414 919 1149 171 -400 -956 -200 1692 599 -1543 -660 1108 597 14 -284
3961 -284 -1050 -5 1743 112 -1598 -422 811 564 231 -372 -1194 73 1335 -468 -1194 91 644
3978 644 113 362 -669 -1270 1008 1261 -711 -994 148 157 566 357 -1402 -970 1294 1166 -975 -876 -128
3997 -128 91 1188 173 -1713 -695 1521 698 -1057 -743 -595 547 1488 -506 -2074 -147 1625
4013 1625 426 -735 -782 -492 816 1481 -1045 -1972 548 1698 -15 -715 -976 -131 1362 870 -1585
4030 -1585 -1371 1265 1125 -314 -630 -1104 137 1749 521 -2155 -891 1522 929 -263 -853 -1213 698
4047 698 2279 -430 -2148 28 1647 576 -226 -989 -632 1554 1790 -1004 -1612 543 1326 581 30
4064 30 -1024 -352 1952 1253 -1672 -1098 1062 1031 319 -365 -1215 21 1995 393 -1653 -458 1008
4081 1008 939 173 -886 -1321 757 1866 -349 -1772 -195 736 959 128 -1089 -1269 1405 1687 -1038
4098 -1038 -1269 137 610 582 192 -1526 -901 1282 828 -1351 -815 146 279 611 -95 -1399 -268 1294
4116 1294 10 -1066 -402 138 345 838 -697 -1589 331 1348 -393 -843 -168 -63 161 777 -849
4133 -849 -1364 568 900 -414 -446 -259 -281 817 726 -1296 -1027 1106 656 -87 -196 -669 -317 1482 499
4152 499 -1209 -621 994 427 78 89 -833 -28 1548 -53 -1462 -31 765 431 164 -484 -933 801
4170 801 1654 -445 -1414 311 743 705 437 -922 -987 1423 1508 -910 -1198 546 1066 634 145 -1592 -509
4189 -509 1785 1127 -1164 -867 214 515 565 -459 -1712 38 2178 67 -1281 -410 271 799 827 -665
4207 -665 -1449 759 1782 -650 -1342 -70 597 967 427 -1319 -1044 1187 1246 -756 -1031 133 548 931
4225 931 -1 -1757 -623 1642 738 -1180 -722 -181 639 1158 -522 -2003 194 1624 98 -1014 -585
4242 -585 -351 699 1107 -844 -1727 620 1276 -212 -687 -362 -257 1106 764 -1548 -1188 1075 761 -756
4260 -756 -592 -682 -37 1362 102 -1686 -435 1263 199 -485 -294 -568 218 1166 -309 -1854 30
4277 30 1165 333 -282 -509 -688 651 1218 -498 -1201 482 695 47 281 -515 -597 1166 1075 -854 -533
4296 -533 504 496 82 180 -687 -126 1312 682 -985 -245 573 91 413 23 -967 175 1459 107 -942
4315 -942 12 373 335 840 -226 -1253 480 1404 -233 -669 -142 269 502 627 -884 -1127 818 1068
4333 1068 -275 -317 -233 -97 1004 523 -1312 -860 1078 456 -542 -529 -511 51 1127 75 -1648 -384
4351 -384 1125 428 -507 -681 -441 504 1222 -453 -1581 192 1191 -39 -560 -680 -616 1254 1071 -1039
4369 -1039 -1385 835 905 -116 -598 -777 -528 1180 818 -1735 -919 750 739 -142 -343 -1054 -6 1431
4387 1431 -4 -1452 -215 824 463 168 -312 -1025 617 1222 -749 -1434 189 793 176 -161 -771
4404 -771 -629 1081 1150 -1038 -1089 730 722 415 -70 -1024 -316 1620 703 -1263 -478 467 578 613 -161 -1078
4424 -1078 132 1483 241 -886 -99 403 326 712 -380 -1032 450 1298 -228 -600 166 101 371 495
4442 495 -673 -716 868 818 -559 -423 36 42 491 409 -1302 -396 1397 516 -476 58 22 20 843 153 -1076
4463 -1076 -162 937 230 -489 -140 -424 227 1015 -202 -977 82 716 -286 77 -216 -815 557 975
4481 975 -709 -988 223 322 -235 22 -427 -552 711 930 -1219 -759 506 259 -158 -290 -863 -234 1069
4500 1069 125 -1126 -132 463 -25 217 -430 -1383 9 1530 -330 -1087 -124 367 319 367 -578 -996 757
4519 757 1321 -339 -989 -94 287 643 300 -870 -739 1154 946 -796 -482 270 297 908 154 -1163 -238
4538 -238 1304 352 -793 -3 432 449 746 -423 -1219 561 1250 -221 -567 -50 10 517 590 -866 -925
4557 -925 915 1078 -582 -582 -149 10 792 404 -968 -547 1059 600 -497 -179 -59 120 1004 178 -1065
4576 -1065 -24 970 135 -242 -60 -307 164 1059 -366 -1008 472 916 -115 -208 -37 -234 553 903 -609
4595 -609 -838 832 650 -67 -63 -487 -495 862 584 -848 -518 646 147 52 -265 -712 -232 1339 345 -1144
4615 -1144 -312 468 -172 119 116 -917 -248 943 -199 -952 -37 186 78 332 -80 -850 456 639 -507
4634 -507 -459 220 91 144 379 -733 -639 764 541 -582 -325 357 -4 447 171 -1138 -544 1215 395
4653 395 -744 -172 -270 237 769 -108 -1087 38 1181 112 -633 -239 -236 575 1065 -322 -1066 562 953
4672 953 -21 -74 -35 -115 713 724 -894 -643 812 647 -385 -325 -281 134 1075 387 -972 -298 1036 564
4692 564 -91 -256 -561 440 1100 -41 -1095 241 937 217 34 -359 -717 467 1089 -681 -1057 204
4710 204 727 4 -78 -509 -468 874 656 -821 -645 406 304 4 -76 -828 -399 950 240 -865 -356
4729 -356 590 5 151 -418 -859 264 846 -266 -1115 -47 278 -5 116 -467 -777 493 847 -395
4747 -395 -849 169 87 -86 212 -706 -559 1008 536 -657 -412 -16 -237 425 178 -619 -438 810 374
4766 374 -537 -108 72 -15 473 187 -962 108 816 -155 -615 -52 -187 71 657 -419 -780 485 554
4785 554 -273 -186 -93 -501 365 574 -631 -671 486 323 -101 -191 -428 -440 761 536 -1015 -356 512 245
4805 245 111 -5 -545 -28 880 175 -1006 8 496 -57 144 -195 -646 240 1039 -77 -699 128 635
4824 635 78 258 -333 -527 774 745 -769 -791 339 380 339 -31 -868 -320 1060 628 -843 -430 265 460
4844 460 505 -151 -969 -12 1136 234 -761 -265 109 241 378 -354 -864 498 837 -339 -768 -242 -26
4863 -26 321 320 -585 -675 671 535 -521 -530 45 -7 484 -109 -1013 -302 698 399 -735 -201 54 229 404
4884 404 -215 -1093 -74 1063 -15 -527 -292 -108 52 485 -354 -998 407 705 -219 -575 -49 -227 430
4903 430 559 -619 -524 702 365 -294 -57 -181 -114 749 185 -808 -280 726 150 -242 314 -151 -84 764
4923 764 52 -644 106 545 34 5 66 -537 260 973 32 -548 521 586 18 338 -165 -516 551 690
4943 690 -93 -374 179 79 347 588 -447 -290 930 473 -563 -71 153 57 332 306 -676 -145 665 -42
4963 -42 -509 -244 11 250 731 -104 -806 29 595 -257 -310 41 -112 161 505 -756 -774 496 724 -380
4983 -380 -459 -184 -187 315 393 -816 -653 636 483 -218 -366 -350 -46 747 191 -871 -318 734 195 -207
5003 -207 -157 -313 299 904 -265 -1036 120 539 14 -333 -419 -243 404 773 -776 -918 349 610 24
5022 24 -57 -460 -363 745 323 -825 -274 726 371 -75 -36 -496 -136 1054 203 -719 7 504 153 -22
5042 -22 -161 -530 52 664 -41 -869 -13 179 -112 108 -217 -433 721 671 -572 -567 213 230 174 219 -443 -516
5064 -516 822 157 -669 -274 413 378 353 -20 -631 14 802 -33 -523 296 125 94 398 -90 -807 128 722
5085 722 -47 -407 64 -103 71 420 -66 -640 179 314 -278 -140 20 -108 504 469 -648 -258 346 34
5105 34 -370 146 -198 -24 499 390 -702 -196 335 278 -211 201 -207 49 580 -79 -645 -161 232 154 -48
5126 -48 -303 -469 64 824 -237 -732 154 111 22 4 -481 -603 422 484 -483 -509 325 92 58 259 -585 -278
5148 -278 664 347 -721 -334 315 73 432 -180 -600 88 894 -6 -522 -5 5 223 359 -478 -827 325
5168 325 617 -490 -568 231 176 271 304 -739 -562 672 571 -278 -332 77 250 623 101 -648 -175 782 101
5189 101 -350 -47 -44 206 428 76 -481 172 945 -66 -137 89 -73 323 585 -256 -678 414 600 -267
5209 -267 -162 171 2 421 477 -411 -283 593 447 -288 126 -183 -280 691 113 -754 -204 509 255 -149 104
5230 104 -262 -191 640 -79 -593 58 291 -182 -31 -22 -422 208 622 -340 -458 283 63 -231 73 -384 -443
5251 -443 401 275 -549 -332 192 -50 118 -167 -480 -334 542 130 -884 -363 125 -6 336 109 -838 12
5271 12 758 134 -491 -114 350 206 454 -39 -683 140 578 -134 -271 236 80 274 463 -276 -435 569
5291 569 607 -278 75 2 28 498 239 -524 -287 537 438 -341 -7 -77 103 637 253 -582 102 744 291 -255
5313 -255 60 9 551 861 -36 -510 487 707 69 -78 -445 -196 532 690 -301 -310 618 498 -170 -80 -347
5334 -347 -251 607 479 -776 -459 512 335 -78 -19 -472 -153 673 19 -593 -12 410 -37 -161 -145 -448 312
5355 312 692 -427 -713 84 501 -66 86 -243 -460 378 495 -389 -207 106 45 16 113 -447 -247 576 83
5376 83 -390 95 280 65 25 137 -491 232 678 -206 -508 73 184 -95 289 -201 -531 156 685 -419
5396 -419 -512 102 133 350 330 -410 -503 287 270 -239 20 193 -354 245 298 -589 -429 675 392 -314 -21 -134
5418 -134 -139 502 302 -563 -165 460 107 -154 85 -521 35 665 -107 -493 137 218 -43 44 -25 -375 304 575
5440 575 -518 -744 310 415 62 -127 -85 -365 365 432 -752 -283 388 257 35 -63 -122 -24 511 390 -540
5461 -540 -205 451 57 270 -102 -634 -12 754 69 -352 -31 -158 44 208 -127 -621 305 465 -293 -468
5481 -468 10 328 171 96 -424 -386 601 373 -552 -475 81 -172 220 81 -729 -225 628 24 -737 -234 48
5502 48 170 253 -297 -825 18 685 -129 -605 -75 -175 2 142 -534 -673 474 381 -360 -534 -84 -252 164
5523 164 132 -682 -491 599 146 -437 -79 62 -186 407 38 -858 22 550 -92 -201 -14 -215 43 803
5543 803 -135 -584 248 364 -22 -34 109 -292 312 511 -133 -247 529 296 70 142 -94 -228 375 555 -110
5564 -110 -127 238 80 377 508 -344 -124 633 273 -293 -14 205 46 153 54 -272 100 582 -18 -398 -26
5585 -26 274 11 162 -76 -364 196 590 -241 -342 55 121 176 347 -655 -578 702 720 -176 -225 -75 -98 135
5607 135 3 -714 -364 551 153 -169 -215 -23 6 311 -64 -799 58 428 -1 -253 -143 -160 179 602 -437
5628 -437 -632 366 527 -146 -325 -193 -75 390 622 -538 -719 379 174 -214 -206 -300 -326 609 324 -715
5648 -715 -126 663 249 -221 -49 -424 173 771 29 -704 144 570 278 -1 49 -260 363 656 -389 -460
5668 -460 428 466 67 -156 -181 -247 773 336 -563 -282 517 292 26 -85 -492 112 600 400 -604 103
5688 103 309 195 110 104 -435 86 586 -101 -275 221 65 -9 525 -163 -358 164 429 -220 -412 -23 -45 -90
5710 -90 278 -35 -501 487 348 -314 -114 173 -56 261 217 -578 -185 416 126 -254 -18 -158 -283 439 -82
5731 -82 -576 -69 612 -105 -221 26 -222 -45 663 -126 -628 54 344 -133 -126 -124 -376 326 510 -319 -532 207
5753 207 -78 -16 81 -289 -163 621 403 -726 -241 158 150 83 2 -447 -30 421 80 -843 -114 377 -26 100
5775 100 -125 -597 68 411 -60 -562 -33 190 14 191 -435 -416 335 529 -228 -524 292 180 -90 189
5795 189 -608 -463 713 239 -582 -254 92 58 358 75 -502 -26 492 27 -582 -95 -12 65 310 -227 -668
5816 -668 348 415 -327 -289 -64 72 285 140 -312 -454 441 509 -401 -190 51 76 503 207 -665 -26 790
5837 790 222 -215 -95 -50 222 558 151 -755 169 471 -189 -54 -47 -112 260 398 -374 -594 286 306 -46 -236
5859 -236 -82 -139 169 279 -467 -300 304 321 -67 23 -396 -281 199 62 -585 -156 323 16 -252 4 -590
5880 -590 -224 336 -241 -686 -73 -7 -301 -18 -276 -495 -14 431 -362 -347 -67 0 -4 169 -224 -448 157 402
5902 402 -381 -294 -89 -147 -2 223 -277 -319 517 441 -444 -140 100 -74 444 278 -504 -70 488 306 -194
5923 -194 -7 4 159 518 -125 -691 226 671 179 -30 -34 222 352 576 -259 -621 374 870 -98 -2 134
5944 134 -374 440 340 -472 -247 474 261 -83 -177 -43 211 620 83 -490 -14 351 216 -264 -130 -345
5964 -345 201 483 -208 -597 70 603 74 -7 -118 -377 277 475 -718 -616 254 436 -158 160 -308 -229
5984 -229 327 219 -739 -175 336 146 -60 -12 -397 -128 550 -30 -721 67 256 -138 -102 -200 -330 291 644
6005 644 -279 -590 224 58 -77 43 -466 -457 470 462 -335 -578 125 23 129 257 -362 -206 554 334 -493
6026 -493 103 198 218 232 -117 -366 57 559 30 -419 -140 34 32 288 -51 -378 86 615 -82 -220 156 107
6048 107 95 297 -143 -160 459 449 -275 -200 -185 -168 235 446 -400 -415 517 369 -188 -2 126 -151 421 171
6070 171 -490 -22 351 100 54 218 -216 -169 511 55 -474 24 197 16 4 -204 -446 219 551 -72 -512
6091 -512 155 211 -74 5 -169 -119 379 457 -457 -452 272 285 64 -228 -316 -122 580 270 -628 -60 141 42 84
6114 84 -20 -579 263 631 -70 -446 -255 128 122 225 -170 -647 280 514 -222 -336 36 -87 115 260 -422
6135 -422 -249 571 289 -472 -192 -158 195 327 5 -503 -248 464 86 -337 -362 102 65 480 -245 -656 95
6156 95 646 -18 -474 -189 -79 190 306 -300 -320 308 281 -178 -220 -149 -180 506 220 -518 -419 328 324 -51 -265
6179 -265 -137 169 526 231 -477 -36 245 360 -127 -31 -66 122 420 -79 -504 128 425 155 67 -244 -294
6200 -294 310 467 -405 -309 219 280 -43 -35 -98 -110 495 333 -258 -183 304 18 112 63 -313 -67 408 112 -408
6223 -408 -19 475 -100 147 48 -524 55 368 76 -476 -128 205 130 20 -153 -456 170 381 -262 -115 38
6244 38 19 62 54 -430 -390 187 216 -227 -52 -92 53 245 18 -584 -375 385 137 -503 -280 -238 -73 419 -17
6267 -17 -582 -263 408 -117 -314 -82 -279 376 360 -338 -387 136 96 -55 140 -137 -126 386 449 -439 -666 333
6289 333 457 -154 -165 -221 31 382 234 -573 -154 174 53 -69 -99 -384 152 611 90 -496 83 577 247
6310 247 114 -37 -294 271 490 -291 -464 298 322 160 102 19 -210 479 486 -447 -323 124 105 179 118 -199 -31
6333 -31 395 311 -483 -136 322 217 249 125 -342 -119 444 -204 -430 -20 183 174 190 -380 -631 30 491 -129
6355 -129 -279 85 -66 110 88 -314 -433 257 175 -143 -117 18 90 -3 -41 -560 -214 481 207 -309 -145 68
6377 68 -193 202 54 -602 -254 481 -139 -282 -207 -161 132 458 -251 -483 128 383 -54 -190 -137 -146 306 375
6399 375 -395 -340 389 236 -122 -19 -66 -176 263 215 -462 -255 316 187 50 -105 -369 -79 350 82 -336
6420 -336 -56 409 19 -80 -207 -285 138 633 -105 -266 343 209 64 117 -379 -305 342 419 -299 -305 121 260
6442 260 225 65 -291 -16 483 260 -318 -323 114 90 282 -21 -574 84 607 44 -450 -16 154 125 167 99
6464 99 -167 150 557 -221 -236 -100 56 48 156 -268 -321 471 468 -244 -176 87 72 220 157 -359 -193 349 28
6487 28 -259 -130 -227 -20 358 -1 -513 85 260 40 -224 -67 -199 74 460 -159 -782 -82 290 1 -69
6508 -69 -110 -205 176 189 -322 -277 170 329 -120 20 -165 -321 187 61 -496 -201 293 -129 -220 -60 -310 173
6530 173 266 114 -513 -128 203 32 -57 -256 -451 31 568 -126 -325 -37 130 -32 275 -142 -334 159 466
6551 466 -203 -258 -34 165 86 133 -506 -141 536 217 -408 -188 297 122 248 5 -442 -66 712 200 -256
6572 -256 117 11 -4 491 -51 -443 212 610 -14 -132 -66 0 280 413 -134 -209 435 355 59 -159 82 184
6594 184 187 217 -324 -269 465 233 -55 -63 148 117 351 -68 -453 154 456 36 -137 -139 -156 157 410 -215 -430
6617 -430 15 369 93 -203 -245 -221 319 279 -288 -439 70 440 -30 -92 -237 -291 426 243 -398 -367 137 207
6639 207 6 22 -298 -93 399 106 -330 -261 205 9 33 25 -344 -61 449 -36 -321 41 78 84 135 186 -173
6662 -173 289 294 -181 -482 191 230 119 15 -140 -85 167 172 -150 -122 -24 183 -53 71 -239 -64 366 235 -73
6685 -73 -35 20 64 113 159 -465 152 530 -4 36 122 -83 162 479 -125 -159 247 350 -118 -88 25 222 370
6708 370 338 -310 -251 255 415 -59 -195 -141 -126 653 318 -532 13 336 223 -143 -92 -311 -30 411 49 -300
6730 -300 -6 159 197 -113 -120 -249 99 386 -120 -256 204 323 16 165 -333 -319 314 137 -427 -234 213
6751 213 159 -56 -5 -252 -48 524 92 -539 -137 189 242 202 -128 -252 107 392 -23 -474 -104 122 -3
6772 -3 31 -206 -381 416 379 -272 -297 56 241 203 142 -200 -316 337 135 -273 -279 130 55 241 -35 -310 193
6795 193 230 162 -282 -22 271 46 169 -215 -275 111 438 -308 -90 -39 -8 177 126 26 -334 255 359 -269
6817 -269 -147 -101 -60 101 200 -337 -291 292 173 -22 162 -13 9 274 230 -345 -22 235 287 -38 -28 -240 -74
6840 -74 385 -126 -235 178 473 -39 -72 -191 -55 -62 480 -155 -141 187 91 36 140 -10 -368 269 326 -240 -302
6863 -302 295 141 -77 60 -359 -50 377 68 -444 -13 250 188 220 -244 -426 1 408 -102 -412 -91 18
6884 18 12 193 -36 -453 10 400 154 -197 -111 144 102 259 -198 -347 245 355 -132 -138 -2 -47 291 -120 -351
6907 -351 -385 449 57 -273 -150 -161 271 133 191 -403 83 360 119 -203 -2 -20 335 316 -216 -201 273 402
6929 402 9 80 19 -99 225 114 -292 -79 195 191 -29 -153 -195 -80 94 220 -462 138 618 58 14 54
6951 54 -32 26 318 -44 -453 165 534 21 -331 -89 -56 171 266 -247 -415 257 434 -71 -123 -153 -101 190 147
6974 147 -236 -276 58 40 5 72 -191 -136 422 -86 -259 -60 273 -260 -55 163 -414 -65 393 34 -203 1
6996 1 8 263 0 45 -414 19 380 14 -294 108 96 280 299 -153 -302 237 459 -68 -77 -86 -126 154 229 -275
7020 -275 -169 271 151 8 -90 -234 -97 167 -26 -408 -41 310 143 -81 156 -156 36 160 19 -560
7040 -560 -65 391 -76 -101 -218 -87 219 543 -143 -378 37 388 104 -34 -236 -63 335 24 -247 -71
7060 -71 253 244 -90 -107 -113 223 469 79 -453 -118 6 11 -126 -125 -299 273 440 -91 -387 15 265 14 -45 -23
7084 -23 -16 389 292 -31 -370 142 90 127 140 -381 -256 408 95 -410 -52 50 -9 -54 -122 -474 92 446 -85
7107 -85 -358 -84 368 -131 25 -157 -396 48 357 -180 -277 40 55 111 205 -392 -290 207 370 -183 -272 -112
7129 -112 17 48 -10 -421 -72 249 254 -271 -32 110 -101 263 5 -436 -137 296 -34 -376 -188 -108 35 247
7151 247 -301 -438 93 187 -167 -118 98 -92 5 135 -186 -251 177 106 -98 -56 -118 34 308 179 -219 -115
7173 -115 306 193 64 -25 -244 -22 509 175 -226 -240 238 53 31 -12 -330 56 334 -158 -429 -8 71 32
7195 32 170 -150 -137 283 293 -235 -151 141 -62 227 167 -212 -196 245 129 -249 39 84 -10 210 -25 -203 -36
7218 -36 509 -70 -226 -60 5 -38 263 18 -381 173 430 72 -226 -84 55 261 343 -250 -249 230 242 -422
7240 -422 -142 33 127 288 135 -387 -418 266 -5 -5 34 -58 17 106 195 -482 -215 354 112 -216 61 -177 153
7263 153 309 -74 -509 157 377 -287 -151 -269 -121 188 249 -311 -160 192 296 -98 -147 7 -41 154 231
7284 231 -427 -55 311 61 -77 -198 50 -68 404 136 -390 44 174 63 83 -91 -209 85 256 43
7304 43 -372 123 174 209 25 -140 -77 152 298 -178 -100 153 61 89 14 -67 15 430 357 -261 -158 175 227 -9
7328 -9 -75 -276 -23 431 -13 -237 167 -28 -21 275 -128 -219 205 325 123 -156 78 -103 130 73 -166 -310
7350 -310 329 278 -222 -153 75 -28 279 161 -184 -219 336 -89 -291 -47 -167 47 166 121 -411 73 275
7371 275 -31 -9 -81 -324 28 181 48 -245 -23 223 78 -23 31 -273 88 410 -73 -297 38 172 -159
7392 -159 -118 88 -274 203 257 -295 -171 220 -102 90 -68 -228 22 375 75 -257 -27 93 152 68 -140
7413 -140 -171 126 117 -23 -417 116 180 64 28 -259 -317 258 377 -189 -293 -131 -49 104 241 -53 -287 232
7435 232 186 -212 -41 131 23 79 -86 -339 -51 390 1 -21 -139 102 -118 148 0 -259 367 299 -201
7456 -201 -47 124 39 -68 369 -209 -171 351 285 -291 -158 -95 82 52 240 -220 -275 126 95 -128 8 -149
7478 -149 -13 209 -62 -235 -12 347 16 -115 37 -231 -5 75 1 -129 44 80 -118 40 -150 -102 149
7499 149 290 -171 -346 125 130 -112 -9 -318 -135 348 226 -496 -359 92 181 63 8 -285 -87 115 -4
7520 -4 -186 -126 137 -72 -158 -131 -339 -2 198 26 -320 138 177 126 -4 66 -369 72 267 -199 -87 123 -40
7543 -40 -41 138 -208 -159 164 179 -371 -144 -33 153 165 229 -511 -38 143 19 -253 -17 76 100 245 25 -399
7566 -399 24 256 152 -88 51 193 237 224 -155 -130 76 284 -145 60 18 -52 -6 110 -269 -187 174 44
7588 44 -26 -118 -101 48 179 -109 -289 -20 202 74 -42 -48 89 -119 310 38 -420 88 260 -43 -144 12
7610 12 -168 98 244 -11 -375 279 224 111 -73 -257 -161 187 104 -138 -62 99 220 53 -31 -24 -92 252 -73
7633 -73 -327 -157 126 -9 143 -98 -77 -143 347 77 -252 -23 101 -13 113 -48 -235 129 160 -135 -404
7654 -404 110 9 143 -35 -275 -234 178 121 -105 102 93 -99 115 85 -175 -133 162 -13 18 80 -98 33 197
7677 197 47 -153 129 258 -4 -105 -185 264 140 49 -227 -219 67 138 86 -149 -114 -181 351 260 -113 -134 176
7700 176 175 92 -182 -134 46 244 81 -403 -186 205 53 -137 -12 -67 -234 144 -6 -265 86 307 140 -2
7722 -2 -97 -59 -46 216 -145 -70 202 106 96 -85 -105 -104 338 210 -155 -229 274 197 43 47 -175 -91 453 -28 -134
7747 -134 -9 93 -64 26 118 -191 -17 222 -78 -357 -123 41 164 14 -35 -179 134 323 -16 -219 -57
7768 -57 126 -79 121 43 -152 162 204 -33 25 -36 -89 115 136 -130 -39 160 57 -210 -115 -16 54 82 -232 -248
7792 -248 87 105 -78 -176 27 47 161 295 194 -181 155 131 -33 -53 -160 151 349 238 -222 9 223 345
7814 345 88 13 -159 89 303 162 -256 -121 303 -29 50 -73 -96 -105 318 3 -177 146 278 -18 12 17 -252
7837 -252 45 186 -128 -174 107 -40 128 139 -217 -401 139 298 -99 -88 -127 76 58 26 -164 -111 213 33
7859 33 -202 170 -84 -107 114 -65 -212 -119 290 -50 -253 -176 74 -83 -84 -35 -204 -61 151 106 -102 92 7
7882 7 38 53 -177 -383 310 156 20 -48 -215 17 6 -57 -248 -46 383 167 -131 20 41 -214 121 27 -193
7905 -193 16 105 152 -137 134 -116 97 145 17 -272 15 110 -160 141 -230 47 155 75 -95 -54 -41 25 -32
7928 -32 -196 -93 -75 46 46 -189 -47 114 30 80 -139 -40 -127 113 5 -314 143 200 14 199 35 -149 -50
7951 -50 179 26 -92 203 22 176 -66 -96 50 -36 141 155 -131 45 -43 74 -75 -118 -187 70 94 -131 78
7974 78 70 -195 0 -107 -180 -20 110 106 -196 -44 -169 -84 154 -52 -244 113 287 -20 -140 -33 94 -83
7996 -83 157 -57 -338 79 -2 -228 -145 -48 -159 158 178 -76 -251 159 -71 -194 112 -20 160 64 -2 -364
8018 -364 115 195 -9 -232 190 -105 24 166 -110 -342 165 148 -83 43 -118 -126 192 93 -66 -161 35 -84
8040 -84 48 107 -9 -165 214 196 -107 -287 149 32 -19 -6 113 49 411 164 -321 17 166 16 9 -121 -208
8063 -208 -89 130 -83 -87 138 133 -36 28 -138 -306 173 196 -16 -59 223 207 12 -136 -176 -129 208 178 -153 -179
8087 -179 195 116 74 -66 -303 66 224 124 -203 -231 57 107 54 37 -290 270 148 -25 95 75 -60 87
8109 87 184 -114 -108 117 177 -138 -7 93 -108 95 -3 -203 -66 153 83 -133 -12 -118 -184 76 -264 -456 -83
8132 -83 150 -100 -50 162 -146 32 257 -12 -119 80 -10 0 -40 204 -117 2 74 -174 -234 129 112 -12 85
8155 85 -341 -99 248 139 -27 -250 150 9 30 66 -181 40 308 32 -234 -166 -25 41 165 -147 -153 157
8177 157 160 -39 -83 -21 -128 47 258 -244 -272 141 133 -177 15 189
8191A89
##END NTUPLES=NMR FID
##END=
