##TITLE=1H_EC-3099(VI-2)
 CDCl3, 8 sc, 
 24.9.2019
##JCAMPDX= 6.0         $$ Bruker NMR JCAMP-DX V2.0
##DATA TYPE= NMR FID
##DATA CLASS= NTUPLES
##ORIGIN= UXNMR, Bruker Analytische Messtechnik GmbH
##OWNER= root
$$ XWIN-NMR		Version 3.5
$$ Wed Sep 25 14:02:00 2019 Russian Standard Time (UT+4h)  she@DPX200
##.OBSERVE FREQUENCY= 200.1315
##.OBSERVE NUCLEUS= ^1H
##.DELAY= (6, 6)
##.ACQUISITION MODE= SIMULTANEOUS
##.ACQUISITION SCHEME= undefined
##.AVERAGES= 8
##.DIGITISER RES= 18
##SPECTROMETER/DATA SYSTEM= spect
##.PULSE SEQUENCE= zg30
##.SOLVENT NAME= CDCl3
##.SHIFT REFERENCE= (INTERNAL, CDCl3, 0, 15.7039)
##AUDIT TRAIL= $$ (NUMBER, WHEN, WHO, WHERE, WHAT)
$$ ##TITLE= Audit trail, XWIN-NMR		Version 3.5
$$ ##JCAMPDX= 5.01
$$ ##ORIGIN= Bruker BioSpin GmbH
$$ ##OWNER= she
$$ F:/spectra/data/she/nmr/H-F/1/audita.txt
$$ ##AUDIT TRAIL=  $$ (NUMBER, WHEN, WHO, WHERE, WHAT)
(   1,<2019-09-25 14:00:57.09 +0400>,<she>,<DPX200>,
      <created by zg, POWCHK disabled, PULCHK disabled
       configuration hash MD5:
       00 E9 B6 7A A2 85 ED C7 34 08 36 98 17 FE 4E 26
       data hash MD5: 16K
       DB ED 7D 0C 88 1F FC 70 E9 D1 6C D3 80 32 F3 14>)
$$ ##END=
$$ 
$$ hash MD5
$$ 8A FF 4C 4F EB 6F DE 3F 0E 18 C7 12 AF 77 5F 1A
##$RELAX= 
##$RELAX= 
##$RELAX= 
##$RELAX= 
##$RELAX= 
##$RELAX= 
$$ Bruker specific parameters
$$ --------------------------
##$DU= <F:/spectra>
##$EXPNO= 1
##$NAME= <H-F>
##$PROCNO= 1
##$TYPE= <nmr>
##$USER= <she>
##$AMP= (0..31)
100 100 100 100 100 100 100 100 100 100 100 100 100 100 100 100 100 100 
100 100 100 100 100 100 100 100 100 100 100 100 100 100 
##$AQSEQ= 0
##$AQ_mod= 1
##$AUNM= <au_zg>
##$AUTOPOS= <>
##$BF1= 200.13
##$BF2= 200.13
##$BF3= 200.13
##$BF4= 200.13
##$BF5= 200.13
##$BF6= 200.13
##$BF7= 200.13
##$BF8= 200.13
##$BYTORDA= 1
##$CFDGTYP= 0
##$CFRGTYP= 5
##$CHEMSTR= <none>
##$CNST= (0..31)
1 1 145 1 1 1 1 1 1 1 1 1 1 1 1 1 1 1 1 1 1 1 1 1 1 1 1 1 1 1 1 1 
##$CPDPRG= <>
##$CPDPRG1= <>
##$CPDPRG2= <>
##$CPDPRG3= <>
##$CPDPRG4= <mlev>
##$CPDPRG5= <mlev>
##$CPDPRG6= <mlev>
##$CPDPRG7= <mlev>
##$CPDPRG8= <mlev>
##$CPDPRGB= <>
##$CPDPRGT= <>
##$D= (0..31)
0 1.2 0 0 0 0 0 0 0 0.06 0 0.03 0 0 0 0 0.0002 0 0 0 0 0 0 0 0 0 0 0 0 
0 0 0 
##$DATE= 1569405656
##$DBL= (0..7)
120 120 120 120 120 120 120 120 
##$DBP= (0..7)
150 150 150 150 150 150 150 150 
##$DBP07= 0
##$DBPNAM0= <>
##$DBPNAM1= <>
##$DBPNAM2= <>
##$DBPNAM3= <>
##$DBPNAM4= <>
##$DBPNAM5= <>
##$DBPNAM6= <>
##$DBPNAM7= <>
##$DBPOAL= (0..7)
0.5 0.5 0.5 0.5 0.5 0.5 0.5 0.5 
##$DBPOFFS= (0..7)
0 0 0 0 0 0 0 0 
##$DE= 6
##$DECBNUC= <off>
##$DECIM= 24
##$DECNUC= <off>
##$DECSTAT= 4
##$DIGMOD= 1
##$DIGTYP= 9
##$DL= (0..7)
0 120 120 120 120 120 120 120 
##$DP= (0..7)
150 150 150 150 150 150 150 150 
##$DP07= 0
##$DPNAME0= <>
##$DPNAME1= <>
##$DPNAME2= <>
##$DPNAME3= <>
##$DPNAME4= <>
##$DPNAME5= <>
##$DPNAME6= <>
##$DPNAME7= <>
##$DPOAL= (0..7)
0.5 0.5 0.5 0.5 0.5 0.5 0.5 0.5 
##$DPOFFS= (0..7)
0 0 0 0 0 0 0 0 
##$DQDMODE= 0
##$DR= 18
##$DS= 0
##$DSLIST= <SSSSSSSSSSSSSSS>
$$ [...]
##$SUBNAM2= <"">
##$SUBNAM3= <"">
##$SUBNAM4= <"">
##$SUBNAM5= <"">
##$SUBNAM6= <"">
##$SUBNAM7= <"">
##$SUBNAM8= <"">
##$SUBNAM9= <"">
##$SW= 24.0689530833862
##$SWIBOX= (0..15)
0 0 2 0 0 0 0 0 0 0 0 0 0 0 0 0 
##$SW_h= 4816.95568400771
##$TD= 16384
##$TD0= 1
##$TE= 0
##$TE2= 300
##$TE3= 300
##$TEG= 300
##$TL= (0..7)
0 120 120 120 120 120 120 120 
##$TP= (0..7)
150 150 150 150 150 150 150 150 
##$TP07= 0
##$TPNAME0= <>
##$TPNAME1= <>
##$TPNAME2= <>
##$TPNAME3= <>
##$TPNAME4= <>
##$TPNAME5= <>
##$TPNAME6= <>
##$TPNAME7= <>
##$TPOAL= (0..7)
0.5 0.5 0.5 0.5 0.5 0.5 0.5 0.5 
##$TPOFFS= (0..7)
0 0 0 0 0 0 0 0 
##$TUNHIN= 0
##$TUNHOUT= 0
##$TUNXOUT= 0
##$USERA1= <user>
##$USERA2= <user>
##$USERA3= <user>
##$USERA4= <user>
##$USERA5= <user>
##$V9= 5
##$VALIST= <valist>
##$VCLIST= <CCCCCCCCCCCCCCC>
##$VD= 0
##$VDLIST= <DDDDDDDDDDDDDDD>
##$VPLIST= <PPPPPPPPPPPPPPP>
##$VTLIST= <TTTTTTTTTTTTTTT>
##$WBST= 1024
##$WBSW= 4
##$XGAIN= (0..3)
0 0 0 0 
##$XL= 0
##$YL= 0
##$YMAX_a= 148938
##$YMIN_a= -269403
##$ZGOPTNS= <>
##$ZL1= 120
##$ZL2= 120
##$ZL3= 120
##$ZL4= 120
##$ABSF1= 10
##$ABSF2= 0
##$ABSG= 5
##$ABSL= 3
##$ALPHA= 0
##$AQORDER= 0
##$ASSFAC= 0
##$ASSFACI= 0
##$ASSFACX= 0
##$ASSWID= 0
##$AUNMP= <proc_1d>
##$AZFE= 0.1
##$AZFW= 0.1
##$BCFW= 1
##$BC_mod= 2
##$BYTORDP= 1
##$COROFFS= 0
##$CY= 11.3945322036743
##$DATMOD= 1
##$DC= 2
##$DFILT= <>
##$DTYPP= 0
##$F1P= 20.1720416913024
##$F2P= 0.152960286110954
##$FCOR= 0.5
##$FTSIZE= 0
##$FT_mod= 4
##$GAMMA= 1
##$GB= 0.15
##$INTBC= 1
##$INTSCL= 1
##$ISEN= 128
##$LB= 0.24
##$LEV0= 0
##$LPBIN= 0
##$MAXI= 10000
##$MC2= 0
##$MEAN= 0
##$ME_mod= 0
##$MI= 1.114404
##$NCOEF= 0
##$NC_proc= 0
##$NLEV= 6
##$NOISF1= 3.799351
##$NOISF2= 2.8
##$NSP= 1
##$NTH_PI= 0
##$NZP= 0
##$OFFSET= 15.70392
##$PC= 1
##$PHC0= -9573.179
##$PHC1= 16.60095
##$PH_mod= 1
##$PKNL= yes
##$PPARMOD= 0
##$PSCAL= 0
##$PSIGN= 0
##$REVERSE= no
##$SF= 200.130013532006
##$SI= 16384
##$SIGF1= 3
##$SIGF2= 2
##$SINO= 400
##$SIOLD= 16384
##$SREGLST= <1H.CDCl3>
##$SSB= 0
##$STSI= 0
##$STSR= 0
##$SW_p= 3612.71676300578
##$SYMM= 0
##$S_DEV= 0
##$TDeff= 0
##$TDoff= 0
##$TI= <>
##$TILT= no
##$TM1= 0
##$TM2= 0
##$TOPLEV= 0
##$USERP1= <user>
##$USERP2= <user>
##$USERP3= <user>
##$USERP4= <user>
##$USERP5= <user>
##$WDW= 1
##$XDIM= 8192
##$YMAX_p= 0
##$YMIN_p= 0
$$ End of Bruker specific parameters
$$ ---------------------------------
##NTUPLES= NMR FID
##VAR_NAME=  TIME,          FID/REAL,        FID/IMAG
##SYMBOL=    X,             R,               I
##VAR_TYPE=  INDEPENDENT,   DEPENDENT,       DEPENDENT
##VAR_FORM=  AFFN,          ASDF,            ASDF
##VAR_DIM=   8192,          8192,            8192
##UNITS=     SECONDS,       ARBITRARY UNITS, ARBITRARY UNITS
##FACTOR=    0.0002076,     1,               1
##FIRST=     0,             0,               0
##LAST=      1.7004516,     0,               0
##MIN=       0,             -269403,         0
##MAX=       1.7004516,     148938,          0
$$ Real data points
##PAGE= N=1
##DATA TABLE= (X++(R..R)), XYDATA
0 0 0 0 0 0 0 0 0 -8 8 -8 16 -16 24 -24 32 -40 48 -56 64 -74 89 -105 121 -138 161 -185 209 -238 270 -305
30 -305 344 -387 434 -484 540 -604 669 -745 827 -917 1015 -1124 1244 -1377 1527 -1695 1881
47 1881 -2096 2341 -2625 2960 -3361 3856 -4474 5279 -6378 7968 -10498 15152 -26577 111512
61 111512 80275 -182742 -76826 86709 148938 42453 -55860 -41174 93905 105302 -22661
72 -22661 -106115 -30922 72658 96065 -5903 -96638 -39685 66330 19265 -74127 -50128 30532
84 30532 51417 23359 -45978 -89718 -35003 30248 5790 -16381 11466 9931 -24758 -43144
96 -43144 -52414 -20210 50556 42307 -47561 -68367 -10715 14486 -4834 -27593 -29135 14979 42338
109 42338 -16790 -68928 -32723 8271 11169 14325 -6459 -31321 14997 48401 -27533 -81981
121 -81981 -13817 60028 55010 9153 -44087 -55993 2130 47796 29136 -1752 -19396 -17810
133 -17810 19081 24019 -36578 -44026 30945 54583 7891 -20056 -29696 -22236 27563 41112 -19274
146 -19274 -40412 11635 44111 31378 -4068 -46372 -27872 51419 68299 7137 -26864 -19747
158 -19747 -3480 32308 44627 4765 -11970 14323 16871 2808 -2020 -16317 -6134 38842
170 38842 27441 -32737 -28464 15796 14367 -1364 -9038 -32988 -24243 25205 23111 -28647 -40902
183 -40902 -14438 8364 16548 -7202 -32299 -9103 6962 -26511 -28263 15730 17427 -10665 -14644
196 -14644 -20704 -16751 23042 22194 -35481 -39408 14659 27411 -2948 -25516 -21748 19010 43191
209 43191 -13866 -64270 -9123 58233 36457 -24577 -55088 -22406 59533 75855 -22013 -80718
221 -80718 -10388 65414 50466 -16090 -60807 -20242 69707 61077 -43129 -63182 22198 61366
233 61366 14137 -44449 -54845 8854 74565 29269 -65390 -62285 15097 51807 21452 -39402
245 -39402 -59446 2697 47588 -6647 -52282 -10329 26540 9191 -12845 -27439 -22404 17174
257 17174 23902 -26633 -37947 8352 27434 5913 -18337 -30995 -6997 28290 5462 -33167
269 -33167 -8442 22543 -1324 -25025 -18753 -3376 25398 30532 -25383 -58708 -10747 33029
281 33029 20509 -8901 -32559 -25473 24808 37131 -20831 -45503 -3511 23121 15180 -2709
293 -2709 -27155 -20156 25062 27382 -19335 -28518 2346 22234 23994 -5720 -47371 -22994 41208
306 41208 38669 -7630 -19736 -12863 -3428 21037 17607 -15997 -11287 17697 11406 -3305 -435
319 -435 -1574 6437 20657 3075 -14454 7307 16302 -1889 2715 10704 -5528 1825 26080 13057
333 13057 -7912 -5218 -6490 -975 25883 23174 -8826 -11966 854 2309 12922 14802 -9843
346 -9843 -9183 15466 3959 -16772 168 13678 4938 1876 -5734 -14297 6018 16658 -11451
359 -11451 -18674 5179 6727 -1553 3087 -5740 -12061 5075 -830 -22620 128 28844 2788
372 2788 -31602 -26960 969 32298 27709 -28207 -49553 5131 38512 4636 -28041 -25258 3429
385 3429 38204 20200 -44728 -44201 28157 49091 -4308 -44171 -29277 22844 54179 5307 -60284
398 -60284 -31158 41577 46511 -758 -34296 -29856 15204 45070 4044 -35926 212 38488
410 38488 15491 -18277 -21598 2725 37091 29538 -22813 -30027 20127 35486 5019 -12082 -9012
423 -9012 7872 29714 12952 -24486 -9063 29478 18763 -10198 -8434 9470 27385 23116 -18722
436 -18722 -34768 15681 49072 17502 -14878 -14682 953 27609 28847 -12272 -23377 18653 33802
449 33802 2326 -18350 -12997 10265 34747 14246 -32138 -23647 21370 24742 -2863 -22733 -28515
462 -28515 -750 36923 15251 -37052 -34645 2065 13576 5152 -12801 -27756 -6448 18176
474 18176 -5857 -30961 -11676 8406 6765 405 -18462 -29778 -493 20543 -3823 -19764
486 -19764 -7162 -1215 1500 6233 -8291 -16710 -212 2664 -6406 7557 11916 -11216 -13832 3264
500 3264 4942 8102 14128 -3227 -12401 7965 14118 -151 3259 10953 8019 12206 7330 -9652
514 -9652 1644 24334 11560 -5341 4649 7468 3791 13172 8337 -9236 -2045 9672 1663 4459
528 4459 12002 -6099 -17193 -1157 9156 10871 9927 -12292 -25881 4646 24525 -1437 -18783
541 -18783 -4366 9617 14966 2893 -25170 -16727 26585 26149 -16358 -28288 -3759 20790 25775
554 25775 -7271 -43451 -14688 38868 25807 -24446 -34470 -8417 18234 19473 -15933 -36372
566 -36372 284 29487 467 -31277 -23376 1914 23667 14158 -29438 -37133 11096 30831 -2061
579 -2061 -23080 -14425 1646 15806 6613 -20299 -13769 15056 8919 -13097 -8411 4212 8901
592 8901 6554 -13529 -23745 7997 29421 801 -23044 -9156 8745 16163 7998 -16725 -15860
605 -15860 20016 24852 -9278 -18579 2287 18397 22456 3173 -26929 -12314 31584 29172 -10463
618 -10463 -24071 -8209 15348 27633 1924 -30979 -15021 17526 11556 -9547 -16329 -15074 1646
631 1646 14409 -11021 -32772 -6831 16432 -331 -19364 -21503 -13546 8103 14292 -13947 -27346
644 -27346 -4134 8606 819 -4051 -10379 -9635 7649 6930 -13593 -7859 11176 3586 -6766 -1968
658 -1968 -1098 2258 10375 -2051 -14409 2819 13401 -904 -2852 6149 2118 618 2518 -5356
672 -5356 1254 20955 10665 -13564 -7658 10428 15165 12547 -600 -12005 6097 22991 4197
685 4197 -9777 3543 8606 4620 7985 1963 -5326 7255 9532 -8641 -6342 10539 6466 -1940
699 -1940 119 -3006 -2785 4288 -2008 -4561 12153 10684 -13775 -14342 5016 12193 11891 1330 -17922
714 -17922 -7866 23147 15408 -16230 -16798 3799 15501 14968 -6331 -25359 -4027 22642 4641
727 4641 -21565 -13265 6246 13810 2894 -25242 -29693 7485 26004 -1746 -23203 -16342 -3309
740 -3309 8160 2855 -19528 -15242 15018 12694 -15825 -17321 -506 5557 5685 -2741 -13606 397
754 397 17564 1224 -17184 -7226 6446 11167 9701 -5469 -13068 4938 10280 -7869 -6528 11637
768 11637 11429 2959 -2908 -13254 -5857 19481 16681 -7746 -8018 6455 9479 7720 -1712 -12608
782 -12608 3123 24979 11419 -11406 -8109 3412 10078 11004 -4401 -13019 10495 23208 -2225
795 -2225 -20842 -10226 5489 18700 16415 -11895 -23303 3330 16585 -712 -8658 -1694 3968
808 3968 10511 4942 -14343 -10455 11559 11904 -230 -735 -480 1374 8284 120 -11786 3613 17816
823 17816 4062 -4813 2061 -544 -3408 3227 1143 1014 12926 6391 -15387 -12136 6058 10066
837 10066 6012 -1848 -11408 -1297 12865 -1243 -15893 -2330 10413 6524 667 -7820 -11632
850 -11632 4655 11516 -8107 -11979 7527 10157 -1815 -6498 -10429 -5906 10827 9253 -8647
863 -8647 -6065 4121 -3011 -7670 -1165 1316 4888 6199 -8514 -12929 4923 7719 -6879 -4839
877 -4839 4007 1944 2355 -302 -11056 -3459 14201 4230 -11881 -2520 9180 5288 -1568 -10383
891 -10383 -9729 11842 20285 -3971 -17676 -4172 6965 7956 3767 -9352 -7968 12512 11196 -12048
905 -12048 -12090 4417 8629 6184 -1145 -12977 -4531 14283 6220 -11543 -5483 5450 4420 3477
919 3477 -2509 -9817 617 9624 -1926 -6188 4646 4361 -2571 -2442 -5248 -2527 11911 7239 -12748
934 -12748 -8699 7191 4909 -400 -861 -6062 -1659 10176 1507 -12202 -3194 7592 4328 64
948 64 -5079 -8837 4565 13232 -3376 -13431 -983 6378 5043 3608 -7369 -11770 6449 13525
962 13525 -3424 -9006 1012 3284 3369 2189 -7447 -4407 12682 7593 -10611 -7631 4452 6884
976 6884 5822 -2431 -12113 -365 13808 2312 -9526 -1644 3780 2558 2553 -4714 -8115 6981 10408
991 10408 -7699 -9478 5087 5733 -45 -1966 -6138 -1865 10326 3878 -10611 -3406 6820 877
1005 877 -2616 -2400 -3628 4482 7430 -9740 -14423 4704 11077 -1548 -7214 -7890 -5237 6331 5160
1020 5160 -11926 -10423 5671 3357 -5890 -5412 -4970 -1861 5652 -1382 -11318 -549 7281 -3395
1034 -3395 -7137 -512 339 3324 5043 -5198 -6473 6615 4134 -7794 -610 7987 3929 989
1048 989 -2808 -8578 2787 15737 3091 -9556 -869 6672 4521 2843 -3208 -4507 9834 13155
1062 13155 -3769 -6914 4899 6010 3290 3163 -2226 675 13111 5953 -10934 -4850 8649 7609
1076 7609 4074 362 -7025 -1069 8038 -710 -8004 2548 6554 -267 -2204 -6063 -8568 2876
1090 2876 8284 -4524 -7539 1640 -37 -3660 -1277 -5344 -4923 6931 5507 -7149 -4606 1220
1104 1220 -3217 -1692 2690 -1471 621 6633 -3833 -12530 -1945 5471 2557 2259 -3059 -8810 340
1119 340 5665 -6497 -8496 3890 4892 481 -1107 -8229 -8389 6531 8510 -5467 -4975 4494 3316
1134 3316 556 -2253 -8602 -392 14875 8336 -6277 -4147 691 157 4563 3406 -3017 4108 9336
1149 9336 -3958 -9267 1728 4995 2556 4111 -405 -3699 3893 2303 -8526 -1831 9951 5201
1163 5201 -1223 -803 -3007 -185 5805 -1399 -5497 7785 11511 -2053 -7629 -4136 -650 7572 8438
1178 8438 -5240 -6279 6479 2156 -9667 -4678 2738 3853 5018 -2859 -12536 -3259 7073 -2472
1192 -2472 -8417 307 3923 2500 264 -9527 -10011 6831 10272 -3465 -4235 4111 2041 -743 -1511
1207 -1511 -5439 2264 15128 5314 -9886 -4003 5067 3256 2122 -289 -2381 7037 9592 -6997
1221 -6997 -12007 3250 9779 3475 -1285 -5698 -2581 9683 4884 -12444 -7485 9986 10551 1865
1235 1865 -4828 -10342 -1824 12326 5179 -8739 -2198 6733 2390 -1953 -5158 -6887 3285 10873
1249 10873 -1378 -9671 -2153 154 -1917 666 -3149 -6472 3043 4298 -8155 -8000 801 -378
1263 -378 -1381 1293 -3511 -4246 4051 -260 -9316 -1947 5887 2686 704 -1951 -7789 -687 8662
1278 8662 -2 -6499 1547 3805 -44 280 -3468 -5865 4747 8038 -4388 -6133 2576 1652 -936
1293 -936 764 -3757 -2800 8098 5313 -6633 -3872 3761 2273 2943 2279 -3156 1388 8853 720
1308 720 -5649 2759 5946 2398 3826 502 -4775 3588 8510 -1268 -3393 4029 1936 -739 2802
1323 2802 -98 -2991 2906 1768 -3966 1637 4650 -3511 -3520 2605 709 125 2360 -3706 -3710 6715
1339 6715 3833 -7015 -3192 4184 1893 651 -1565 -6944 209 9720 -532 -10343 -2277 3995
1353 3995 1554 -64 -4692 -6635 3204 5905 -6661 -7455 3101 3303 -1363 -2537 -5908 -1873 8170
1368 8170 1921 -10575 -2916 7727 2956 -2601 -3429 -3893 3669 9452 -2255 -9885 1647 7870
1382 7870 800 -3572 -4245 -1522 7944 6538 -8882 -8896 5091 6420 -623 -2570 -5006 -1183 7950
1397 7950 2307 -10381 -3730 7719 3554 -2373 -3171 -4286 1933 8419 -1803 -9670 889 8049
1411 8049 1839 -2398 -4780 -4170 5532 8588 -4513 -7631 2631 4088 13 -615 -4021 -3129 7450
1426 7450 5768 -7808 -6018 3915 3453 1282 411 -5047 -1675 7743 2688 -6350 -1326 4097 2310
1441 2310 2851 -248 -5197 2139 8032 -1546 -5372 3552 4699 791 858 -3240 -3831 6821 7519 -5005
1457 -5005 -5213 3535 2943 944 335 -4186 -808 7950 2292 -7205 -2092 4133 1985 1357 -847 -5260
1473 -5260 1362 7168 -1957 -6080 1701 2524 -636 1882 -1132 -5121 1583 3626 -3586 -2245 3842
1488 3842 -838 -3357 610 -1225 -2103 2799 -326 -4269 825 1619 -4530 -1301 2858 -1802 -1790 1617
1504 1617 -2865 -2734 3651 -682 -6036 1195 4560 -2118 -2388 -648 -2689 1737 4202 -4075 -4790 4468
1520 4468 3619 -3526 -2854 -1640 601 7119 2084 -9036 -3445 7249 2974 -2504 -1503 -1638 1860
1535 1860 6803 -1925 -9004 1498 8149 194 -3508 -1202 -523 3864 3737 -6076 -5702 6861 6451
1550 6451 -3339 -4616 -1771 1676 6722 1327 -8721 -1296 9710 2813 -6270 -3760 180 4666
1564 4666 7413 -2808 -10443 1063 9508 1112 -5239 -3223 6 5663 5670 -6007 -8127 3896 6828
1579 6828 -787 -2543 -2157 -683 5784 3185 -7999 -3959 7556 5105 -2158 -2392 -2654 824 7375
1594 7375 1424 -7747 -618 7705 2388 -2627 -2976 -2464 3954 7605 -2991 -8266 1516 6028 345
1609 345 -2447 -4010 -2923 6083 6064 -6773 -7507 3547 4087 -993 -1452 -3506 -1681 5590 1658 -7910
1625 -7910 -3244 5496 2074 -1906 -2623 -3884 1353 5942 -2712 -8352 599 4913 -628 -2218 -3452
1640 -3452 -4333 2971 4649 -5517 -6754 2517 2715 -2082 -1970 -3720 -3055 4305 3066 -5661 -3200 2695
1656 2695 330 -319 1147 -2935 -1587 4588 1194 -3357 1079 1497 -1887 2109 3629 -2184 -507
1671 -507 3744 -212 -1037 2944 -95 -1777 4525 2927 -3557 -438 2892 364 1966 2478 -2518 709
1687 709 6208 415 -3822 2039 3495 1610 3146 -186 -3345 4281 6672 -2697 -4383 3564 4502
1702 4502 2248 354 -4893 -3298 6874 5254 -5436 -4547 1777 2456 1569 -1905 -7413 -914 8196
1717 8196 1320 -7950 -3477 1148 1651 2039 -3327 -6893 2386 7755 -2492 -7724 -1293 2260 2653
1732 2653 1661 -4905 -5475 4818 4971 -5418 -6055 563 3020 3436 -1111 -8828 -3913 7503 3405
1747 3405 -5960 -4297 170 2493 4177 -2137 -9443 -758 8908 2399 -4910 -2870 -66 3030 4854
1762 4854 -2913 -6832 3494 7971 -463 -4311 -2225 80 5265 4441 -5426 -5316 5493 5289 -3310
1777 -3310 -3999 -1335 1692 6228 939 -8911 -2932 7688 3767 -4085 -3861 -888 4198 7163 -2259
1792 -2259 -9343 574 8676 2628 -2928 -3011 -1207 4851 5988 -4757 -6831 4072 6287 -401 -2663
1807 -2663 -2532 -1471 4699 3230 -5896 -4042 4790 2739 -2301 -2063 -2432 -284 4757 602 -5381 -81
1823 -81 4611 -113 -1333 -206 -1557 1981 5620 -997 -4663 2097 3404 -102 1493 670 -2458 2259
1839 2259 5234 -1245 -2807 1369 440 1064 3742 -606 -4152 1730 3186 -1358 -1036 339 -929 2674
1855 2674 3847 -3998 -4801 2883 3286 -456 -198 -1789 -1646 3703 2252 -6015 -2974 4614 2683 -1667
1871 -1667 -2606 -3893 -389 4716 -1247 -7319 -638 4618 183 -3490 -5195 -5193 2956 6256 -3777 -8551
1887 -8551 -134 3341 -394 -2537 -4519 -2465 5915 4956 -6425 -7230 1541 3798 1685 -940 -4511
1902 -4511 -1067 6853 1956 -7445 -3545 3856 3984 2280 -2036 -6216 302 6572 -243 -5844 369
1917 369 4499 2283 19 -4639 -5064 4915 8181 -1679 -5337 723 3349 2763 386 -4837 -1813 8501
1933 8501 6701 -4271 -5000 646 3676 5025 1270 -5626 -305 8618 2573 -6436 -3498 2472 4936
1948 4936 5283 -1721 -7462 313 7321 669 -4416 -577 2536 4094 2316 -5452 -6229 4843 7054
1963 7054 -1592 -3848 -280 1600 3379 644 -6698 -2532 7715 4858 -4425 -4549 -1497 1058 3905
1978 3905 95 -5966 -769 5400 45 -5052 -2935 -736 2282 4562 -2205 -6828 16 3357 -1274
1993 -1274 -1657 -222 -1436 1665 3214 -3686 -4987 2040 2325 -1000 503 -402 -2415 1201 1281 -3647
2009 -3647 -1281 3087 828 -1115 -355 -2896 -2142 3775 1905 -3602 -952 1293 -1021 329 277 -3802
2025 -3802 -971 5274 910 -4257 -1625 47 654 2944 -761 -4961 510 5189 -251 -3686 -1375
2040 -1375 -72 2896 4407 -2815 -5753 2100 4466 -864 -1898 -702 -139 3554 2518 -5104 -3476
2055 -3476 5159 4136 -1867 -2039 -979 1225 4836 919 -5642 -821 6061 2459 -1820 -2026 -1307 3026
2071 3026 6065 -1420 -5966 1411 5900 1124 -1844 -2140 -1420 4485 5591 -3538 -5706 2336 4721
2086 4721 982 -947 -3118 -1577 4885 3413 -4840 -3398 3227 2870 60 -1656 -3845 176 6116
2101 6116 489 -6277 -1538 3951 1662 -791 -2953 -3993 2591 6287 -2358 -7107 -344 4032 1778
2116 1778 -840 -4442 -3328 4639 4720 -4742 -5678 1270 3630 2085 -1202 -5962 -2500 6333 3014 -5276
2132 -5276 -3182 1818 1924 1354 -1341 -4972 204 6208 629 -5449 -1187 2017 1568 1069 -2351 -3464
2148 -3464 2974 5208 -2452 -4445 371 1998 2145 1525 -3482 -3184 4012 3120 -3516 -2318 1521 1244
2164 1244 2189 591 -4788 -2134 4743 2372 -2314 -882 -392 -224 2437 359 -4127 -142 3918 672
2180 672 -1061 -212 -1685 101 4160 123 -2988 1390 2682 -936 -450 139 -1638 2063 4272 -1426
2196 -1426 -4042 1063 2068 97 694 -1059 -1760 3202 2551 -3866 -3069 2232 1991 1473 282 -4010
2212 -4010 -2031 4849 2303 -3960 -1722 2489 2241 1914 -1012 -5115 -223 6177 1825 -3515 -1147
2227 -1147 861 1384 2111 -1788 -4199 2730 5278 -1244 -4034 -1162 168 2395 2433 -3105 -3495 3613
2243 3613 3169 -3298 -3045 41 1377 3425 1141 -5372 -2952 4208 2172 -3147 -2287 -206 1735 3726
2259 3726 -1929 -7274 -839 5520 1480 -2642 -2925 -2781 1367 3626 -3181 -6375 1262 4709 -422
2274 -422 -3158 -3323 -1793 3238 3486 -3984 -4480 2960 3433 -1270 -2551 -2388 890 5802 2104 -5586
2290 -5586 -2325 4544 2683 -753 -1494 -1518 2719 6025 -920 -6707 210 5551 2633 -564 -2267 -2407
2306 -2407 3467 5069 -2540 -4917 1969 4537 1946 -367 -3252 -1853 4508 3699 -3039 -2099 2985
2321 2985 2126 427 -267 -2946 -299 5253 1966 -3888 -1153 2076 471 368 -324 -2745 748 4059
2337 4059 -962 -3930 -7 1230 485 1065 -1502 -3219 1797 3336 -2277 -2877 555 619 1505 2180 -2906
2354 -2906 -3957 2414 2624 -1900 -1346 -206 -1081 1605 1336 -3871 -2781 2746 1284 -1682 -1139 -2119
2370 -2119 -1368 2507 71 -4923 -1380 2714 524 -1307 -1202 -2815 -70 3749 -614 -4409 305
2385 305 2786 134 -627 -1439 -2022 2804 4278 -2068 -4121 1176 2595 1011 343 -2763 -1913 4230
2401 4230 3850 -3443 -3427 1071 1663 1863 587 -3529 -1422 4546 1848 -3799 -1763 1619 1713 1925 -601
2418 -601 -4394 222 4774 119 -3285 -235 1023 1469 1832 -2307 -3818 2573 4272 -1892 -2950 383
2434 383 959 1718 1030 -4197 -2650 4796 3914 -3045 -3190 -148 1387 3551 521 -4774 -1023 5435
2450 5435 2351 -2750 -1844 -9 2424 4612 -530 -5032 863 5318 504 -2412 -984 132 2979
2465 2979 3610 -2738 -4713 2298 4090 -571 -1596 -1092 -479 2845 1334 -4358 -2504 3846 2446 -1786
2481 -1786 -1958 -1679 79 3262 136 -4901 -674 3678 612 -1654 -1508 -2112 826 3724 -850 -4106
2497 -4106 360 1926 -862 -903 -1088 -2149 1552 2396 -2488 -3080 922 595 -646 745 -1336 -2159 1983
2514 1983 1376 -3003 -1340 1675 -129 -308 620 -2202 -1497 2652 429 -3028 -319 1354 -37 866
2530 866 -497 -3608 -130 3624 108 -2573 -325 -202 299 2246 -989 -3725 1313 3823 -237 -1656
2546 -1656 -359 -787 1665 3257 -1527 -3094 2237 3030 -491 -263 -549 -851 3125 2995 -2411 -1771 2495
2563 2495 1489 -261 673 -821 -143 3539 1143 -3608 -339 3178 718 -349 117 -1677 883 3710
2579 3710 -812 -3808 828 2660 552 167 -1522 -2341 2395 3505 -1950 -2849 1386 1612 376 471
2595 471 -2426 -1829 3568 2668 -3366 -2312 1453 779 896 107 -3186 -799 3904 755 -3543 -883
2611 -883 1489 548 557 -1271 -3350 1260 4044 -1272 -3786 -5 1210 773 1139 -2626 -3220 2726 3314
2628 3314 -2593 -3076 213 676 1560 772 -3556 -2443 3727 1796 -2881 -1927 -62 378 2218 -269
2644 -269 -4367 -961 3475 20 -2308 -420 -487 -7 1736 -1019 -3787 1125 3054 -1134 -1843 275
2660 275 -356 844 1426 -2497 -2089 2711 1912 -1980 -997 -41 -335 2191 1395 -3119 -705 2971 552
2677 552 -1544 188 -357 28 3091 643 -3241 -74 2777 55 -85 577 -1272 408 3044 -24
2693 -24 -2458 1051 1471 -392 845 398 -1660 1235 2571 -1270 -1239 2050 899 -237 1479 -762
2709 -762 -1679 2295 2058 -2109 -769 1121 84 704 1152 -2110 -1255 2915 807 -2168 -219 131 -322
2726 -322 1977 402 -3357 -432 3091 166 -1612 -236 -1065 -22 2678 -481 -3646 323 2442
2741 2442 -676 -786 -378 -1576 644 2399 -1704 -2286 1549 1308 -1401 -441 -678 -1116 2384 1219 -3535
2758 -3535 -1705 2509 462 -1444 -349 -1196 -401 2940 -456 -4258 -428 2775 266 -835 -1002 -1942
2774 -1942 1143 3214 -1760 -3943 1080 2566 101 -114 -1699 -2385 2292 3117 -2566 -2289 1835 1036
2790 1036 -654 -67 -1795 -880 3468 1525 -3377 -1229 1881 469 358 120 -1839 624 3648 -564
2806 -564 -3497 218 1679 338 1012 -749 -2252 1534 2854 -1937 -2336 1458 1098 509 1056 -1853
2822 -1853 -2562 2326 2351 -1690 -919 949 -400 402 858 -1990 -1002 3117 915 -1484 263 588 -1195
2839 -1195 994 929 -1623 1003 2871 -731 -1734 841 214 -28 1980 164 -1887 1542 1624 -1858
2855 -1858 -947 958 -122 1045 1492 -2218 -2520 1802 957 -1244 270 -172 -1350 1465 1342 -2997
2871 -2997 -1729 1808 293 -292 876 -1872 -1965 1845 742 -2274 -331 953 -765 108 248 -2960
2887 -2960 -957 2506 66 -2056 232 -258 -1122 981 -169 -2646 566 2538 -1292 -1708 533 -608
2903 -608 -317 1571 -885 -2130 1957 1519 -1901 -1079 241 -141 1782 1609 -2621 -1824 2869 921 -1462
2920 -1462 59 -272 -366 2196 468 -3185 -494 2560 57 -977 519 -677 38 2460 -495 -2909
2936 -2909 1269 2685 -399 -338 -14 -895 1504 2157 -1757 -1686 2837 1918 -1017 -248 -434 -248 2818 1533
2954 1533 -2930 -837 3087 964 -923 -253 -965 496 3441 379 -3330 -386 1984 -33 106 -205
2970 -205 -1802 761 2975 -1348 -2622 854 951 -384 719 -679 -1870 1196 1538 -2223 -1310 1499
2986 1499 -9 -533 427 -1228 -1265 1701 422 -2446 370 1574 -866 -418 -79 -1964 152 2804
3002 2804 -688 -2107 680 317 -819 832 203 -2054 527 2173 -1188 -1365 771 -489 -397 1760
3018 1760 -509 -1665 1276 735 -1953 -34 537 -1110 700 1691 -1452 -1559 1351 -407 -1390 1007
3034 1007 165 -1607 771 651 -2229 -173 1848 -613 -534 1067 -1059 -828 1847 32 -1939 777
3050 777 1335 -454 978 293 -2420 339 2910 -48 -1441 655 229 -39 1610 -489 -2323 1311
3066 1311 2850 -811 -1155 567 -385 764 2004 -1248 -1728 2260 1497 -1367 -147 274 -377 1631
3082 1631 1306 -2070 -660 2448 100 -1525 649 441 -31 1815 -267 -2517 898 2423 -754 -1124
3098 -1124 396 -326 830 1578 -1741 -2286 1860 2297 -1216 -986 -191 -673 1570 1354 -2556 -1327 2583
3115 2583 801 -1420 -287 -672 -539 2233 521 -2794 -299 2170 -396 -1105 -54 -939 157 2028
3131 2028 -1086 -2714 919 1101 -1283 -344 -249 -1240 1108 1684 -2199 -2048 1643 562 -956 57 -935
3148 -935 -1482 1437 742 -2422 -779 1448 -104 -517 581 -1271 -940 1861 -15 -1794 636 625 -1049
3165 -1049 534 910 -1652 21 1854 -735 -844 1749 45 -1295 962 323 -1307 982 1213 -1380
3181 -1380 137 1727 -488 -82 1392 -707 -827 1890 695 -1750 372 716 -742 957 1420 -1433
3197 -1433 -561 1962 168 -758 892 14 -550 1986 1100 -2120 -294 1680 -58 350 887 -1240 -250
3214 -250 2262 40 -1839 483 736 -484 1236 291 -1776 676 2004 -1005 -1129 972 227 -163
3230 -163 1033 -839 -1892 1595 1573 -1675 -872 698 -193 566 637 -1864 -810 2731 560 -2176 -456
3247 -456 200 -390 940 -153 -2627 60 2763 -580 -1874 12 -192 5 1614 -468 -2428 714
3263 714 1340 -1669 -980 608 -535 419 879 -1951 -1702 1718 567 -1836 -115 514 -565 840 101
3280 101 -2675 -556 2431 -50 -1705 -41 -216 -191 1408 -574 -2396 872 2247 -782 -1064 -318
3296 -318 -784 813 2195 -1188 -1824 1538 1229 -1000 -107 80 -956 1394 1778 -1634 -1029 1598 423
3313 423 -517 580 -58 -480 1847 532 -2102 308 1752 -354 13 959 -877 199 2047 -447
3329 -447 -1398 1435 1200 -586 503 291 -1063 836 1839 -1036 -796 1588 415 -433 1036 -332
3345 -332 -1415 1295 1346 -946 152 743 -886 -22 1426 -780 -917 1627 334 -1262 619 -45 -1404
3362 -1404 1016 852 -1742 -381 1341 -538 -992 528 -834 -673 1554 -90 -2017 187 858 -1057
3378 -1057 -350 141 -1291 478 1744 -1615 -2521 893 876 -730 103 -920 -1529 1124 1537 -2258 -1751
3395 -1751 962 480 174 269 -1745 -1384 2011 831 -2061 -501 937 -77 549 -138 -2099 61 2727
3412 2727 -46 -2128 123 607 10 650 -735 -2011 1597 2457 -1493 -2025 728 574 294 465 -1552
3429 -1552 -795 2396 1340 -2220 -1223 995 596 1141 479 -2172 -493 2905 538 -1795 86 717
3445 717 399 1253 -90 -2280 460 2584 -347 -1002 686 254 390 1111 -956 -1750 1766 1808 -1245
3462 -1245 -559 593 -276 682 993 -1744 -574 2498 894 -1481 -370 194 27 1756 405 -2258
3478 -2258 -387 2177 205 -1068 48 -594 230 1976 -459 -2267 368 1297 -730 -175 127 -1226
3494 -1226 296 1508 -1163 -1798 1110 602 -729 504 -266 -1400 802 1059 -1727 -617 1288 -210
3510 -210 -683 403 -955 -1067 1109 190 -1836 294 792 -871 -107 47 -1766 -215 1901 -232 -1645
3527 -1645 223 -226 -689 797 -169 -1971 279 1733 -657 -1232 41 -664 269 1931 -868 -2012
3543 -2012 938 1154 -931 -302 -17 -490 1399 1486 -1532 -1681 1251 691 -617 328 -61 -285 1685 594
3561 594 -2429 -359 1990 666 -339 80 -891 346 2491 -347 -2375 680 2246 441 -147 -735
3577 -735 -1330 1505 2607 -947 -1790 1324 1333 -102 -85 -1067 -766 2462 2222 -1880 -1222 1365 465 140
3595 140 296 -1182 37 2431 107 -2431 -235 1437 247 306 -58 -1507 593 2131 -1329 -2250
3611 -2250 875 1713 300 61 -1369 -1788 1611 1916 -1812 -1608 732 476 31 -165 -2271 -1164 2527
3628 2527 1216 -2047 -1178 388 -253 803 -6 -1960 -281 2341 -118 -2081 -381 -73 -113 1194
3644 1194 -211 -2066 399 1423 -1104 -1482 413 -124 423 950 -1548 -1980 1103 1326 -1186 -484 123
3661 123 -351 876 813 -2165 -1234 1811 904 -907 45 -460 -559 1281 483 -1808 25 1558 -8 -479
3679 -479 231 -940 36 1939 126 -1419 697 768 -649 392 349 -1193 589 1824 -620 -950 963
3696 963 609 -219 623 -244 -817 1362 1427 -1272 -761 994 273 650 1095 -1322 -855 2159 1000 -1516
3714 -1516 -359 771 342 1375 319 -2225 -369 2499 473 -1366 -84 -166 480 1836 -378 -2286
3730 -2286 352 2175 -70 -900 -405 -484 905 1693 -1333 -1995 1199 1542 -937 -768 -268 -539 1545
3747 1545 905 -2379 -1124 2055 653 -1059 -756 -763 59 1914 -34 -2613 -280 1919 41 -1131
3763 -1131 -823 -1132 962 2152 -1271 -2984 495 1648 -102 -417 -975 -1236 1304 1691 -1780 -1950 955
3780 955 1112 -49 -96 -1189 -784 1737 953 -2191 -792 1625 491 -66 -359 -1575 -46 2399 -64
3797 -64 -2368 -48 1425 202 72 -743 -1384 1198 2414 -712 -1927 669 1105 499 549 -1042 -1376
3814 -1376 1930 1832 -1334 -1217 549 399 624 771 -1212 -682 2098 972 -1331 -117 700 326 865
3831 865 426 -1688 140 2174 33 -1210 311 416 284 1236 -659 -1529 910 1849 -484 -618 384
3848 384 -86 559 1186 -1119 -1564 1517 1441 -920 -195 -98 -616 1116 1189 -1658 -1198 1071 586 -261 142
3867 142 -804 -888 1426 541 -1600 -330 910 -317 -88 198 -1286 -378 1552 -203 -1785 4 587
3884 587 -389 366 -432 -1682 630 1748 -1043 -1800 484 195 51 453 -1243 -1441 1536 1513 -1735 -1538
3902 -1538 310 338 882 357 -2300 -1360 2186 911 -1840 -949 187 239 1360 -288 -2579 -224 2311
3919 2311 255 -1143 -150 -285 217 1190 -933 -2065 1220 1980 -794 -1071 -69 -103 1161 1350 -1425
3936 -1425 -1452 1962 1284 -1306 -824 -65 414 1731 537 -2133 -713 2227 825 -698 -379 -145 662
3953 662 2295 -229 -2612 47 2272 424 -370 -43 -754 874 1935 -1239 -2048 1144 1795 -117
3969 -117 -352 -649 -822 1461 1341 -1544 -1037 1540 577 -589 -233 -1051 -310 2339 541 -2116 -582
3986 -582 1694 214 -289 -407 -1261 594 2201 -347 -2773 -38 948 241 213 -584 -1751 778 1806
4003 1806 -1445 -1660 309 433 162 691 -980 -1742 1079 975 -1320 -643 554 -294 -17 342 -1660
4020 -1660 -1038 1654 243 -1281 -229 -91 -637 465 -79 -1683 92 1874 -423 -1206 -264 -333 63
4037 63 1407 -347 -1806 406 1580 -660 -762 -176 -627 777 1756 -1029 -1936 840 919 -325 186
4054 186 -462 -754 1428 1296 -1593 -1073 1200 742 136 716 -1098 -623 1809 695 -1803 -260 1353
4071 1353 342 384 75 -1355 336 2364 -58 -1667 593 1326 282 385 -945 -1417 1501 2431 -1054
4088 -1054 -1526 587 637 630 503 -1368 -1065 1989 1524 -1735 -1181 364 605 1234 349 -1953 -750 2173
4106 2173 481 -1694 -367 397 466 1141 -308 -2086 522 2123 -651 -1493 -152 168 478 909 -1376
4123 -1376 -1832 1492 1750 -979 -1399 -41 -74 829 812 -2072 -1421 1875 1155 -1341 -871 -644 144 1466
4141 1466 265 -2526 -459 1859 288 -981 -704 -864 338 1901 -392 -2200 253 1465 -284
4156 -284 -645 -403 -717 785 1210 -1471 -1662 1046 1120 -500 -475 -545 -539 1421 745 -2036 -998 1615 417
4175 417 -388 -22 -880 -149 1830 355 -1941 -257 1386 375 21 96 -1186 58 2037 87 -1462
4192 -1462 326 574 111 627 -214 -1292 742 1962 -497 -811 698 205 345 1041 -396 -996 1499
4209 1499 1268 -982 -333 853 -26 714 858 -1356 -371 1773 632 -971 70 209 118 1358 310
4226 310 -1849 -244 1685 88 -807 134 -489 166 1785 -566 -2151 375 1515 -220 -316 -362 -1117
4243 -1117 726 1586 -1257 -1578 711 779 -354 -220 -846 -1004 1318 892 -1844 -990 1261 199 -700
4260 -700 -409 -1345 -303 1898 96 -2295 -548 1077 -134 -282 -742 -1560 413 2136 -877 -2312
4276 -2312 19 553 339 391 -1245 -1512 1342 1612 -1546 -1495 447 513 532 534 -1464 -1218 1706 910 -1658
4295 -1658 -736 743 95 538 50 -1639 104 2247 214 -1384 249 688 345 803 -566 -1533 1001
4312 1001 1954 -545 -1164 320 431 824 1157 -979 -1334 1713 1558 -1093 -911 192 313 1198 908 -1620
4330 -1620 -810 1718 775 -994 -112 -35 -82 1614 366 -1801 -16 1645 21 -753 390 -222 446
4347 446 1297 -679 -1619 866 1479 -393 -486 85 -496 822 1345 -1232 -1144 1406 677 -396 -69 -578
4365 -578 -803 1259 935 -1508 -793 1118 33 -235 197 -1216 -690 1479 358 -1612 -378 389 -343
4382 -343 549 92 -1406 -76 1562 -398 -1321 167 -33 -308 798 -318 -1650 594 1209 -903 -883
4399 -883 377 -140 100 742 -1360 -1390 1300 868 -1201 -378 117 -262 882 406 -1911 -767 1665 528
4417 528 -966 -224 -399 -79 1311 79 -1813 54 1649 -136 -432 60 -691 381 1605 -194 -1529
4434 -1529 568 1258 -375 -341 -115 -643 986 1375 -1230 -1280 1541 762 -414 25 -353 -300 1701 735
4452 735 -1833 -582 1446 661 -123 -201 -985 233 1928 235 -1716 79 1501 515 262 -549 -1430
4469 -1430 816 2020 -700 -1379 647 718 167 494 -925 -1159 1291 1322 -1185 -893 794 29 -50 276
4487 276 -914 -315 1903 564 -1709 -372 599 48 326 -121 -1368 134 1697 -316 -1762 -1
4503 -1 290 141 687 -619 -1664 667 1551 -858 -999 177 50 288 752 -1189 -1457 998 908 -995
4521 -995 -357 -62 -453 395 457 -1273 -606 1387 -123 -869 94 -197 -559 744 -72 -1763 132 1036
4539 1036 -389 -811 275 -485 168 1095 -530 -1624 587 822 -497 -39 -8 -667 776 1210 -1141
4556 -1141 -1021 745 362 -134 619 -347 -1006 1180 910 -1205 -506 770 -101 300 717 -963 -472 1401
4574 1401 440 -1082 120 549 -51 675 414 -1290 261 1733 -93 -774 324 430 252 957 -539
4591 -539 -1199 860 1613 -430 -853 239 85 599 844 -901 -923 1473 1132 -763 -563 -127 -116 981
4609 981 666 -1746 -561 1529 451 -826 -200 -468 36 1405 -17 -1725 -116 1123 -264 -332 -120
4626 -120 -457 436 923 -1128 -1553 735 833 -631 -460 -426 -733 1064 557 -1879 -1133 1243 708 -476
4644 -476 -213 -862 -565 1355 323 -1790 -284 1200 111 -601 -429 -1017 -26 1546 -155 -1502 249
4661 249 689 -420 75 -304 -905 766 1369 -740 -1018 659 207 -113 352 -420 -407 1063 639 -1177
4679 -1177 -518 974 416 201 350 -969 -120 1395 414 -1318 246 710 68 688 111 -1196 127
4696 127 1678 -176 -764 362 -5 -40 834 -115 -1034 498 1334 -339 -378 271 -308 321 970 -566 -810
4715 -810 969 585 -776 57 65 -534 691 708 -913 -307 1113 -87 -423 334 -110 76 1050 195 -1413
4734 -1413 79 891 -37 190 70 -715 222 1283 -407 -1306 437 615 -2 330 -585 -1316 322 1021
4752 1021 -718 -745 552 114 -268 411 -802 -1062 1113 748 -899 -571 247 -358 -97 400 -919 -144
4770 -144 1319 21 -1102 59 326 -158 191 182 -1487 177 1357 -535 -1257 -8 -94 88 645 -816
4788 -816 -1608 519 1085 -659 -615 -62 -6 435 397 -1022 -1130 1163 656 -527 -17 -209 -257 797 403
4807 403 -1400 -276 1315 193 -562 214 -233 -58 1064 -3 -1068 571 1208 -244 -403 199 -248
4824 -248 627 1092 -881 -845 975 889 -443 -215 210 -31 1000 800 -1170 -548 1274 663 -156 396 -305
4843 -305 -106 1266 345 -1164 -77 1042 -100 86 210 -540 62 1206 -179 -693 630 574 -320 285
4861 285 -203 -666 534 970 -703 -647 879 117 -393 302 -751 -891 945 651 -1024 -424 422 -326
4879 -326 200 74 -936 -526 1130 -65 -971 -70 61 -291 550 163 -1233 -295 903 -382 -793 176
4897 176 -478 -381 701 -146 -1175 240 388 -423 -9 307 -412 -17 747 -746 -893 940 228 -513 43
4916 43 70 -783 489 454 -1155 -412 948 18 -373 199 -727 -313 997 136 -1111 -169 706 -68 155
4935 155 -64 -838 190 1441 -72 -1091 346 373 -23 660 -54 -757 497 1159 -732 -661 516 102
4953 102 228 742 -494 -621 1087 707 -868 -227 440 8 343 385 -947 31 1189 122 -797 34
4971 34 369 68 573 -12 -1130 364 1407 -192 -546 198 -155 93 747 -639 -1030 789 1062 -452
4989 -452 -234 -8 -313 215 692 -795 -475 952 192 -603 138 103 -403 572 288 -1125 36 914 -178
5008 -178 -645 -70 -332 64 792 -334 -1249 316 763 -366 -295 -293 -648 298 982 -774 -1057 645 477
5027 477 -397 179 -301 -704 533 728 -942 -462 559 50 -266 324 -688 -644 677 316 -678 203 351
5046 351 -471 213 332 -613 -26 1041 -167 -442 267 101 -350 609 86 -661 542 793 -416 -394 419
5065 419 123 279 605 -191 -738 825 693 -546 -8 323 -46 614 987 -740 -523 875 -13 -362 368
5084 368 -113 -207 753 274 -849 -94 705 45 -84 446 -492 -136 740 -60 -907 665 690 -161 109 -16
5104 -16 -589 267 957 -510 -651 637 596 -320 127 -443 -324 1066 821 -824 -585 499 78 100 360
5123 360 -615 -276 1242 197 -1042 -36 404 81 393 217 -826 70 926 -361 -811 295 81 15
5141 15 359 -335 -960 485 762 -637 -348 551 -118 -16 171 -697 -531 840 453 -895 49 193 -300
5160 -300 183 200 -900 105 1167 -138 -911 44 -109 -133 709 -96 -927 50 761 -422 -471 184 -234
5179 -234 -55 718 -462 -870 425 397 -439 42 242 -411 174 651 -750 -531 847 398 -459 236 -3
5198 -3 -474 587 547 -663 62 879 80 147 351 -230 -121 959 -4 -765 367 702 -56 240 328 -666
5218 -666 359 1199 -72 -437 308 87 46 659 -85 -642 763 747 -455 -197 284 -437 27 692 -522
5237 -522 -502 553 173 -633 175 329 -429 142 138 -979 -314 604 -233 -693 255 -30 -156 394 -222 -939
5257 -939 163 671 -529 -408 -150 -391 111 646 -766 -970 370 317 -482 -53 -200 -599 331 586 -879
5276 -879 -735 477 -90 -329 -132 -473 -529 794 204 -987 -142 557 -323 -236 163 -667 -175 991 -332
5295 -332 -992 132 479 -185 142 -168 -639 609 997 -592 -560 397 150 -37 370 -517 -656 680 600
5314 600 -869 -290 698 154 320 422 -541 -154 933 253 -640 389 262 -11 434 258 -569 -66 1079
5333 1079 135 -408 388 106 -124 444 -411 -574 570 718 -707 -276 216 -192 51 573 -725 -631 987
5352 987 330 -624 -51 -25 -40 699 461 -794 -225 768 210 -362 121 -251 -265 600 79 -876 115 680 -357
5373 -357 -117 152 -650 -1 778 -355 -867 603 430 -540 145 131 -644 335 519 -683 -307 634 114
5392 114 -146 100 -278 -350 746 304 -834 -306 429 -133 -65 238 -746 -425 764 63 -762 -87 -31 -196
5412 -196 441 24 -997 -69 870 -487 -444 165 -107 1 620 -212 -746 684 457 -375 -103 182 -187
5431 -187 185 423 -762 -695 850 329 -646 -140 197 -111 580 321 -1003 -296 1037 15 -381 61 -199
5450 -199 177 859 -197 -824 277 682 -76 -232 130 -309 328 951 -407 -822 474 575 -86 201 33
5469 33 -217 631 591 -613 -434 908 304 -166 257 -50 -96 840 139 -745 128 776 -207 91 123 -541 161
5490 161 886 -204 -974 280 428 -55 24 -237 -804 240 749 -447 -430 249 53 -142 387 -340 -510
5509 -510 509 545 -898 -215 230 -486 127 213 -666 -438 750 210 -747 83 -66 -210 444 192 -778 78
5529 78 770 -510 -486 183 -169 -127 532 -81 -1088 425 539 -463 -262 -69 -367 254 711 -519 -860
5548 -860 457 431 -319 211 -220 -434 523 527 -776 -367 614 -92 -168 273 -158 -424 626 173 -616 130
5568 130 376 -193 -91 130 -583 144 985 -201 -669 345 436 -111 428 -22 -507 642 871 -720 -526
5587 -526 457 42 219 442 -513 -432 1052 426 -773 -28 325 99 767 430 -717 -197 1062 376 -621
5606 -621 153 68 -118 499 -81 -977 150 793 -272 -507 230 -140 2 789 -531 -626 549 601 -794
5625 -794 -386 30 -216 198 102 -698 -608 732 306 -732 -176 -164 -238 447 142 -1253 -243 618 -236 -241 -170
5646 -170 -372 -152 778 -187 -1247 119 501 -582 -177 25 -608 39 628 -601 -912 384 185 -511
5664 -511 237 -130 -277 627 409 -934 -341 675 118 -55 245 -475 -204 911 193 -876 -110 472 -98
5683 -98 32 191 -584 196 997 -122 -743 297 216 -201 281 -114 -631 205 759 -359 -300 337 -22 45
5703 45 443 -488 -607 659 506 -399 -30 252 -164 319 269 -727 -80 941 -12 -585 163 246 -311 194
5723 194 53 -806 210 699 -247 -236 -5 -275 268 752 -326 -762 520 491 -170 -1 47 -395 376 690
5743 690 -591 -610 472 -38 -271 115 -217 -442 667 336 -881 -204 663 121 -222 169 -474 -117 815
5762 815 -86 -824 33 600 -198 130 -33 -635 305 739 -498 -1023 348 190 45 354 -400 -746 448
5781 448 627 -605 -493 294 55 140 178 -811 -598 916 245 -633 -327 181 -139 401 258 -842 -79 857
5801 857 -17 -507 93 118 59 398 -378 -617 365 711 -345 -449 237 86 121 580 -555 -669 729 508
5821 508 -504 -13 284 -100 616 472 -955 -463 962 374 -138 153 -139 -94 645 221 -665 8 1057
5840 1057 -32 -137 193 -559 -87 952 70 -526 376 414 -374 58 213 -516 336 699 -582 -430 613
5859 613 163 -63 127 -47 -332 716 544 -951 -396 621 119 67 150 -458 -206 940 143 -743 53
5878 53 187 -76 265 200 -759 -16 782 -177 -564 130 -54 7 437 -225 -953 15 626 -419 -410 161 -250
5899 -250 -106 269 -419 -445 666 288 -659 -120 96 -210 412 76 -779 -331 816 1 -627 -38 -477 -102
5919 -102 786 -22 -1039 -99 575 -144 -418 81 -318 117 883 -238 -870 332 464 -329 266 -175 -442
5938 -442 491 589 -484 -454 560 241 -76 64 -229 -547 845 320 -683 1 783 104 98 77 -567 144
5958 144 1237 169 -810 93 516 14 124 -326 -537 444 1038 -275 -650 362 253 151 576 -244 -493
5977 -493 714 741 -559 -315 388 110 176 284 -333 -279 727 119 -710 122 206 -115 252 -2 -872 -73
5997 -73 843 -203 -587 26 -25 -62 286 -245 -659 331 619 -564 -382 25 -335 -36 415 -648 -501 435
6017 435 376 -629 -127 48 -471 354 393 -889 -320 500 -29 -533 96 -277 -403 567 -76 -920 -24 558
6037 558 -266 -284 5 -395 16 565 -391 -799 242 227 -248 64 -214 -439 339 743 -461 -427 416 317 -24
6058 -24 461 -472 -375 638 467 -575 -286 413 84 115 39 -425 -217 827 606 -262 131 85 -241 232 84
6079 84 -590 326 751 -116 -508 50 146 5 501 -184 -579 393 637 -491 -169 113 -30 516 433 -506 -382
6100 -382 773 318 -451 -25 -10 -189 476 241 -975 -177 802 209 -275 196 -221 71 794 -95 -752 96
6120 96 687 -42 -127 39 -450 219 417 -559 -636 402 523 -149 -130 -252 -309 420 362 -829 -420 760 235
6141 235 -421 235 -348 -113 777 -28 -732 63 432 50 -4 -27 -489 1 803 -199 -747 47 242 -186
6161 -186 399 -125 -605 247 697 -408 -557 182 76 -250 298 -364 -500 483 360 -879 -122 259 -234
6180 -234 197 92 -490 -183 704 -29 -517 151 48 123 386 88 -633 112 904 -15 -359 -26 -173 186
6200 186 598 -152 -605 291 557 -174 -21 343 -63 294 694 -538 -327 621 270 -344 48 196 -98 492
6220 492 369 -315 -220 781 113 -51 338 -202 -156 531 69 -584 252 515 -19 53 -28 -304 383 834 -277
6241 -277 -569 193 299 -22 77 -219 -520 376 838 -380 -419 336 -15 194 314 -555 -640 745 340 -632
6261 -632 -419 177 -44 223 291 -579 -245 459 -163 -589 -84 80 -319 200 -228 -593 97 541 -417 -692
6281 -692 260 10 -85 199 -437 -730 294 586 -385 -494 139 -372 246 215 -569 -438 618 90 -429 -119
6301 -119 -91 -238 482 108 -833 -96 515 -52 -327 88 -224 99 479 -82 -679 322 588 -58 -101 74
6321 74 -283 347 729 -296 -656 513 357 -143 -41 -213 -396 717 554 -579 -110 599 244 -157 189
6340 189 -408 -100 701 177 -688 53 316 110 62 -75 -471 182 816 59 -306 86 102 -218 277 -83 -514
6361 -514 188 465 -404 -257 307 50 -302 184 -262 -163 502 111 -546 -149 252 -11 99 -20 -682 -310
6381 -310 654 163 -693 51 70 110 431 -264 -844 -58 504 -207 -285 135 -71 -66 390 -281 -584 111 478 -13
6403 -13 -92 -29 -375 129 373 -360 -349 341 216 -444 65 -239 -284 409 358 -477 -146 425 -7 -125 152 -275
6425 -275 168 790 -85 -559 -24 375 -41 117 12 -482 201 813 -135 -595 311 310 -25 206 -98 -478 472
6446 472 556 -440 -256 193 -50 66 225 -245 -277 840 420 -612 11 347 -8 319 142 -542 -35 819
6466 819 -1 -484 82 416 145 433 -111 -568 391 523 -183 -494 -22 -78 284 508 -250 -410 581 450
6486 450 -443 -14 57 -131 370 293 -415 -519 482 184 -220 134 82 -179 301 0 -532 118 403 4 -163
6507 -163 20 46 -149 437 -416 -648 215 325 -336 -158 -102 -472 472 501 -464 -419 338 171 -169 111 -250
6528 -250 -296 466 228 -607 -361 309 118 -104 98 -351 -150 241 -223 -555 39 268 -180 -181 78 -293 11
6549 11 502 36 -756 73 80 -209 199 -231 -412 276 331 -394 -158 38 -169 190 232 -397 -321 483 348 -385
6571 -385 -70 271 -42 277 377 -619 -46 671 350 -94 221 49 -14 367 252 -410 -11 462 -43 -38 183
6592 183 10 171 660 51 -265 477 322 -342 42 272 -5 351 600 -508 -516 532 126 -155 -4 -122
6612 -122 -277 488 349 -551 -213 414 168 -10 -40 -327 137 630 -154 -671 124 296 -137 29 -145 -377
6632 -377 27 666 -385 -710 246 189 -206 258 -318 -373 415 220 -514 -311 339 -114 4 203 -302 -289 360
6653 360 -44 -552 33 160 -64 -49 43 -622 60 695 -256 -521 90 128 72 314 -236 -746 190 362 -164
6674 -164 -224 35 -139 152 112 -490 -449 498 226 -333 -188 68 -230 147 172 -449 -126 724 182 -300 6
6695 6 100 -69 333 -186 -466 142 576 -136 -146 177 -77 266 430 -113 -174 159 331 -277 92 -36 -287 475
6717 475 520 -291 -226 332 99 -3 188 -81 -454 329 180 -336 92 378 -21 43 277 -289 -194 530 103
6738 103 -372 273 114 -123 145 284 -281 330 475 -224 -227 160 -27 -29 203 -270 -403 404 687 -522 -311
6759 -311 13 -212 339 502 -384 -401 557 227 -335 -226 -140 -235 213 318 -609 -159 228 129 -346 -104 -155 81
6781 81 200 21 -368 -134 222 -260 -192 -44 -178 -45 409 -494 -422 316 441 -203 -46 -184 -152 335 128
6802 128 -743 -271 388 128 -118 -106 -327 -270 522 238 -498 0 530 172 182 131 -515 -49 610 -83 -414
6823 -414 41 242 -58 61 203 -350 198 389 -437 -533 363 197 124 281 -70 -307 446 412 -501 80 314
6844 314 290 425 127 -430 -59 693 77 -346 142 136 -34 385 153 -434 75 436 -79 -287 145 68 -90
6865 -90 445 14 -565 333 339 -302 71 277 -343 100 345 -165 -344 527 115 -481 -144 124 -157 349 125
6886 125 -444 -23 316 -238 -344 107 -37 -136 491 40 -670 -56 236 -65 -18 -41 -372 -129 547 -139 -388
6907 -388 233 222 -27 -25 -129 -431 201 175 -116 -391 154 -80 -2 162 -362 -303 561 69 -382 36 97 -211
6929 -211 21 286 -417 -188 519 44 -336 34 -4 -10 316 125 -474 67 471 -55 -542 183 36 81 205
6950 205 -324 -479 231 514 -309 -184 340 -105 51 275 -486 -472 380 115 -372 137 82 -65 292 58 -475
6971 -475 51 410 60 -86 103 -23 -170 530 -24 -490 215 486 -128 -99 1 -224 167 287 -280 -423
6991 -423 294 322 -139 -23 -18 -390 223 463 -474 -233 206 -154 -260 -12 -228 -123 533 -9 -503 21 376
7012 376 -207 48 74 -438 -257 442 -118 -419 97 -2 -214 75 -190 -249 77 318 -239 -368 88 -93 5
7033 5 -65 -228 -226 459 162 -498 -204 62 -227 -237 365 -397 -192 509 135 -243 221 9 -331 416 230 -146
7055 -146 -21 370 -169 -44 95 -119 -29 324 -194 -434 173 220 -132 54 91 -331 186 252 -289 -425 385
7076 385 137 -125 222 -37 -281 261 213 -438 67 506 -219 -11 222 -306 -116 510 28 -372 211 146 -35
7097 -35 278 165 -421 8 579 -99 -93 168 -13 -233 159 40 -285 135 436 -543 -209 230 -11 0 240
7118 240 -271 -99 463 105 -311 193 183 -122 68 186 -391 -273 496 155 -365 160 132 -146 330 -141 -553
7139 -553 104 340 -69 -230 283 -90 132 181 -260 -376 232 177 -294 -71 5 -268 183 177 -413 -173 532 12
7161 12 -402 223 -161 -55 131 40 -483 -153 214 -233 -158 -70 -182 -149 470 -4 -435 180 376 33 -5 -31
7183 -31 -286 260 762 -283 -256 458 135 -221 227 -269 -421 256 392 -277 104 418 -137 -138 46 -195 -162
7204 -162 522 168 -236 179 302 72 89 270 -292 76 580 -64 -85 295 104 -161 107 41 -441 388 604
7225 604 -278 -134 269 83 107 128 -298 -363 224 171 -208 45 -2 -207 126 288 -257 -125 85 133 -67 438
7247 438 -142 -122 262 125 -390 -20 263 -272 23 49 -228 -120 171 -217 -454 340 181 -388 182 0 -319
7268 -319 81 358 -233 -423 165 -2 -273 145 -288 -155 384 292 -638 -168 5 19 47 87 -244 -228 315 238
7290 238 -500 -40 -13 -146 -128 -107 -356 -89 337 -114 -364 253 86 -147 168 -67 -230 306 310 -246 -92 210
7312 210 -71 17 133 -394 -134 625 177 -489 -30 182 162 305 23 -349 -221 521 -213 -184 65 -18 -70 577
7334 577 83 -404 326 526 -90 -169 148 -148 100 425 -509 -448 254 296 -132 -2 -69 42 160 78 -482 -75
7356 -75 524 132 -276 303 28 -158 425 213 -425 192 241 15 -85 34 -319 203 400 -82 -466 171 14
7377 14 -384 194 -88 -223 61 629 -52 -188 -6 -101 -175 288 -163 -147 300 62 -442 147 199 -143 32 208
7399 208 -461 -332 420 -89 -449 57 195 -91 302 -80 -521 317 398 -179 -311 61 -18 -261 455 -273 -497
7420 -497 201 220 -159 -19 -8 -315 -20 325 -154 -317 277 -40 -389 -23 -171 -141 373 220 -358 -122 304
7441 304 12 -188 61 65 -154 387 137 -388 158 114 -34 -42 -19 -88 63 384 -111 -397 250 400 -149 66
7463 66 -136 -240 325 466 -341 -337 346 -75 -98 218 -184 -286 392 220 -414 65 260 86 128 190 9 71
7485 71 630 60 -282 26 272 -184 238 48 -372 277 464 -168 -281 155 90 -225 322 -110 -373 221 298
7506 298 -342 -174 205 -191 179 227 -375 -193 328 145 -254 27 -14 -223 276 238 -471 -50 338 52 -265
7527 -265 -98 -207 -103 309 87 -262 88 342 -179 -242 9 -18 -160 228 -235 -411 302 0 -256 -31 -153
7548 -153 -121 258 345 -262 -54 485 41 -88 120 -56 -257 235 150 -289 -2 365 -15 187 197 -286 -79
7569 -79 379 -46 -260 287 -106 -48 231 47 -304 128 256 -147 -4 303 -22 117 115 -173 -396 227 277 -296
7591 -296 107 234 -99 71 91 -505 -10 374 176 -263 87 -11 -46 448 66 -416 27 363 -29 -99 219
7612 219 -158 131 450 -49 -385 216 372 -182 -44 -6 -195 50 471 -272 -255 298 184 -258 119 100 -171
7633 -171 129 119 -561 -195 145 -96 15 -98 -163 -230 375 -120 -550 73 120 71 -36 -171 -336 -100 312 -160
7655 -160 -519 46 78 -50 39 -317 -360 289 383 -219 -356 119 -8 -30 195 -166 -250 340 97 -445 -91 108
7677 108 -98 145 -14 -187 13 322 31 -424 175 -56 -28 130 49 -303 160 533 -286 -137 111 21 -86
7698 -86 -30 -93 -528 312 427 -206 -138 311 -117 202 322 -437 -269 311 286 -31 -87 184 -86 321 217 -374
7720 -374 3 265 -50 68 218 -133 10 459 -2 -119 292 326 -281 37 212 -209 258 457 -29 -123 120
7741 120 16 -13 189 -101 -161 80 231 -363 -104 229 17 86 180 -246 -187 387 96 -311 42 157 -57 199
7763 199 93 -381 -109 269 -85 -324 189 -151 -151 156 -158 -261 186 153 -187 -79 40 -67 52 187 -281
7784 -281 -259 124 284 -317 -89 68 -56 67 233 -577 -114 334 84 -127 77 -128 -228 440 -65 -492
7804 -492 -174 409 -68 -56 194 -101 152 285 30 -410 313 301 -128 -61 -31 -86 289 527 -339 -154 205 66
7826 66 -152 -13 -29 -59 381 164 -453 -85 304 44 -63 95 -176 146 295 113 -329 32 161 64 64 -66
7848 -66 -203 212 402 -56 -178 179 87 -24 388 87 -120 195 154 -264 -218 267 -17 98 144 -218 -125 392
7870 392 167 -296 74 19 -18 83 -209 -411 77 279 -159 -187 131 -42 21 91 -36 -349 4 283 -178 -169
7892 -169 21 43 -153 63 -190 -317 274 219 -412 130 124 -184 -83 99 -343 -374 212 171 1 112 -144 -245
7914 -245 209 56 -452 122 153 -431 -103 93 -270 138 401 -181 -362 361 267 -112 -34 -65 -296 83 431
7935 431 -433 -270 88 50 -148 231 -92 -137 299 176 -229 -97 283 -86 -28 193 -151 -143 532 56 -86 140
7957 140 166 -140 247 125 -298 66 290 8 -203 165 88 79 288 -165 -312 430 344 -198 18 152 -38 101
7979 101 205 -233 -266 351 136 -184 -77 79 31 336 120 -344 26 239 -185 -133 113 -145 -82 269 -112
8000 -112 -231 12 208 53 -139 61 19 64 304 -180 -241 190 251 -141 -94 217 -188 230 242 -242 -186 224
8022 224 38 -239 80 -115 -21 202 47 -371 -84 357 13 -38 24 -320 -203 365 -23 -128 168 204 24
8043 24 44 -65 -488 134 498 -24 -258 135 0 -63 163 -169 -130 296 207 -248 -146 199 -224 173 17 -402
8065 -402 5 446 -131 -290 -4 28 -84 34 85 -510 -83 431 -34 -215 43 -61 40 217 -46 -384 311
8086 311 178 -317 -127 89 -267 14 389 -11 -255 366 211 35 137 -97 -93 164 260 -129 29 294 241
8107 241 -135 113 146 64 420 13 -182 -2 335 -32 -132 133 -268 -39 346 47 -305 55 60 -117 146
8128 146 -128 -230 221 286 -219 -158 18 19 13 78 -331 -225 270 152 -381 -143 40 -74 62 87 -264 -28 389
8151 389 -11 -272 23 141 131 120 -22 -334 -73 515 -225 -319 -14 -41 42 -36 -272 -327 94 274 -229 -229 -67
8174 -67 -155 70 328 -248 -451 382 147 -284 135 -76 -39 221 61 -466 101 217 106
8191A06
$$ Imaginary data points
##PAGE= N=2
##DATA TABLE= (X++(I..I)), XYDATA
0 0 0 0 0 0 0 0 0 0 0 6 -8 8 -8 8 -12 16 -16 21 -24 25 -32 38 -40 48 -56 63 -72 83 -94 103 -118 132 -147
33 -147 165 -183 204 -227 251 -279 308 -343 377 -418 463 -515 569 -634 711 -794 897 -1016 1162
52 1162 -1345 1582 -1899 2349 -3035 4201 -6562 13211 -68989 -269403 -99681 108597 105158
65 105158 -38778 -121892 -72168 48808 43176 -91619 -140762 -29534 67725 43051 -65989
76 -65989 -128111 -48802 57457 8568 -89409 -50179 40594 35713 -22631 -72599 -80746 -10693
88 -10693 55250 18922 -27136 -4670 32 -35017 -39357 -19895 10641 53304 30171 -57396 -64966
101 -64966 13398 40382 4583 -16780 -8470 23264 36425 -18188 -59710 -6636 46679 31996
113 31996 12925 57 -17901 13395 42070 -20823 -62736 17034 84581 43759 -22614 -52141
125 -52141 -34927 28099 62589 21372 -22324 -24680 -10134 17900 22253 -25320 -29764 41742 56463
138 56463 -10255 -39149 -20247 -109 33425 38848 -18940 -37015 22275 48304 12028 -23883
150 -23883 -38928 -9022 56530 54633 -23302 -53450 -18428 9689 27588 26254 -17002 -36285
162 -36285 -3980 4341 -17312 -19390 -17979 -10701 19685 7609 -48897 -41333 13970 11022 -20291
175 -20291 -22770 -26258 -16514 23396 17558 -35686 -39953 2326 21791 13825 -9890 -29420 -6218
188 -6218 17508 -9068 -16063 25466 25728 -13688 -16404 -3800 677 24966 22594 -28325 -29293 29633
202 29633 38179 -5333 -22370 -5154 25783 35814 -14291 -51934 7537 68511 26481 -40776
214 -40776 -43800 5674 63970 54264 -41662 -82128 6249 76876 31658 -42527 -58669 -4424
226 -4424 65703 40332 -61651 -69114 28608 57840 -10993 -60506 -40708 23240 62808 4816
238 4816 -80629 -54543 37200 55555 -319 -51519 -47657 16128 53028 -5154 -51965 -2256
250 -2256 39833 9025 -20922 -19266 -5887 23197 25405 -21086 -30106 20744 35623 -719 -22977
263 -22977 -18923 5643 32024 9343 -29659 -6292 29238 3820 -22964 -5182 15394 25549
275 25549 18632 -26661 -46260 10561 52810 21250 -17329 -23873 -5376 33545 36978 -19960 -39233
288 -39233 13723 41163 15279 -7732 -16669 -4830 32422 30129 -17812 -23491 17149 31123 14781
301 14781 -11174 -32774 -3412 53918 39763 -20486 -27518 -289 12041 23104 17383 -13779
313 -13779 -10609 21966 15854 -6898 -1240 4729 6834 15319 1710 -16221 4511 18949 -2595
326 -2595 -4972 8805 -2331 -2618 17911 5189 -19826 -11051 627 2838 18083 12696 -20498
339 -20498 -21485 2809 5777 5143 5287 -14231 -16192 9792 3957 -19152 -3092 14373 -250 -9251
353 -9251 -8216 -11826 2814 13715 -11340 -20289 7554 11864 -4728 -3002 -4041 -10546 3820 5494
367 5494 -13635 1532 26725 -189 -32359 -13635 19794 32621 15252 -30802 -40147 18257
379 18257 48067 2209 -31487 -11855 19256 35286 10901 -40665 -30511 41508 51784 -14124
391 -14124 -44802 -8518 38861 47497 -5349 -55973 -14990 58351 45730 -18200 -39136 -12492
403 -12492 29208 44730 712 -36812 1498 40955 9947 -26541 -15475 14344 33672 17097
415 17097 -28804 -29629 23786 36021 -6140 -23147 -6162 10648 20702 3492 -27538 -11128
427 -11128 28219 14491 -19812 -12552 10304 16782 5029 -25852 -31292 18187 43823 -622 -36285
440 -36285 -20683 4247 18588 11372 -24279 -31960 10710 23353 -15719 -33470 -13911 8214
452 8214 17773 -5162 -43162 -28666 19789 17201 -20937 -32626 -20303 5147 28210 1798 -46194
465 -46194 -33290 15009 21122 -1165 -16358 -20668 -601 21332 -1164 -26395 -2636 20977
477 20977 9644 -4045 -13063 -15368 11016 29287 1657 -18033 1319 12455 7593 8044 -1424
490 -1424 -8841 8621 16026 2977 8034 14444 -5433 -8819 13641 16437 8654 10384 -1214 -10253
504 -10253 9944 18659 495 -890 9629 4663 1695 461 -10917 -2894 17955 4776 -16857
517 -16857 -5677 4329 -3567 -114 -1445 -16754 -10154 6220 -1806 -7095 300 -11209 -20223 -549
531 -549 11238 2949 -3594 -16372 -22765 5842 24184 -5317 -24289 -2991 12238 6983 -6003
544 -6003 -23174 -12485 24786 19640 -25940 -31438 4212 22470 11792 -18121 -39806 -7244 39857
557 39857 17649 -37030 -35430 4726 24231 12801 -18987 -31117 5900 32065 -2016 -32756
569 -32756 -12506 17614 24874 6377 -27695 -26589 21932 37082 -5336 -26781 -5499 13659
581 13659 17230 4978 -17211 -9671 19801 13540 -12585 -6617 10608 9635 1870 -9910 -13658 13815
595 13815 30227 -1790 -25707 -2967 18440 14973 2291 -14593 -10863 20666 22326 -14035 -21252
608 -21252 7392 19464 9823 -8965 -27228 -9733 28929 19184 -25741 -31864 -2738 16538 14712
621 14712 -11587 -36328 -14840 19980 9052 -18782 -18921 -7292 4840 11599 -9371 -26833 555
634 555 24554 2013 -19062 -10419 4364 17747 17897 -8573 -19063 8689 22721 7243 -1675
647 -1675 -1201 1199 14127 14136 -5627 -2651 17908 10563 -4933 2122 7791 6410 10145 1968 -8799
662 -8799 7003 19432 2514 -3943 7742 5842 170 4139 1546 3716 17394 7684 -15403 -6585
676 -6585 15611 14456 3381 -6290 -11924 3879 18945 -550 -17248 -649 8861 -603 -1337 -2694
690 -2694 -9520 -137 5224 -10529 -9913 8470 4877 -8657 -5509 -2980 -3939 2866 264 -5491 6157
705 6157 5868 -15720 -13992 9548 13267 2348 -7096 -17113 -6704 19499 10014 -22898 -18919 8726
719 8726 14390 2971 -14501 -24700 -2908 21873 1626 -25496 -11236 11635 10710 -5064 -22764
732 -22764 -18770 16506 29356 -4998 -26460 -8065 10125 13616 5805 -11216 -6705 20361 17048
745 17048 -13753 -12884 11112 15354 7350 25 -6205 4884 19141 3234 -15134 -592 16305
758 16305 13337 5203 -6017 -10150 7028 15031 -3064 -4691 13810 11761 -3334 -6205 -6648 835
772 835 20288 14821 -12135 -11367 8461 9739 1669 -4414 -9371 3478 20484 4301 -20144 -11089
786 -11089 6900 8539 3923 -7457 -12914 6510 16878 -9419 -25200 -4865 13817 15176 5375
799 5375 -17461 -22779 6586 20591 -1466 -12236 382 6274 5977 507 -12965 -7873 14533
812 14533 13152 -5359 -6168 -482 71 3729 -873 -10504 1888 15251 -690 -13589 -3330 -371
826 -371 -4574 1276 1862 -2352 4006 -313 -18167 -11963 9970 10533 -1444 -7531 -11125 -2251 10394
841 10394 -1441 -15945 -1077 13116 3497 -6618 -9034 -8424 4881 11236 -6972 -12642 7507
854 7507 10091 -6560 -10283 -5614 -253 11140 8189 -10460 -9339 5144 605 -6204 1860 5490
868 5490 3128 2287 -7335 -10267 7012 11352 -5227 -5418 6703 3619 -1006 -674 -6395 -1154 13875
883 13875 5082 -12764 -2864 11137 3469 -5695 -7261 -3185 12420 16008 -8782 -20580 -586
896 -586 12857 6864 -1008 -8858 -6283 10918 9684 -13163 -12082 8890 11091 644 -5269 -10215
910 -10215 -2333 14105 5776 -13543 -6015 8579 4608 -1190 -3843 -7560 1019 10200 -1063 -8234
924 -8234 3101 4674 -4583 -3735 -1362 210 9022 4909 -13342 -8704 10135 6905 -4043 -2927
938 -2927 -3067 -758 8254 1616 -11931 -2312 10831 3540 -4165 -4578 -4683 4933 11762 -4224 -13904
953 -13904 1859 10771 3392 -1032 -6403 -8172 7628 13802 -5005 -11464 2454 6233 1165 40
967 40 -5356 -3261 10380 5878 -12547 -8278 7977 7184 318 -5021 -9876 331 13198 1072
981 1072 -12761 -2698 6078 1259 -1107 -4043 -6386 5594 9160 -8156 -11060 6137 7268 -3951
995 -3951 -4749 -3896 -658 8011 2415 -11778 -4849 7773 1010 -5689 -2444 -1697 2142 4386 -8585
1010 -8585 -12411 6930 12798 -4319 -10552 -4356 197 7187 5730 -9369 -8030 9503 7335 -5558
1024 -5558 -3279 1748 3009 7210 2437 -6979 2043 11651 433 -5372 4060 6296 4412 5040 -2330
1039 -2330 -4235 8199 7866 -5046 -148 10663 3986 -2492 -2128 -3543 4965 14851 1864 -12151
1053 -12151 -1062 9594 3824 -711 -2740 -2680 7753 10115 -6594 -10309 4616 6826 -983 -1326
1067 -1326 -2715 -2116 6642 1287 -14157 -7145 9003 5143 -3880 -5669 -8673 -3751 5597 -1674 -10200
1082 -10200 -23 5410 -4093 -6989 -5272 -5337 3257 7934 -4927 -9134 1917 2329 -3804 -961 -781
1097 -781 -1788 6632 5692 -7802 -5695 4246 872 -1395 4012 865 -1302 3781 -3056 -10447 1328
1112 1328 10507 2884 -1424 -3012 -6092 1435 7880 -2612 -6250 6957 8305 -1220 -2780 -3583 -2825
1127 -2825 9610 11068 -4175 -5393 6766 5651 -831 -1295 -2904 3200 14360 6023 -10524 -6197
1141 -6197 3942 2820 3104 3131 -3055 363 5928 -4843 -9959 2992 7853 843 -380 -1562 -4895
1156 -4895 1470 2806 -6233 -1633 10592 3994 -6159 -3583 -1825 -473 4413 -97 -5657 4605
1170 4605 8208 -6839 -11829 -2130 2891 5588 4314 -7889 -9557 4202 2480 -9719 -4248 5819
1184 5819 3625 24 -4470 -10349 -1337 9844 1044 -7140 2872 7016 1262 -1782 -5673 -4303
1198 -4303 10030 12776 -3614 -5704 4818 3639 -1898 -601 -882 3479 11847 1998 -13200 -5015
1212 -5015 7618 3658 -1196 -1372 -2545 2845 5082 -8437 -12105 5210 11369 -274 -6177 -5464
1226 -5464 -1872 6750 3116 -12129 -6681 11830 8849 -5240 -9401 -7746 602 11427 3461 -11682
1240 -11682 -5043 6383 329 -6274 -5098 -3775 3473 8306 -4028 -12338 -2190 3710 -1034 -379
1254 -379 -763 -4159 2457 4944 -6329 -6619 4891 4783 -294 2216 13 -2380 4490 2657 -5580
1269 -5580 723 9810 3874 -1699 -1746 -4075 1465 9766 1591 -6677 1733 6180 -589 -1385 -929 -2618
1285 -2618 4997 8330 -3880 -6834 4485 4878 -1005 509 -135 -432 7723 5406 -6875 -3597 6808
1300 6808 4603 992 1189 -2082 205 6968 -35 -7238 1687 6574 -32 -1246 -1323 -4860 835 6265
1316 6265 -3197 -7219 1894 1663 -3480 -500 -670 -4288 398 1894 -4365 -859 3468 -3715 -5345
1331 -5345 2375 1798 -2070 15 -2818 -3994 4499 3213 -8075 -4188 5386 1540 -2984 -2548 -4952
1346 -4952 -60 7745 -1332 -11499 -1779 6663 977 -2478 -3557 -4352 3588 6327 -5283 -6846 5308
1361 5308 5726 -2392 -2465 -1847 669 7857 2666 -9170 -1844 10405 3830 -4974 -2502 -45 3972
1376 3972 7443 -2765 -9904 2390 9303 -705 -5746 -2263 1052 6496 4135 -9001 -8240 7458
1390 7458 8003 -2882 -4605 -2141 731 6864 2307 -9331 -2802 9882 4210 -4760 -3231 -821
1404 -821 2878 6854 -1359 -9147 1939 9550 595 -5175 -3261 -671 5651 7341 -4941 -8530 3828
1419 3828 6258 -1354 -1836 -1862 -1239 6284 5077 -7871 -5865 6753 5484 -935 -988 -2665 -670 7201
1435 7201 2581 -7017 -1725 5983 2611 -179 -890 -4160 1326 7181 -1768 -6675 2769 5118 -1870
1450 -1870 -2277 -2191 -2703 4934 5586 -6750 -7127 4044 3467 -2058 -1615 -3158 -1351 5583 963 -8781
1466 -8781 -3017 5691 1374 -2300 -1900 -4286 406 5778 -2392 -7655 1267 3957 -1932 -1030 -963 -4444
1482 -4444 463 4229 -3141 -3589 3171 -249 -4298 447 970 -1900 1928 741 -4380 212 2911
1497 2911 -3111 -1413 4203 -256 -2337 1822 -660 -2260 3708 1603 -4717 1516 5748 -1623 -3219
1512 -3219 1151 252 1656 4303 -2455 -4292 4822 4941 -3921 -2781 1850 2408 5041 1214 -7977 -2611
1528 -2611 8768 3916 -4611 -1786 845 1876 4655 -1673 -8299 1973 9253 -433 -5710 -448
1542 -448 1574 2482 2463 -4911 -4604 6890 6554 -5178 -5696 1114 3430 4684 264 -7948 -1133 9595
1558 9595 1936 -8448 -3251 3695 4498 3867 -3872 -9552 1879 10363 -194 -7882 -2171 2454 4440
1573 4440 3103 -6445 -7522 5135 8070 -2443 -4902 -662 773 3973 1893 -6937 -3719 8275
1587 8275 4778 -5432 -3950 -415 1455 5274 167 -8117 -1291 7786 954 -5693 -3187 -245 2855
1602 2855 4926 -4197 -9089 1782 6793 -1459 -4858 -2521 -701 4603 4048 -7548 -7654 4987 5734
1617 5734 -2580 -3205 -1620 -582 4623 1405 -7539 -2637 6828 2452 -4139 -2737 -1222 1492 4917
1632 4917 -2128 -7834 1502 6709 -951 -3711 -1534 -1211 3040 4844 -3837 -5731 4689 5171 -2224
1647 -2224 -1716 65 64 5127 4330 -4331 -2327 5461 2933 -294 1906 -21 -262 5124 2662 -3161
1663 -3161 738 3557 -617 1439 3913 -1609 -1399 3793 707 -2000 2578 1164 -1860 3105 3092 -3981
1679 -3981 -1346 3840 915 168 1466 -2164 -772 4710 87 -5183 899 3904 -297 -571 -1280 -3875
1695 -3875 1605 4727 -4563 -6579 2476 3326 -2086 -3422 -5124 -3350 4733 3158 -7677 -6299 2500
1710 2500 2035 -1809 -3392 -5631 -246 7525 417 -9092 -3313 4447 2065 -8 -2828 -4780 2818
1725 2818 7336 -2740 -8399 529 5132 1969 -186 -4000 -4012 4839 5245 -5621 -5503 3462 4886
1740 4886 1199 -2148 -6314 -1398 8651 4080 -6826 -3550 3686 3848 2499 -1944 -6375 1556 10501
1755 10501 2520 -6662 -2121 3117 3654 3250 -2401 -5447 3836 8105 -1874 -6266 -810 2393 4029
1770 4029 2676 -5199 -5245 5804 5328 -4735 -4877 1225 3034 3991 -185 -7703 -1941 8769 3750
1785 3750 -5905 -3423 1966 4530 4496 -3275 -8325 1843 9783 1393 -5702 -2945 704 4247 3627
1800 3627 -5031 -6701 4332 6502 -2660 -5064 -1593 254 3683 2323 -5668 -3804 5465 3359 -3794
1815 -3794 -2321 55 1006 3985 893 -4999 26 5560 281 -2795 531 543 1528 4449 -1229 -5266
1831 -5266 1487 4395 -825 -1034 159 -2309 523 3612 -2476 -4745 929 1506 -672 1285 -1411
1846 -1411 -5002 466 3201 -2195 -2612 561 -750 556 1767 -4187 -5332 3277 3892 -2300 -2543 -1246
1862 -1246 -1746 1847 1280 -6039 -3492 5303 2129 -4435 -3724 -2434 72 3962 -943 -6879 -371 5616
1878 5616 -376 -4840 -3189 -1001 4597 6083 -3318 -7797 2344 6508 271 -2160 -1174 844 6073
1893 6073 4604 -6026 -5794 4992 6887 1012 -1445 -2565 445 6381 1960 -6918 -2010 6921 4703
1908 4703 -296 -2493 -4200 1464 7233 409 -5829 1387 6144 1311 -2022 -3208 -1880 5940 8045
1923 8045 -2682 -6768 1895 5002 1395 -1008 -3203 -415 7601 4789 -6561 -6165 2674 4646 2489
1938 2489 -795 -5454 -830 6961 891 -8142 -3364 4565 4372 1390 -4010 -7475 344 7350 -215
1953 -215 -6222 -899 3084 1676 -581 -5583 -4811 5126 6644 -3776 -6146 -5 1847 870 -1081
1968 -1081 -5536 -2109 7131 3348 -7194 -5917 774 2400 2469 -710 -5989 -909 5613 -177 -6026
1983 -6026 -1672 2102 2852 2845 -2528 -6071 857 5313 -556 -2488 1019 369 1041 2288 -2775 -4051
1999 -4051 3151 4103 -1361 -1029 598 -1705 552 1911 -2135 -1224 3879 1193 -2360 -744 -1034 -982
2015 -982 3699 2382 -3535 -1373 2633 -179 -438 935 -2007 1 5352 1121 -4870 -1104 2446
2030 2446 1587 2075 -189 -3841 1059 5767 -292 -4337 -131 2448 2801 2540 -2758 -4898 2983 6019
2046 6019 -1155 -3000 651 1212 2586 1762 -4203 -2789 5601 4382 -3348 -2774 1061 1891 3279 244
2062 244 -5204 -419 6327 1929 -4221 -2365 317 2592 4062 -2264 -6588 1582 6044 -652 -4202
2077 -4202 -1825 -180 3119 3514 -4562 -6605 2795 5236 -1179 -3432 -2552 -757 3847 2355 -5545
2092 -5545 -4101 3815 2774 -2269 -2612 -2438 362 4560 -265 -7057 -1580 5065 1261 -2625 -2654 -2252
2108 -2252 2660 5244 -2943 -7297 969 5737 845 -2416 -3251 -1768 4530 4219 -4881 -5519 3310 4971
2124 4971 557 -2607 -4203 -542 6536 3158 -5861 -3315 3649 2946 -12 -1592 -3028 1155 6284
2139 6284 375 -5900 -603 4131 1847 -341 -1883 -2216 3158 4542 -2682 -4681 1583 3639 916
2154 916 168 -2982 -2452 3909 3591 -3826 -2871 2844 1923 83 -411 -3500 -1320 5064 2595 -3715 -1613
2171 -1613 1195 478 1593 419 -3419 -119 4444 598 -2608 -317 -259 252 3253 385 -3757 544
2187 544 3105 -1363 -1666 537 -504 949 3169 -2174 -4485 960 2897 -527 -569 -480 -1356 2002 2058
2204 2058 -3880 -3102 3338 2616 -286 -929 -2971 -1381 4669 2358 -4554 -1938 3536 1714 -601 -2011
2220 -2011 -4055 327 6009 1030 -5192 -1971 1640 913 510 -1708 -3348 1959 4759 -2279 -5212
2235 -5212 -131 1919 1539 1151 -2899 -3376 3314 3191 -4135 -3446 1697 1944 1416 -359 -4911 -2428 4596
2252 4596 2165 -3924 -2376 1125 1722 1594 -2386 -6051 481 6571 1323 -4352 -2631 -285 2134
2267 2134 3284 -2079 -4965 2791 6299 -609 -4000 -1099 1457 4163 3797 -2963 -3500 4341 4640 -1616
2283 -1616 -2492 262 2675 5212 1281 -5536 -1716 5689 3055 -2285 -1668 328 2431 4045 -1720
2298 -1720 -6567 641 6818 1678 -3215 -2455 -907 3181 3944 -3157 -5305 2512 4885 -377 -2917
2313 -2917 -2803 -825 3776 2928 -4181 -3438 2928 1912 -1923 -1652 -2026 -450 4183 631 -5365 -2223
2329 -2223 2601 347 -1329 -799 -1847 241 3069 -1452 -4687 60 2575 -50 -326 -1050 -2737 1443
2345 1443 3049 -2614 -3490 1546 1659 105 429 -2508 -3382 2594 3095 -2552 -2404 524 -134 576 872
2362 872 -3151 -2513 3438 2071 -2380 -1223 -292 -177 2411 780 -3916 -338 4154 1138 -1757 -603
2378 -603 -523 876 4051 290 -3718 948 4377 247 -1350 -139 -115 2711 3832 -1968 -4060 2066
2394 2066 3828 33 -937 -1637 -843 3787 3081 -3997 -3714 2664 2704 356 -314 -2836 -908 4259 1621
2411 1621 -4462 -1596 2789 1775 225 -1041 -3171 605 4680 -2 -4034 -200 2200 622 416
2426 416 -1894 -2941 2630 4288 -2234 -3605 1301 1931 622 -80 -2873 -1661 4769 3499 -4000 -3481
2442 -3481 1602 2587 2278 -195 -4001 -539 5487 1873 -4327 -1823 1630 2361 2537 -1718 -5155 729
2458 729 5202 -296 -4369 -958 874 1611 1498 -3287 -4931 2235 4259 -1977 -3310 -774 120 1599
2474 1599 558 -4213 -2396 4067 2323 -3287 -2530 -384 519 2568 -212 -4499 -523 4435 351
2489 351 -3353 -1318 -381 956 3004 -742 -4312 289 3112 -820 -1712 23 -733 1265 2406 -2211
2505 -2211 -3132 2009 2013 -867 429 -247 -1572 1639 1962 -2670 -1289 2811 884 -669 632 -868
2521 -868 -1186 2725 1312 -2709 29 2736 333 -86 -6 -2026 403 4320 570 -3116 -49 1390
2537 1390 492 1837 -143 -3015 1606 4478 -587 -2418 503 745 1480 2709 -1164 -2698 2408 3296
2553 3296 -1138 -1379 90 -126 2134 2059 -2716 -2598 2500 1596 -1508 -469 -227 -484 2254 654 -3964
2570 -3964 -742 3607 391 -1894 -540 -832 405 2750 -921 -4191 711 3314 -238 -1494 -1494 -1544
2586 -1544 1691 2701 -2673 -3566 2049 2064 -885 -939 -1514 -1320 2982 2146 -3813 -2778 2090 1498 -442
2603 -442 -752 -2206 -679 3512 694 -4119 -894 2551 274 -329 -924 -2510 1381 3874 -1472 -4397
2619 -4397 412 2350 414 -122 -2038 -2620 2814 3421 -3004 -3519 1364 1667 612 -227 -2753 -1678
2635 -1678 3746 2005 -3441 -2097 1483 1283 1199 -521 -3584 -258 4411 871 -2918 -47 1196 106
2651 106 1557 -306 -2731 1392 3539 -1115 -2375 1313 1017 455 1393 -1216 -1720 2995 2626 -2130
2667 -2130 -1323 1272 657 1490 1378 -2406 -970 3692 1032 -2157 -111 998 201 2080 779 -3228
2683 -3228 -22 3237 315 -1321 329 -590 -32 2560 -173 -2615 705 1828 -583 -228 246 -1881
2699 -1881 368 2118 -1277 -2176 1682 781 -1362 259 -500 -2081 1394 1853 -2514 -1838 1472 12
2715 12 -508 394 -1790 -1530 2498 823 -3057 -913 1248 -65 811 187 -3135 -658 3420 105 -2789
2732 -2789 -289 128 19 1850 -451 -3479 252 3137 -509 -1882 58 -525 346 2160 -1393 -2804
2748 -2804 1584 1859 -1951 -997 166 -713 1566 1338 -3135 -1507 3139 911 -1910 -429 -69 140
2764 140 2218 -4 -3535 144 4039 464 -1854 -372 -302 1318 2998 -1681 -3542 1899 3426 -291
2780 -291 -1399 -824 -834 2381 3082 -2304 -2651 2483 1697 -1011 -469 -436 -175 3041 1328 -3569 -1263 2785
2798 2785 787 -742 70 -939 402 2839 -329 -3755 564 2754 212 -91 -495 -1833 921 2733
2814 2733 -1737 -2701 1840 1853 -377 -109 -1511 -2017 2354 2825 -2011 -1489 1610 246 -202 677 -1138
2831 -1138 -869 2869 1157 -2309 -98 882 -832 305 1104 -1398 57 2244 -1052 -2588 952 839
2847 839 -758 1099 157 -2199 508 1682 -2072 -1406 1155 144 -464 525 -1885 -2594 1854 1426 -2004
2864 -2004 -656 292 -1184 538 1060 -2585 -1732 2483 1019 -1310 52 -1046 -1721 1659 1379 -2249
2880 -2249 -710 1649 -376 -572 475 -1506 -447 2952 497 -2312 142 988 -673 996 745 -1726
2896 -1726 616 2833 -735 -2056 1067 806 -202 1381 -201 -1691 1878 2214 -1800 -1084 1432 536
2912 536 764 1209 -2071 -1657 2776 1475 -1787 -374 870 -284 1438 889 -2783 -419 3313 574
2928 574 -1429 539 191 -159 1974 -231 -2504 1266 3057 -757 -1380 436 -212 868 1821 -1575
2944 -1575 -1750 2327 1712 -2146 -991 648 -29 1723 919 -3296 -1216 2920 740 -2316 -959 -375
2960 -375 228 2440 -378 -3748 -477 2492 -69 -1220 -192 -1200 97 2317 -1456 -3032 949
2975 949 1906 -843 -281 -293 -2068 507 1789 -2142 -1690 1774 582 -1362 -112 -537 -1181 1441 861
2992 861 -2110 -112 1877 -657 -1167 531 -838 186 2689 -311 -2672 649 1396 -647 364 835
3008 835 -1607 431 2228 -1291 -1963 1104 462 -558 1159 -41 -1831 797 1423 -1444 -322 1420
3024 1420 -511 205 1452 -1275 -1500 1756 721 -1004 1047 856 -1358 525 1366 -1533 -247 2300
3040 2300 88 -878 1247 51 -1019 1736 729 -1886 611 2147 -537 -169 542 -1405 307 2988
3056 2988 -49 -2313 588 989 -480 789 -128 -1888 1132 2729 -1314 -2052 711 333 361 1256 -1120
3073 -1120 -1902 1835 1569 -1822 -912 813 -264 840 857 -2094 -1295 2266 195 -2123 401 1006 -432
3090 -432 321 -243 -2604 486 2772 -870 -2326 365 297 -159 773 -1522 -2306 2011 2204 -1889 -1655
3107 -1655 311 -190 825 1011 -2372 -1598 2710 815 -2492 -953 145 -574 1221 564 -2828 -732
3123 -732 2270 -392 -1943 229 -62 11 1285 -792 -2420 1015 1939 -1188 -1117 587 -451 612 1454
3140 1454 -1860 -1828 2179 1617 -1293 -107 262 -558 1257 1411 -2020 -587 2374 443 -826 482
3156 482 -271 -652 2016 742 -1473 583 1550 -829 80 1138 -970 -377 2017 -376 -1101 1391 512
3173 512 -1475 776 1211 -851 479 1535 -1058 -622 1702 -82 -860 1120 45 -994 1380 844
3189 844 -1664 -221 1451 -690 148 1202 -1161 -962 2153 357 -1512 441 283 -791 1045 856
3205 856 -2220 -643 1847 18 -591 523 -959 -658 1956 44 -2507 77 1291 -681 122 166
3221 166 -1854 -226 1923 -910 -1945 901 552 -851 183 -775 -1818 1048 1618 -1889 -1519 1042
3237 1042 139 -399 44 -1390 -962 2152 666 -2801 -701 1205 -389 302 -39 -2007 -165 2610
3253 2610 -417 -2500 115 854 -110 938 -416 -2140 608 2001 -1195 -1245 1213 480 11 724 -1042
3270 -1042 -1313 2062 1225 -1785 -181 1435 -125 451 508 -1669 -157 2806 321 -2066 420 807
3286 807 189 1150 102 -1948 1098 2700 -543 -1599 544 567 990 1716 -782 -2052 1725 1844 -1305
3303 -1305 -327 449 -398 981 1631 -1573 -1358 1868 781 -951 456 482 -545 1160 679 -1851 -134
3320 -134 2014 -236 -819 748 -404 -418 1297 -243 -1930 971 1223 -1217 -405 534 -973 135 1687
3337 1687 -1248 -1389 1140 435 -1261 292 -218 -1605 634 1324 -1435 -915 686 -953 -554 1079
3353 1079 -932 -1393 1056 503 -1574 64 206 -1282 303 1138 -1650 -1030 1458 -101 -1471 327
3369 327 20 -642 1064 233 -2023 -28 1559 -767 -792 649 -492 23 1471 -1133 -2227 1510 1728
3386 1728 -622 -158 27 -988 1044 1572 -1752 -1671 1863 1284 -451 135 -708 -678 2123 1419 -2067 -456
3404 -456 1706 431 -205 82 -1246 306 2755 184 -2302 309 1673 -139 220 -34 -1047 1132
3420 1132 2217 -1485 -1969 1420 1392 -194 264 -743 -806 1973 1336 -2250 -970 1848 1061 253 66
3437 66 -1661 -390 2925 769 -2248 -94 1713 155 289 -227 -1609 484 2498 -473 -1959 604
3453 604 743 -146 524 -690 -1551 1645 1803 -1679 -1334 838 279 -173 546 -1192 -993 2153 627 -2275
3471 -2275 -590 852 -110 539 62 -2395 -772 2142 -106 -2142 -228 191 -79 1315 -333 -2296
3487 -2296 78 1816 -575 -707 374 -716 32 1203 -1024 -2054 1119 1179 -1078 -176 92 -1104
3503 -1104 250 1102 -1248 -860 1541 -41 -1142 204 -190 -842 1203 751 -1505 24 1480 -578
3519 -578 -657 419 -714 -186 2128 99 -1701 301 850 -378 785 538 -1389 313 2219 -376
3535 -376 -1289 478 225 306 1444 -380 -1702 1181 1679 -772 -562 631 117 878 1330 -1285 -1276 1901
3553 1901 1430 -956 263 470 -180 996 663 -2211 -238 2740 812 -1209 -216 -247 264 1857 -410
3570 -410 -2436 805 2491 -77 -1336 -654 -599 1206 2297 -1342 -2431 1191 1654 -904 -873 -490 -375
3587 -375 1653 1391 -2292 -2034 1341 757 -551 -170 -819 -205 1513 -178 -2775 -303 1653 41 -656
3604 -656 -547 -1315 193 1669 -1142 -2433 911 1840 -632 -1040 -1216 -1138 1403 2010 -1724 -2132 1117
3621 1117 1036 -314 -565 -1464 -380 2493 1276 -2423 -1368 926 328 -107 314 -1495 -118 2248 225
3638 225 -2354 -149 1151 205 785 74 -1442 366 1856 -757 -1272 910 794 280 798 -907 -1265
3655 -1265 1520 1821 -939 -566 1041 156 503 883 -1246 -1057 2287 1385 -1244 -247 182 -210 1130
3672 1130 775 -1351 -140 2105 175 -975 89 -79 -231 1354 124 -1617 223 1458 -516 -309
3688 -309 672 -387 277 1489 -542 -1623 934 761 -550 155 94 -933 917 1194 -1584 -1130 1228
3705 1228 514 60 313 -996 -1064 1705 1031 -2112 -1037 1100 227 319 -138 -1815 -614 2424 345
3722 345 -2063 -517 468 239 866 -531 -2326 136 2102 -420 -1622 -276 -30 708 1055 -1209 -2054
3739 -2054 1328 1502 -1617 -1251 266 93 871 510 -2213 -1376 1980 853 -1787 -893 -6 341 1412
3756 1412 -138 -2621 -296 2292 169 -1453 -321 -88 757 1738 -979 -2699 954 2321 -287 -987
3772 -987 -420 -439 1121 1747 -1581 -1960 1451 1694 -424 -531 -475 -277 1718 1044 -2153 -678 2220 866
3790 866 -623 -218 -443 157 2383 360 -2369 142 2136 19 -510 -272 -742 1072 2435 -978 -2178
3807 -2178 936 1747 47 -214 -611 -943 1632 1759 -1854 -1373 1284 887 179 353 -976 -978 1964 1061
3825 1061 -1879 -539 1152 379 -47 119 -1433 -87 2025 -264 -1773 117 796 -187 422 -644
3841 -644 -1696 588 1782 -1048 -1628 325 248 -80 758 -1049 -1768 1108 1290 -1349 -1008 295 -386
3858 -386 584 689 -1630 -1246 1308 690 -1104 -330 -513 -723 1195 598 -1889 -844 1398 79 -559
3875 -559 147 -806 -555 1615 -60 -2018 -71 1190 -358 -54 38 -1058 386 1647 -796 -1823 703
3892 703 891 31 93 -664 -1104 1597 1525 -1629 -1474 1381 1184 189 153 -1643 -922 2415 1402 -1763 -750
3911 -750 1182 774 618 -156 -1806 141 2899 416 -1812 -91 881 423 917 -483 -1577 1336 2446
3928 2446 -956 -1454 367 643 887 946 -1104 -1153 2039 1472 -1711 -1146 845 731 1247 377 -2156 -776
3946 -776 2601 879 -1556 -551 562 614 1511 -428 -2887 126 2840 165 -1211 -267 -324 389 1293
3963 1293 -913 -2067 1107 1931 -902 -1450 -326 -490 926 1153 -1550 -1518 1533 796 -1437 -914 -393
3980 -393 -85 1643 237 -2567 -744 1699 221 -1102 -222 -444 105 1671 -707 -2696 22 1754
3996 1754 31 -383 -516 -1120 458 1444 -1000 -1620 890 1191 -248 -188 -932 -1416 1219 1187 -1314 -888
4014 -888 1164 135 -320 213 -827 -421 1754 957 -1500 -388 867 -62 213 246 -1323 217 2097
4031 2097 -300 -1656 220 814 457 1321 -87 -1641 746 1779 -392 -951 560 280 594 1309 -1021
4048 -1021 -1752 1321 1493 -352 -395 -15 -271 949 991 -1663 -1344 1715 976 -628 -52 -561 -617 1688
4066 1688 672 -1873 -190 1827 236 -642 -261 -927 87 1862 -326 -2101 367 1441 -246 -558
4082 -558 -591 -870 1197 1926 -1387 -2307 640 1068 -54 -277 -973 -1008 1799 1142 -2257 -1518 1247 807
4100 807 108 88 -1535 -657 2013 630 -2167 -835 1012 399 1 -654 -1704 273 2158 -606 -1766
4117 -1766 176 771 128 301 -1267 -1676 1247 1912 -1560 -1848 665 562 399 179 -1682 -1244 2213
4134 2213 1224 -1483 -1337 417 476 919 324 -2000 -381 2163 515 -1602 -356 169 237 1412 -179
4151 -179 -2345 419 1961 -229 -1035 148 54 593 1403 -1095 -1545 1281 1606 -793 -454 306 112 960
4169 960 845 -1680 -653 2016 967 -765 -121 12 -29 1643 594 -1720 -111 1833 610 -678
4185 -678 -178 -736 246 1730 134 -1790 382 1238 -82 106 41 -1065 728 1728 -654 -1377 733
4202 733 415 -294 495 -236 -1018 1077 1177 -1414 -819 846 -1 -78 451 -1152 -786 1510 453 -1477
4220 -1477 -309 452 50 399 -65 -1804 -355 1801 107 -1318 -66 109 -35 1026 -431 -2220
4236 -2220 354 1940 -341 -1009 -258 -588 356 1085 -1233 -1971 1017 1241 -833 -637 -399 -678 1270
4253 1270 1018 -1793 -938 1751 644 -1082 -521 -449 105 1671 286 -2455 -188 1758 238 -846
4269 -846 -393 -804 836 1954 -945 -2284 591 1763 329 -255 -507 -957 1419 1632 -1333 -1819 1174
4286 1174 1215 -53 127 -1017 -658 1872 1269 -1566 -762 1289 706 129 -67 -1014 -79 1965 358 -1764
4304 -1764 52 896 209 224 -387 -882 1059 1937 -719 -1677 513 856 156 674 -921 -1249 1495 1535
4322 1535 -1424 -1178 611 714 752 506 -1549 -974 1759 782 -1414 -449 451 67 660 69 -1897 -210
4340 -210 1700 -92 -1247 -19 41 -46 768 -521 -1746 754 1503 -796 -961 180 -249 118 893 -1049
4358 -1049 -1423 1043 828 -1087 -720 -180 -360 828 883 -1897 -949 1301 432 -872 22 -597 -563 1458
4376 1458 550 -1811 -594 978 97 25 190 -1031 -152 1468 -146 -1473 156 730 -168 413 -287
4393 -287 -1080 491 1609 -629 -984 972 542 -159 503 -491 -1168 1316 1296 -877 -544 695 155 255
4411 255 467 -1315 -399 2040 903 -1237 -212 597 152 944 382 -1623 203 2004 -52 -1132 102
4428 102 45 419 1336 -359 -1623 717 1532 -435 -636 265 -40 676 922 -1100 -1441 1436 992 -860
4446 -860 -175 140 3 1148 530 -1857 -610 1801 534 -558 -187 -656 34 1620 -180 -2016 -65
4463 -65 1381 66 -640 -347 -997 688 1706 -798 -1798 543 904 -414 -363 -302 -970 966 1153 -1194
4481 -1194 -1410 998 599 -259 -133 -804 -310 1414 366 -1993 -561 1097 254 -297 -219 -1011 -5 1616
4499 1616 -494 -1896 311 974 -138 63 -516 -1401 682 1610 -982 -1375 621 519 3 320 -928
4516 -928 -1129 1198 1252 -1286 -553 623 -59 305 502 -1006 -440 1413 258 -1194 49 428 -184 739
4534 739 440 -1283 228 1673 -97 -876 655 245 70 1095 -347 -1207 686 1258 -634 -255 319
4551 319 -208 462 1340 -766 -1154 978 866 -437 336 -98 -442 921 1038 -984 -452 1162 415 55
4569 55 378 -692 -500 1539 581 -1571 -192 991 -188 0 140 -1039 138 1353 -317 -1334 320
4586 320 737 -287 231 -225 -1000 617 1321 -1220 -1301 751 387 -44 257 -1172 -1214 1313 975 -1393
4604 -1393 -943 313 163 507 402 -1533 -713 1465 113 -1444 -358 220 -128 740 -95 -1620 -9
4621 -9 1481 -318 -951 123 -262 -61 651 -667 -1496 872 1234 -752 -565 73 -191 524 605 -1353 -872
4640 -872 1635 929 -812 -338 -35 36 1082 406 -1396 -285 1513 473 -671 -141 -414 280 1551
4657 1551 -31 -1323 365 1376 -319 -134 148 -409 651 1348 -819 -1225 999 744 -187 18 29
4674 29 -421 885 1023 -1181 -456 1438 552 -155 167 -665 -40 1508 300 -1276 26 1191 41
4691 41 -29 72 -1190 128 1659 82 -1080 129 425 -230 420 -147 -1015 629 1258 -669 -944 171
4709 171 -107 -57 734 -483 -997 544 613 -954 -228 340 -296 251 626 -944 -712 978 119 -654 253
4728 253 276 -537 479 24 -1434 -186 1075 -154 -809 169 -532 -250 930 -293 -1441 435 937
4745 937 -509 -278 -246 -1034 426 1300 -609 -1157 630 345 -455 76 -282 -605 742 824 -1009 -778 540
4764 540 8 -85 377 -593 -430 1171 175 -1324 130 635 69 -47 13 -906 218 1231 -265 -1166 516
4783 516 799 168 401 -325 -1139 798 1336 -593 -952 571 402 321 486 -805 -851 1325 963 -698 -289
4802 -289 215 21 755 454 -1113 -369 1545 179 -891 202 161 133 575 106 -1116 357 1235 -248
4820 -248 -741 296 179 303 776 -595 -898 1034 916 -669 -349 238 -124 564 749 -1136 -775 1311
4838 1311 353 -762 -49 16 -249 645 80 -1410 -158 1124 -146 -505 64 -517 -207 899 -187 -1367
4856 -1367 388 771 -585 -301 120 -702 84 846 -811 -1042 395 225 -770 -26 -274 -674 430 648
4874 648 -1026 -559 530 -100 -309 298 -969 -616 1134 355 -1364 -158 616 -227 532 219 -960 -247
4892 -247 1030 -87 -753 428 89 -186 619 200 -917 222 898 -332 -122 330 -363 114 705 -451
4910 -451 -818 774 734 -595 316 520 -299 494 810 -803 -290 1154 274 -402 175 -57 -87 1098 383
4929 383 -844 108 1002 147 -439 63 -424 290 1516 -97 -1215 249 765 -8 233 67 -711 585
4947 585 1197 -698 -753 636 442 52 239 -370 -731 752 463 -1005 -207 750 235 -104 43 -728 -132
4966 -132 1166 38 -1142 119 565 -80 -26 -181 -977 150 1486 -370 -1251 4 186 -91 323 -386
4984 -386 -955 538 944 -789 -767 251 -283 -56 494 -864 -597 1006 345 -945 -161 533 -227 268
5002 268 327 -959 -73 913 -272 -785 145 168 9 529 -109 -1031 244 951 -395 -510 433 -47 193
5021 193 1033 -735 -881 766 959 -407 69 -1 -349 481 688 -588 -462 1002 472 -91 344 -127 -484
5040 -484 936 596 -658 123 531 -108 -83 487 -429 -124 1020 -63 -708 476 609 -345 86 437 -468
5059 -468 362 1030 -384 -768 546 308 -155 289 -153 -681 601 532 -637 -431 552 -238 197 381 -822
5078 -822 -861 754 513 -578 92 164 -379 529 442 -1086 -168 1012 201 -309 142 -344 -410 660 65 -852
5098 -852 199 868 -590 -425 174 -412 -50 796 -641 -1035 610 437 -646 -316 -72 -299 675 650 -1113
5117 -1113 -745 675 245 -262 -44 -419 -341 972 92 -1513 -316 688 -123 -145 65 -680 -178 964
5135 964 -343 -1021 107 512 -477 72 -278 -770 183 700 -688 -658 598 195 -435 -16 -304 -358 771
5154 771 731 -917 -489 427 -161 -40 405 -542 -89 1114 6 -946 75 493 -47 339 166 -810 -70
5173 -70 860 -414 -486 533 205 11 712 -243 -1020 428 923 -529 -73 663 -181 -23 392 -580 -366
5192 -366 882 404 -532 43 314 -360 490 288 -795 -109 1050 -19 -598 38 -146 -106 982 65 -1176
5211 -1176 40 572 -322 -34 309 -547 -130 745 -200 -949 6 382 -278 137 -193 -779 362 555 -814
5230 -814 -418 328 -366 -174 366 -532 -761 389 318 -793 -265 380 -337 -13 249 -673 -466 816 92
5249 92 -829 71 167 -436 189 -19 -877 168 818 -341 -507 163 -176 -57 597 -286 -804 542 615 -410
5269 -410 -372 -160 -319 315 469 -524 -629 1018 436 -607 35 -16 -184 593 409 -792 12 949 137 -245
5289 -245 169 -3 248 831 -115 -856 534 1070 -92 -201 301 -127 343 834 -424 -789 628 602 -130
5308 -130 127 -235 -312 519 674 -756 -281 511 127 -268 198 -336 -223 1032 182 -732 65 523 -180 -62
5328 -62 179 -423 128 1003 -302 -736 416 289 -276 273 46 -483 448 550 -735 -661 443 15 129
5347 129 248 -455 -561 819 466 -904 -39 108 -240 216 512 -723 -510 717 221 -777 -87 227 -186
5366 -186 410 147 -783 74 722 -349 -451 389 -261 -298 542 -11 -767 264 497 -580 -62 96 -550
5385 -550 173 543 -278 -475 710 287 -364 -18 -89 -316 388 520 -796 -144 797 -13 -16 297 -161 -235 780
5406 780 223 -793 -73 606 -34 166 232 -661 -108 972 -3 -694 398 86 -108 374 -226 -806 445
5425 445 659 -290 -302 596 71 -23 446 -318 -579 836 593 -840 -136 404 52 268 233 -642 -117 987
5445 987 142 -663 21 3 182 639 85 -899 7 898 -393 -430 193 -291 251 733 -454 -839 416 525
5465 525 -444 -151 170 -152 221 614 -694 -702 689 366 -478 29 -90 -358 407 205 -943 1 725 -67
5485 -67 -336 78 -512 -185 479 -284 -1001 208 571 -270 -257 -133 -623 286 832 -493 -727 265 43 -292
5505 -292 238 -225 -685 387 333 -682 -545 415 -83 -181 443 -515 -418 720 42 -837 -46 314 -156 -39
5525 -39 60 -639 49 845 -284 -585 412 135 -118 468 -75 -530 382 795 -312 -207 397 23 63 542
5545 542 -556 -671 800 577 -367 -290 327 -216 468 581 -822 -270 843 94 -346 84 -7 -241 788
5564 788 340 -642 3 751 -143 -170 372 -69 87 712 -144 -823 170 588 -91 122 18 -373 391 694
5584 694 -690 -879 589 263 16 68 -433 -368 647 480 -707 -416 422 -46 -21 32 -824 -328 920 157
5604 157 -1027 -145 317 -85 -64 -209 -876 -83 862 -407 -753 160 152 -26 235 -390 -600 550 474 -939
5624 -939 -547 152 73 49 215 -663 -709 641 311 -825 -341 215 -39 330 272 -960 -176 884 71 -530
5644 -530 176 41 -123 572 143 -741 456 719 -279 -326 199 -28 70 910 -206 -596 625 548 -448 -14
5664 -14 66 -161 505 526 -733 -382 786 132 -435 190 -65 -142 741 310 -925 -4 702 132 27 187
5684 187 -396 -31 1179 -154 -751 185 441 -167 227 4 -499 389 665 -481 -463 467 173 -263 341
5703 341 -81 -541 506 485 -576 -177 634 -66 -90 199 -521 -192 703 86 -573 -76 312 -240 96 224
5723 224 -896 77 970 -200 -699 77 -4 -58 700 -80 -930 317 807 -251 -305 168 -179 159 662 -396
5743 -396 -601 547 400 -311 -20 61 -212 474 355 -759 -562 610 290 -190 -14 -145 -517 642 104
5762 104 -769 82 687 2 -223 -92 -427 254 585 -384 -816 267 493 -122 51 -218 -411 547 692 -591
5782 -591 -543 496 61 -100 99 -413 -357 826 630 -896 -282 624 -31 -12 251 -360 -297 823 -112 -800
5802 -800 207 540 122 270 202 -638 456 832 -399 -394 581 345 106 378 -462 -783 666 879 -477
5821 -477 -448 158 42 196 371 -584 -377 1002 540 -413 -259 115 -140 380 261 -688 -79 986 -219
5840 -219 -530 242 70 -205 511 -124 -812 411 442 -339 -303 130 -123 180 655 -538 -687 515 427 -645
5860 -645 -79 72 -326 397 259 -874 -595 633 33 -312 -41 -535 -449 680 -45 -775 -240 616 -80
5879 -80 -75 41 -828 -382 673 52 -663 268 280 -485 225 -167 -870 125 718 -350 -540 258 27 -39 267
5900 267 -264 -497 665 279 -628 -153 394 -188 104 161 -567 -453 808 129 -820 -10 158 -27 390 112
5920 112 -802 61 851 135 -178 51 -145 61 608 -222 -766 535 943 -93 -270 -22 -344 405 514
5939 514 -221 -320 904 249 -237 -115 -43 -122 620 476 -923 -254 1011 237 -464 103 -234 49 659 11
5959 11 -968 45 638 -86 -176 -56 -460 241 937 -610 -898 251 378 -197 12 -79 -497 618 601 -632
5979 -632 -715 320 255 -132 236 -350 -440 448 493 -951 -116 361 -60 -144 -86 -719 -303 701 -152 -755 165
6000 165 102 -163 6 -209 -655 236 779 -488 -567 308 203 86 349 -514 -550 445 663 -462 -289 102
6020 102 -208 345 193 -527 -506 688 149 -532 273 -51 -246 577 244 -583 84 945 -64 -417 187 -30
6040 -30 81 434 -253 -716 494 760 -183 -35 -3 -225 389 755 -513 -548 634 509 -239 191 -217 -264
6060 -264 508 632 -627 -333 487 28 54 256 -355 -289 758 382 -674 -12 261 -95 312 368 -568 94
6080 94 885 -139 -711 265 339 81 253 13 -508 49 732 -603 -395 178 62 22 267 -593 -587 623 277
6101 277 -649 -272 119 73 256 114 -792 -292 866 80 -464 -114 -125 -127 452 125 -863 -29 851 -47 -437
6122 -437 -98 -263 -88 528 -102 -799 478 405 -528 -190 96 -77 319 312 -726 -457 579 72 -524 -77
6142 -77 -181 -109 428 295 -891 -160 616 -23 -129 -37 -378 13 566 -109 -742 33 645 -84 77 -61 -401
6163 -401 210 723 -306 -482 425 224 13 210 -181 -482 403 643 -435 -173 444 102 -106 181 -241
6182 -241 -118 611 165 -622 -114 585 -24 -33 160 -528 162 975 9 -619 90 94 136 519 -201 -740 295
6203 295 848 -320 -299 407 -44 -112 150 -353 -710 597 489 -501 -22 142 -272 277 412 -594 -368 694
6223 694 185 -494 22 21 -173 346 236 -747 150 548 -235 -379 -152 -309 -56 465 -322 -583 -34 340 -274
6244 -274 -405 -229 -401 122 582 -582 -726 210 149 -276 64 -225 -383 418 424 -657 -381 335 15 -11 210
6265 210 -566 -172 466 90 -777 156 479 -37 174 -29 -714 57 821 -179 -665 149 293 51 110 -87
6285 -87 -479 550 928 -399 -464 188 101 192 459 -362 -130 776 655 -549 -197 115 99 454 251 -642 -40
6306 -40 880 -68 -301 161 179 71 550 -30 -658 268 603 -124 -204 170 -168 207 461 -347 -566 450 601
6327 601 -301 -66 29 -131 399 426 -757 -325 590 348 -338 -80 -29 -208 449 348 -556 -202 592 -88 -174
6348 -174 152 -277 -54 538 -235 -652 180 326 -291 -46 -105 -510 336 582 -506 -332 493 228 -339 -160
6368 -160 -311 -425 223 293 -798 -264 388 -28 -62 74 -468 -262 576 240 -702 -205 290 -92 268 8
6388 8 -674 10 804 -166 -542 -20 -33 -131 225 18 -485 223 556 -281 -259 259 -302 -44 447 -189 -317 651
6410 651 416 -117 35 231 -287 325 462 -331 -105 498 158 -150 52 39 112 517 82 -644 109 783 214
6431 214 87 116 -40 248 514 -206 -666 259 510 -86 103 -146 -530 190 637 -342 -523 354 335 -33 105
6452 105 -140 -191 603 351 -351 -49 230 -85 -64 -55 -396 40 612 -128 -569 32 403 -39 65 -192 -473
6473 -473 141 605 -310 -572 118 76 61 179 -154 -294 338 467 -400 -473 230 -125 131 208 -527 -286 487
6494 487 221 -475 -111 114 -241 141 -18 -543 -19 644 -10 -411 109 183 -50 337 -70 -720 192 446
6514 446 -256 -428 189 -113 139 302 -330 -549 513 202 -313 -154 -66 -94 421 260 -615 -321 514 117
6534 117 -127 122 9 -119 241 122 -371 -73 205 -21 -22 219 -79 42 642 -188 -542 150 352 -112 -82
6555 -82 163 -404 336 528 -286 -303 409 229 14 -30 -55 -316 508 363 -501 -159 282 34 154 250 -311 -195
6577 -195 705 153 -326 36 321 43 394 99 -290 55 560 -59 -268 234 -63 58 355 -100 -618 195
6597 195 463 -29 -121 106 4 103 303 -470 -413 563 296 -273 -83 34 -258 215 200 -529 -198 487 124
6618 124 -363 -60 -195 26 303 -181 -604 -101 461 -138 -238 17 -425 11 560 -250 -608 74 216 -225
6638 -225 -75 6 -274 287 290 -262 -311 245 148 -169 -137 -104 -267 551 71 -768 41 246 125 48 -20 -370 47
6661 47 714 4 -534 242 404 -16 220 -114 -423 269 774 -67 -406 191 223 77 250 -256 -159 380 552
6682 552 -239 -266 408 3 118 227 -356 -107 484 176 -347 160 177 -20 193 83 -329 108 607 -49 -379
6703 -379 11 -49 5 457 -350 -416 451 338 -285 106 138 -118 28 513 -236 -472 434 152 -291 50 -54
6724 -54 -388 -1 413 -416 -256 369 -117 -42 181 -447 -432 426 -24 -402 -6 306 -122 -275 -90 -263 -41
6745 -41 407 -140 -450 124 142 -254 -112 -217 -315 219 399 -226 -596 159 213 -10 391 -281 -471 584 439
6766 439 -136 -168 126 -38 74 203 -631 -301 444 -3 -314 -112 -8 -347 252 -28 -363 14 565 -243
6786 -243 -389 560 41 -62 516 -114 -459 586 470 -232 -173 64 -111 196 398 -419 -178 395 248 -54
6806 -54 -51 -303 64 467 224 -548 -154 427 -30 -132 111 -163 204 660 -84 -455 335 350 -214 -51 207
6827 207 -161 69 428 -217 -376 289 201 142 214 -43 -267 353 275 -379 -149 396 105 -53 168 -203 -262 607
6849 607 53 -528 4 192 -123 -12 -156 -318 -208 477 -129 -437 108 44 -211 147 -49 -735 106 412
6869 412 -334 -330 163 -155 -87 284 -233 -458 119 149 -694 -140 178 -110 120 217 -473 -180 463 -65 -345 82
6891 82 38 -101 86 -26 -366 -107 526 -233 -154 18 -232 -121 447 -43 -479 175 589 -171 -44 9 -340
6912 -340 181 478 -160 -340 540 313 20 235 -57 -260 239 139 -502 -236 438 -274 -177 321 -89 -292
6932 -292 526 108 -334 204 232 8 208 195 -378 3 665 46 -472 281 121 117 146 -59 -465 294 422 -247
6954 -247 -163 238 66 27 485 -454 -383 538 333 -238 15 148 -64 70 249 -321 -168 349 -39 -304 153
6975 153 63 -80 231 -133 -485 158 389 -408 -324 32 -165 -149 512 -223 -597 376 279 -212 -114 -136 -267 125
6997 125 109 -575 -346 403 116 -407 103 -84 -288 241 124 -493 -308 327 -137 -142 113 -187 -189 360 -121 -391
7019 -391 256 165 -157 31 -80 -200 182 416 -236 -300 263 42 -107 121 -126 -184 439 384 -439 100 192 139
7041 139 -15 230 -292 -222 357 87 -269 111 297 -135 -2 230 -337 -179 457 -214 -120 291 158 89 341
7062 341 -95 -327 239 276 -319 11 192 92 170 223 -270 -285 245 453 -172 32 91 -63 57 193 -388 -189
7084 -189 558 -116 -214 165 143 -166 474 89 -644 -103 291 -271 -101 232 -40 -199 411 51 -600 171 297
7105 297 -144 107 116 -296 123 462 -252 -303 302 23 -178 -7 -238 -314 234 -50 -670 62 430 -175 -192 95
7127 95 -244 -129 503 42 -659 -67 153 -128 162 -82 -449 23 477 26 -246 103 69 -140 376 -91 -455
7148 -455 348 387 -307 -280 90 -227 -141 476 -344 -420 444 129 -501 -19 197 -28 223 83 -541 -40 564
7169 564 -106 -242 161 193 62 471 14 -466 357 513 -382 -162 322 -120 131 190 -95 -390 300 499 -170
7190 -170 105 -107 -239 264 205 -370 -244 554 16 -270 72 -122 -39 285 224 -359 31 466 5 -129 137
7211 137 -239 -55 406 -161 -364 67 169 -307 316 -11 -343 143 456 -162 -115 221 133 -143 150 -218 -258
7232 -258 248 260 -365 29 182 -206 -57 17 -273 -302 528 -115 -297 69 -93 -226 -10 -111 -472 70 503
7253 503 34 -301 347 -237 -122 157 -239 -368 55 353 -396 -220 181 -174 -63 374 -385 -455 165 220 -210
7274 -210 172 -121 -346 285 330 -399 -289 247 99 -130 100 -378 -425 491 173 -397 -21 316 -87 15 30
7295 30 -364 42 398 -143 -490 180 179 -255 143 37 -502 183 437 -317 -185 81 196 -43 154 -114 -119 352
7317 352 381 -446 -264 222 -152 256 467 -173 -62 673 87 -470 44 17 28 328 144 -397 97 388 -36
7338 -36 -186 135 22 49 352 -90 -350 295 405 -345 -97 200 -271 -123 292 -365 -108 530 191 -215 -64
7359 -64 164 -75 211 158 -400 -80 434 -132 -416 60 -75 -143 128 -60 -507 86 238 -408 -189 178 -343
7380 -343 19 391 -251 -347 46 107 -114 34 21 -361 176 289 -464 1 313 -141 -289 63 -69 -114 269
7401 269 168 -540 145 234 -21 -37 143 -323 -162 343 39 -502 121 87 -74 301 -11 -376 238 619 -101
7422 -101 -285 -13 37 -15 372 -133 -374 366 79 -224 -101 55 -56 140 352 -168 -236 387 58 -16 168
7443 168 -46 -100 224 53 -436 -110 375 66 -144 198 -2 -92 475 136 -606 443 442 -120 17 81 -276
7464 -276 28 408 -261 -254 175 137 -177 194 -168 -244 242 194 -426 -88 502 -150 -77 89 -77 -130 460 -71
7486 -71 -343 -169 409 -79 27 -13 -429 -40 317 -101 -333 189 35 -171 134 55 -293 301 210 -385 -311 252
7508 252 -21 27 255 -381 -373 373 130 -375 -165 198 27 98 91 -318 -107 276 38 -134 67 -103 -151 269
7530 269 -3 -413 214 268 -205 -54 283 -252 142 237 -59 -154 435 379 -362 -168 156 -3 216 358 -444
7551 -444 -193 480 287 -147 286 54 86 398 -35 -329 58 261 -157 -17 152 -254 -89 517 -47 -161
7571 -161 290 239 8 73 357 -300 3 385 -105 -253 323 76 -325 312 -63 -243 148 215 -253 -104 287
7592 287 -181 -147 28 -105 -157 310 139 -490 245 9 -25 -2 128 -429 101 345 34 -205 158 38 -23 279
7614 279 237 -561 11 293 -292 -169 195 -218 -194 188 -438 -322 223 232 -284 -40 94 -258 255 188 -419 -200
7636 -200 496 122 -79 129 100 -124 310 -20 -611 382 263 -47 -266 124 -87 -23 438 -235 -414 157 216
7657 216 -293 14 -49 -286 82 223 -422 -150 210 60 -110 227 27 14 299 306 -442 -197 211 129 -131 220
7679 220 -133 -60 498 -105 -522 155 270 68 124 -22 -352 154 643 -199 -383 366 87 -65 198 -157 -281
7700 -281 289 334 -405 4 179 -3 -61 136 -169 -68 144 241 -215 54 17 -103 101 218 -261 -82 158
7721 158 -225 -413 234 -155 -173 282 21 -447 142 193 -150 -65 187 -33 -90 112 -108 -373 352 301 -33 96
7743 96 -6 -346 130 453 -305 -133 269 1 -29 175 -51 -211 145 171 -392 -113 197 -108 -75 253 -317
7764 -317 -67 301 -207 -283 187 189 17 42 -13 -182 159 268 -496 -85 166 -44 -268 245 2 -341 308 312
7786 312 -315 -31 220 26 -74 15 -247 -261 373 92 -197 59 142 61 77 -122 -360 19 774 1 -161 89
7808 89 -57 -20 178 95 -186 281 257 -194 6 262 -4 219 210 -231 -242 320 199 -488 -43 154 -171 306
7830 306 65 -414 -63 447 -80 -279 62 -69 -214 425 -89 -625 -43 381 -148 -120 26 -232 84 483
7850 483 -109 -430 315 139 -129 81 69 -267 34 234 -246 -201 381 -81 -198 -19 -192 -187 322 98 -389
7871 -389 -133 107 23 -81 31 -375 -297 380 -106 -601 251 70 20 71 94 -178 50 260 -123 -628 169 -38
7893 -38 -64 259 -128 -462 168 399 -80 -120 31 -102 45 41 -261 -289 226 19 -242 172 -36 -171 246 137
7915 137 -476 183 302 -350 -224 273 35 5 206 -55 -164 75 90 -199 -45 246 -294 49 371 -162 -292
7936 -292 292 222 -87 -22 174 -242 187 332 -186 -78 338 167 -45 218 -58 -170 200 158 -321 -89 183
7957 183 59 -77 99 -246 -97 311 -55 -412 46 51 -32 257 -49 -321 329 255 -382 -396 72 111 83 85 -273
7980 -273 -395 364 308 -167 -191 122 12 27 243 -203 -297 317 -75 -295 151 98 -143 -45 83 -489 -153 227
8002 227 -43 -243 103 -119 -52 240 33 -480 236 312 -279 -137 128 -121 -39 49 -263 -204 273 196 -169 -273
8024 -273 37 -61 175 290 -450 -134 393 -20 33 77 -60 -91 515 7 -270 125 197 -48 -117 54 -184 41
8046 41 307 -65 -322 422 101 -166 -19 -125 -129 300 447 -244 -122 305 178 109 38 59 -148 209 170 -240
8068 -240 -3 413 134 76 224 -265 57 482 58 -305 -36 -55 -189 82 171 -299 98 426 109 -271 51
8089 51 -120 -235 235 -113 -94 233 210 -148 -15 278 -297 19 27 -183 -54 310 144 -128 44 -5 -145 87
8111 87 134 -458 -135 169 82 57 -118 -292 -81 188 -48 -501 152 280 -68 35 -25 -388 143 256 -439 -363
8133 -363 46 34 -295 189 -206 -339 98 305 -292 -294 173 74 -91 -6 47 -28 374 109 -108 62 84 -56 11
8156 11 -225 -97 -10 388 -352 -359 57 251 105 273 -77 -257 248 244 -175 -450 176 94 141 305 -222 -230 360
8179 360 238 -101 -110 322 -143 168 235 -400 -93 586 -27 -160
8191a60
##END NTUPLES=NMR FID
##END=
