##TITLE=1H_EC-3099(IX)
 CDCl3, 8 sc, 
 4.2.2020
##JCAMPDX= 6.0         $$ Bruker NMR JCAMP-DX V2.0
##DATA TYPE= NMR FID
##DATA CLASS= NTUPLES
##ORIGIN= UXNMR, Bruker Analytische Messtechnik GmbH
##OWNER= root
$$ XWIN-NMR		Version 3.5
$$ Tue Feb  4 13:47:16 2020 Russian Standard Time (UT+4h)  she@DPX200
##.OBSERVE FREQUENCY= 200.1315
##.OBSERVE NUCLEUS= ^1H
##.DELAY= (6, 6)
##.ACQUISITION MODE= SIMULTANEOUS
##.ACQUISITION SCHEME= undefined
##.AVERAGES= 8
##.DIGITISER RES= 18
##SPECTROMETER/DATA SYSTEM= spect
##.PULSE SEQUENCE= zg30
##.SOLVENT NAME= CDCl3
##.SHIFT REFERENCE= (INTERNAL, CDCl3, 0, 15.7039)
##AUDIT TRAIL= $$ (NUMBER, WHEN, WHO, WHERE, WHAT)
$$ ##TITLE= Audit trail, XWIN-NMR		Version 3.5
$$ ##JCAMPDX= 5.01
$$ ##ORIGIN= Bruker BioSpin GmbH
$$ ##OWNER= she
$$ F:/spectra/data/she/nmr/H-F/1/audita.txt
$$ ##AUDIT TRAIL=  $$ (NUMBER, WHEN, WHO, WHERE, WHAT)
(   1,<2020-02-04 13:46:09.73 +0400>,<she>,<DPX200>,
      <created by zg, POWCHK disabled, PULCHK disabled
       configuration hash MD5:
       00 E9 B6 7A A2 85 ED C7 34 08 36 98 17 FE 4E 26
       data hash MD5: 16K
       71 25 F1 A7 34 77 9A 65 D8 91 C4 16 C8 82 ED A4>)
$$ ##END=
$$ 
$$ hash MD5
$$ A6 3C E7 B4 7B 03 5A C9 C4 A4 B2 01 33 91 5B BB
##$RELAX= 
##$RELAX= 
##$RELAX= 
##$RELAX= 
##$RELAX= 
##$RELAX= 
$$ Bruker specific parameters
$$ --------------------------
##$DU= <F:/spectra>
##$EXPNO= 1
##$NAME= <H-F>
##$PROCNO= 1
##$TYPE= <nmr>
##$USER= <she>
##$AMP= (0..31)
100 100 100 100 100 100 100 100 100 100 100 100 100 100 100 100 100 100 
100 100 100 100 100 100 100 100 100 100 100 100 100 100 
##$AQSEQ= 0
##$AQ_mod= 1
##$AUNM= <au_zg>
##$AUTOPOS= <>
##$BF1= 200.13
##$BF2= 200.13
##$BF3= 200.13
##$BF4= 200.13
##$BF5= 200.13
##$BF6= 200.13
##$BF7= 200.13
##$BF8= 200.13
##$BYTORDA= 1
##$CFDGTYP= 0
##$CFRGTYP= 5
##$CHEMSTR= <none>
##$CNST= (0..31)
1 1 145 1 1 1 1 1 1 1 1 1 1 1 1 1 1 1 1 1 1 1 1 1 1 1 1 1 1 1 1 1 
##$CPDPRG= <>
##$CPDPRG1= <>
##$CPDPRG2= <>
##$CPDPRG3= <>
##$CPDPRG4= <mlev>
##$CPDPRG5= <mlev>
##$CPDPRG6= <mlev>
##$CPDPRG7= <mlev>
##$CPDPRG8= <mlev>
##$CPDPRGB= <>
##$CPDPRGT= <>
##$D= (0..31)
0 1.2 0 0 0 0 0 0 0 0.06 0 0.03 0 0 0 0 0.0002 0 0 0 0 0 0 0 0 0 0 0 0 
0 0 0 
##$DATE= 1580809569
##$DBL= (0..7)
120 120 120 120 120 120 120 120 
##$DBP= (0..7)
150 150 150 150 150 150 150 150 
##$DBP07= 0
##$DBPNAM0= <>
##$DBPNAM1= <>
##$DBPNAM2= <>
##$DBPNAM3= <>
##$DBPNAM4= <>
##$DBPNAM5= <>
##$DBPNAM6= <>
##$DBPNAM7= <>
##$DBPOAL= (0..7)
0.5 0.5 0.5 0.5 0.5 0.5 0.5 0.5 
##$DBPOFFS= (0..7)
0 0 0 0 0 0 0 0 
##$DE= 6
##$DECBNUC= <off>
##$DECIM= 24
##$DECNUC= <off>
##$DECSTAT= 4
##$DIGMOD= 1
##$DIGTYP= 9
##$DL= (0..7)
0 120 120 120 120 120 120 120 
##$DP= (0..7)
150 150 150 150 150 150 150 150 
##$DP07= 0
##$DPNAME0= <>
##$DPNAME1= <>
##$DPNAME2= <>
##$DPNAME3= <>
##$DPNAME4= <>
##$DPNAME5= <>
##$DPNAME6= <>
##$DPNAME7= <>
##$DPOAL= (0..7)
0.5 0.5 0.5 0.5 0.5 0.5 0.5 0.5 
##$DPOFFS= (0..7)
0 0 0 0 0 0 0 0 
##$DQDMODE= 0
##$DR= 18
##$DS= 0
##$DSLIST= <SSSSSSSSSSSSSSS>
$$ [...]
##$SUBNAM2= <"">
##$SUBNAM3= <"">
##$SUBNAM4= <"">
##$SUBNAM5= <"">
##$SUBNAM6= <"">
##$SUBNAM7= <"">
##$SUBNAM8= <"">
##$SUBNAM9= <"">
##$SW= 24.9337058887773
##$SWIBOX= (0..15)
0 0 2 0 0 0 0 0 0 0 0 0 0 0 0 0 
##$SW_h= 4990.01996007984
##$TD= 16384
##$TD0= 1
##$TE= 0
##$TE2= 300
##$TE3= 300
##$TEG= 300
##$TL= (0..7)
0 120 120 120 120 120 120 120 
##$TP= (0..7)
150 150 150 150 150 150 150 150 
##$TP07= 0
##$TPNAME0= <>
##$TPNAME1= <>
##$TPNAME2= <>
##$TPNAME3= <>
##$TPNAME4= <>
##$TPNAME5= <>
##$TPNAME6= <>
##$TPNAME7= <>
##$TPOAL= (0..7)
0.5 0.5 0.5 0.5 0.5 0.5 0.5 0.5 
##$TPOFFS= (0..7)
0 0 0 0 0 0 0 0 
##$TUNHIN= 0
##$TUNHOUT= 0
##$TUNXOUT= 0
##$USERA1= <user>
##$USERA2= <user>
##$USERA3= <user>
##$USERA4= <user>
##$USERA5= <user>
##$V9= 5
##$VALIST= <valist>
##$VCLIST= <CCCCCCCCCCCCCCC>
##$VD= 0
##$VDLIST= <DDDDDDDDDDDDDDD>
##$VPLIST= <PPPPPPPPPPPPPPP>
##$VTLIST= <TTTTTTTTTTTTTTT>
##$WBST= 1024
##$WBSW= 4
##$XGAIN= (0..3)
0 0 0 0 
##$XL= 0
##$YL= 0
##$YMAX_a= 495948
##$YMIN_a= -252745
##$ZGOPTNS= <>
##$ZL1= 120
##$ZL2= 120
##$ZL3= 120
##$ZL4= 120
##$ABSF1= 10
##$ABSF2= 0
##$ABSG= 5
##$ABSL= 3
##$ALPHA= 0
##$AQORDER= 0
##$ASSFAC= 0
##$ASSFACI= 0
##$ASSFACX= 0
##$ASSWID= 0
##$AUNMP= <proc_1d>
##$AZFE= 0.1
##$AZFW= 0.1
##$BCFW= 1
##$BC_mod= 2
##$BYTORDP= 1
##$COROFFS= 0
##$CY= 11.3945322036743
##$DATMOD= 1
##$DC= 2
##$DFILT= <>
##$DTYPP= 0
##$F1P= 16.9975609425685
##$F2P= -3.02152046262296
##$FCOR= 0.5
##$FTSIZE= 0
##$FT_mod= 4
##$GAMMA= 1
##$GB= 0.15
##$INTBC= 1
##$INTSCL= 1
##$ISEN= 128
##$LB= 0.24
##$LEV0= 0
##$LPBIN= 0
##$MAXI= 10000
##$MC2= 0
##$MEAN= 0
##$ME_mod= 0
##$MI= 1.114404
##$NCOEF= 0
##$NC_proc= 0
##$NLEV= 6
##$NOISF1= 3.799351
##$NOISF2= 2.8
##$NSP= 1
##$NTH_PI= 0
##$NZP= 0
##$OFFSET= 15.70392
##$PC= 1
##$PHC0= -9787.872
##$PHC1= 16.40081
##$PH_mod= 1
##$PKNL= yes
##$PPARMOD= 0
##$PSCAL= 0
##$PSIGN= 0
##$REVERSE= no
##$SF= 200.130013532006
##$SI= 16384
##$SIGF1= 3
##$SIGF2= 2
##$SINO= 400
##$SIOLD= 16384
##$SREGLST= <1H.CDCl3>
##$SSB= 0
##$STSI= 0
##$STSR= 0
##$SW_p= 3612.71676300578
##$SYMM= 0
##$S_DEV= 0
##$TDeff= 0
##$TDoff= 0
##$TI= <>
##$TILT= no
##$TM1= 0
##$TM2= 0
##$TOPLEV= 0
##$USERP1= <user>
##$USERP2= <user>
##$USERP3= <user>
##$USERP4= <user>
##$USERP5= <user>
##$WDW= 1
##$XDIM= 8192
##$YMAX_p= 0
##$YMIN_p= 0
$$ End of Bruker specific parameters
$$ ---------------------------------
##NTUPLES= NMR FID
##VAR_NAME=  TIME,          FID/REAL,        FID/IMAG
##SYMBOL=    X,             R,               I
##VAR_TYPE=  INDEPENDENT,   DEPENDENT,       DEPENDENT
##VAR_FORM=  AFFN,          ASDF,            ASDF
##VAR_DIM=   8192,          8192,            8192
##UNITS=     SECONDS,       ARBITRARY UNITS, ARBITRARY UNITS
##FACTOR=    0.0002004,     1,               1
##FIRST=     0,             0,               0
##LAST=      1.6414764,     0,               0
##MIN=       0,             -252745,         0
##MAX=       1.6414764,     495948,          0
$$ Real data points
##PAGE= N=1
##DATA TABLE= (X++(R..R)), XYDATA
0 0 0 0 0 0 0 0 0 8 -8 8 -16 16 -24 24 -32 40 -48 57 -68 79 -93 110 -125 146 -167 192 -220 251 -284 320
30 320 -362 407 -455 512 -570 635 -707 787 -873 968 -1072 1189 -1315 1453 -1611 1787 -1982
47 -1982 2211 -2465 2763 -3112 3529 -4037 4670 -5491 6596 -8173 10633 -15008 25147 -98275
61 -98275 112839 384913 90239 -236103 -252745 39818 184093 47952 -166593 -121993 117283
72 117283 256288 94674 -145120 -169181 54001 216153 133318 -51043 -64389 80324 158109
83 158109 48003 -92460 -79765 76753 187960 137631 1432 -61778 -21123 29676 26216
94 26216 19704 63229 115166 85818 -23715 -99786 -44879 80434 125324 42934 -46070 -28383
106 -28383 47560 54203 -23693 -68843 -7282 82165 81783 -5250 -72889 -55199 8940 33486 -9124
119 -9124 -48756 -4717 78260 71810 -48389 -145719 -99240 39737 120491 71785 -40240 -98520
131 -98520 -58176 23076 51935 3748 -48002 -25870 41518 50332 -26064 -90128 -53997 41076
143 41076 82982 26944 -60953 -81586 -14091 51948 24625 -63204 -91314 -12193 82757 75246
155 75246 -36122 -129383 -101428 12841 85964 48599 -39699 -77419 -35354 23609 30351 -9357
167 -9357 -32523 -5644 36300 36831 -9822 -47013 -18077 51430 74798 23375 -30722 -17321 38976
180 38976 63076 27264 -22824 -26617 24213 75202 66044 7752 -30513 -10455 29467 34630 11988
193 11988 9326 29732 27371 -9609 -28650 3897 49509 48717 -2054 -46514 -31737 27094 55474
206 55474 12860 -44269 -34310 26760 49188 -3447 -57606 -32852 38423 48729 -27352 -86300
218 -86300 -36784 65622 83103 -19070 -117134 -80950 50050 107413 13114 -109073 -97697
229 -97697 31702 110531 38711 -85674 -95393 21339 102473 36504 -79104 -77700 42070
240 42070 114139 39016 -82703 -88353 34122 128039 72606 -61330 -105010 -8117 101342
251 101342 88730 -17708 -72894 -12482 66677 52926 -23059 -51147 12 51554 36144 -18172
263 -18172 -35349 6901 45953 23368 -31886 -42599 8633 54742 35164 -22603 -42315 -4140
275 -4140 34213 23664 -7818 -8527 17601 22079 -11466 -39466 -16759 39893 61591 15005 -47463
288 -47463 -48905 10287 55240 30813 -30573 -50850 -2685 52271 42837 -19143 -54943 -22496
300 -22496 33097 42625 -997 -39034 -23213 21422 31818 -8306 -45924 -25348 35576 59761
312 59761 6763 -67890 -71754 3489 66561 44666 -28293 -64476 -27952 29627 35188 -15025
324 -15025 -53632 -29002 24249 35047 -9803 -49937 -33161 15187 28765 -8847 -41865 -24665
336 -24665 16747 26432 -8213 -45457 -38186 8287 41956 24671 -22081 -45430 -26546 8039
348 8039 22387 11881 -4965 -9919 -6345 -3317 -1541 2265 4413 1815 47 -203 1050 2155 2947
363 2947 2734 2538 2977 4282 5228 6730 5278 1391 -2145 -1129 2226 9667 18727 18333 2925 -14626
379 -14626 -18633 -3225 21705 34654 18951 -14943 -32217 -9884 28542 38290 4512 -31391
391 -31391 -23168 18423 37006 7676 -30421 -27119 14369 40984 15110 -33215 -38816 7721 43024
404 43024 14167 -42099 -47198 11773 60292 29301 -48359 -75589 -16964 53587 50260 -18219
416 -18219 -64689 -36371 24809 37959 -9330 -48404 -25631 22696 27510 -17769 -51034 -25913
428 -25913 24341 32297 -11446 -47457 -28569 16949 27526 -7980 -43217 -34725 5208 27692
440 27692 7894 -25031 -31149 -12348 2149 -3500 -11898 -6470 4113 -1715 -21591 -27734 -5868
453 -5868 18167 15202 -9405 -26280 -16023 8103 17466 1804 -14963 -7628 15392 21973 3434
466 3434 -14697 -5699 19849 26826 4901 -14483 484 33013 39472 6596 -28695 -20373 28471
479 28471 60603 34022 -21794 -38380 3098 48915 42801 -3769 -28788 -1355 38402 32989
491 32989 -11376 -33474 -2577 40670 39200 -7647 -40281 -15447 33219 39364 -8400 -47205
503 -47205 -26457 27557 44650 2272 -45820 -41568 3360 27674 5707 -26433 -27318 -6310 2151
516 2151 -13221 -27881 -15672 8279 8479 -19133 -36861 -21389 5587 9043 -12089 -24601 -10438
529 -10438 8373 4525 -13395 -16729 -492 10436 1160 -12268 -7398 12352 20375 1467 -22343
542 -22343 -17100 14089 33111 16658 -14300 -24174 -3688 20120 18546 647 -7784 932 8840
555 8840 4586 -4302 -4707 5312 12803 8721 -1275 -3904 3242 10449 10602 3620 -2375 -829 8007
570 8007 16315 16001 7022 -5099 -9059 4850 24631 27226 5286 -16175 -12763 11889 26915 14488
584 14488 -8183 -10174 9207 20490 6536 -14932 -13985 10971 28013 11620 -19308 -23156 7280
597 7280 31761 16657 -18909 -29833 -2488 29012 25599 -8491 -31074 -16086 14360 22155 2220
610 2220 -18343 -15535 1543 6182 -7002 -16507 -6785 7504 4117 -13760 -23186 -12020 5827
623 5827 6838 -9345 -19855 -9902 5257 5794 -5636 -11240 -2800 7638 5383 -5886 -6699 9357
637 9357 20903 9100 -11412 -11430 14660 35911 23540 -10030 -21524 4060 34699 31813 1539
650 1539 -17842 -2038 26063 27578 -1744 -20761 -1334 29043 25662 -9437 -29203 -6164 30558
663 30558 30823 -9067 -37815 -16729 26865 35690 -2547 -38772 -26510 17488 35654 4457 -31890
676 -31890 -26041 9017 23395 -728 -28272 -19900 12522 22399 -5865 -35062 -24366 10751 23375
689 23375 -1295 -28477 -24136 2122 14949 257 -18001 -12978 4666 7420 -6574 -13512 -607
702 -607 12752 4514 -14430 -13918 10102 25456 8151 -19597 -20468 6265 26433 15136 -11674
715 -11674 -18338 3589 20678 7724 -16480 -15477 10139 24181 5319 -22986 -23463 4915 25413
728 25413 12273 -15192 -21888 -1234 18305 11932 -9299 -16755 -1219 15062 12489 -765 -4838
741 -4838 1125 5273 1907 -475 5564 14185 12239 -680 -8332 -1253 10679 12035 4397 800 5005
756 5005 6120 -2236 -9061 -1425 13767 15429 -881 -14402 -8592 8609 13477 -2567 -18744 -10507
770 -10507 13070 20335 -78 -21725 -18156 3244 14634 3325 -12041 -9937 5025 8780 -7286
783 -7286 -22531 -14317 9748 21141 3614 -21899 -26269 -5798 11503 7400 -8028 -14021 -5184
796 -5184 5304 2360 -10693 -15770 -5039 7091 6170 -2181 -5828 -1600 1146 -3822 -8475 -2523
810 -2523 10539 14773 2824 -11588 -12178 160 9591 5686 -1922 455 8401 4800 -10582 -17228
824 -17228 -4487 15278 17838 -664 -19410 -15969 5044 13868 -1866 -19957 -13566 10716 20492
837 20492 1655 -23257 -23742 -194 18233 10522 -9026 -13275 346 10829 -360 -17479 -13671
850 -13671 11738 26601 9452 -18124 -23075 -1917 17259 13146 -4720 -9534 3986 13373 3551
863 3551 -12703 -11376 5965 17249 8425 -6327 -6016 6099 8827 -2472 -10172 -355 16356 18119
877 18119 1334 -13310 -9457 6554 11778 2786 -1474 6185 11491 1927 -12899 -12858 4861 19382
891 19382 12634 -7533 -15098 -2310 11861 6731 -9972 -13662 2590 16406 8720 -11441 -18088
904 -18088 -4544 9065 7125 -4142 -7887 173 7298 503 -13091 -13715 1291 14119 8976 -5254
918 -5254 -12343 -6833 914 1407 -855 498 3692 833 -5753 -8078 -1776 4947 2802 -4709 -6914
933 -6914 1415 8052 1973 -10145 -11300 791 10970 7495 -4141 -9064 -1885 6019 2581 -6538
947 -6538 -6195 6050 13486 5051 -10049 -13118 -765 12776 11191 -1646 -9590 -3407 6593 7890
961 7890 70 -6579 -2128 6483 7518 -390 -5229 -1798 3454 4691 747 -2903 -1070 4385 5800
976 5800 17 -6348 -5189 2248 7802 4615 -3198 -5916 -2127 2854 2711 -23 -1591 -1233 689 265
992 265 -1719 -1361 1644 2267 -1120 -4254 -1932 2796 4238 514 -4292 -3367 1467 3694 -562 -2859
1008 -2859 -833 3341 2267 -3559 -6064 -718 6727 5619 -3545 -8618 -2698 6665 8112 -1222 -10166
1023 -10166 -6179 6903 12165 2837 -8129 -6991 3424 8892 3983 -2805 -2162 5327 8371 1970
1037 1970 -5214 -3072 6288 12018 6138 -3176 -4897 2132 7024 4656 306 252 2874 3710 2146 24
1053 24 -18 680 464 -492 1990 4718 3027 -3082 -6524 -3319 3011 5018 1091 -3066 -2696 2 -1268
1070 -1268 -5099 -4584 1920 5829 1592 -7014 -10594 -4334 3041 2091 -4548 -6629 -2323 1438 -1029
1085 -1029 -7280 -9670 -4053 2623 2015 -3252 -6008 -3766 -1126 -2769 -5544 -3081 3153 6154 735
1100 735 -6497 -6687 -1125 4348 5337 2644 1031 1792 1860 -1741 -2822 1660 7423 7738 1704 -2923 -768
1117 -768 3863 4272 -273 -2978 1755 7924 7084 -817 -6899 -5544 2271 7584 5194 161 -1335 1101
1133 1101 1573 -1029 -2978 -706 5571 8956 4584 -4181 -8404 -3020 4929 7993 4020 -2646 -3867
1148 -3867 905 3739 -314 -5624 -4883 2998 8098 3635 -7135 -9827 -2785 3962 2162 -3384 -3230
1163 -3230 2023 5005 -1540 -10630 -9684 2922 11597 6373 -5386 -9370 -2540 4091 1805 -4555 -3186
1178 -3186 5618 8353 -418 -10076 -9293 1681 8828 3695 -5777 -6496 2073 5971 -2247 -11651 -8199
1193 -8199 5082 12900 4527 -9106 -11712 -1106 6870 2776 -4994 -2654 6919 9864 -473 -11985
1207 -11985 -8761 6377 15681 7975 -4809 -7383 1624 8109 3484 -5535 -4608 6359 12145 3617
1221 3617 -7989 -9341 -1015 6160 4136 -2067 -3685 739 2717 -2300 -8276 -7506 881 7248 5162
1236 5162 -2904 -8367 -6697 -1765 1116 1158 517 98 -492 -1636 -3897 -4628 -2024 1830 3223 1655
1252 1655 -1078 -2880 -3036 -2239 -1251 -655 1037 2998 2104 -1141 -4045 -4638 -1890 2482 4294 3253
1268 3253 1646 104 -1555 -1874 -514 2131 5873 6945 4363 -570 -2533 -323 4013 5788 4866
1283 4866 2091 1460 2913 3344 477 -2334 -1040 3596 7249 4642 -1126 -5000 -3048 1301 2300 622
1299 622 -582 188 2519 1184 -4148 -7402 -3007 4877 7213 1574 -5876 -6827 -647 4434 2247 -4052
1315 -4052 -4192 2105 6061 1111 -7977 -9393 -500 7520 4506 -5759 -9023 -1151 5734 1306 -9524
1330 -9524 -11016 520 10776 5517 -9511 -14994 -3991 8657 7088 -5281 -10362 -2059 8929
1343 8929 5288 -7708 -12123 -761 12316 8532 -5961 -11952 -1354 10936 7326 -6373 -10315
1356 -10315 1305 12679 7738 -7104 -12560 -1454 12059 8312 -5937 -10545 1049 12606 6133
1369 6133 -8785 -11736 2803 15915 9480 -8070 -13183 874 14646 10434 -6162 -11617 734
1382 734 14651 10360 -6027 -11733 -8 12611 9474 -4639 -10619 -635 11207 7863 -5685
1395 -5685 -11203 -1130 10266 7917 -4586 -10563 -3439 6667 6275 -3647 -9057 -2859 6107 5534
1409 5534 -3248 -8499 -3038 5442 5190 -2552 -6781 -1581 5214 4910 -1749 -6523 -3562 3548 6093
1424 6093 780 -4537 -3901 1270 3289 979 -2905 -2679 1396 3088 795 -2759 -3037 -498 2589 1795
1440 1795 -1264 -2295 -425 2685 1657 -1754 -2746 169 3724 4268 486 -3400 -2506 1562 3036 1056
1456 1056 -1593 -1035 1939 2990 -468 -4608 -3291 2006 5341 2104 -3769 -5737 -1646 3538 2123
1471 2123 -3167 -5355 -1041 3900 3381 -2517 -7496 -4739 3210 5936 620 -5731 -4855 1582 4244
1486 4244 -115 -5475 -4164 3149 6872 1435 -6601 -7463 -122 7218 4696 -3908 -7029 -261 6427
1501 6427 3325 -4890 -7377 296 8305 5622 -3777 -8154 -1324 7367 6037 -3720 -7161 1063 9529
1516 9529 6280 -5449 -10087 -846 10772 9149 -2550 -9164 -2168 8754 7920 -3590 -9303 -114
1530 -114 11347 9043 -4374 -11220 -2188 9926 10162 -2844 -10482 -2317 10146 9410 -4659 -12275
1544 -12275 -3167 10954 10625 -3144 -12531 -4291 8704 8906 -3284 -11253 -3137 9627 9654 -4207
1558 -4207 -13387 -5262 9535 10928 -1983 -12105 -6044 7328 9229 -1857 -11241 -5839 6974
1571 6974 10161 -1071 -10654 -6957 4835 8696 332 -8173 -5750 4426 7463 103 -7883 -6029
1585 -6029 3160 7818 2342 -6335 -6359 1167 5942 1840 -4386 -4478 1353 5179 1787 -4453 -5247 804
1601 804 5541 2967 -3421 -5200 -258 4753 3202 -2843 -5358 -618 4759 4481 -1565 -5683 -2888
1616 -2888 3712 5270 -193 -5162 -3091 3140 4568 -228 -5017 -3548 2654 5136 776 -5401 -5026
1631 -5026 1591 5818 2199 -4114 -5115 1048 5507 2803 -3859 -4774 433 5624 3425 -2923 -4957
1646 -4957 -121 5550 3808 -2689 -5479 -49 5133 4530 -1900 -5519 -1278 4933 5586 -438 -5543
1661 -5543 -2692 3826 6435 1257 -4907 -3167 3471 6272 2029 -4211 -3476 2533 7109 3272 -3966
1676 -3966 -4867 1918 7304 4171 -2860 -5053 611 6502 4362 -2867 -5669 -157 6199 4313 -2508
1691 -2508 -6214 -1270 5728 4839 -3300 -7244 -1379 5660 4775 -3347 -8139 -2649 6285 6621 -2886 -9061
1707 -9061 -3176 5583 6406 -2411 -8256 -3893 5517 7023 -2284 -9710 -5017 4920 7127 -1680 -9462
1722 -9462 -6037 4253 7180 -1117 -9340 -6156 3532 7092 -319 -8448 -6554 2884 7244 741 -7514
1737 -7514 -6070 2938 7325 1475 -6674 -5591 3081 7907 2329 -5554 -5565 2404 8013 4107 -3902
1752 -3902 -5633 1760 7600 4378 -3410 -5102 930 7029 4794 -2558 -5249 -250 6012 4794 -1662
1767 -1662 -5233 -805 5952 5646 -791 -5695 -1879 5283 6356 187 -5086 -3028 3668 6061 720
1782 720 -5077 -3226 3364 6067 376 -5821 -4465 2511 6352 915 -5928 -5680 1929 6120 1059
1797 1059 -6532 -6598 1003 6685 1988 -5920 -7261 -29 6261 2651 -5169 -6724 194 6670 4011
1812 4011 -5135 -7437 237 7101 4392 -4077 -7000 -952 6215 5284 -2900 -7004 -1769 5875 4908
1827 4908 -2566 -6708 -2296 5142 4743 -1980 -5838 -2163 3940 4313 -1727 -5483 -2035 4246 5168 -554
1843 -554 -5188 -2565 3329 4899 511 -3438 -2212 2770 4150 584 -3444 -2197 2361 4348 1466
1858 1466 -3125 -3288 968 3950 1643 -2784 -3678 -19 3510 2194 -2217 -4307 -1305 2645 2743 -1663
1874 -1663 -4128 -2215 2419 3076 -664 -4168 -2293 2333 3602 -454 -4271 -3028 2247 4550 421
1889 421 -4807 -3909 1804 4788 678 -4783 -4519 762 4490 1499 -4309 -4812 1117 5057 1794 -4482
1905 -4482 -5273 766 5555 3374 -3285 -5391 229 6130 4390 -2232 -5246 -508 6420 5889 -1295
1920 -1295 -5243 -1242 5271 5974 -95 -4392 -1014 4808 5294 -1280 -5324 -1826 4871 5822 -57 -5427
1936 -5427 -3058 3209 5098 275 -4647 -2538 2958 5105 -338 -5870 -4474 2768 5764 1176 -4769
1951 -4769 -4377 2069 4816 950 -5325 -4743 2075 6327 1755 -6069 -6928 408 5729 2887 -4420 -6005
1967 -6005 104 4792 1711 -5546 -6313 212 6037 3629 -4594 -7090 -1299 5314 3445 -3856 -5496
1982 -5496 523 6238 3631 -4094 -7261 -841 6556 5398 -2077 -5735 -1319 4494 3770 -2619 -5491
1997 -5491 -174 6312 4521 -3107 -6990 -2673 4746 5293 -318 -4693 -1916 3966 3503 -1866 -5225
2012 -5225 -1612 4210 5610 425 -4164 -2677 2006 3608 642 -1767 -169 3156 3507 -301 -3554
2027 -3554 -2088 2255 4339 2197 -1276 -1962 295 1670 624 -1243 -719 1791 3073 776 -2319
2042 -2319 -3025 -626 2164 2697 446 -1545 -700 928 844 -742 -2318 -844 2613 3598 706 -3163
2058 -3163 -3357 -97 2777 2099 -612 -1682 169 2138 582 -2979 -3367 274 3949 3198 -1638 -4360
2074 -4360 -1844 2123 2708 -852 -3097 -291 3581 2955 -2049 -4923 -2026 3647 4785 263 -3772
2089 -3772 -2252 1923 3126 -1022 -4245 -1633 4159 5020 -926 -5667 -3991 2037 4998 1000 -3992
2104 -3992 -3361 1846 4128 240 -5145 -4050 1668 4804 1583 -4333 -4755 85 3721 1214 -3202
2119 -3202 -3532 1017 4103 1436 -4158 -5001 451 4530 2348 -2861 -4029 77 3834 1464 -3204
2134 -3204 -3977 818 4814 2388 -3197 -4957 116 4770 2958 -2758 -4397 136 5017 3496 -2663
2149 -2663 -4860 -841 5264 4556 -1720 -5064 -1123 4385 3820 -1459 -4368 -956 4286 4666 -698 -4492
2165 -4492 -1564 3664 4396 -409 -3852 -1626 3455 4516 -436 -3958 -1744 2958 3859 326 -3038
2180 -3038 -1717 2177 3272 -300 -3358 -1702 2572 3379 66 -2975 -2298 1191 2899 413 -2046
2195 -2046 -1703 1181 2478 422 -2245 -2148 300 2160 1204 -1030 -1499 -72 932 -69 -1168 -1131 339
2212 339 1787 1085 -769 -2019 -979 930 1391 315 -780 -724 138 361 -389 -1266 -769 761 1753 873
2230 873 -1607 -2054 -246 1066 583 -800 -1156 470 1903 795 -2248 -2894 -449 2832 2506 -767
2246 -767 -3074 -1683 1044 1995 -776 -2555 -596 2396 2586 -1233 -3899 -2609 1505 3234 602 -2610
2262 -2610 -2441 742 2208 -73 -3152 -2135 1602 3713 1146 -3374 -3378 372 2722 1072 -1767 -2175
2278 -2175 993 2826 251 -2917 -2688 1437 4150 1988 -2063 -3249 -66 2641 1264 -1689 -2154
2293 -2154 945 3085 1337 -2405 -3155 -554 3184 2702 -753 -2291 37 2179 1263 -1176 -2280 647
2309 647 3301 2659 -734 -2483 -487 2326 2608 258 -1242 114 2648 2169 -1140 -2326 -154 2942
2325 2942 3332 -15 -2152 -1128 2046 2566 -401 -2345 -760 2761 2921 -138 -3150 -1952 1397 2959
2341 2959 768 -2102 -1999 705 2241 -99 -2279 -2132 814 2708 726 -2662 -2889 -261 1867 1021
2357 1021 -1567 -2496 -490 1370 671 -1843 -2391 -977 1283 949 -1608 -2399 -841 746 429 -738
2373 -738 -1609 -584 777 1039 -615 -1773 -421 1105 1609 106 -1374 -884 672 1145 173 -966 -739
2390 -739 1018 1753 823 -1107 -1170 589 1484 363 -916 -1137 379 1521 972 -898 -1724 -13 1620
2407 1620 1553 -881 -1592 -339 1607 1343 -325 -1321 -234 1441 1663 -466 -1518 -216 1596 1558 -573
2424 -573 -1922 -240 1814 2402 -426 -1948 -955 1432 2280 318 -1981 -1272 1441 2454 351 -1669
2440 -1669 -1212 1006 2130 418 -1494 -1481 1099 2066 824 -1256 -1257 497 1998 929 -1070 -1704 121
2457 121 1712 785 -695 -1171 -331 1005 867 -617 -1127 194 814 260 -642 -930 -39 727 659 -549
2475 -549 -969 216 641 612 -410 -675 57 957 589 -188 -827 277 743 970 -188 -552 -44 673 1322
2494 1322 581 -1121 -589 520 991 115 -685 -1098 -187 1054 515 -615 -1529 -354 710 366 -794
2511 -794 -1311 -437 629 470 -976 -1500 -586 690 601 -592 -1798 -765 1049 998 -747 -1939 -1109 815
2529 815 1145 133 -1562 -1119 741 1469 223 -1503 -934 715 1705 865 -1564 -1275 401 1864 630
2546 630 -960 -976 143 1857 1299 -514 -1201 243 1735 1380 -31 -924 438 1465 1046 -48 -540
2563 -540 639 1617 776 -563 -731 134 1273 1014 -603 -1115 244 1200 694 -681 -1006 166 964 619
2581 619 -898 -1311 -18 1395 841 -405 -1317 -194 1352 973 -562 -1376 -204 1231 1305 56 -1227
2598 -1227 -1127 524 1161 143 -952 -282 859 821 -585 -1295 -790 110 783 -2 -1097 -1174 -132 328
2616 328 -139 -882 -466 208 540 116 -674 -1015 -200 201 197 -431 -468 -591 5 -40 -667 -533 141 126 455 -150
2638 -150 -595 -975 -205 365 301 -81 -561 -537 41 56 -5 -785 -491 186 682 754 -478 -835 -334 600 608 77
2660 77 68 70 524 524 -442 -397 384 921 550 -442 -686 -132 197 420 -492 -382 647 869 294 -941 -995 709
2682 709 1066 657 -649 -859 306 1289 366 -997 -1330 724 1663 907 -696 -1455 67 1046 867 -552
2700 -552 -1208 381 1517 1025 -798 -1396 -12 1519 881 -565 -909 -52 991 1161 -543 -1208 244
2717 244 1272 782 -256 -1381 -132 1073 780 -326 -1133 162 1045 860 -541 -1220 -530 749 1090
2734 1090 -35 -1424 -886 254 532 -263 -716 -370 211 531 25 -848 -814 215 213 -59 -704 -327 -149
2753 -149 -11 -463 -513 -219 -281 510 -360 -647 -508 -244 58 -502 -440 -331 145 496 -220 -631 -678 96 136 285
2775 285 -412 -610 -152 558 141 -429 -604 -79 311 626 217 -370 -634 87 394 817 -141 -139 28 704 165
2796 165 -77 -408 -165 492 820 478 -545 -600 -41 1176 488 -420 -570 320 1145 696 -289 -987 -99 1096
2816 1096 621 -130 -496 93 894 561 -481 -664 34 1347 730 -493 -829 -206 1002 748 -584 -788
2834 -788 129 1182 1075 -703 -1154 -355 1023 1284 -65 -1024 -211 514 603 -475 -716 79 1624 1134
2852 1134 -581 -1340 -934 889 1118 -295 -840 -463 1020 712 -896 -1428 -469 1221 1215 -500 -1492 -730
2870 -730 664 854 -662 -1291 -571 1025 902 -422 -1642 -1169 617 1511 180 -1277 -782 353 889
2887 889 -240 -1486 -845 686 1185 296 -1344 -1202 -149 930 457 -345 -694 -72 496 223 -770 -850
2905 -850 69 845 246 -430 -772 -772 216 -31 -66 -212 250 392 111 -522 -494 -142 460 502 125 -512 -294 183
2927 183 389 95 -252 -115 414 606 299 -309 -557 -261 649 801 96 -84 201 810 420 22 -641 271
2947 271 1031 1270 0 -840 -467 776 1060 347 -288 -104 749 1098 182 -618 -368 532 1254 20 -769
2966 -769 -461 763 899 249 -1117 -625 785 1360 347 -1198 -1434 191 1067 542 -1213 -1364 132
2983 132 1124 340 -1252 -1434 -51 1378 919 -996 -1509 -210 958 689 -821 -1488 -461 1089 859
3000 859 -675 -1762 -361 1017 975 -435 -1493 -680 887 786 -583 -1257 -232 794 784 -497 -1564
3017 -1564 -484 1097 761 -241 -1261 -535 813 659 -450 -1086 -770 617 772 -400 -1253 -778 306
3034 306 766 -291 -1262 -918 433 1014 -23 -1006 -956 302 784 505 -820 -913 644 1102 761 -503
3052 -503 -667 221 761 898 -64 -433 520 867 605 -448 -708 193 1064 892 120 -827 -176 1036 958 58
3072 58 -626 -488 803 1004 104 -787 -459 519 1171 262 -657 -939 308 1100 622 -400 -729 190 1158
3091 1158 366 -821 -991 -428 1036 955 -92 -1050 -293 627 860 -407 -1179 -363 793 709 -546 -1041
3109 -1041 -395 755 777 -620 -1034 -449 836 820 -219 -791 -633 851 1143 38 -1103 -859 715 991
3127 991 -203 -932 -682 865 1014 -29 -1280 -1123 655 1277 12 -1362 -1278 287 1268 234 -1311
3144 -1311 -1198 80 911 586 -1428 -1200 294 1316 490 -930 -1379 74 1471 669 -1258 -1338 99
3161 99 1220 606 -1390 -1425 -282 1142 714 -705 -1266 -38 1171 729 -423 -1097 -107 1160 901 -360
3179 -360 -1070 -324 1134 1008 -335 -1042 -253 946 1334 -59 -1109 -589 952 1278 279 -807 -484 622
3197 622 957 222 -777 -295 639 616 185 -808 -631 489 1013 198 -635 -371 18 1114 400 -617 -891
3216 -891 268 1080 575 -354 -970 49 881 859 -553 -804 -195 1093 988 -394 -912 -610 813 1162
3234 1162 67 -999 -799 514 591 221 -825 -716 288 934 81 -1070 -922 172 1038 395 -682
3251 -682 -961 51 1106 416 -880 -1245 -122 1169 597 -1027 -1614 -292 935 927 -494 -1360 -146
3268 -146 977 700 -1051 -1728 -158 1076 921 -566 -1637 -914 897 1133 -213 -1247 -401 735 1030
3285 1030 -686 -1546 -659 689 1249 26 -1180 -771 734 1123 3 -1355 -632 717 1144 83 -1256
3302 -1256 -1100 423 1079 257 -867 -1064 420 1195 417 -1346 -951 352 1373 470 -825 -1256 381
3319 381 1537 598 -693 -1255 481 1673 917 -728 -1161 -86 1374 1045 -290 -950 -327 1132 1117
3336 1117 -186 -756 -436 1059 1406 -315 -884 -290 1056 1110 197 -1012 -581 790 996 -135 -1176
3353 -1176 -370 1100 888 243 -659 -753 555 676 23 -854 -504 471 820 151 -828 -1018 153 922 220
3372 220 -785 -1117 -144 775 513 -533 -1168 -185 909 859 -503 -1306 -584 456 621 -497 -762 -112
3390 -112 659 907 -465 -893 -657 757 870 65 -1184 -752 270 947 211 -1293 -797 466 1216 163
3408 163 -1211 -1114 416 1049 -24 -1180 -1259 122 1334 422 -1219 -1219 311 1167 779 -946 -1360 -140
3426 -140 1156 993 -490 -1398 38 1433 1052 -485 -1282 -439 764 987 -598 -1351 -73 1165 1139
3443 1139 -441 -1115 -426 870 1294 -73 -1397 -509 1102 1142 -116 -1447 -515 1329 1242 126 -1181
3460 -1181 -684 1063 1181 442 -1268 -695 556 1343 122 -1229 -539 462 1255 490 -1141 -929 272
3477 272 1188 129 -894 -1011 559 1092 513 -1083 -988 365 1092 626 -810 -1102 -28 802 81 -481
3495 -481 -1050 6 923 296 -555 -1016 -107 553 655 -6 -707 -460 254 473 -150 -951 -515 468 1032 -3
3515 -3 -1136 -788 286 658 89 -938 -713 199 732 363 -883 -931 101 683 385 -704 -1033 -32 978
3534 978 634 -274 -962 42 825 736 -738 -1256 -567 548 819 -170 -980 -345 666 623 -291 -923 -203
3553 -203 866 1136 -18 -1273 -658 780 991 106 -1082 -721 699 1081 -200 -1031 -1016 724 1187 419
3571 419 -822 -990 507 1115 375 -883 -841 467 1216 591 -757 -955 65 1231 541 -530 -762 208
3589 208 885 1067 -521 -633 -151 1073 793 -632 -1105 -24 1068 967 -313 -987 -36 1073 1030 -523
3607 -523 -1308 -148 1127 1033 -281 -1208 -88 1087 878 -392 -1123 -715 1035 874 -119 -1071 -380 697
3625 697 958 -20 -856 -635 581 1022 54 -945 -759 473 845 155 -696 -445 326 635 83 -1012 -473
3644 -473 269 711 221 -488 -928 311 755 272 -543 -865 24 589 225 -937 -1064 -38 642 427 -311
3663 -311 -1025 -609 373 515 -446 -864 -144 358 816 -127 -1047 -608 357 547 220 -782 -602 340 274 238
3683 238 -708 -808 41 756 621 -273 -1011 -203 935 624 -553 -257 2 962 400 -673 -572 86 1309
3702 1309 790 -106 -838 -136 831 1138 -233 -751 -57 1089 898 -438 -1060 -483 898 1348 175 -751
3720 -751 -42 671 795 -106 -1113 -595 947 1177 308 -877 -779 375 756 -21 -493 -820 349 955 369
3739 369 -1042 -610 421 1271 455 -840 -840 459 1030 301 -794 -704 298 1239 611 -690 -888 -229 844
3758 844 842 -608 -1033 -118 932 481 -300 -902 54 1086 603 -547 -1222 -212 557 616 -650 -941 -416
3777 -416 721 588 -314 -1013 -337 818 891 -444 -1004 -606 411 653 -76 -674 -408 444 659 38 -567
3796 -567 -672 367 813 6 -651 -692 384 977 -9 -651 -558 261 647 38 -772 -823 64 512 404 -416
3816 -416 -642 -53 620 437 -299 -566 -120 571 788 44 -300 -239 543 482 -39 -139 -48 195 515 -138 -245
3837 -245 -428 169 627 -149 -476 -387 310 565 474 -360 -709 222 711 380 -411 -738 278 933 530 -413
3857 -413 -638 339 852 503 -184 -920 63 943 942 -541 -996 -213 575 955 -218 -840 -242 275 660 -18
3877 -18 -1053 -369 466 629 -435 -896 -405 561 502 -30 -978 -331 402 956 -69 -856 -679 169 872 74
3897 74 -709 -705 296 689 235 -1173 -727 413 1026 250 -779 -668 103 629 9 -762 -854 -150 714 131
3917 131 -466 -904 141 897 371 -407 -688 35 561 517 -476 -656 -101 822 512 -329 -818 118 917 495
3937 495 -415 -657 -77 618 505 -214 -694 -572 593 820 170 -466 -319 342 521 72 -995 -253 459
3956 459 771 -14 -356 -189 276 692 276 -443 -280 462 674 173 -364 -393 -16 651 381 -92 -172 -195 452
3977 452 83 -336 -354 -117 425 420 -395 -526 164 720 259 -184 -835 -212 282 461 -76 -434 -278 272 482
3998 482 -28 -452 -104 289 707 -39 -661 -382 530 370 181 -310 -378 -25 750 148 -278 -597 -176 358
4018 358 320 -541 -475 -140 500 497 -472 -1079 -20 687 248 -216 -769 -366 158 278 -384 -557 -142 523 389
4039 389 -156 -401 -270 532 717 -327 -313 -182 360 300 -442 -903 -355 305 678 -120 -879 -532 163 583
4059 583 124 -486 -520 124 323 -15 -580 -365 177 653 111 -382 -406 113 558 24 -526 -565 150 448 210
4080 210 -363 -279 -229 335 394 -217 -181 95 434 293 -631 -468 -23 336 614 -123 -551 51 339 442 71
4101 71 -25 173 207 493 226 -502 -225 473 293 329 -447 -314 205 148 14 -87 -391 337 161 267 -505 -118
4123 -118 183 158 323 82 -297 247 111 -86 -174 -316 36 416 459 -95 -213 0 419 284 -99 -503 -99
4144 -99 423 353 -189 -309 -128 318 389 174 -197 -256 278 429 55 -386 -315 381 371 34 -448 -474 -211 339
4166 339 359 -640 -467 -15 549 248 -443 -269 -385 537 242 -435 -677 -83 622 195 -245 -527 -158 456
4186 456 190 -417 -736 7 477 380 122 -522 -5 185 324 -130 -782 55 276 411 -366 -476 -609 303
4206 303 374 27 -163 -47 305 675 89 -261 -404 351 421 -44 -24 -113 130 375 -49 -274 -135 71 396
4227 396 229 -243 -200 316 67 -86 -179 -254 150 295 40 -298 -250 336 455 193 -340 -326 -107 636 333 -301
4249 -301 -262 273 234 363 29 -339 -45 316 421 -70 -636 -137 372 33 -345 -286 -311 271 155 45 -52 -194
4271 -194 -310 285 206 -105 -261 234 89 106 -21 -364 -127 -100 171 -132 -333 -191 96 240 1 -144 -124
4292 -124 163 90 118 -290 -226 104 328 127 -316 39 -107 388 -109 -497 -520 -28 270 112 -350 -321 41 243
4314 243 257 -314 -170 70 278 -8 -297 -298 -154 132 23 -440 -49 328 318 -226 -349 -550 124 237 -68
4335 -68 -347 -370 35 672 60 -30 -473 201 453 137 -190 -369 39 379 177 81 -397 -173 409 370 -260 -201
4357 -201 26 232 73 -71 -325 171 324 72 -54 -190 -195 247 393 164 -268 21 272 -55 -334 11 30
4378 30 228 23 146 -406 -118 190 180 113 -23 -197 -79 -48 61 -285 -382 173 134 23 -503 -139 -27 350
4400 350 177 179 -94 -194 47 186 -98 -168 -369 292 188 129 -196 -161 -27 89 -95 -194 -273 -134 -37 -9 -198
4423 -198 -309 -176 -116 -122 -60 -210 -226 98 136 -228 -124 -36 421 229 10 -679 0 323 453 -148 -213 -236 -72
4446 -72 137 -124 -226 -358 306 242 231 -102 -173 -69 -9 342 -565 -147 253 296 -118 -310 -54 -107 513 319
4468 319 115 -225 33 238 -96 -344 -224 -123 206 48 -260 -99 -133 102 212 -422 -122 -192 356 34 -247
4489 -247 -64 35 154 364 34 -358 -254 381 210 -415 -216 300 448 307 -167 -291 59 294 478 -176
4509 -176 -200 -87 -96 31 -147 104 -117 -52 256 97 -390 -285 168 82 18 -143 91 146 315 33 -104 72
4531 72 184 293 -297 -83 -136 37 134 -204 -309 -589 100 323 213 -120 -160 -228 21 -98 -68 -111 -331 -61
4553 -61 22 276 -180 -200 -113 158 -112 -43 -213 -165 -150 66 103 -185 -104 209 -100 -157 -16 -59 -154 -5 83 -107
4577 -107 -294 211 -50 -211 -461 -249 59 -22 103 -583 -34 -81 187 11 -247 -153 170 257 161 -241 -375 205
4599 205 63 54 -290 -266 133 456 -11 -296 -69 202 321 63 61 -169 39 384 -80 -328 -384 72 22 360
4621 360 -1 42 198 539 180 -133 -160 204 238 104 -118 -170 263 428 342 -53 -302 -65 446 288 -241 -239
4643 -239 -3 510 47 -26 -526 54 113 225 4 -88 -313 352 359 -74 -290 -140 -71 149 81 -370 83 21 406
4666 406 -66 -183 -296 316 174 336 -95 -203 181 132 -160 -166 -138 161 -19 210 -143 -227 -200 271 304 -90
4688 -90 -313 53 112 62 -188 -121 24 291 290 -188 67 -21 325 93 64 -102 -109 176 187 1 -233 -411 299 208
4712 208 231 -90 124 -86 235 -149 -200 -40 8 49 53 -82 -230 13 132 109 -416 -114 -294 211 268 -283 -188
4735 -188 130 423 59 -369 -525 -40 297 185 3 -528 -73 9 -79 264 -18 5 276 225 -145 -408 -240
4756 -240 109 370 42 -358 -237 423 346 114 -283 -161 79 267 -70 -206 183 276 444 140 -202 -38 106
4777 106 263 80 -370 -128 201 199 -141 -240 -75 76 127 76 -90 -417 -97 172 -138 -237 -386 -102 165 221
4799 221 -45 -285 -92 -10 15 -130 -514 -138 198 3 -348 -267 -318 141 360 -11 -190 -87 -15 236 6 -259
4821 -259 -188 163 -35 100 -86 -309 191 309 -53 -135 -509 -69 199 18 11 -347 43 326 232 -210 -317 240
4843 240 -43 2 -114 -217 94 311 194 -9 -308 121 22 90 -276 -225 -21 170 255 229 -213 -134 202 288 99
4866 99 -330 -87 330 16 131 -458 -85 110 212 193 57 -289 80 331 3 -27 52 91 323 273 -45 -312
4888 -312 -43 94 111 10 -223 214 490 69 -97 -562 -164 447 257 -436 -297 -148 305 285 177 -241 -74
4909 -74 375 10 5 -441 91 128 154 -22 -420 2 497 279 -111 -277 -246 148 -61 13 -372 -211 68 252
4931 252 -118 -332 -87 66 39 243 -153 -244 68 -71 -107 -68 -437 312 550 -163 -231 -184 -154 67 106 151 59
4954 59 -98 175 198 -121 40 21 147 -58 -170 -409 -142 351 278 -90 -194 -118 133 137 -60 -183 -128 383 139
4977 139 -24 -270 33 112 24 22 -187 -412 302 533 -164 -307 -467 35 -23 269 -272 118 117 318 136 -170
4999 -170 -97 135 354 -47 -3 24 -191 312 184 -109 178 -18 324 372 -49 -267 86 10 233 72 -122 -155
5021 -155 312 209 -197 -444 -92 199 460 156 -183 -225 59 75 -72 -58 -315 -28 402 135 -302 -13 177
5042 177 414 131 -212 -423 16 292 -91 -86 -84 73 394 282 -133 -272 80 213 79 -385 -268 153 189 -38
5064 -38 -183 -198 1 374 183 -77 -427 -385 240 291 -273 -489 7 366 183 -93 -380 -102 -10 298 79 -276
5086 -276 82 511 301 71 -262 -59 237 493 165 -94 166 114 337 196 -440 -100 -176 148 47 -542 -380
5107 -380 112 297 86 -322 -242 262 405 -49 -36 -243 98 3 -234 -197 -449 -125 190 111 -28 -204 193 511
5129 511 36 371 -76 106 118 91 126 -373 125 82 -46 381 -144 -198 -193 145 157 -55 -134 133 -18 37 -245
5152 -245 56 -42 614 -240 -51 -167 -24 227 118 79 -97 233 373 173 -313 -220 -297 99 109 -32 265 163
5174 163 98 -34 -22 22 -190 -34 166 108 -401 59 121 436 38 -431 7 -103 136 14 -358 -20 78 227
5196 227 -31 -31 -60 -115 339 134 -193 -364 -33 243 -268 -138 -255 -273 287 -24 -199 -256 54 167 22 -116
5218 -116 -400 -47 283 134 -115 -192 -203 -30 165 -246 -151 -207 372 275 -115 -143 -62 147 479 33 -341 55
5240 55 224 202 234 -355 -134 31 239 81 -173 -282 -110 -46 65 -217 -352 -239 524 239 -258 -102 28
5261 28 269 -109 -310 66 128 460 109 -192 -150 -26 268 168 230 -72 -3 464 46 -4 3 -324 367 141 -222
5284 -222 -159 120 438 -140 -53 -219 71 219 109 5 -103 -165 296 310 -167 -289 -299 257 -137 -308 -174 -211
5306 -211 43 230 -62 -382 -139 283 25 -21 -319 -280 35 -177 118 -159 -39 -361 77 137 -144 -447 105
5327 105 309 265 -120 -282 32 241 -67 73 -150 -306 295 214 43 -421 -105 87 252 -124 -199 136 152
5348 152 306 -8 -386 -47 386 380 -126 -140 -305 -58 248 -162 -334 -101 46 70 127 -408 -224 -44 389 100
5370 100 -335 -366 21 268 371 224 -228 371 331 290 -127 71 -123 608 313 -83 -162 94 52 410 -46 -343
5392 -343 -149 150 42 21 101 -165 441 431 52 -281 71 362 367 250 -291 -184 413 90 36 -281 -90 135
5414 135 50 -26 -195 -164 -171 56 -209 -307 162 9 169 -122 -139 -29 19 -205 19 -118 -133 147 196 199 -198 -207 -111
5439 -111 153 110 -169 -117 23 211 137 -71 6 -83 155 214 126 -302 51 19 112 -9 -202 3 -66 333 148
5462 148 -14 187 86 181 251 -196 -47 19 324 19 66 -286 302 174 -11 -247 -316 108 -161 18 -389 -296
5484 -296 264 405 -116 -52 -343 -209 112 309 -37 -82 231 6 74 161 -355 73 88 161 83 -221 300 41
5506 41 38 -211 -272 -287 -165 247 92 -423 12 110 155 35 -412 -230 96 174 -199 -208 -84 129 250 71 -63
5529 -63 64 151 380 -3 107 39 191 313 259 -165 21 288 315 -7 -199 -303 248 254 -43 -160 -132 247 223
5552 223 -7 -197 -399 45 64 199 -63 -191 -89 -4 45 -150 -150 -200 -123 258 233 -280 185 458 218 206 -125
5575 -125 -179 -200 97 378 3 -199 -126 655 -125 -9 -22 103 -54 145 -193 106 -73 137 -56 34 -99 -128
5597 -128 3 28 -373 -160 -17 28 193 -100 -156 -146 375 177 -31 -347 -203 152 526 62 70 122 543 235
5619 235 -6 -158 -59 338 162 -251 -254 -116 80 -35 -41 -81 -114 -24 79 -38 -66 -72 122 103 -92 -241 84 199
5643 199 240 -256 -196 130 128 173 415 55 -289 -105 164 30 64 232 -140 275 1 -167 -232 -62 -137 256 -201
5666 -201 -580 -197 222 68 -88 -331 160 214 242 241 55 -274 199 245 -223 -289 -30 -76 313 18 6 -291 227
5689 227 10 -253 -359 120 487 111 -36 -205 -153 97 94 176 4 21 -5 176 46 -183 -162 -14 224 -178
5711 -178 -131 -167 -133 277 -74 -147 -64 57 155 204 -84 -512 -195 304 -113 -169 171 51 26 120 26 -169 -30 116
5735 116 163 -74 -185 107 -93 255 22 -259 -97 147 57 -162 -34 -180 -266 51 99 -436 71 189 141 227
5757 227 5 -205 -53 64 -32 15 389 146 233 -59 144 -74 -221 21 237 -64 25 -116 -82 209 157 -147
5779 -147 -270 81 331 -64 -302 -53 199 -94 16 -117 -153 32 39 163 -28 112 39 181 -219 31 231
5800 231 -62 133 -41 226 133 325 83 -260 -250 -158 -215 352 -96 -317 -33 10 395 258 -171 -143 -307 200
5822 200 -29 -49 -511 119 95 254 -95 -63 187 -28 48 -2 2 -149 76 -202 -82 7 32 74 120 204 14 -90
5846 -90 50 -43 -67 -77 -198 71 333 -18 184 -115 215 135 8 -151 105 193 -24 51 -172 -56 15 180 53
5869 53 47 -101 -127 66 136 -165 -283 90 -118 144 143 -163 -104 240 -123 -150 -357 88 -197 12 -27 31 147 -87
5893 -87 71 231 -220 -155 116 21 -34 -92 5 4 -22 205 122 -140 53 456 74 29 84 100 153 46 -31 -106 278
5918 278 -52 -251 -72 -64 147 14 48 -114 53 150 114 285 124 -129 140 47 135 232 -11 242 216 352 214
5941 214 -143 -7 411 134 -249 63 6 59 -214 136 -311 62 65 166 -60 -64 -49 39 482 -279 -202 57 -83
5964 -83 133 104 142 -255 1 213 -77 -42 -58 -51 261 324 -265 -32 91 -52 -3 93 58 -53 87 -239 -95 25
5988 25 80 99 34 41 -243 171 -109 335 -140 -199 -314 136 330 -40 -208 121 17 58 155 -166 161 -150 81
6011 81 288 265 -58 -151 195 -93 -126 20 152 37 -30 -56 -37 -207 193 27 -133 22 322 81 34 -102 243
6034 243 -55 180 -28 -60 -136 11 -5 -114 101 -191 151 -96 159 11 -124 -65 -83 299 88 69 151 -20
6056 -20 -204 -21 64 -124 42 283 251 -192 -97 111 -30 -37 221 -118 -160 15 -202 -183 -32 79 23 106 -376
6079 -376 -114 -97 306 28 -283 -477 145 -188 -92 -18 -206 -76 181 31 -196 -236 -126 62 -36 -300 40 136
6101 136 35 306 -7 -83 -1 -143 126 -58 -160 -72 -329 50 -195 -43 -144 96 115 -271 -216 -233 -146 -64 209
6124 209 168 -142 -57 -36 -274 341 -87 289 284 97 7 -123 77 -149 -228 -156 -207 62 176 -94 -140 163 17
6147 17 212 -76 17 -250 -132 -213 -30 -123 -279 -129 180 -48 -49 -174 -91 78 -41 -246 -11 7 133 110 210
6170 210 -16 12 -147 -62 -246 -263 -7 1 188 -105 51 -12 0 -71 274 -127 100 172 6 -86 -161 -99 -106 30 261
6195 261 -317 11 -26 38 -7 230 59 223 -123 -2 -311 16 -42 -45 210 -213 -95 -213 -47 -123 70 44 37
6218 37 123 175 -70 78 -9 -99 3 66 -195 19 -214 -112 -83 21 316 -113 81 -205 39 -93 -39 -10 -11 -41
6242 -41 -57 37 88 -35 104 -121 -92 174 217 -15 -19 -198 93 126 148 29 -196 -39 -80 213 -160 22 -53 -216
6266 -216 124 -169 27 87 17 92 24 99 226 71 -13 -154 -79 111 248 -57 159 197 5 50 40 127 41 -74
6290 -74 51 1 6 96 253 37 162 -189 -269 201 -13 82 -31 -97 161 -109 -175 125 -123 64 -32 222 -97
6313 -97 -64 15 -33 -104 -177 112 -115 -21 49 186 2 -39 -274 223 2 -16 57 234 -168 -212 -145 -263 81 29 341
6338 341 -195 -290 400 243 137 23 22 -40 -212 -52 -271 -245 -51 -291 -47 -19 54 88 75 -296 187 44 -128
6361 -128 -157 95 62 144 -99 97 2 57 -24 -7 208 106 121 -30 35 14 221 26 -240 66 96 -186 144 135
6385 135 -256 115 -128 -11 -8 -65 -206 309 -111 -72 -7 -13 215 4 129 -23 5 170 232 68 9 -63 165 97
6409 97 1 11 -109 85 253 156 68 -14 82 108 73 158 68 236 -23 92 109 -125 146 23 202 -183 -93 -319
6433 -319 84 -154 -59 -156 196 204 97 -59 66 -217 -226 176 -60 252 -23 153 86 143 54 -218 -5 14 7 -40
6457 -40 -48 7 -25 56 -240 12 307 163 87 22 31 -90 -30 322 -3 -95 -10 173 -252 -368 112 -102 -18 -34 32
6482 32 -103 -222 230 -117 12 90 125 -15 -143 115 39 -56 -78 -41 53 -189 -6 -161 -218 143 -83 -188 -45
6505 -45 -178 -9 -205 196 29 166 22 28 54 106 151 37 -38 45 -111 -29 144 -101 203 240 51 -67 36
6528 36 27 -100 215 127 -11 -35 62 335 -42 57 70 286 118 -109 -88 -139 11 100 -69 50 -135 -49 124 44
6552 44 274 2 63 -54 39 -2 83 26 179 25 52 163 -159 58 4 5 7 -115 -440 23 86 92 -283 -29 -19
6577 -19 -267 -15 221 -17 228 82 146 -122 -145 94 216 162 0 333 -12 63 232 -137 -179 -167 273 103
6599 103 137 211 -146 25 -52 -31 21 -25 20 102 -89 -9 47 0 -65 47 -133 54 -173 -135 -64 46 16 180 1
6624 1 -71 116 164 -30 45 -196 -11 47 -190 219 78 -92 364 14 49 -44 -200 103 -129 -129 35 -249 253
6647 253 210 -212 200 38 -233 188 13 -237 -143 -36 -6 67 -40 -60 44 197 -134 16 -49 53 -130 116
6669 116 121 -343 -207 -72 -210 53 -138 124 -406 -120 244 -136 -16 231 71 203 -68 5 87 -69 134
6690 134 135 -423 -55 -159 8 -57 -241 101 -25 327 -63 244 20 100 -392 12 27 256 218 -299 -200 -14
6712 -14 146 -136 192 -415 -82 -122 -94 9 -437 -36 160 -135 -75 -89 14 -177 -48 -13 -115 -445 253 -197
6734 -197 -42 106 -109 -58 -126 -29 -59 238 -23 264 -61 -197 -174 -82 -160 -283 45 -10 -34 26 94 340 12 -78
6758 -78 16 46 -38 -124 273 -159 147 -21 218 -70 18 83 -126 136 -221 -101 172 90 -44 11 -89 -80 38 -65
6782 -65 3 12 265 148 149 -304 -126 180 -166 -3 -32 -224 111 -119 -95 4 154 -19 229 170 260 -19 -68 332
6806 332 314 123 79 45 292 -21 369 -78 124 159 139 -72 11 31 -104 180 -277 2 -94 80 106 -64 -240
6829 -240 208 -32 -34 -68 5 37 5 100 95 7 -189 -193 121 -26 -141 270 -118 164 -123 -283 28 18 281 259 -31
6854 -31 -72 -331 46 115 43 -276 90 93 -17 -126 -69 -27 212 265 104 -54 -224 364 -56 -195 -290 91 144 -27
6878 -27 161 -244 -68 19 170 -61 -5 -16 85 107 11 -6 -16 138 -175 99 -136 -210 401 -161 -229 -168 311 -188
6902 -188 -32 249 -109 12 -70 126 19 -26 50 -416 -211 256 50 172 311 49 394 -65 166 -18 170
6923 170 53 -59 -239 -105 404 48 68 104 -255 56 232 -93 -190 -122 -38 -44 -101 30 95 53 -156 76 -12 225
6947 225 -151 2 186 -229 62 238 409 -41 224 -93 -411 146 339 -83 79 -56 230 -105 -208 154
6967 154 -98 96 -266 123 150 -53 6 130 -158 -203 148 49 135 40 -146 79 67 237 -41 99 95 -116 48
6990 48 -31 -386 -23 8 -121 -89 -39 -249 39 280 71 -174 67 203 -101 -35 -89 3 220 106 -7 -218 -154
7013 -154 142 -161 -152 -107 124 255 169 143 -162 92 -43 -84 -218 -60 23 -81 -167 55 173 -233 -52 -99 161
7036 161 -104 16 91 -229 1 47 -3 -76 -31 244 38 110 28 4 35 118 44 -317 82 -101 86 -7 40 143
7060 143 -7 -157 -176 21 388 111 -86 -152 -76 52 94 -329 -200 -422 144 -36 -166 34 173 20 -148
7081 -148 156 -151 -142 -178 47 73 -149 56 -86 -45 353 48 -165 -52 -272 -60 -101 -117 64 -97 99 -126
7103 -126 142 110 -152 248 150 -87 55 57 -168 32 -57 -54 74 119 -89 117 150 -39 33 -198 -110 -90 -269 245
7127 245 115 58 -136 37 290 63 -57 -253 104 98 -63 43 -57 -207 -44 -256 165 -162 -42 159 -99
7148 -99 178 91 -200 -218 68 -75 28 44 -176 88 98 -232 173 -8 39 -61 -88 85 100 127 -188 -85 -78 -150
7172 -150 114 107 3 336 -160 66 186 99 59 -125 226 273 243 -299 143 -81 -68 -323 129 76 11 378 -117
7195 -117 -147 9 -119 24 -202 -62 -28 69 198 -163 62 -100 372 -176 213 -39 68 39 8 131 -311 71
7217 71 200 -72 112 -89 -215 39 -75 83 -18 139 -105 91 81 5 286 125 -309 -121 -54 -83 -84 33
7239 33 16 -90 9 309 28 -173 53 104 -114 250 219 9 -321 -306 -31 8 -178 -116 164 366 -7 185 208
7262 208 12 -21 148 -132 -41 -109 -153 41 75 264 -243 -261 26 90 -73 -135 -84 -64 0 -67 154 189 35 69 -5
7287 -5 70 50 269 154 -18 92 -261 -28 77 -239 -124 143 10 -129 118 -154 132 -226 104 74 106 -55
7309 -55 195 87 253 -138 -130 -145 -179 -86 -37 221 -30 -227 52 51 -40 -6 -274 -164 92 -215 246 30 152 6
7333 6 244 295 -372 -46 -27 -9 -22 -52 -348 -124 -91 23 -64 220 -351 -98 -52 -59 136 -82 -18 151 -56 -181
7357 -181 -77 25 -273 70 40 -221 -32 -197 -95 121 -498 -97 -45 -383 -78 133 -128 154 130 -82 165
7378 165 -151 50 -120 -29 30 -218 78 94 -107 -106 -33 -8 51 53 -16 -1 73 195 46 68 105 -19 -130 56 114
7403 114 -234 10 121 62 -222 105 20 -164 421 -1 -204 8 67 -59 139 -67 65 -57 320 -190 71
7424 71 -44 -227 -2 -186 -141 -92 -125 296 4 -58 60 -72 42 -193 -134 -161 -216 121 -135 36 -37 -18 -22 -173
7448 -173 -98 -218 -287 -104 166 89 -28 291 -126 -95 16 -62 273 16 165 -190 -183 126 216 -113 121 82 24
7471 24 62 146 -204 149 -113 -170 -293 109 126 -9 76 333 -54 -20 -315 191 139 -143 -81 -59 -187 133 137 -72
7495 -72 -301 -26 -154 -209 -119 24 -53 -16 24 -56 -444 -69 180 121 59 -135 277 41 75 -74 173 36 6 -127
7519 -127 -163 -34 32 52 146 5 164 -84 -180 305 -196 105 54 2 30 -190 -141 -5 -202 7 352 -25 -237
7542 -237 118 44 412 -195 -179 339 -168 79 45 -117 164 107 75 -40 -150 181 91 25 119 -63 151 -111 83
7565 83 37 61 176 28 56 215 -192 -83 -69 68 169 126 50 70 181 147 65 -192 -32 99 -129 149 161 124
7589 124 -141 87 197 122 18 -134 108 100 213 -121 -88 -167 -5 141 9 176 -77 -187 -169 261 -80 63
7611 63 182 -75 -124 -85 152 -66 367 120 82 71 53 -7 -4 35 -21 188 -19 -41 27 282 -132 154 -140 -25
7635 -25 137 27 -103 -154 -149 -121 111 -221 -64 49 -90 -42 111 33 84 209 -65 -157 60 11 -47 -276 3 -159
7659 -159 -95 66 -77 118 -84 -368 -116 46 76 81 157 190 -196 66 98 -84 115 29 45 -107 47 292 123
7682 123 -41 -283 -48 -127 -348 -116 -17 -212 -95 -302 305 82 1 -25 -132 109 24 -136 -223 84 -16 -21 167
7705 167 -5 -85 -211 -13 160 27 -17 -146 -377 -150 -262 15 -159 123 -314 -171 -106 54 -365 -229 263
7726 263 -9 194 251 -74 37 -95 -102 -125 30 -127 -89 -107 -83 -80 159 177 -45 -368 165 -125 -142 -25 -84 -112
7750 -112 -446 129 53 163 46 -182 -92 -165 -100 -13 -137 -11 -88 52 107 61 -117 60 182 306 -327 5 54
7773 54 -199 -218 -97 -212 59 17 54 -46 -169 41 56 -82 -222 133 66 59 -174 307 111 210 61 175 8
7796 8 -264 551 -50 -88 -272 135 72 163 247 -112 -134 -261 -254 70 2 69 -198 77 295 90 131 333 -98 -297
7820 -297 162 -131 -128 25 96 -125 146 32 216 -25 97 -148 148 108 156 -72 -60 156 149 -26 -110 139 160
7843 160 -88 -192 41 9 -26 -71 25 27 -127 99 -35 62 17 228 -29 -42 -122 -63 321 -164 147 149 44 -92
7867 -92 6 99 -202 -32 -63 91 -98 249 235 -33 -182 294 -116 11 116 160 50 17 -64 -4 -79 -119 27 27
7891 27 -47 -275 59 6 -85 -155 232 -69 276 17 -160 -297 -170 59 -1 5 -281 -26 -150 124 -117 17 -178
7914 -178 103 42 206 265 31 -53 -260 -1 40 -385 -53 295 245 40 136 -202 69 136 150 49 -121 -132 33
7937 33 -153 -64 224 -205 -172 179 99 -62 8 -194 35 178 -11 -93 128 276 28 -264 -89 -59 -64 -24 22 54
7961 54 42 169 126 -98 -43 167 1 59 -45 -116 -165 129 135 -131 78 -22 176 -126 365 11 117 322 -118
7984 -118 -353 -309 74 218 165 51 -87 99 161 56 76 224 -81 18 -166 -49 -17 -12 80 186 230 86 267
8007 267 -92 52 -372 -26 -134 16 114 93 -123 -218 347 -152 288 75 -92 139 34 -235 -116 68 -164
8028 -164 -127 14 85 17 -11 -223 -154 -35 -57 -139 -55 -5 -252 188 310 -54 289 -17 -29 -80 13 246 274 312 -237
8053 -237 67 -118 -66 -4 -23 17 -163 -205 -97 60 -89 71 20 24 178 72 -204 80 128 86 179 178 -96 169
8077 169 -12 -220 289 -16 -98 -92 -126 -71 9 203 -273 -46 63 353 -238 -211 -96 -82 -333 -434 47 76 203
8100 203 9 58 -304 140 50 -59 184 -223 -92 194 50 -53 -21 43 89 -105 84 258 -327 31 293 -71
8122 -71 -76 150 175 -126 65 -161 171 204 186 247 -15 -90 41 40 73 -42 -286 369 -130 -65 -65 -217 292 177 150
8147 150 42 130 -17 429 -56 -122 -228 64 -95 306 -70 -153 -135 52 93 -184 -185 -10 -13 36 53 -149 -246 78
8171 78 -35 -120 -216 -501 125 22 88 -302 -39 -264 130 314 -147 -37 132 177 -37 184 -18 -127
8191a27
$$ Imaginary data points
##PAGE= N=2
##DATA TABLE= (X++(I..I)), XYDATA
0 0 0 0 0 -6 8 0 8 -8 8 -16 24 -24 32 -40 48 -56 69 -80 95 -112 133 -151 174 -204 232 -265 302 -344 390
29 390 -439 496 -556 624 -698 778 -867 963 -1071 1186 -1316 1458 -1614 1786 -1978 2194
45 2194 -2431 2703 -3013 3370 -3784 4276 -4867 5597 -6523 7740 -9423 11912 -15977 23776
59 23776 -44243 209689 495948 39654 -244090 -147725 202402 280960 84138 -113199 -9521
70 -9521 212970 262370 33527 -167201 -102695 150175 248713 92959 -100722 -74811 83993
81 83993 130527 -5078 -114037 -47297 113748 163282 46834 -100510 -119321 -28915 42538
92 42538 32782 10465 29567 46990 -5751 -96388 -118458 -23165 89113 86180 -27117 -104515
104 -104515 -59269 24972 21061 -54348 -76951 -1762 67509 30940 -66683 -106416 -50299 24517
116 24517 35356 -15036 -45791 -1999 54877 20146 -89251 -131538 -31890 103974 125681 19855
128 19855 -93152 -104898 -21611 60090 60328 -5404 -49419 -15980 42515 32623 -43028 -78137
140 -78137 -14347 72693 74841 -9491 -82878 -65530 18409 66709 19170 -58887 -56071 34391
152 34391 97760 47185 -66755 -111719 -30982 89516 119377 38380 -52738 -58147 12046 68705
164 68705 55431 5330 -11265 22382 54860 39161 -7393 -25409 17213 73860 69163 1955
176 1955 -42433 -10828 46935 51658 1966 -38323 -21031 33485 61018 25273 -37776 -57416
188 -57416 -16858 27065 22837 -9101 -16313 1419 -1939 -31081 -36905 1417 34346 13714 -39567
201 -39567 -62759 -26689 29523 37538 -16105 -61550 -34581 26581 33309 -25783 -64424 -23647
213 -23647 41067 33189 -41726 -74404 -6081 78327 58294 -51050 -110291 -33421 90962 102427
225 102427 -17145 -111851 -54717 80622 117968 11066 -96957 -64829 62165 111835 17279
236 17279 -84771 -49570 72771 107796 4358 -97901 -60834 69173 120318 23300 -100153
247 -100153 -94746 29110 112972 55951 -61413 -88233 -2982 67986 31443 -49334 -58094 8037
259 8037 50092 16267 -39070 -41119 7671 36557 3783 -44911 -37314 19229 48950 10683 -44826
272 -44826 -45763 4726 37299 14080 -22816 -20444 6336 7457 -22215 -35726 -3395 41145 37800
285 37800 -20392 -66723 -42268 24003 50193 5920 -50967 -49046 9060 48748 17867 -45745
297 -45745 -59998 -9430 40439 29529 -23356 -49815 -19511 23863 21363 -22524 -45809 -12208
309 -12208 38574 37109 -25980 -77821 -48645 34250 71629 19555 -56114 -66385 -8086 43707
321 43707 29286 -26984 -50303 -10445 38109 31425 -20499 -47139 -14470 32965 32231 -12160 -36122
334 -36122 -7745 31526 27829 -12428 -36395 -11889 34662 48891 12422 -33039 -37594 -569
346 -569 34144 34385 10596 -8989 -8654 1481 7072 7393 8717 8493 4668 1845 2999 4746 4946 4708
362 4708 4250 3306 3602 3597 3487 3214 1258 -2334 -3031 348 4419 8219 10241 3103 -12615 -21850 -13650
379 -13650 6802 23206 19984 -4497 -32106 -32567 -267 30309 22897 -16809 -42014 -20102 21161
392 21161 26742 -10654 -40884 -23337 18673 30248 -6144 -45940 -35101 15406 36816 -2782
404 -2782 -50138 -36610 24576 50979 1120 -66096 -62534 12418 66316 33312 -41696 -66916
416 -66916 -15437 43249 37032 -18825 -46923 -11194 34593 25132 -22920 -41642 -4444 39798
428 39798 31249 -18637 -42704 -9171 34306 30292 -12135 -36260 -12034 29206 36961 5013 -25673
441 -25673 -19806 8334 21128 11258 383 4636 13000 6865 -7511 -5358 18142 34748 21008
454 21008 -5618 -13561 5915 28767 29458 9122 -5130 6971 27204 25743 3629 -9383 4825
467 4825 27622 26371 953 -12686 6320 31468 24786 -11722 -33158 -9735 35235 46297 3411
480 3411 -45263 -40476 11686 45556 20203 -30026 -42172 -4334 29343 11773 -32289 -40739 -988
493 -988 32830 14550 -34442 -50876 -12973 29760 19803 -31435 -54819 -18187 31756 29192 -22533
506 -22533 -57875 -33328 17918 30650 -3544 -34359 -24589 3524 10467 -6303 -16399 -932
518 -932 18656 12115 -14312 -22547 1189 26459 21724 -2753 -10923 7064 23946 15706 -3677
531 -3677 -3414 14591 22404 10098 -2456 4519 21157 21234 165 -16168 -2428 27166 33577 6945
545 6945 -21392 -18416 9989 29066 17839 -4784 -10228 2297 11135 5403 -2711 -237 9815
558 9815 13718 5986 -3854 -3225 6108 11268 7348 -504 -3972 599 9384 12586 5967 -5007 -11331
573 -11331 -7238 7557 19374 11519 -12711 -26163 -11927 13502 19781 -248 -20923 -16196 5031
586 5031 11798 -5524 -22314 -13900 11071 18572 -3694 -29437 -22428 10332 25563 620 -31433
599 -31433 -28654 5324 27982 11103 -24883 -35753 -8853 19955 17102 -10110 -25732 -14488
611 -14488 5448 7494 -6973 -13526 -1617 10288 3434 -12430 -14806 1818 16995 12267 -5135
624 -5135 -10772 3934 18131 13940 597 -2342 8003 16695 11411 785 1705 15378 20993 5470
638 5470 -11377 -4865 20086 29888 7401 -22276 -22261 8890 31341 15341 -18265 -28290 -4728
651 -4728 19503 11546 -18494 -29053 -4254 20608 8201 -26062 -34311 -3057 26269 13258 -27485
664 -27485 -42240 -9660 29218 22472 -21446 -45090 -18100 25051 28547 -11296 -40568 -21764
676 -21764 16497 21855 -8632 -30485 -13091 17833 18408 -13067 -32630 -11513 23120 24683 -6803
689 -6803 -27869 -12634 16627 22558 1818 -14385 -4599 13777 13258 -2181 -6894 6389 16388
702 16388 5650 -10219 -5351 17081 23155 430 -22175 -13181 15918 27282 6223 -19555 -17888
715 -17888 7269 19754 2224 -18948 -11710 13899 19971 -3789 -25714 -15197 15892 27206
727 27206 4867 -20822 -17065 8241 22275 8870 -12353 -13093 6661 19813 10358 -5748 -7598
740 -7598 1143 6149 2081 -477 3758 8265 2728 -9325 -12465 -1998 8837 6096 -4471 -8424
754 -8424 -4175 -2205 -8202 -11234 -2075 9058 5334 -12171 -20425 -8814 7511 6726 -10043 -20299
768 -20299 -7158 13688 12748 -11486 -27095 -13856 9793 14890 -1799 -15942 -10195 4789 5728
781 5728 -10098 -18209 -4626 16095 17395 -5684 -25597 -18435 7173 19844 8325 -9569 -11281
794 -11281 1228 10227 4380 -7542 -8063 5106 15068 9328 -1941 -4365 1654 4566 1049 -1555
808 -1555 4369 13596 11047 -3313 -14067 -8348 7071 13490 4766 -4562 -3236 3545 -187 -11949
822 -11949 -12259 3972 18131 11925 -9381 -21608 -9605 11809 15262 -3150 -16956 -5035 17085
835 17085 18466 -4810 -23429 -13013 14101 25496 9145 -11308 -10932 5464 13255 1633 -11715
848 -11715 -3057 19838 24642 239 -22982 -16649 10374 24417 12076 -7883 -9689 5679 12810
861 12810 654 -11997 -5447 12430 17551 3387 -10659 -7084 6394 8148 -3615 -8226 3173
874 3173 15906 9986 -8738 -18123 -6840 9701 11530 -782 -6492 409 3898 -5727 -15704 -8752
888 -8752 9014 16329 2609 -16638 -17892 -384 11678 2596 -12571 -11539 5266 14328 1395
901 1395 -17089 -16409 2068 13580 6006 -6688 -8321 1052 6299 -1506 -11309 -7188 8605 16051
915 16051 4769 -11184 -12614 -2072 6598 5679 766 569 2526 -331 -5494 -4878 2887 7703 3855
930 3855 -3677 -4419 4100 7928 656 -9145 -5942 7265 13666 5162 -6676 -7742 1520 8845 3631
945 3631 -5052 -2464 8828 11506 -152 -12037 -8807 6128 15648 8220 -6417 -10517 -839 8896
959 8896 6518 -2961 -7115 -532 7477 5318 -3659 -6493 -965 4691 3640 -1252 -4148 -743 3535
974 3535 3284 -3197 -7122 -2842 4875 6895 932 -6290 -6383 -109 4250 2627 -1319 -2525 -1176 409
990 409 131 -1251 -569 1725 1910 -1729 -3383 -38 4192 3314 -1351 -4363 -2024 3262 4064 -268 -2894
1007 -2894 184 3466 1525 -3440 -3776 2642 7804 3933 -4696 -6651 1267 9184 6696 -3471 -8723
1022 -8723 -1019 10452 11195 -862 -9700 -4213 7114 9583 2257 -4748 -2257 4909 5699 -1752 -6563
1037 -6563 -2166 6847 7976 -603 -8687 -6813 1701 5144 525 -4554 -3662 -288 -50 -2647 -4168
1052 -4168 -3362 -1906 -1761 -2406 -1289 249 -2507 -7164 -7882 -2074 3418 2834 -2982 -6691 -4839 -1297
1068 -1297 -1936 -4819 -2472 2256 3517 -2112 -9508 -8815 -45 5925 2799 -4554 -5244 373 3094 174
1084 174 -4745 -3886 2557 7767 4784 -2048 -3158 693 3875 2651 874 3028 7592 7458 852 -4406
1100 -4406 -1804 5711 9540 7082 2208 267 1200 1505 -159 -88 3934 7440 4178 -2901 -5684 -1613
1116 -1613 3492 2563 -2078 -3300 1616 5839 2156 -5666 -8787 -3002 4879 7092 1823 -4439 -4699
1131 -4699 -603 680 -1962 -2530 547 4644 4618 -1952 -9170 -8561 -459 6289 5983 -1295 -6892 -6046
1147 -6046 -38 1700 -2442 -6502 -3130 4121 6119 -1307 -9936 -8974 706 6748 2577 -3543 -2931
1162 -2931 1969 3067 -3145 -9039 -3754 8329 12288 2396 -9322 -9360 913 6824 2528 -3438 -1619
1177 -1619 5081 5553 -4273 -11095 -5477 6481 9663 1757 -7469 -5659 3644 5913 -2934 -9084 -2149
1192 -2149 10673 12157 26 -11414 -8441 4542 10952 4326 -4012 -1047 7249 6593 -3782 -11071
1206 -11071 -3232 11568 14547 2240 -10692 -9260 2394 7679 629 -7257 -4318 5660 7074 -3159
1220 -3159 -12691 -8974 2431 7301 2168 -5208 -5335 -464 1533 -2900 -7002 -3068 5161 8263 1953
1235 1953 -5925 -8425 -2454 4055 5300 2977 738 -232 -474 -1279 -1825 -1064 1900 4832 4207 753
1251 753 -1706 -2610 -1150 1084 2078 2677 3409 3414 1565 -1567 -2453 -587 3470 6305 5613 2701 302
1268 302 -758 -747 655 2645 4564 5467 4238 99 -3897 -3804 306 4222 3892 1185 -2031 -2323 -935
1285 -935 -890 -3010 -4530 -2046 2614 3322 -1293 -7213 -7467 -3398 1524 1559 -1402 -2540 -1481 -437 -1636
1302 -1636 -5060 -5714 116 6221 4963 -3088 -8517 -6066 1581 5439 762 -5018 -3633 2576 3968
1317 3968 -1954 -8645 -6787 3159 8763 2110 -7803 -8119 1533 6765 534 -8082 -6211 5665 11920
1332 11920 2753 -11082 -11053 3422 13720 7128 -5423 -8030 2493 11156 4940 -7277 -7619 5768
1346 5768 14490 6138 -8074 -9614 3291 12940 5762 -7633 -8030 5242 13184 4332 -9530 -9987
1360 -9987 4177 14159 6126 -8475 -9350 4405 12499 3177 -10396 -7930 7411 15554 4055 -12042
1374 -12042 -11569 5277 15151 5467 -10324 -11355 3701 13571 4934 -11344 -12566 2678 12460 4611
1388 4611 -9958 -11483 659 9998 3100 -10178 -11518 1479 10183 3417 -8780 -11117 -643
1401 -643 8248 4721 -6098 -8750 -214 7350 3969 -5094 -7527 -238 7368 4355 -4103 -6548 532
1416 532 6332 3259 -3646 -6025 -711 5818 5325 -1214 -6065 -2821 2956 3769 -202 -3028 -1644 2071
1432 2071 2786 -402 -3356 -2163 1448 3079 1371 -1953 -2206 644 2716 879 -2261 -2111 944 3755
1448 3755 1961 -1893 -4105 -1813 2194 2852 -265 -2780 -1611 828 1125 -2144 -4753 -1919 3061
1463 3061 3877 -730 -5735 -5025 547 4496 1552 -3809 -4283 822 5057 2272 -4092 -5859 -832 6068
1479 6068 6374 -709 -6259 -2567 4134 5230 -336 -4699 -1232 5407 6333 -614 -6884 -4331 4481
1494 4481 8538 3263 -4925 -5517 3015 7303 2262 -5092 -4460 3932 8676 3162 -5630 -7102 1981
1509 1981 9279 4358 -4652 -5390 3248 9357 3514 -7161 -7960 3123 11721 5814 -6750 -9902 373
1524 373 9553 5548 -6458 -8822 1911 10787 4422 -9012 -10816 645 10830 6201 -7193 -10797
1538 -10797 -105 10190 5411 -8597 -12083 192 11853 6701 -8041 -12885 -1294 10312 6603
1551 6603 -7032 -10974 -139 10016 5844 -7900 -12811 -770 11797 8166 -6656 -12463 -2860
1564 -2860 9481 7696 -4823 -11004 -2317 9573 8154 -4083 -11077 -3653 7831 8313 -2167 -9106
1578 -9106 -3110 6581 6811 -2366 -8265 -3317 6069 7795 -116 -7292 -4806 3681 6716 538 -5144
1593 -5144 -3263 3084 5353 491 -4825 -3410 3029 6107 1309 -4552 -4309 1782 5634 2036 -4176
1608 -4176 -4385 1625 5561 2685 -3593 -5241 -650 4988 3982 -1892 -5654 -1799 4240 4095 -1603
1623 -1603 -4880 -1354 4304 5356 -845 -5720 -2916 3916 6001 1111 -4882 -3426 3389 5858 1357
1638 1357 -4589 -3441 2975 5951 1893 -3947 -3970 2124 5928 2302 -4167 -4350 1560 5794 2869 -3497
1654 -3497 -5221 660 6247 4116 -2995 -5969 -811 5472 4919 -1196 -5724 -2002 4665 5213 -582
1669 -582 -5233 -2544 3585 5453 32 -5955 -4442 2808 6138 866 -6062 -5543 1243 5395 1259
1684 1259 -6003 -6386 839 5488 1871 -5707 -6668 -112 5166 2416 -5548 -7022 -52 6079 2483
1699 2483 -5991 -7476 37 6973 4208 -5396 -8863 -1114 7185 4649 -4491 -8195 -1634 6692 5086
1714 5086 -4482 -9093 -1843 7284 6459 -3781 -9025 -2360 7376 7098 -3246 -8817 -2492 7288 7571
1729 7571 -1568 -7703 -3049 6772 8431 -274 -6756 -2498 6577 7765 80 -6072 -2391 6374 8124
1744 8124 839 -6275 -3340 5138 8071 1918 -5598 -4412 3432 7496 1632 -5904 -4743 2149 6402
1759 6402 2144 -4680 -5249 1002 6017 2752 -4218 -5569 256 5919 3103 -3610 -6089 -864 5801
1774 5801 4107 -3044 -6407 -2411 3878 3921 -2401 -6192 -2798 3979 3862 -2493 -6846 -3555 3625 5029
1790 5029 -1632 -7395 -4422 3323 5611 -1051 -7083 -4284 4086 6754 882 -6523 -5189 3436 7452
1805 7452 1466 -5809 -4805 3106 7478 2014 -5933 -5667 3229 7689 2531 -5598 -6358 1458 7207
1820 7207 3547 -4954 -6272 657 6706 3465 -4339 -6159 257 6383 3800 -3287 -5750 80 5524
1835 5524 3685 -2564 -5084 -111 5482 4151 -2267 -5269 -604 4778 4309 -1289 -4274 -1320 3197
1850 3197 3601 -1305 -4392 -1759 2880 3671 -892 -4437 -2414 2194 3586 -219 -4219 -2882 1007
1865 1007 3443 807 -3216 -3849 579 3799 1909 -2325 -3849 -359 3364 2640 -1596 -3643 -735
1880 -735 3849 2813 -1589 -4223 -1335 3507 3573 -827 -4792 -2117 3444 4788 -539 -4771 -2445 3284
1896 3284 5017 921 -4180 -2817 3266 5802 1196 -4574 -3141 3313 6735 2434 -4164 -3756 2517
1911 2517 6637 2933 -3938 -4331 1809 6522 3518 -3918 -5782 127 5810 3736 -3005 -5594 -1132
1926 -1132 4559 2814 -3400 -6292 -1014 4804 3213 -3425 -6713 -2208 3446 3613 -2306 -5733 -2353
1941 -2353 3668 3630 -2528 -6293 -2591 4137 4881 -1299 -6499 -3557 2841 4429 -1270 -5801 -3286 3808
1957 3808 5247 -904 -7108 -5029 3260 6499 1268 -5193 -4981 1710 5422 793 -5444 -3898 3277
1972 3277 6991 2056 -5470 -5633 2129 7200 2844 -4248 -3987 2772 6259 1874 -5059 -5301 2207 7814
1988 7814 4023 -4326 -5733 575 5431 3045 -3487 -4041 2035 6680 3194 -4782 -6293 454 6450
2003 6450 4759 -2135 -4929 -463 4903 3310 -2814 -4185 667 5760 4332 -1627 -4983 -1754 3502
2018 3502 3890 -177 -2121 -333 2624 1854 -2077 -4158 -720 3738 3834 -59 -3513 -2422 297 1540
2034 1540 -238 -1380 -473 1524 1814 -958 -3356 -2500 547 2631 1932 -756 -2548 -890 831 707
2050 707 -1481 -1665 305 2383 2151 -1326 -3731 -2169 1348 3376 1349 -2004 -2582 -212 1693 -372
2066 -372 -3108 -2083 1933 3924 1137 -3275 -4486 -547 3397 2311 -1576 -2826 251 3065 1540
2081 1540 -3220 -4549 68 4936 3765 -1678 -4496 -1858 2520 2760 -1643 -3691 -538 4273 3117
2096 3117 -2995 -6120 -2063 3932 4327 -877 -4966 -2711 2498 3733 -1181 -4737 -2133 3468 4689
2111 4689 -272 -5027 -3575 2193 4652 764 -3430 -2160 2270 4215 118 -4311 -3072 2485 5528
2126 5528 1388 -3608 -3022 1721 4228 1184 -3212 -2406 2631 5173 933 -3986 -3813 2159 5450 1984
2142 1984 -3513 -3419 2162 5382 1901 -3737 -3786 1660 5508 2996 -3180 -4623 452 4780 2559 -2901
2158 -2901 -3927 289 5192 3211 -3147 -4711 -397 4340 3275 -2324 -4582 -838 3881 2878 -2259
2173 -2259 -4703 -1030 3614 2814 -1476 -4249 -1455 2213 2684 -1768 -3635 -949 2753 2809 -1457 -4060
2189 -4060 -1692 1934 2451 -462 -2975 -1351 1530 2096 -720 -2992 -1673 1319 2627 44 -2017
2204 -2017 -1448 378 891 -36 -1001 -786 917 1371 98 -1669 -1724 -163 1257 843 -196 -1105 -716 -6
2222 -6 349 -495 -1147 -258 920 1288 -414 -1914 -1909 299 1289 482 -986 -1300 414 1382 47 -2329 -1768
2241 -1768 1043 3401 1540 -2042 -3351 -911 2329 2077 -1022 -1886 -33 2564 1608 -2003 -3240 -974
2257 -974 3073 3337 -358 -3269 -1345 2086 2485 -493 -2452 -653 3076 3689 -252 -3948 -2256 2273
2273 2273 3871 1080 -1998 -1074 1720 2502 -301 -2929 -1413 3041 3882 897 -3241 -2669 769 3256
2289 3256 767 -2072 -1231 1590 2871 271 -2848 -2211 1287 3824 1874 -1686 -2389 609 2637 861
2305 861 -1572 -1344 1363 3450 1720 -2261 -2863 154 2844 1983 -995 -2247 -424 1965 626 -1767
2321 -1767 -2614 584 2814 1703 -1894 -3257 -814 1890 1571 -1540 -3045 -448 2086 1477 -1888 -3768
2337 -3768 -1525 2083 2146 -854 -3051 -2074 860 1595 -452 -2885 -1567 1513 2197 -601 -3037 -2196
2353 -2196 869 2324 548 -1766 -2313 355 1855 308 -1934 -1629 691 2115 713 -1222 -1398 359
2369 359 2002 852 -421 -699 557 1547 1185 -583 -1530 450 2014 1545 -304 -1218 -46 1148 1670
2386 1670 280 -1062 -211 1141 1211 -131 -1217 -657 1045 1498 238 -1257 -989 597 1504 364 -1230
2403 -1230 -804 605 1836 745 -1104 -1343 514 1739 923 -792 -1379 -84 1460 912 -756 -1528
2419 -1528 399 2089 1450 -1194 -1845 68 2199 1307 -1240 -2040 -271 1592 1513 -879 -2150 -669
2435 -669 1683 2074 -738 -2445 -934 1659 1737 -249 -2368 -882 1089 2099 -322 -2195 -1295 976
2451 976 1704 171 -1768 -1627 476 1476 455 -1428 -1208 -155 684 315 -1038 -1066 407 648 218
2468 218 -891 -732 324 1144 349 -784 -769 308 1219 836 -422 -885 118 753 635 -586 -988 -195
2486 -195 775 734 -482 -1013 -86 718 375 -562 -1592 -791 365 462 -329 -1486 -1097 -198 1197 33 -1459
2505 -1459 -968 -120 802 308 -816 -1154 262 1378 635 -709 -1086 411 1425 945 -820 -1207 -119
2522 -119 1766 1388 -550 -1183 -390 1568 1467 -139 -1348 -268 1531 1580 43 -1380 -12 1445 1663
2539 1663 183 -1457 -618 1320 1917 538 -1200 -893 1328 1550 602 -908 -981 715 1775 432 -809
2556 -809 -1082 185 1128 584 -961 -959 454 1023 -195 -1227 -774 264 1256 192 -1455 -1354 81 768
2574 768 84 -1252 -985 568 786 429 -1370 -1317 174 1209 569 -1089 -1490 36 1166 681 -1370
2591 -1370 -1566 -217 1007 669 -944 -1897 -842 472 962 -424 -896 -471 473 509 -759 -1271 -90
2608 -90 509 768 -580 -1306 -518 556 369 -100 -735 -308 678 777 -189 -795 -608 589 929 245 -250 -305
2628 -305 483 516 322 -174 -262 528 728 538 -168 -551 -168 504 809 505 132 -149 167 415 762 178 -206
2649 -206 122 653 1056 228 -251 -478 254 982 664 -99 -227 281 303 -79 -725 -338 496 866 96 -408
2669 -408 -826 -215 412 375 -257 -355 748 1045 111 -997 -643 647 1357 212 -780 -334 526 1200 -24
2688 -24 -1524 -795 757 1842 330 -1521 -1298 100 1233 716 -1205 -1047 225 1174 12 -1412 -1308
2705 -1308 173 1681 681 -1187 -1739 -113 754 283 -913 -1226 109 1020 873 -1121 -1462 -324 955
2722 955 518 -736 -1019 -267 695 433 -1020 -943 111 994 700 -822 -1288 -534 597 779 -342 -786
2740 -786 -197 317 264 -196 -785 -453 347 289 -177 -339 -208 338 247 -525 -606 3 564 477 22 -138 -198 151
2762 151 519 330 49 226 634 327 5 -303 -66 452 470 242 -242 -121 562 620 333 46 -125 252 894
2783 894 600 -27 -313 -322 415 1114 331 -175 -447 341 617 381 -50 -131 172 819 773 -54 -507 -374 195
2804 195 644 152 -578 -244 674 889 253 -611 -957 413 1038 649 -506 -847 48 459 430 -849 -660
2823 -660 681 957 107 -946 -1334 225 1103 630 -498 -1058 62 931 57 -1269 -1105 147 1189
2840 1189 722 -991 -1563 -842 406 581 -881 -1096 122 945 676 -1296 -1494 -208 932 965 -709
2857 -709 -1327 -169 762 76 -1319 -985 233 1253 623 -778 -1603 -528 1029 810 -590 -1154 191
2874 191 1467 668 -1041 -1724 -139 1403 1549 -280 -1482 -623 1001 926 117 -798 -348 1086 1306 -91
2892 -91 -1374 -622 656 1263 360 -542 -672 367 726 -154 -831 -398 332 1046 748 -581 -360 24 525
2911 525 486 -77 143 231 381 -26 -217 -179 201 902 572 367 -215 -54 351 247 -75 93 389 555 659
2932 659 -264 -517 -241 414 766 348 73 -256 498 905 116 -426 -255 198 916 826 -413 -921 -250 791
2952 791 956 -121 -304 -199 466 488 -657 -1130 -372 474 693 -547 -1243 -916 517 647 -249 -1476 -788
2971 -788 506 562 -377 -1738 -1085 411 1136 -110 -1457 -1359 546 820 41 -1424 -1244 309 1488 369
2989 369 -1532 -1370 412 1308 169 -1076 -1256 199 960 528 -1342 -1597 149 1217 738 -569 -1095
3006 -1095 -2 1140 534 -694 -992 335 1134 803 -883 -958 300 1196 754 -492 -1093 347 1287
3023 1287 641 -625 -1215 -171 1306 757 -533 -900 -215 1424 908 -268 -942 -197 1379 1320 -148
3040 -148 -1128 -486 915 1066 -23 -766 -17 729 1119 239 -835 -237 780 1110 198 -638 -645 635 750
3059 750 629 -847 -841 352 991 25 -468 -1195 -227 1018 587 -620 -954 -305 532 703 -321 -1053 -703
3078 -703 921 1065 -210 -987 -591 380 976 316 -1075 -968 700 755 210 -1063 -836 94 1086 278 -625
3097 -625 -1220 37 811 483 -670 -921 81 820 490 -764 -1116 -197 1001 377 -471 -1137 -400 1093
3115 1093 474 -966 -1494 -365 1043 724 -766 -1422 -635 842 992 -647 -1749 -198 677 791 -533
3132 -533 -1620 -692 866 1301 -376 -1532 -668 678 1142 -43 -1602 -478 590 1372 186 -1089
3148 -1089 -1013 804 1395 184 -1340 -1025 712 1770 558 -1265 -898 585 1547 360 -1031 -850 421
3165 421 1563 729 -761 -976 496 1198 575 -772 -1189 350 1524 976 -848 -1147 293 1355 1068
3182 1068 -696 -1068 -139 1049 1198 -126 -1037 -250 1049 972 -93 -1187 -85 500 888 -124 -788
3199 -788 -461 664 943 -254 -731 -305 645 705 105 -875 -426 283 876 440 -797 -686 468 890 100
3218 100 -650 -932 312 1035 376 -782 -826 379 847 267 -729 -822 -334 854 787 -225 -1221 -907 526
3237 526 651 -289 -1012 -635 799 870 -205 -1556 -608 520 1083 192 -1158 -803 687 1233 145 -1111
3255 -1111 -903 398 1037 393 -989 -1233 292 1592 561 -900 -894 252 1291 424 -1004 -1164 467
3272 467 1104 876 -1245 -1430 174 1335 1251 -425 -1291 -201 1348 965 -232 -1111 -198 1081 1156 -281
3290 -281 -1199 -663 1134 861 -304 -1229 163 1246 1362 -236 -1131 -321 1351 1463 -176 -1273 -469
3307 -469 1031 1135 202 -1133 -681 995 1378 -20 -1213 -655 689 1281 463 -1024 -1001 532 1733
3324 1733 113 -1203 -1100 584 1637 632 -882 -1092 -21 1198 959 -726 -977 65 1183 664
3340 664 -773 -912 -232 885 666 -468 -1268 -385 756 487 -557 -1388 -243 1014 592 -572 -1335
3357 -1335 -468 263 784 -537 -920 -436 383 655 -455 -1189 -610 641 949 22 -1213 -901 165 1036
3375 1036 -267 -798 -1197 99 955 463 -742 -1179 -13 552 618 -610 -906 248 673 519 7 -1044
3393 -1044 -68 623 616 -115 -1274 -128 911 1132 -33 -870 -217 1129 1096 -202 -1018 -503 865 1356
3411 1356 162 -969 -779 838 1372 443 -1331 -992 551 1279 770 -1239 -967 395 1279 505 -1009
3428 -1009 -1227 127 1322 829 -837 -999 87 1433 942 -917 -1043 48 1486 941 -612 -1118 -26
3445 -26 1339 1025 -497 -1355 -169 1453 852 -595 -1186 -11 1012 739 -469 -1124 -461 1033 1170
3462 1170 -501 -1256 -128 897 1117 -196 -1049 -306 809 605 -180 -1252 -800 434 995 -60 -1181
3479 -1181 -734 443 704 -101 -1078 -853 393 961 149 -897 -842 143 823 455 -714 -838 203 942
3497 942 188 -1151 -1047 149 790 396 -556 -1216 -30 751 269 -533 -710 98 1155 703 -238 -1325
3515 -1325 -556 644 879 96 -857 -445 819 1057 -81 -868 -641 398 960 315 -805 -441 89 955
3533 955 237 -878 -634 434 1084 383 -772 -662 72 870 751 -476 -775 109 831 482 -501 -1102 44
3552 44 713 776 -551 -1049 -317 980 804 -119 -856 -324 1107 811 -487 -911 -392 942 1215 79 -916
3571 -916 -470 857 1117 -9 -1122 -127 594 1022 153 -1342 -604 607 1091 299 -949 -642 202 1284
3589 1284 189 -943 -765 570 1385 285 -965 -934 267 1141 428 -922 -867 262 1362 306 -839
3606 -839 -1169 -295 924 646 -998 -893 -222 911 753 -800 -1121 -148 1083 766 -416 -1567 -120
3623 -120 935 658 -520 -1236 -49 804 896 -162 -1093 -651 631 1081 -31 -946 -376 384 572 -27
3641 -27 -626 -540 334 692 -30 -810 -562 410 673 -26 -722 -639 237 846 44 -731 -378 -34 1001 470 -794
3662 -794 -963 111 835 480 -377 -525 8 980 824 -368 -956 84 621 634 -27 -554 -535 332 1137 -82
3682 -82 -519 -210 532 1196 257 -474 -629 404 821 375 -408 -440 223 927 588 -266 -351 220 1190 589 -518
3703 -518 -970 218 783 259 -313 -682 311 832 791 -727 -1228 -188 1222 636 -199 -1147 -262 862 607
3722 607 -340 -1096 -295 792 720 -449 -826 -642 793 992 92 -825 -330 730 755 -186 -937 -687 682
3741 682 776 88 -1064 -788 103 862 -93 -984 -728 433 775 23 -1093 -894 354 908 362 -957 -1146
3760 -1146 384 714 281 -724 -1006 440 841 591 -690 -909 124 761 610 -405 -936 -163 930
3777 930 482 -520 -684 11 835 507 -295 -839 -459 686 628 -563 -613 -202 838 704 -274 -773 15
3796 15 764 552 67 -972 -285 703 530 79 -662 -479 468 995 283 -510 -313 379 914 475 -179 -536
3816 -536 224 1039 606 42 -502 141 1055 409 -307 -672 132 592 619 -381 -515 -134 339 492 -396 -759
3836 -759 -183 596 684 -16 -433 -75 381 736 36 -705 -277 475 745 53 -741 -642 537 825 -15 -703
3856 -703 -587 -12 597 380 -589 -822 88 683 206 -601 -971 -185 792 621 -387 -793 -170 480 570 -620
3876 -620 -828 -5 638 444 -241 -755 -162 646 603 -344 -879 -478 572 666 -338 -844 -165 375 694 -150
3896 -150 -959 -235 572 707 -178 -912 -521 659 515 -55 -1064 -721 647 372 -151 -670 -830 398 712
3915 712 223 -857 -596 275 1072 190 -556 -519 70 724 451 -445 -506 13 371 206 -280 -379 371 855 577
3936 577 -332 -556 29 533 382 -348 -547 248 691 493 -207 -424 160 677 187 -286 -298 -142 538 554 -198
3957 -198 -771 -193 417 618 171 -657 -305 372 508 104 -310 36 179 808 363 -381 -455 -30 462 170
3977 170 -437 -437 216 257 9 -487 -667 289 558 282 -323 -425 -123 259 15 -213 -538 36 545 480 -323
3998 -323 -675 -101 304 504 -202 -701 -352 280 290 165 -670 -301 211 424 -131 -326 -460 147 262 297 -473
4019 -473 -582 200 266 267 -461 -270 -35 582 62 -454 -855 4 444 172 -248 -460 72 544 378 -287 -620
4040 -620 42 529 355 -71 -803 -69 190 242 -297 -677 -325 700 708 -222 -424 -148 428 551 207 -660 -346
4061 -346 354 547 -43 -702 -168 585 398 140 -433 -171 354 463 -142 -499 178 413 562 -9 -396 -290
4081 -290 205 696 490 124 -172 451 458 50 -582 -201 600 691 153 -296 -356 74 456 348 -371 -140 355
4102 355 260 273 -105 -676 -96 454 454 -60 -498 -135 235 261 -211 -490 -463 109 331 -251 -474 -319 137 146 -76
4125 -76 -394 -198 -12 -9 -47 -279 -246 202 206 60 -339 -463 -153 237 399 -314 -416 -56 221 16 -213 -612
4147 -612 -138 224 445 101 -469 -61 274 210 -66 -464 -44 565 212 47 -897 -178 -38 262 -15 -257
4167 -257 -381 94 -33 -118 -497 -276 276 392 -25 -749 -335 -5 432 -333 -324 -144 110 692 94 -676 -238
4188 -238 294 743 394 -144 -481 -55 600 451 -143 -517 80 625 551 8 -452 24 377 331 -23 -522 307
4209 307 303 403 -296 -450 148 480 261 143 -214 -29 563 161 -95 -334 -268 220 170 -341 -569 -45 205
4230 205 537 27 -247 43 378 286 -11 -177 -391 -2 388 170 -179 -327 352 499 61 -202 -200 189 -46
4251 -46 11 -313 -373 -212 178 -53 -226 -339 -190 321 234 16 -231 -115 -102 177 251 -124 -272 -132 79 90
4273 90 -119 -233 259 108 -399 -204 -65 119 89 103 -588 -226 -141 294 -115 -243 -313 -85 345 441 79 -257
4295 -257 -36 393 267 -66 -452 -137 398 591 84 -459 -143 494 183 -85 -422 -330 -168 184 -15 -109 55
4316 55 489 177 -108 -272 -376 112 482 -45 -350 -328 313 473 7 42 -245 295 181 59 -322 -327 463 555
4338 555 58 -418 -289 106 487 -72 -201 34 -65 313 405 -81 -432 11 258 104 -115 -223 317 336 612
4359 612 96 -361 -273 182 176 -247 -325 -21 319 217 -417 -299 -186 123 111 -79 -173 251 194 185 -260 -462 16
4382 16 119 239 -62 -429 108 -145 270 -27 -221 170 200 43 -301 -478 -609 -80 145 199 1 -353 231
4403 231 11 -4 -87 -278 -5 108 92 -152 -53 11 202 5 -236 -20 -263 17 -89 -202 108 -87 64 49
4425 49 -169 -427 -38 237 129 92 -211 -120 -21 347 142 -403 -150 -341 200 356 -146 -191 -319 320 132 -9
4447 -9 -306 -44 495 170 -18 -327 -98 247 444 31 -263 -248 373 315 -294 -377 170 437 154 117 -557 -116
4469 -116 349 257 83 -269 79 295 155 53 -572 61 169 254 131 -221 22 100 322 254 -362 -372 60 436
4491 436 132 -419 -262 -130 468 178 -233 -353 -268 582 302 -461 -193 -104 238 38 -84 -375 -191 251 424
4512 424 56 -497 45 271 149 -218 -162 -40 84 33 -160 -412 -76 248 274 -329 -132 -149 232 275 -179 -398
4534 -398 -51 117 -150 92 -209 131 401 -98 -140 -219 -228 -2 398 340 -130 -224 -43 338 134 -396 8 13 57
4557 57 248 -29 -327 82 17 14 29 36 -109 90 11 -63 -362 -340 233 294 -51 12 16 274 441 54 -397 -109 169
4582 169 197 7 91 -156 145 221 342 91 -212 109 218 235 -1 15 174 253 67 -115 -197 -187 60 53 -11 -324
4606 -324 -45 243 215 125 -156 238 547 -65 168 -252 -132 47 129 95 -122 81 210 307 -32 0 -273 -241
4628 -241 398 -101 -595 -2 90 359 -23 -306 -601 138 426 109 -423 -169 -84 440 41 -413 -306 -152 17
4649 17 -143 16 -297 45 85 3 -21 -306 -47 -12 11 15 -151 -260 114 -146 5 -199 -39 -65 162 199 -232
4672 -232 -32 57 414 -146 -113 -16 255 -114 201 -343 95 180 28 -482 -249 75 14 67 68 -195 86 215 164
4695 164 -116 -111 -256 -97 89 -17 36 -218 -27 15 143 -359 66 79 300 261 -215 -272 -14 32 181 123 -190
4718 -190 151 -65 225 76 -327 51 301 50 305 -394 -248 28 135 94 118 -387 95 163 -108 -203 -295 66
4740 66 301 -130 -225 -315 300 172 389 -50 -662 -101 436 370 -180 -441 107 339 240 -74 -241 -120 299 97
4762 97 -346 -152 -77 250 249 25 -129 -269 133 446 -181 -278 -62 79 378 -53 107 -218 101 309 174 -285
4784 -285 -422 309 110 -67 -220 -108 123 232 186 -294 -172 115 346 380 -118 -88 -45 131 -72 207 -99
4805 -99 233 327 172 -279 -41 -254 421 244 -449 -370 -178 -57 219 -15 103 -40 190 -4 25 -275 -75
4826 -75 256 6 -44 -246 -112 263 232 -37 13 -167 236 203 322 -200 -195 15 -60 -14 -295 34 -37 154 327
4849 327 31 -170 97 67 204 -71 14 61 216 265 -63 -266 13 233 273 96 -59 -158 -89 28 134 -159
4871 -159 50 384 190 -135 -288 40 221 548 -1 -204 -314 26 207 -49 -353 16 78 417 -114 -259
4891 -259 -289 194 388 189 -352 -248 -57 354 177 -403 -462 22 -45 -92 -404 -263 130 106 -70 40 -187 -164
4913 -164 222 271 -163 -328 -96 208 175 -274 -326 21 -123 104 -237 -412 -120 208 48 -165 -400 -410 120
4934 120 12 -86 -296 -483 247 394 -183 -358 49 126 223 490 -213 -333 101 -96 98 -114 -162 -107 238 110
4956 110 -148 -240 5 200 115 -182 -278 -106 -9 55 -191 -82 35 490 -70 43 -117 -20 154 -75 -159 -161 81
4979 81 238 258 -208 -17 12 218 106 216 -156 -180 205 152 -186 116 -145 -57 326 61 -84 20 -58 423
5001 423 294 -213 -27 -58 410 -74 -137 -381 241 -29 169 -124 -41 -131 257 264 -381 -245 -390 131 18 -95
5023 -95 -205 225 187 198 -353 -205 -153 32 219 -110 -239 -422 330 207 106 -328 5 -242 210 32 -202
5044 -202 -50 8 159 101 -244 -409 193 285 36 -132 207 43 100 -167 77 -104 49 402 276 -93 -51 302
5066 302 154 121 -81 -248 15 94 267 -234 -229 199 1 225 206 -212 -76 415 206 -306 -443 -317 -20 -233
5088 -233 -164 -247 10 183 -41 115 -248 267 315 280 -52 -422 -39 203 276 -268 -16 -237 3 179 -408 -45
5110 -45 -139 158 38 10 -8 -181 277 148 67 -253 -75 343 297 -105 -135 16 30 292 147 337 159 -61 95
5133 95 229 38 -260 -14 343 182 -102 -174 -48 337 99 53 -282 -18 203 45 107 -218 -67 202 60
5154 60 19 42 -98 -29 -20 -37 -130 46 113 395 206 -112 40 7 276 39 -263 -78 133 -74 127 91 -248 195
5178 195 145 338 -240 -200 207 153 41 -3 -417 -134 255 78 14 -163 -47 90 231 108 -332 23 -95 312
5200 312 -101 -194 -16 221 252 143 -134 151 233 384 -22 -415 -93 132 452 28 -528 -133 272 356 155
5221 155 -263 -3 81 147 402 42 -168 222 89 185 -126 -295 204 150 70 -135 -103 -14 247 112 -126 45
5243 45 -497 142 173 103 100 224 -122 211 83 -223 250 -83 44 -199 -6 61 -113 -162 186 -9 -8 117 0
5266 0 96 44 -82 2 368 -236 -108 -31 -73 109 -1 -15 -370 -81 360 90 142 -201 72 108 7 -67 -81 -98
5290 -98 206 -38 -33 -428 4 28 404 250 -79 59 128 67 -160 -371 18 -229 244 61 -254 41 109 213
5312 213 -305 -45 -152 -57 322 -36 -266 -339 20 93 4 -288 -514 270 439 77 -496 -238 202 -153 224
5333 224 -151 -208 153 188 -80 -304 72 68 265 92 -33 -197 -209 -9 394 -69 -289 218 94 283 -132 -150
5355 -150 -193 186 411 -67 -91 -62 507 -100 -166 -172 1 116 328 305 -86 -279 86 289 -93 -373 -129 168
5377 168 670 178 -353 -405 161 212 343 -138 -136 144 280 310 -260 -250 113 324 96 -31 -316 -104 1 305
5399 305 -80 -261 -182 -15 -233 -188 -302 40 307 91 0 -397 -30 146 6 -77 -215 -76 206 190 -14 -246
5421 -246 -25 71 283 34 23 284 216 273 -122 69 -151 -90 182 -356 -169 -221 -28 -55 -64 62 -87 174 261
5444 261 16 147 -231 276 13 109 -56 -93 -149 266 -47 -321 -89 20 398 211 -290 -452 -256 316 302
5465 302 -159 111 -148 274 -1 -158 -642 -549 422 120 85 35 -99 -59 -196 -12 -5 -39 449 61 -115 -51 -187
5488 -187 311 429 -34 25 193 35 338 172 -164 -16 -53 377 84 49 -57 37 445 107 -83 -144 -69 201
5510 201 147 -183 -177 78 328 203 -236 -265 54 133 316 -112 -157 -92 -9 284 -211 -258 -66 23 81 220 -435 -2
5534 -2 172 135 -97 -52 71 213 57 240 -77 -29 -248 201 101 -366 48 -23 260 116 -487 -309 -66 231
5556 231 -192 -99 -37 127 294 217 -30 -450 -337 34 -110 -212 -75 215 418 449 -69 -410 165 -102 -36 304
5578 304 -327 85 158 211 -88 108 10 143 111 -79 107 -239 274 283 158 -310 48 -239 198 184 -150 -128 185
5601 185 215 -41 -44 -103 50 155 83 -184 219 312 230 53 -154 147 153 253 70 -2 99 -100 279 188 45 -19
5625 -19 65 451 -75 -178 -54 -152 -2 209 -4 -36 128 178 380 12 -229 228 329 423 13 -56 -17 36 329
5648 329 114 207 -272 -33 279 69 -176 -265 -16 131 -13 -12 -13 232 12 -133 -361 -271 -162 84 76 -146 -294
5671 -294 -165 -225 299 153 -26 104 334 151 29 -86 -98 -58 5 68 76 86 -66 -45 -262 -81 -62 80 188
5694 188 -63 -416 -176 -73 10 -61 67 345 -114 389 -158 -248 -175 212 287 -115 9 31 103 128 167 70 167 241
5718 241 79 56 131 -232 36 -48 276 81 -299 109 105 -82 239 143 -3 -104 -13 67 -253 10 -119 -300 108
5741 108 -11 87 -80 146 -151 -62 5 3 330 -91 -374 -79 -25 52 109 -145 -228 74 -175 263 -50 -202 101
5764 101 183 225 38 -37 43 141 112 -108 28 197 30 25 -84 -129 29 -226 107 -28 75 57 -71 -175 -186 -351
5788 -351 93 35 155 -18 -209 -14 7 -34 63 -240 222 56 118 -69 -315 -78 202 42 61 -82 -208 236
5810 236 281 54 -84 -40 16 -22 55 -9 -150 -192 123 103 10 -247 -77 -104 28 -135 -169 -161 88 202 196 -266 -169
5835 -169 7 56 128 -245 -65 -61 383 -87 -132 122 -35 121 162 -343 -276 313 54 -17 -1 -284 253 97 30
5858 30 -89 -199 74 185 13 132 -281 -114 128 -60 -47 -116 305 146 -71 -167 -117 -15 4 285 4 -6
5880 -6 136 -123 1 194 -137 -28 -79 101 259 -208 331 321 153 76 -63 281 22 101 -43 -131 40 -149
5902 -149 89 96 -240 -9 258 92 128 8 -189 117 -165 62 -110 231 12 53 29 32 -50 -342 77 418 -215
5925 -215 -370 57 -147 139 -150 -318 -48 175 125 41 -322 157 113 -19 345 -182 -157 -27 261 -51 -56 -47 131
5948 131 199 -78 165 -301 150 -35 -33 -181 -365 111 -77 9 -319 -215 146 20 137 -8 -87 124 299 72
5970 72 -178 35 0 15 174 -65 -41 -148 121 17 182 291 -97 -30 154 180 -3 62 159 219 -297 111 -274
5993 -274 298 81 -270 -140 -131 85 -82 36 -83 -200 206 200 -111 -210 -133 75 85 -56 -3 -125 -6 157 10
6016 10 206 -316 -31 114 -147 181 -273 -125 437 18 -2 148 22 16 -165 -259 -131 -232 -151 277 50 -129
6038 -129 305 -20 118 164 -71 -98 -127 126 -116 -76 -60 185 156 -13 -39 -570 116 -180 -243 -132 -47 21 -17 -94
6062 -94 -163 -166 -115 28 10 64 -212 229 141 -45 -223 25 118 112 -12 -77 -185 -105 -160 17 -163 -137 -52 377 -53
6087 -53 7 -302 -85 7 -64 288 -149 -168 -3 244 15 -293 -111 191 272 34 102 -178 158 443 114 -346
6109 -346 -73 11 -51 225 -342 21 121 169 127 -98 93 -139 -43 156 -153 -225 242 201 -69 -185 -177 169 188
6132 188 -183 -351 -182 168 24 85 -203 -323 -28 223 82 60 126 -231 -186 59 -289 -76 113 -39 -75 -171
6154 -171 -29 422 -186 19 2 -109 28 167 52 125 137 10 70 39 188 -32 -54 -168 62 26 -183 -4
6176 -4 114 169 196 81 -243 192 152 92 104 -121 256 -119 -29 259 -256 -378 70 326 -418 -267 116 134 16
6199 16 154 8 108 326 24 135 -106 -119 -102 85 125 -11 60 222 127 -208 42 235 -166 217 -291 1
6221 1 79 -38 150 472 64 -5 194 -90 -17 -81 -13 -226 -81 97 190 210 235 2 116 260 -154 -353 -93
6244 -93 206 -434 -4 -201 -39 -43 -82 20 81 -112 299 -75 -199 -6 160 252 -58 41 129 -76 -94 -142 133
6267 133 -261 -104 266 -80 -153 200 -206 66 228 -167 -158 -26 173 75 105 -317 252 -117 51 -299 38 233
6289 233 16 118 -402 33 74 -502 -101 -118 68 -91 194 42 1 -132 104 50 -89 -147 -59 -296 9 122
6311 122 115 116 -217 162 117 -401 -212 255 40 164 192 -119 -39 110 -13 -28 57 20 -22 -103 -55 81 -310 35
6335 35 -48 -37 -1 -149 -171 -134 101 -200 19 186 9 -135 -32 193 184 -35 52 -31 117 110 -198 16 84 66 -94
6360 -94 93 47 192 -21 -59 -156 -197 -256 -73 232 133 -118 -149 -31 245 90 80 60 -165 -250 -70 136 1 125
6384 125 -71 74 -185 300 -77 -122 135 -61 93 -38 -330 44 158 -30 64 -131 2 370 -132 170 -20
6405 -20 -124 -69 -22 313 164 -180 -32 185 -26 -184 -88 -24 178 262 -316 58 96 -102 159 68 192 -98 -22
6428 -22 216 63 240 6 12 -27 -170 25 314 -148 173 -83 -206 195 84 -63 -195 -83 -38 227 -41 -162
6450 -162 -457 10 241 266 -41 -213 -172 158 -149 128 -127 -201 2 203 70 0 92 10 171 148 -338 -2
6472 -2 -45 -49 -118 -6 32 282 -88 -121 125 -147 -145 -214 -67 -128 -101 -12 -8 74 124 140 -461 166 61 39 -161 -107 91
6499 91 432 -18 -59 -90 168 -92 -257 120 13 200 114 -140 -245 -137 221 -114 26 -61 -95 152 83 146 -270
6522 -270 118 -64 336 88 -164 72 122 235 352 -9 -2 138 158 -6 150 -94 53 -6 67 -27 51 -78 -184
6545 -184 151 -89 -53 -214 21 -139 2 -54 -27 298 -227 -34 -106 77 -22 148 -3 -161 -137 186 242 -29
6567 -29 193 185 24 259 -37 88 115 123 -42 -212 230 338 90 352 -143 -180 73 35 16 -155 -248 84 -45
6590 -45 -94 -114 -160 126 -232 -264 51 -17 -155 14 44 -78 -186 -165 -127 210 -46 -128 -243 -87 -14 -108 -37 -198
6614 -198 5 -9 29 -40 -98 -51 98 31 -44 -156 314 94 -56 2 103 -42 149 176 -69 -25 6 98 -23 223
6638 223 -152 91 -79 34 8 -50 -53 147 38 138 -208 -37 168 183 243 -33 -283 158 118 52 -190 -201 140
6661 140 316 -167 -137 189 218 107 321 -364 -230 -164 239 -46 131 -44 168 50 -84 84 -50 29 258
6682 258 16 -62 -205 -158 471 89 62 60 97 12 -101 -141 -63 -228 96 -152 68 26 -31 243 -7 30 241 -151
6706 -151 190 37 213 -48 -229 -312 275 66 -167 2 52 155 -119 -310 4 -217 -307 -62 67 -61 157
6727 157 342 -68 121 40 -211 36 72 36 -478 -235 -38 -196 63 134 -95 90 124 -43 -105 -212 100 -2
6749 -2 -48 -140 -2 254 138 129 -8 -247 -45 -67 -91 13 131 -55 137 100 204 -159 9 34 38 -46 -51 132 -102
6774 -102 188 -117 30 39 240 -348 17 48 244 181 28 -10 -46 -19 239 55 92 -282 -110 264 46 307 -113
6797 -113 -62 152 -68 -107 125 18 50 -375 13 -189 -21 260 -69 -156 -8 -93 -219 3 -52 114 74 -25 245
6820 245 -68 -43 67 -80 206 262 205 -58 127 111 -180 44 -188 -96 259 -141 151 50 30 99 73 -156 8
6843 8 -214 189 -11 3 -81 -96 376 69 214 21 -172 108 416 104 -89 -12 180 32 -231 -136 -107 62 -188
6866 -188 25 35 -177 -17 163 -138 -159 -16 43 76 -53 9 263 -29 -65 21 41 162 -44 220 87 9 81
6889 81 -128 -84 174 -101 196 -98 10 79 177 163 -1 94 28 63 -237 -157 126 -105 294 58 -153 164 20
6912 20 49 159 60 145 -44 12 174 98 2 -129 -48 -26 -113 70 267 48 -143 -307 37 304 -34 172 -109
6935 -109 -4 -108 -112 274 20 211 61 59 75 55 -32 174 296 -76 3 -349 -225 -18 -129 195 -16 72 -77
6958 -77 -102 -96 -164 18 91 198 -378 -112 6 111 169 -289 138 23 241 -7 -34 -78 203 253 189 168 -120 33
6982 33 104 -31 -178 -72 62 121 -201 41 28 -69 334 33 -288 -222 -249 -295 -55 -37 -145 132 88 -174 -266 411
7006 411 314 -189 155 -72 -48 -9 -149 136 101 -88 21 -78 120 350 8 204 322 -163 -68 10 -34 294 -46
7029 -46 77 -347 -52 212 217 170 22 -135 186 246 -206 -47 213 190 -87 291 64 -184 64 73 1 -67 198
7052 198 -144 -103 -3 83 -1 -371 51 -25 -185 8 -148 237 -157 -78 -258 -27 -71 -165 -145 323 -85 -46 -34
7075 -34 141 -84 136 -88 44 206 -112 328 -80 -15 241 5 12 140 92 44 136 51 -136 306 50 -20 -141
7098 -141 -23 194 335 -211 41 -87 32 -195 -8 -107 126 203 -9 21 75 -184 -179 -72 -131 13 88 382 34
7121 34 -41 116 130 -163 77 183 -41 -162 276 60 59 -31 -31 54 115 -101 -230 -161 169 -130 53 -55 75 -152
7145 -152 43 124 -95 -135 237 153 274 172 -133 104 51 23 -6 138 -112 125 10 239 234 81 -201 -15 -32
7168 -32 -33 223 -185 -129 -92 -181 -119 97 35 -51 -170 -164 137 3 -120 -300 186 97 135 131 158 60 -91 332 169 -131
7194 -131 30 -69 253 -25 145 -29 -259 1 40 178 -231 71 4 418 31 -185 -138 122 83 -324 380 176
7216 176 246 90 -209 -287 75 98 -185 412 -73 -52 169 -27 -116 -113 120 -68 95 -290 101 183 172 104 -178
7239 -178 81 -87 -1 16 -55 147 -107 232 200 62 123 103 -90 -35 195 9 -5 447 -324 197 -292 -131 -190
7262 -190 -139 19 65 105 -157 94 128 -6 -92 -71 121 -49 -12 -85 -75 154 212 96 12 207 -147 31 -84 72
7286 72 -92 39 217 59 154 -23 -135 74 -70 -189 -19 -23 -193 -131 -103 93 187 -263 333 -23 -222 99
7308 99 96 -398 3 -122 -118 153 167 52 -81 -29 112 -101 164 60 -3 124 57 -79 -44 -42 -54 -114 -213 -189 -30
7333 -30 -298 -87 255 -136 69 92 -66 59 -176 -43 -27 -218 -112 -98 -91 14 21 -45 -52 77 0 68 7 -86 -118
7358 -118 -219 -186 -147 49 -122 189 347 168 58 -73 59 -64 -102 -72 158 -106 127 173 -20 111 10 -20
7380 -20 -75 105 -64 282 -9 9 156 34 -372 61 -40 71 -123 8 131 182 -49 -104 54 148 205 89
7402 89 47 -10 18 -96 39 -377 -158 322 116 240 3 -97 273 112 -231 -2 169 94 28 -22 -83 -127 -105
7425 -105 120 -7 -146 -212 -237 -163 -80 -167 -227 -47 57 178 52 -309 -249 126 99 -321 99 -95 74 -136 -3
7448 -3 -6 -4 153 -12 1 82 70 -97 257 203 -18 -114 228 57 34 267 -125 147 105 -182 -6 134 22 271
7472 271 50 183 206 -49 160 -48 41 106 -46 -17 -248 -43 -116 -183 114 301 45 -2 -147 -23 -106 188 20
7495 20 -334 18 125 44 -90 15 90 24 55 -118 -96 -78 51 67 -181 -193 -161 -60 387 -38 112 319 -49
7518 -49 -77 -359 -253 228 -156 -34 -45 -181 65 -101 -205 223 -217 -76 -74 265 -254 322 114 -81 -48 24
7540 24 -7 109 136 -114 83 -238 38 -352 221 -128 -224 -42 -52 12 96 -169 -168 -142 139 -82 -221 54 -239
7563 -239 8 -51 -102 -275 147 -111 -3 128 34 12 137 -34 -96 -42 198 148 60 -166 179 111 89 177 217 203
7587 203 64 289 -33 -66 266 52 25 -27 25 -37 -218 295 -240 -115 147 -56 -154 -12 305 -173 -56 -102
7609 -102 102 46 -70 -20 24 216 21 -202 -45 108 243 340 -304 36 243 500 405 -184 -359 181 80 167
7631 167 -144 -155 66 -87 64 59 -69 -59 334 64 141 27 -15 -37 -271 -120 -198 -104 38 144 46 -108 -87 -125
7655 -125 76 -24 84 -180 93 84 82 189 -15 -101 11 -298 6 -3 -180 50 -457 96 109 76 77 81 -166 132
7679 132 63 203 164 5 -155 217 -82 -252 172 2 -15 152 150 143 -15 -193 41 -139 -192 -341 -275 259 -498
7702 -498 185 -96 -49 -14 -318 -192 -49 -223 272 185 -63 105 136 27 -137 277 -132 108 142 -3 56 33
7724 33 -189 -123 52 -200 -232 -45 201 -83 -201 166 -192 229 -8 210 -58 -53 45 -9 26 45 -210 77 26
7747 26 -7 82 -86 60 20 -135 -189 -17 -179 -296 -138 123 194 200 408 175 -193 -109 -88 -95 123 -146 17 121
7771 121 61 116 -21 -125 -80 111 -39 79 -233 132 -120 23 46 -324 -288 174 102 109 200 107 -89 -181 -49 21
7795 21 56 -266 33 -262 -145 -21 -129 124 -63 -36 -118 355 154 91 -251 -176 288 -5 -225 -147 -581 235
7817 235 168 114 86 -117 -80 185 318 284 156 133 -92 311 2 74 -166 225 17 -145 113 108 -122 218 -118
7840 -118 62 176 -31 -193 57 -203 97 143 -229 79 15 22 179 72 95 -284 -88 2 -222 -92 218 45
7862 45 -186 -6 252 -3 -258 -52 -65 79 -69 204 -94 -45 -239 378 -108 -24 108 170 -6 199 -265 81
7884 81 182 23 50 4 9 166 -206 155 -112 -49 178 222 272 -93 -109 -73 69 -144 -167 -137 -118 253 -176 27
7908 27 -157 -92 78 184 -8 -61 -125 150 144 -108 159 87 -164 -98 -27 4 -46 4 159 244 -249 -263 378 3 -20
7933 -20 -152 88 117 -141 -18 142 -122 -40 84 -71 -192 -100 136 68 -112 -161 33 109 114 -5 -45 -46 -54 58 -31
7958 -31 101 229 30 216 -261 56 -7 -80 -44 294 -113 -195 141 -178 -182 -229 -55 52 129 -148 162 248 -25
7981 -25 -163 -104 -20 -218 -99 318 -208 -77 -65 105 5 -168 -114 -17 -37 -12 307 -256 -53 -9 94 -188 155
8004 155 184 270 -158 208 -7 -211 269 252 256 106 -118 -409 -226 31 84 -153 122 146 83 -106 21 -14 53
8027 53 -71 64 6 27 190 92 240 63 -1 -25 -297 76 70 90 157 -169 -29 -199 -55 -17 131 167 -68 -54
8051 -54 -54 152 -168 450 -110 83 111 19 384 331 -193 193 -44 -62 11 -279 -69 -26 -186 -6 148 105 104 96 233
8076 233 230 196 123 -99 149 -10 -158 94 -89 4 -1 285 -88 -176 71 -17 -274 37 278 -542 336 166 -151
8099 -151 44 22 -166 120 57 45 130 209 -212 32 217 28 200 51 87 161 -94 -138 -275 48 -88 73 55
8122 55 -33 148 -6 96 197 -42 186 -245 177 -99 154 -110 -96 -133 35 -94 -60 197 86 44 -6 215
8144 215 191 64 -121 -14 -25 -166 -97 165 -129 -38 226 -182 11 16 8 136 -360 -176 202 -68 38 -174 -32
8167 -32 235 48 63 -169 74 -370 126 -327 -222 -302 -16 108 329 -66 -217 -70 36 107 -8 59 6 -153
8189 -153 -93 -85
8191h5
##END NTUPLES=NMR FID
##END=
