##TITLE=1H_EC-3099(IV-3)
 CDCl3, 8 sc, 
 19.8.2019
##JCAMPDX= 6.0         $$ Bruker NMR JCAMP-DX V2.0
##DATA TYPE= NMR FID
##DATA CLASS= NTUPLES
##ORIGIN= UXNMR, Bruker Analytische Messtechnik GmbH
##OWNER= root
$$ XWIN-NMR		Version 3.5
$$ Mon Aug 19 14:27:47 2019 Russian Standard Time (UT+4h)  she@DPX200
##.OBSERVE FREQUENCY= 200.13155
##.OBSERVE NUCLEUS= ^1H
##.DELAY= (6, 6)
##.ACQUISITION MODE= SIMULTANEOUS
##.ACQUISITION SCHEME= undefined
##.AVERAGES= 8
##.DIGITISER RES= 18
##SPECTROMETER/DATA SYSTEM= spect
##.PULSE SEQUENCE= zg30
##.SOLVENT NAME= D2O
##.SHIFT REFERENCE= (INTERNAL, D2O, 0, 15.7039)
##AUDIT TRAIL= $$ (NUMBER, WHEN, WHO, WHERE, WHAT)
$$ ##TITLE= Audit trail, XWIN-NMR		Version 3.5
$$ ##JCAMPDX= 5.01
$$ ##ORIGIN= Bruker BioSpin GmbH
$$ ##OWNER= she
$$ F:/spectra/data/she/nmr/H-F/1/audita.txt
$$ ##AUDIT TRAIL=  $$ (NUMBER, WHEN, WHO, WHERE, WHAT)
(   1,<2019-08-19 14:26:27.09 +0400>,<she>,<DPX200>,
      <created by zg, POWCHK disabled, PULCHK disabled
       configuration hash MD5:
       00 E9 B6 7A A2 85 ED C7 34 08 36 98 17 FE 4E 26
       data hash MD5: 16K
       87 F5 DA 63 34 DA 9C 16 4E 25 03 CD E8 B4 48 B0>)
$$ ##END=
$$ 
$$ hash MD5
$$ 04 EB 1A 8B EC 22 24 00 AA 79 83 F2 B6 C8 78 F5
##$RELAX= 
##$RELAX= 
##$RELAX= 
##$RELAX= 
##$RELAX= 
##$RELAX= 
$$ Bruker specific parameters
$$ --------------------------
##$DU= <F:/spectra>
##$EXPNO= 1
##$NAME= <H-F>
##$PROCNO= 1
##$TYPE= <nmr>
##$USER= <she>
##$AMP= (0..31)
100 100 100 100 100 100 100 100 100 100 100 100 100 100 100 100 100 100 
100 100 100 100 100 100 100 100 100 100 100 100 100 100 
##$AQSEQ= 0
##$AQ_mod= 1
##$AUNM= <au_zg>
##$AUTOPOS= <>
##$BF1= 200.13
##$BF2= 200.13
##$BF3= 200.13
##$BF4= 200.13
##$BF5= 200.13
##$BF6= 200.13
##$BF7= 200.13
##$BF8= 200.13
##$BYTORDA= 1
##$CFDGTYP= 0
##$CFRGTYP= 5
##$CHEMSTR= <none>
##$CNST= (0..31)
1 1 145 1 1 1 1 1 1 1 1 1 1 1 1 1 1 1 1 1 1 1 1 1 1 1 1 1 1 1 1 1 
##$CPDPRG= <>
##$CPDPRG1= <>
##$CPDPRG2= <>
##$CPDPRG3= <>
##$CPDPRG4= <mlev>
##$CPDPRG5= <mlev>
##$CPDPRG6= <mlev>
##$CPDPRG7= <mlev>
##$CPDPRG8= <mlev>
##$CPDPRGB= <>
##$CPDPRGT= <>
##$D= (0..31)
0 1.2 0 0 0 0 0 0 0 0 0 0.03 0 0 0 0 0 0 0 0 0 0 0 0 0 0 0 0 0 0 0 0 
##$DATE= 1566210386
##$DBL= (0..7)
120 120 120 120 120 120 120 120 
##$DBP= (0..7)
150 150 150 150 150 150 150 150 
##$DBP07= 0
##$DBPNAM0= <>
##$DBPNAM1= <>
##$DBPNAM2= <>
##$DBPNAM3= <>
##$DBPNAM4= <>
##$DBPNAM5= <>
##$DBPNAM6= <>
##$DBPNAM7= <>
##$DBPOAL= (0..7)
0.5 0.5 0.5 0.5 0.5 0.5 0.5 0.5 
##$DBPOFFS= (0..7)
0 0 0 0 0 0 0 0 
##$DE= 6
##$DECBNUC= <off>
##$DECIM= 24
##$DECNUC= <off>
##$DECSTAT= 4
##$DIGMOD= 1
##$DIGTYP= 9
##$DL= (0..7)
0 120 120 120 120 120 120 120 
##$DP= (0..7)
150 150 150 150 150 150 150 150 
##$DP07= 0
##$DPNAME0= <>
##$DPNAME1= <>
##$DPNAME2= <>
##$DPNAME3= <>
##$DPNAME4= <>
##$DPNAME5= <>
##$DPNAME6= <>
##$DPNAME7= <>
##$DPOAL= (0..7)
0.5 0.5 0.5 0.5 0.5 0.5 0.5 0.5 
##$DPOFFS= (0..7)
0 0 0 0 0 0 0 0 
##$DQDMODE= 0
##$DR= 18
##$DS= 0
##$DSLIST= <SSSSSSSSSSSSSSS>
##$DSPFIRM= 0
$$ [...]
##$SUBNAM2= <"">
##$SUBNAM3= <"">
##$SUBNAM4= <"">
##$SUBNAM5= <"">
##$SUBNAM6= <"">
##$SUBNAM7= <"">
##$SUBNAM8= <"">
##$SUBNAM9= <"">
##$SW= 24.9336996594482
##$SWIBOX= (0..15)
0 0 2 0 0 0 0 0 0 0 0 0 0 0 0 0 
##$SW_h= 4990.01996007984
##$TD= 16384
##$TD0= 1
##$TE= 0
##$TE2= 300
##$TE3= 300
##$TEG= 300
##$TL= (0..7)
0 120 120 120 120 120 120 120 
##$TP= (0..7)
150 150 150 150 150 150 150 150 
##$TP07= 0
##$TPNAME0= <>
##$TPNAME1= <>
##$TPNAME2= <>
##$TPNAME3= <>
##$TPNAME4= <>
##$TPNAME5= <>
##$TPNAME6= <>
##$TPNAME7= <>
##$TPOAL= (0..7)
0.5 0.5 0.5 0.5 0.5 0.5 0.5 0.5 
##$TPOFFS= (0..7)
0 0 0 0 0 0 0 0 
##$TUNHIN= 0
##$TUNHOUT= 0
##$TUNXOUT= 0
##$USERA1= <user>
##$USERA2= <user>
##$USERA3= <user>
##$USERA4= <user>
##$USERA5= <user>
##$V9= 5
##$VALIST= <valist>
##$VCLIST= <CCCCCCCCCCCCCCC>
##$VD= 0
##$VDLIST= <DDDDDDDDDDDDDDD>
##$VPLIST= <PPPPPPPPPPPPPPP>
##$VTLIST= <TTTTTTTTTTTTTTT>
##$WBST= 1024
##$WBSW= 4
##$XGAIN= (0..3)
0 0 0 0 
##$XL= 0
##$YL= 0
##$YMAX_a= 510169
##$YMIN_a= -916432
##$ZGOPTNS= <>
##$ZL1= 120
##$ZL2= 120
##$ZL3= 120
##$ZL4= 120
##$ABSF1= 10
##$ABSF2= 0
##$ABSG= 5
##$ABSL= 3
##$ALPHA= 0
##$AQORDER= 0
##$ASSFAC= 0
##$ASSFACI= 0
##$ASSFACX= 0
##$ASSWID= 0
##$AUNMP= <proc_1d>
##$AZFE= 0.1
##$AZFW= 0.1
##$BCFW= 1
##$BC_mod= 2
##$BYTORDP= 1
##$COROFFS= 0
##$CY= 11.3945322036743
##$DATMOD= 1
##$DC= 2
##$DFILT= <>
##$DTYPP= 0
##$F1P= 20.1720416913024
##$F2P= 0.152960286110954
##$FCOR= 0.5
##$FTSIZE= 0
##$FT_mod= 4
##$GAMMA= 1
##$GB= 0.15
##$INTBC= 1
##$INTSCL= 1
##$ISEN= 128
##$LB= 0.24
##$LEV0= 0
##$LPBIN= 0
##$MAXI= 10000
##$MC2= 0
##$MEAN= 0
##$ME_mod= 0
##$MI= 1.114404
##$NCOEF= 0
##$NC_proc= 0
##$NLEV= 6
##$NOISF1= 3.799351
##$NOISF2= 2.8
##$NSP= 1
##$NTH_PI= 0
##$NZP= 0
##$OFFSET= 15.70392
##$PC= 1
##$PHC0= -9209.746
##$PHC1= 6.800973
##$PH_mod= 1
##$PKNL= yes
##$PPARMOD= 0
##$PSCAL= 0
##$PSIGN= 0
##$REVERSE= no
##$SF= 200.130013532006
##$SI= 16384
##$SIGF1= 3
##$SIGF2= 2
##$SINO= 400
##$SIOLD= 16384
##$SREGLST= <1H.CDCl3>
##$SSB= 0
##$STSI= 0
##$STSR= 0
##$SW_p= 3612.71676300578
##$SYMM= 0
##$S_DEV= 0
##$TDeff= 0
##$TDoff= 0
##$TI= <>
##$TILT= no
##$TM1= 0
##$TM2= 0
##$TOPLEV= 0
##$USERP1= <user>
##$USERP2= <user>
##$USERP3= <user>
##$USERP4= <user>
##$USERP5= <user>
##$WDW= 1
##$XDIM= 8192
##$YMAX_p= 0
##$YMIN_p= 0
$$ End of Bruker specific parameters
$$ ---------------------------------
##NTUPLES= NMR FID
##VAR_NAME=  TIME,          FID/REAL,        FID/IMAG
##SYMBOL=    X,             R,               I
##VAR_TYPE=  INDEPENDENT,   DEPENDENT,       DEPENDENT
##VAR_FORM=  AFFN,          ASDF,            ASDF
##VAR_DIM=   8192,          8192,            8192
##UNITS=     SECONDS,       ARBITRARY UNITS, ARBITRARY UNITS
##FACTOR=    0.0002004,     1,               1
##FIRST=     0,             0,               0
##LAST=      1.6414764,     0,               0
##MIN=       0,             -916432,         0
##MAX=       1.6414764,     510169,          0
$$ Real data points
##PAGE= N=1
##DATA TABLE= (X++(R..R)), XYDATA
$$ plain form
0 0 0 0 0 -8 8 -8 8 -24 25 -32 41 -56 64 -80 104 -121 144 -176 209 -241 283 -335 385 -444 511 -586 667
27 667 -760 864 -974 1096 -1234 1384 -1547 1727 -1925 2141 -2380 2639 -2927 3242 -3589 3974
43 3974 -4401 4873 -5407 6007 -6688 7471 -8380 9450 -10732 12301 -14275 16842 -20339
56 -20339 25407 -33452 48243 -84464 356387 215096 -651305 -255722 376546 510169 -13319
67 -13319 -302506 -109024 287156 194359 -239391 -439293 -75789 289013 168676 -302202
77 -302202 -428926 -78019 193054 -36969 -296658 -154045 139894 123738 -128373 -296447
87 -296447 -174725 87663 180961 27129 -78616 -21825 10339 -58481 -68871 46878 187347
98 187347 167749 -52986 -205249 -35434 223600 203856 -7594 -73007 49004 131078 32811
$$ packed form
0@%%%qJ6j6J6l2M9n7P3r7J20j44J84k25K65l20L85m50N24o18P20q29R55j097J253
27F67j427J624j838K070k330K618k931L274l652M066m521N019n566O169o831P563
43C974q375R274j0280J1414j2695J4159j5851J7830k0182K3033k6576L1117l7181
56b0339M5746n8859Q1695j32707M40851j41291q66401L95583O32268J33623n23488
67a3319k89187J93482L96180r2797m33750j99902L63504L64802j20337m70878
77c02202j26724L50907K71073k30023k59689J42613K93939j6156k52111j68074
87b96447J21722K62388R3298j53832j05745N6791L2164o8820j0390J15749J40469
98A87347j9598k20735j52263J69815K59034j9744k11450o5413J22011Q2074r8267
$$ plain form
109 32811 -105741 -49997 140536 177347 20079 -99889 -74412 20223 71347 -11208 -122255
120 -122255 -29086 162979 96289 -173473 -234887 -13934 185628 156065 -41642 -197244 -145003
131 -145003 36650 127451 53820 -63122 -69475 41547 76769 -69123 -166254 -26940 141452
142 141452 101571 -54633 -136700 -75094 75891 127221 -17043 -138290 -36621 130394 126718
153 126718 -28194 -140914 -54519 159348 219653 38049 -127355 -90543 40268 113862 86870
164 86870 -6140 -50615 3219 38847 -13966 -66276 -48739 13029 41687 -32557 -132559 -89230
176 -89230 43554 51116 -53241 -99148 -59920 544 40519 -2092 -91947 -74448 45804 90305
188 90305 19150 -46409 -34913 17835 31127 -5859 3433 67740 54823 -35215 -44352 38676
$$ packed form
109C2811j38552N5744J90533L6811j57268j19968K5477R4635N1124q2555j11047
120a22255R3169J92065o6690k69762o1414K20953J99562k9563j97707j55602N2241
131a45003J81653R0801p3631j16942o353J11022L5222j45892r7131J39314J68392
142A41452l9881j56204q2067O1606J50985N1330j44264j21247J01669J67015l676
153A26718j54912j12720Q6395K13867O0305j81604j65404L6812J30811P3594k6992
164H6870r3010m4475N3834L5628n2813n2310J7537O1768K8658p4244j00002M3329
176h9230J32784P562j04357m5907L9228O0464L9975m2611q9855J7499J20252M4501
188I0305p1155o5559J1496N2748J3292l6986R292O4307j2917r0038r137Q3028
$$ plain form
200 38676 86326 56214 -19231 -72865 -12437 100569 77660 -48640 -65264 38654 83621
211 83621 2648 -90286 -56543 76700 91655 -76723 -162852 -5682 159496 89156 -119443
222 -119443 -193446 -24674 181242 124790 -126665 -190408 32099 207024 97262 -125608
232 -125608 -148759 71491 212290 40973 -176918 -87011 156644 172174 -40540 -171985
242 -171985 -54474 156035 157831 -85117 -232575 -64624 165416 136211 -78860 -179735
252 -179735 -51465 107661 59177 -105280 -106741 42752 83739 -26345 -99224 -44510 59366
263 59366 81752 -21664 -106376 -30217 83510 50149 -60237 -72474 19367 92620 49669
274 49669 -58169 -69723 28741 61768 -9927 -32411 34967 74839 27483 -54780 -69501 35153
$$ packed form
200C8676M7650l0112p5445n3634O0428J13006k2909j26300j6624J03918M4967
211H3621q0973r2934L3743J33243J4955j68378q6129J57170J65178p0340k08599
222a19443p4003J68772K05916n6452k51455o3743K22507J74925j09762k22870
232a25608k3151K20250J40799j71317k17891Q9907K43655J5530k12714j31445
242a71985J17511K10509J796k42948j47458J67951K30040k9205k15071j00875
252a79735J28270J59126m8484j64457j461J49493M0987j10084p2879N4714J03876
263E9366K2386j03416q4712P6159J13727l3361j10386j2237R1841P3253m2951
274D9669j07838j1554R8464L3027p1695k2484O7378L9872m7356q2263j4721J04654
$$ plain form
286 35153 135368 72940 -72288 -98133 9563 104472 79739 -32942 -77441 20721 99302
297 99302 19044 -85903 -56863 44502 85521 29035 -64797 -70939 32551 83944 -7501 -98272
309 -98272 -52939 63568 97508 -15444 -144672 -96594 77971 125874 -4944 -121150 -99058
320 -99058 6640 71377 14837 -80498 -56163 48619 52036 -47206 -91335 -22646 68913 67007
332 67007 -34525 -87830 -3484 83150 44989 -35361 -42598 11602 65084 55355 -20963 -58260
344 -58260 2285 63258 52411 17924 -3646 -15310 -9024 2970 12229 35607 39980 -10710 -45110
357 -45110 -9268 25146 15038 1278 -7050 -18165 -10473 -2606 -17709 -15020 12791 12037 -13110
370 -13110 -25401 -22740 -4184 15603 -7918 -41591 -13118 39106 33834 -9395 -44236 -48768 5776
$$ packed form
286C5153J00215o2428j45228k5845J07696R4909k4733j12681m4499R8162P8581
297I9302q0258j04947K9040J01365M1019n6486r3832o142J03490N1393r1445r0771
309i8272M5333J16507L3940j12952j29228M8078J74565M7903j30818j16206K2092
320i9058J05698O4737n6540r5335K4335J04782L417r9242m4129O8689R1559j906
332F7007j01532n3305Q4346Q6634l8161q0350p237N4200N3482r729p6318l7297
344e8260O0545O0973j0847l4487k1570j1664O286J1994R259K3378M373n0690l4400
357d5110L5842L4414j0108j3760q328j1115P692P867j5103K689K7811p54k5147
370a3110j2291K661J8556J9787k3521l3673K8473N2224n272m3229l4841m532N4544
$$ plain form
383 5776 76249 55003 -36516 -71200 -13169 60908 71249 2000 -54606 -8481 62395 34385
395 34385 -38581 -37821 29982 78199 41472 -56402 -81953 24838 104280 24653 -92703 -79434
407 -79434 39585 105369 21624 -112460 -104086 41499 106438 9794 -95233 -82750 9588
418 9588 65719 13734 -69097 -44464 45349 40942 -48225 -75955 -6133 64890 47694 -40499
430 -40499 -77456 -2710 67657 32575 -31779 -34472 4582 36284 32012 -6755 -16805 22630
442 22630 38091 9628 5869 31179 30510 2830 -13673 5084 53327 66485 3485 -50010 -17170
455 -17170 37603 39867 5836 -29275 -33085 4649 21784 -22520 -50753 -11560 25273 288
467 288 -54238 -72861 -19545 47973 23256 -66879 -80647 2520 60747 25773 -59301 -91776
$$ packed form
383E776P0473k1246r1519l4684N8031P4077J0341o9249n6606M6125P0876k8010
395C4385p2966P60O7803M8217l6727r7874k5551J06791P9442p9627j17356J3269
407g9434J19019O5784q3745j34084Q374J45585O4939r6644j05027J2483R2338
418I588N6131n1985q2831K4633Q9813m407q9167k7730O9822P1023j7196q8193
430d0499l6957P4746P0367l5082o4354k693L9054L1702m272l8767j0050L9435
442B2630J5461k8463l759K5310o69k7680j6503J8757M8243J3158o3000n3495L2840
455a7170N4773K264l4031l5111l810L7734J7135m4304k8233L9193L6833k4985
467B88n4526j8623N3316O7518k4717r0135j3768Q3167N8227l4974q5074l2475
$$ plain form
479 -91776 -8042 95038 62575 -60121 -86628 10289 86058 50083 -40309 -55567 34826 91400
491 91400 16071 -69172 -25904 77155 96257 6424 -83883 -51113 72381 102804 -13934
502 -13934 -98979 -35570 64869 61752 -31818 -91203 -35472 49910 29608 -55299 -61763 4380
514 4380 28784 -11266 -48778 -27023 36864 49024 -25269 -69463 -2456 73120 50286 -18071
526 -18071 -34077 14566 57742 28149 -28441 -9756 52011 42158 -22544 -37237 10032 52575
538 52575 35887 -31974 -61576 3117 64814 22999 -54393 -56063 9069 55667 24907 -46862
550 -46862 -58883 4612 38607 -586 -35645 -22372 7430 17735 -8799 -45205 -26983 31933
562 31933 35613 -21592 -52954 -24956 24989 44930 7092 -40936 -25108 26785 36842 8155
$$ packed form
479i1776Q3734J03080l2463j22696k6507R6917P5769l5975r0392j5258R0393N6574
491I1400p5329q5243M3268J03059J9102q9833r0307L2770J23494L0423j16738
502a3934q5045O3409J00439l117r3570n9385N5731Q5382k0302q4907o464O6143
514D380K4404m0050l7512K1755O3887J2160p4293m4194O7007P5576k2834o8357
526a8071j6006M8643M3176k9593n6590J8685O1767r853o4702j4693M7269M2543
538E2575j6688o7861k9602O4693O1697m1815p7392j670O5132M6598l0760p1769
550d6862j2021O3495L3995l9193l5059J3273K9802J0305k6534l6406J8222N8916
562C1933L680n7205l1362K7998M9945J9941l7838m8028J5828N1893J0057k8687
$$ plain form
574 8155 -15653 -17810 10432 42998 25948 -16812 -15133 16385 23177 7055 -7625 -6480 16172
587 16172 26413 -5008 -29069 -3253 30335 29544 2863 -28422 -28425 17102 44008 9470 -25690
600 -25690 -15803 6009 12632 5307 -12882 -18804 -2569 813 -12685 -11473 -3789 -9845 -12997 -11289
614 -11289 -14778 -4468 11068 -4450 -26063 -9555 18360 22297 12390 -683 -5960 11339 26518
627 26518 13515 4290 17374 20991 7390 -5160 -8690 8350 34131 14443 -39431 -42225 11115
640 11115 34801 384 -43843 -45099 4007 39732 -1844 -61272 -44590 19006 36157 -6857
652 -6857 -49451 -31678 32226 44014 -29522 -68808 906 72339 39061 -47693 -70171 7262
664 7262 88651 55684 -49102 -67236 25344 84024 32872 -45463 -42161 40656 85137 13866
$$ packed form
574H155k3808k157K8242L2566j7050m2760J679L1518O792j6122j4680J145K2652
587A6172J0241l1421k4061K5816L3588p91k6681l1285lM5527K6906l4538l5160
600b5690R887K1812O623p325j8189n922J6235L382j3498J212P684o056l152J708
614a1289l489J0310J5536j5518k1613J6508K7915L937r907j3073n277J7299J5179
627B6518j3003r225J3084L617j3601j2550l530J7040K5781j9688n3874k794N3340
640A1115K3686l4417m4227j256M9106L5725m1576n9428J6682O3596J7151m3014
652f857m2594J7773O3904J1788p3536l9286O9714P1433l3278q6754k2478P7433
664G262Q1389l2967j04786j8134R2580N8680n1152p8335L302Q2817M4481p1271
$$ plain form
676 13866 -68331 -29084 63275 60061 -26243 -67151 -11937 60157 40165 -53046 -79206 4186
688 4186 64798 14597 -60548 -58228 8050 46750 4737 -50577 -21121 46539 31273 -41682
700 -41682 -47912 22090 66051 23641 -50821 -50312 32946 69409 -796 -63981 -27963 41644 45231
713 45231 -19621 -66733 -25189 51586 42058 -40886 -59714 8426 51753 11423 -49649 -42311
725 -42311 32692 72517 10873 -62381 -40408 35096 61056 18070 -35895 -34862 20687 46292
737 46292 480 -36392 -6174 33214 25118 -12260 -33114 -12303 28271 29086 -10289 -24778 756
750 756 19305 12255 -9411 -24850 -5999 27651 22883 -12681 -26222 -13453 2546 15409 12926
763 12926 -7298 -16359 -8232 -4127 -416 8500 6060 -351 4751 1660 -10942 -4306 12054 11865
$$ packed form
676A3866q2197L9247R2359l214q6304m0908N5214P2094j9992r3211k6160Q3392
688D186O0612n0201p5145K320O6278L8700m2013n5314K9456O7660j5266p2955
700d1682o230P0002M3961m2410p4462N09Q3258L6463p0205o3185L6018O9607L587
713D5231o4852m7112M1544P6775r528q2944j8828O8140M3327m0330o1072P338
725d2311P5003L9825o1644p3254K1973P5504K5960m2986n3965J033N5549K5605
737D6292m5812l6872L0218L9388q096l7378k0854K0811M0574Q15l9375j4489K5534
750G56J8549p050k1666j5439J8851L3650m768l5564j3541J2769J5999J2863k483
763A2926k0224r061Q127M105L711Q916k440o411N102l091j2602O636J6360j89
$$ plain form
777 11865 5729 3352 -4078 -4984 5043 3834 -3526 -479 2256 -6 809 -5315 -17117 -8815 8993
792 8993 10641 6530 1068 -16829 -22217 3883 24333 16409 2891 -6412 -11645 -592 13438 8736
806 8736 550 1302 411 329 -606 -12169 -15412 6851 18205 -3797 -24027 -20170 -3738 11548 4465
821 4465 -22548 -19427 20694 30808 -11569 -43642 -21162 32742 56285 10532 -48088 -31274
833 -31274 35134 47376 -1612 -29847 -1737 38835 31305 -24251 -46057 10326 62469 30266
845 30266 -34609 -43366 7405 47114 18890 -42045 -38410 30035 50310 -10461 -56975 -28423
857 -28423 24074 34132 -7662 -44512 -20319 22433 7276 -37012 -31395 16822 35744 -1946
869 -1946 -49173 -37162 25577 46145 -5242 -38409 -3282 34390 20078 -18698 -26536 13232
$$ packed form
777A1865o136k377p430r06J0027j209p360L047K735k262Q15o124j1802Q302J7808
792H993J648m111n462j7897n388K6100K0450p924j3518r303n233J1053J4030m702
806H736q186P52q91q2r35j1563l243K2263J1354k2002k0230L857J6432J5286p083
821D465k7013L121M0121J0114m2377l2073K2480N3904K3543m5753n8620J6814
833c1274O6408J2242m8988k8235K8110M0572p530n5556k1806N6383N2143l2203
845C0266o4875q757N0771L9709k8224o0935L635O8445K0275o0771m6514K8552
857b8423N2497J0058m1794l6850K4193M2752j5157m4288N617M8217J8922l7690
869a946m7227J2011O2739K0568n1387l3167L5127L7672j4312l8776p838L9768
$$ plain form
881 13232 48319 18984 -35253 -25048 29882 40763 -3140 -34690 -11279 37086 39255 -20003
893 -20003 -54412 -7028 48092 32806 -20206 -39977 -9499 28804 20778 -22062 -27504 12544
905 12544 28912 -641 -28848 -21505 11618 33033 7251 -33289 -24057 16630 23390 -2342 -19171
918 -19171 -12289 8968 21167 2432 -21106 -12916 10143 14951 4527 -6885 -8960 4023 11372
931 11372 -4341 -11802 4350 12582 2184 -7608 -10313 -5441 10092 13314 -6351 -16057 -2249
944 -2249 6748 4381 -932 -8121 -6295 6250 6350 -5631 -2945 4522 -428 -4403 -458 2575 7051
959 7051 8351 -4259 -11482 3085 13023 5113 -2137 -3560 -998 8208 8117 -7371 -8355 8584 9323
974 9323 -3953 -5943 -1351 1430 3607 -3023 -11990 -1985 12543 6122 -9906 -15424 -9780 6609
$$ packed form
881A3232L5087k9335n4237J0205N4930J0881m3903l1550K3411M8365K169n9258
893b0003l4409M7384N5120j5286n3012j9771L0478L8303q026m2840n442M0048
905A2544J6368k9553k8207P343L3123K1415k5782m0540R232M0687O760k5732j6829
918a9171O882K1257J2199j8735k3538Q190K3059M808j0424j1412k075J2983P349
931A1372j5713p461J6152Q232j0398r792k705M872J5533L222j9665r706J3808
944b249Q997k367n313p189J826J2545J00j1981K686P467m950l975L945L033M476
959G051J300j2610p223J4567R938p910p250j423K562R206r1j5488r84J6939P39
974I323j3276j990M592K781K177o630q967J0005J4528o421j6028n518N644J6389
$$ plain form
988 6609 17424 2176 -16995 -10630 3383 5237 2562 -3144 -8292 2508 13310 -727 -17474
1001 -17474 -6670 12872 16750 3909 -13778 -12109 13366 21291 -5100 -18912 2617 25385
1013 25385 20411 -7927 -28179 -8687 30648 29458 -8919 -24226 -2346 15858 8882 -12218
1025 -12218 -16787 9216 24989 -4418 -35711 -19252 14949 19323 -2264 -22525 -17916 7938
1037 7938 13253 -13910 -24811 1538 21000 8470 -15527 -22232 -2854 18688 8448 -12622
1049 -12622 -3080 16864 7226 -14484 -14953 5980 27747 24094 -7921 -24123 1399 24610 12602
1062 12602 -4851 -398 15280 19345 127 -22009 -7447 26683 25339 -6493 -20500 -6797
1074 -6797 9119 8887 -10558 -22045 -119 21755 3326 -27478 -29773 -6821 15749 16627 -8474
$$ packed form
988F609J0815j5248j9171O365J4013J854k675n706n148J0800J0802j4037j6747
1001a7474J0804J9542L878j2841j7687J669K5475P925k6391j3812K1529K2768
1013B5385m974k8338k0252J9492L9335j190l8377j5307K1880J8204o976k1100
1025a2218m569K6003J5773k9407l1293J6459L4201M374k1587k0261M609K5854
1037G938N315k7163j0901K6349J9462j2530k3997o705J9378K1542j0240k1070
1049a2622R542J9944r638k1710m69K0933K1767l653l2015j6202K5522K3211j2008
1062A2602j7453M453J5678M065j9218k2136J4562L4130j344l1832j4007J3703
1074f797J5916k32j9445j1487K1926K1874j8429l0804k295K2952K2570Q78k5101
$$ plain form
1087 -8474 -24746 -8076 8769 554 -8824 -3297 7728 14380 5993 -16710 -20193 7703 26091
1100 26091 14036 -7943 -15596 -4231 13531 10651 -10951 -10240 12666 18103 670 -15261 -15444
1113 -15444 2581 22273 13332 -10324 -9775 5248 4078 -6378 -5297 5544 15998 9172 -15261
1126 -15261 -22983 615 17441 7568 -3903 -4391 -1117 2123 -2624 -10374 955 20112 11845 -11707
1140 -11707 -13318 1341 10272 5877 -6351 -7368 10245 14652 -11310 -27168 -7808 14448 14448 -2917
1154 -2917 -20802 -17207 4482 6783 -11040 -11154 8124 13271 -1027 -17473 -16812 6646 26425
1167 26425 11762 -12146 -8791 6747 9824 4431 -1101 -1846 9251 15227 280 -12613 -5588
1180 -5588 4199 8434 9542 1510 -8388 -5170 593 -703 1396 5410 1615 896 2299 -6705 -11723
$$ packed form
1087h474j6272J6670J6845q215r378N527J1025O652q387k2703l483K7896J8388
1100B6091j2055k1979p653J1365J7762k880k1602P11K2906N437j7433j5931j83
1113a5444J8025J9692q941k3656N49J5023j170j0456J081J0841J0454o826k4433
1126a5261p722K3598J6826r873j1471m88L274L240m747p750J1329J9157q267k3552
1140a1707j611J4659Q931m395j2228j017J7613M407k5962j5858J9360K2256%j7365
1154b917j7885L595K1689K301j7823j14J9278N147j4298j6446O61K3458J9779
1167B6425j4663k3908L355J5538L077n393n532p45J1097N976j4947j2893P025
1180e588R787M235J108q032r898L218N763j296K099M014l795p19J403r004n018
$$ plain form
1195 -11723 780 11931 6808 -2945 -12042 -13138 -758 6427 -3224 -9145 -2002 -598 -5250 -7358
1209 -7358 -9189 -4952 6871 6746 -6101 -6832 1231 816 -1134 3035 5490 7638 7501 -2235 -8528
1224 -8528 3408 12987 8455 4088 2060 -1281 1458 4836 140 2103 12085 8386 -4441 -6095
1238 -6095 838 6497 8790 2178 -6415 -633 8301 344 -9839 -6937 -492 5111 3823 -9767
1252 -9767 -19550 -7613 4991 -1864 -10442 -8711 -3014 1575 -2340 -14366 -11264 10186 16476 -114
1266 -114 -12516 -7229 7354 19354 9525 -10136 -4767 17935 17836 -2615 -10274 1311 16654 17023
1280 17023 -3508 -16366 952 17952 5473 -12731 -8529 7770 14644 1737 -19032 -14305
1292 -14305 13406 18453 -6460 -19133 -4770 10573 7477 -9718 -17583 71 16641 638
$$ packed form
1195a1723J2503J1151n123r753r097j096J2380P185r651n921P143J404m652k108
1209g358j831M237J1823j25j2847p31Q063m15j950M169K455K148j37r736o293
1224h528J1936R579m532m367k028l341K739L378m696J963R982l699j2827j654
1238f095O933N659K293o612q593N782Q934p957j0183K902O445N603j288j3590
1252i767r783J1937J2604o855q578J731N697M589l915j2026L102K1450O290j6590
1266a14j2402N287J4583J2000r829j9661N369K2702r9k0451p659J1585J5343L69
1280A7023k0531j2858J7318J7000j2479j8204M202J6299O874j2907k0769M727
1292a4305K7711N047k4913j2673J4363J5343l096j7195p865J7654J6570j6003
$$ plain form
1304 638 -21654 -13095 9172 12598 -2650 -17080 -10531 13383 17388 -8823 -20106 2326 19745
1317 19745 9448 -9330 -12247 4723 20052 6336 -16280 -8581 15257 14399 -6202 -16046 -6027
1330 -6027 13064 14160 -9778 -21930 -187 18022 4908 -14005 -11931 3652 14183 5158 -12982
1343 -12982 -8556 12017 12436 -5185 -9484 805 9868 8325 -4440 -13295 -653 13148 3860
1356 3860 -9029 -6063 2092 3780 1534 -5600 -5349 5327 6125 -4576 -5148 3176 3093 -1035 -902 -1283
1372 -1283 1076 5235 -881 -8420 -2247 4301 395 -3432 -3399 -3710 -1479 -1055 -5950 -3269 5388 2824
1388 2824 -6690 -4866 697 2305 3665 2549 -2477 1219 6859 1733 -3439 1995 5797 4525 3912
1403 3912 91 -2635 2794 4360 -1806 33 6208 2783 -2476 -2093 -1991 363 6056 2975 -4173
$$ packed form
1304F38k2292Q559K2267L426j5248j4430O549K3914M005k6211j1283K2432J7419
1317A9745j0297j8778k917J6970J5329j3716k2616P699K3838q58k0601r844J0019
1330f027J9091J096k3938j2152K1743J8209j3114j8913K074J5583J0531r025j8140
1343a2982M426K0573M19j7621m299J0289R063j543j2765q855J2642J3801r288
1356C860j2889K966Q155J688k246p134K51J0676P98j0701n72Q324q3m128J33l81
1372a283K359M159o116p539O173O548l906l827L3l11K231M24m895K681Q657k564
1388B824r514J824N563J608J360j116n026L696N640n126n172N434L802j272o13
1403C912l821k726N429J566o166J839O175l425n259L83J02K354N693l081p148
$$ plain form
1418 -4173 -1181 1146 -3394 -3687 1103 1367 1048 -1616 -8760 -8448 2764 3403 -6230 -7524 -1820 482
1434 482 -269 -5191 -9826 -919 10803 4545 -7782 -6534 1861 8147 6999 -2280 -5013 8930 14723
1449 14723 -382 -10698 23 13233 14220 2546 -10897 -6838 11475 12960 -4364 -9420 2624
1462 2624 10154 4261 -8377 -12495 2503 15310 2464 -14002 -7308 5996 4874 -5149 -10696
1475 -10696 -4153 9607 7338 -12449 -16605 1090 10174 1281 -8239 -7649 2184 7745 -3498 -14531
1489 -14531 -973 16198 8377 -9392 -11210 1770 13048 8719 -7423 -9164 9010 15695 -1444
1502 -1444 -12451 -3199 10959 13781 465 -13460 -5332 13325 8890 -8784 -8722 5168 11031 2922
1516 2922 -10273 -12368 4104 14771 1346 -11563 -5144 4240 4000 -1755 -6855 -3045 7539 4709
$$ packed form
1418d173K992K327m540k93M790K64l19k664p144L12J1212O39r633j294N704K302
1434D82p51m922m635Q907J1722o258j2327J248Q395O286j148r279k733J3943N793
1449A4723j5105j0316J0721J3210R87j1674j3443M059J8313J485j7324n056J2044
1462B624P530n893j2638m118J4998J2807j2846j6466O694J3304j122j0023n547
1475a0696O543J3760k269j9787m156J7695R084q893r520N90R833N561j1243j1033
1489a4531J3558J7171p821j7769j818J2980J1278m329j6142j741J8174O685j7139
1502a444j1007R252J4158K822j3316j3925Q128J8657m435j7674O2J3890N863q109
1516B922j3195k095J6472J0667j3425j2909O419R384k40n755n100L810J0584k830
$$ plain form
1530 4709 -9267 -8475 3487 4683 -1153 -4070 -3636 834 3604 -2958 -7514 557 6205 262 -3627
1545 -3627 -1970 -624 1053 1627 -2612 -990 5483 2334 -5755 -3199 3403 4554 3299 -437 -4020
1560 -4020 753 5768 942 -2928 2282 3815 1104 770 -782 -1822 3387 4780 -1513 -1443 3701 1634
1576 1634 -1422 -394 -474 586 3243 95 -4507 -1075 1392 -2634 -2213 1463 -863 -2247 -1995 -4728
1592 -4728 -3595 2802 1194 -6083 -4487 176 132 -336 -1979 -4915 -319 5103 192 -4886 -703 3113
1608 3113 2452 1694 -783 -1370 4745 7009 -1258 -3826 3085 6299 3990 325 -3300 -278 7933 5197
1624 5197 -4760 -3761 4299 4172 137 -2720 -3294 2286 6329 -2065 -7980 -595 5962 867 -5416 -6515
1640 -6515 -2109 4849 2504 -8687 -8511 3140 4451 -4115 -6781 -3078 1733 3898 -2508 -8753 -671
$$ packed form
1530D709j3976P92J1962J196n836k917M34M470K770o562m556Q071N648n943l889
1545c627J657J346J677N74m239J622O473l149q089K556O602J151j255l736l583
1560d020M773N015m826l870N210J533k711l34j552j040N209J393o293P0N144k067
1576A634l056J028q0J060K657l148m602L432K467m026M21L676k326j384K52k733
1592d728J133O397j608p277J596M663m4m68j643k936M596N422m911n078M183L816
1608C113o61p58k477n87O115K264q267k568O911L214k309l665l625L022Q211k736
1624E197r957R99Q060j27m035k857n74N580M043q394n915P385O557n095o283j099
1640f515M406O958k345j1191J76J1651J311q566k666L703M811K165o406o245Q082
$$ plain form
1655 -671 8858 2781 -6233 -3882 3262 7260 4015 -5350 -5224 6904 10044 -1154 -5722 -67 4877
1670 4877 4930 83 -5737 -1112 7739 3426 -6116 -3476 3752 4449 1100 -3544 -4389 2273 6284 -1635
1686 -1635 -6018 -43 3526 -320 -2285 -2650 -2186 1988 1319 -4599 -3062 1988 -103 -3465 -1988 -1309
1702 -1309 178 2507 -669 -4586 215 3171 -62 -404 2195 365 -795 1709 841 6 1965 995
1718 995 -1688 1245 1635 -2104 -892 1597 -377 -291 990 -1246 -749 3223 593 -2657 1195 3964
1734 3964 472 -645 246 78 2744 3901 -1363 -2367 2639 2338 -1415 -1430 655 -88 1283 -344
1750 -344 -4022 -967 3504 296 -3173 -696 463 421 1258 -1786 -3027 1392 2410 -2547 -2133 657
1766 657 -865 -2005 -527 -2031 -2610 806 -1194 -3983 -1409 808 -937 -584 437 -1054 -220 2980
$$ packed form
1655f71R529o077r014K351P144L998l245r365J26J2128L140j1198m568N655M944
1670D877N3m847n820M625Q851m313r542K640P228O97l349m644q45O662M011p919
1686a635m383N975L569l846j965l65M64M174o69n918J537N050k091l362J477O79
1702a309J487K329l176l917M801K956l233l42K599j830j160K504q68q35J959r70
1718I95k683K933L90l739J212K489j974Q6J281k236M97L972k630l250L852K769
1734C964l492j117Q91j68K666J157n264j004N006l01l753j5K085p43J371j627
1750c44l678L055M471l208l469K477J159m2Q37l044j241M419J018m957M14K790
1766F57j522j140J478j504n79L416k000k789K574K217j745L53J021j491Q34L200
$$ plain form
1782 2980 1151 50 2860 1939 970 4129 4158 -198 1761 4554 2361 1087 1655 656 1214 3611 -564
1799 -564 -3896 175 3104 240 -2060 -3275 -3404 1345 3091 -3764 -6560 -255 2012 -1150 -3705
1814 -3705 -5420 -2880 2312 270 -6665 -5647 894 577 -2364 -3090 -2954 851 3985 -719 -5751 -73
1830 -73 6033 3115 -102 428 1468 4254 4406 -53 -34 6394 5768 -228 -1113 1461 2140 3852 1305
1847 1305 -3382 -840 3699 187 -4374 -2210 308 914 994 -2826 -5604 -1117 2197 -1277 -2593 -854
1863 -854 -561 -493 -955 -4680 -4386 2419 3575 -2891 -4747 -2892 -631 1629 920 -4233 -2332 3905 2737
1880 2737 -2689 -2662 469 3971 5879 897 -4208 306 7038 3088 -1739 11 3370 5234 2876
1895 2876 -4044 -4754 3906 7378 372 -3988 -2592 95 2421 494 -4401 -1865 5426 2664 -5756
$$ packed form
1782B980j829j101K810r21r69L159K9m356J959K793k193j274N68r99N58K397m175
1799e64l332M071K929k864k300j215j29M749J746o855k796O305K267l162k555
1814c705j715K540N192k042o935J018O541l17k941p26J36L805L134m704n032N678
1830g3O106k918l217N30J040K786J52m459J9O428o26n996q85K574O79J712k547
1847A305m687K542M539l512m561K164K518O06Q0l820k778M487L314l474j316J739
1863h54K93O8m62l725K94O805J156o466j856J855K261K260p09n153J901O237j168
1880B737n426K7L131L502J908m982n105M514O732l950m827J750L359J864k358
1895B876o920p10Q660L472p006m360J396K687K326j927m895K536P291k762q420
$$ plain form
1910 -5756 -4842 1096 3154 2094 -2412 -4884 602 3957 -2454 -6396 -466 4144 2542 -2191 -6156
1925 -6156 -4029 3539 3899 -3224 -2947 3202 3068 -1601 -3686 -1652 4194 7470 1159 -5457 -1514 3460
1941 3460 1996 293 370 96 1545 1477 -3197 -3874 1731 2750 6 -243 4 -1524 -997 247 17
1958 17 2214 3602 -706 -2016 1484 1401 -569 1945 3324 1606 693 -1411 -3591 492 5262 1217
1974 1217 -3451 -1712 -209 -595 -975 -2935 -2433 2800 2117 -5166 -5638 213 1846 -431 -1505 -2471
1990 -2471 72 2805 -1907 -6605 -864 6004 3158 -2569 -4533 -2227 3233 4154 -2010 -3108 4311
2005 4311 5682 -1209 -3997 -17 5135 7079 1777 -4974 -1186 6540 4261 -2792 -2960 2293 5619
2020 5619 3475 -4250 -7408 1308 7419 726 -5926 -4057 658 2318 -801 -6597 -4371 4995 4817
$$ packed form
1910e756R14N938K058j060m506k472N486L355o411l942N930M610j602m733l965
1925f156K127P568L60p123K77O149j34m669k085K034N846L276o311o616L943M974
1941C460j464j703P7k74J449o8m674o77N605J019k744k49K47j528N27J244k30
1958A7K197J388m308j310L500q3j970K514J379j718r13k104k180M083M770m045
1974A217m668J739J503l86l80j960N02N233o83p283m72N851J633k277j074r66
1990b471K543K733m712m698N741O868k846n727j964K306N460R21o164j098P419
2005D311J371o891k788L980N152J944n302o751L788P726k279p053j68N253L326
2020E619k144p725l158Q716O111o693o652J869M715J660l119n796K226R366j78
$$ plain form
2035 4817 -4448 -7940 -2722 3483 4169 -1780 -7229 -2376 5664 1873 -5891 -4505 2016 4623 1848
2050 1848 -4236 -5436 2256 6984 223 -5257 -482 4906 4677 171 -4670 -1164 7537 6333 -2785
2065 -2785 -4374 2299 5609 2583 -2286 -3652 1978 7207 999 -6712 -2653 4433 3703 -1644 -5563
2080 -5563 -3622 4371 5215 -4755 -8208 -708 5506 1361 -4196 -5610 -1332 4586 1361 -6281 -4402
2095 -4402 3586 3539 -1781 -4670 -3170 2075 4695 -852 -5564 12 4727 1439 -2250 -1522 612 3833
2111 3833 3375 -1326 -2644 2172 2881 187 519 1897 1494 1574 211 -2364 162 3612 1436 -760
2127 -760 123 -38 -1697 220 1508 -540 829 1296 -1628 -1253 345 -1083 -946 2500 1595 -2059 -2604
2144 -2604 -1712 -921 1860 996 -2181 -1016 1698 -1108 -4382 -2065 1456 3632 2145 -3904 -6245 688
$$ packed form
2035D817r265l492N218O205O86n949n449M853Q040l791p764J386O521K607k775
2050A848o084j200P692M728o761n480M775N388k29m506m841L506Q701j204r118
2065b785j589O673L310l026m869j366N630N229o208p711M059P086p30n347l919
2080e563J941P993Q44r970l453P500O214m145n557j414M278N918l225p642J879
2095d402P988m7n320k889J500N245K620n547m712N576M715l288l689P28K134L221
2111C833m58m701j318M816P09k694L32J378m03Q0j363k575K526L450k176k196
2127g60Q83j61j659J917J288k048J369M67k924L75J598j428J37L446r05l654n45
2144b604Q92P91K781q64l177J165K714k806l274K317L521K176j487o049k341O933
$$ plain form
2160 688 4498 -417 -2745 -117 2475 2177 -1343 -5798 -1656 7046 5647 -2942 -4868 43 3721
2175 3721 3090 -1283 -2915 3448 7257 278 -7001 -2854 4679 6399 2498 -3464 -3519 3050 4491 -2887
2191 -2887 -4515 2596 5952 1568 -4861 -7218 -945 6630 2653 -5936 -4378 1971 1814 -2439 -5521
2206 -5521 -2979 4270 5631 -3359 -9083 -2589 4531 2367 -2302 -3740 -715 5013 1993 -6265 -5206
2221 -5206 5135 8344 1478 -4237 -4292 1550 7161 2910 -3875 -818 6157 4220 -2244 -4265 -623
2236 -623 6011 7183 -1558 -6764 -606 4705 1593 -2442 -2799 526 4056 1458 -6186 -5911 2549 5392
2252 5392 -137 -3559 -2969 122 2433 -703 -4854 -512 5089 1584 -4592 -4468 -399 3109 3213 -1875
2268 -1875 -4548 534 3535 -1143 -3837 -846 2202 3539 580 -4090 -2789 3592 4043 -1173 -1985
$$ packed form
2160F88L810m915k328K628K592k98l520m455M142Q702j399q589j926M911L678
2175C721o31m373j632O363L809o979p279M147P533J720l901n962n5O569J441p378
2191b887j628P111L356m384o429k357O273P575l977q589J558O349j57m253l082
2206e521K542P249J361q990n724O494P120k164m669j438L025N728l020q258J059
2221e206J0341L209o866n715n5N842N611m251o785L057O975j937o464k021L642
2236f23O634J172q741n206O158N311l112m035l57L325L530k598p644K75Q460K843
2252E392n529l422N90L091K311l136m151M342N601l505o176J24M069L508J04n088
2268a875k673N082L001m678k694K991L048J337k959m670J301O381M51n216q12
$$ plain form
2283 -1985 284 1779 1646 -1114 -3718 -248 4897 2486 -2560 -2297 -308 2111 2889 571 -2719 447
2299 447 3400 376 -1409 -333 526 2277 2482 -1159 -3845 408 2569 333 -1635 -2316 -1016 1563
2315 1563 1610 -3522 -4552 629 2436 6 -2199 -3431 -1382 3009 1823 -3621 -2756 2266 2378 -683
2331 -683 -1907 -1992 1593 4098 -373 -5222 -648 4319 2094 -2216 -2750 -364 4114 3487 -2642 -4273
2347 -4273 2424 5124 361 -2466 -1356 2622 4763 483 -4845 -1297 6013 3952 -2490 -3718 129
2362 129 4027 3533 -3261 -5704 938 6096 750 -5292 -3845 740 3441 767 -5393 -4253 3164
2377 3164 3693 -2797 -5950 -1719 2760 3756 -1911 -6755 -2933 4369 2782 -3431 -3970 176 3137 2282
2393 2282 -2210 -4144 1777 6227 1908 -2865 -973 2561 4137 2510 -1330 -924 4881 5167 -794
$$ packed form
2283a985K269J495j33k760k604L470N145k411n046K63J989K419P78k318l290L166
2299D47K953l024j785J076Q59J751K05l641k686M253K161k236j968o81J300K579
2315A563M7n132j030N181J807k430k205j232K049M391j186n444Q65N022J12l061
2331f83j224q5L585K505m471m849M574M967k225m310n34K386M478o27o129j631
2347d273O697K700m763k827J110L978K141m280n328L548P310k061o442j228L847
2362A29L898m94o794k443O642N158n346o042J447M585K701k674o160J140P417
2377C164N29o490l153M231M479R96n667m844L822P302j587o213n39M146K961q55
2393B282m492j934N921M450m319m773J892L534J576j627l840M06N805K86n961
$$ plain form
2408 -794 -3225 382 3732 3865 661 -3820 -1840 3231 1482 -3452 -2971 436 1458 -158 -3428 -4985
2424 -4985 -318 4078 -353 -4579 -2640 1080 1703 -43 -3803 -3025 3039 4266 -1853 -4532 -769
2439 -769 2387 2838 328 -3120 -1420 3635 2816 -2956 -2394 2159 3830 2674 -1735 -3652 815 5799
2455 5799 2073 -2865 -1263 2016 2921 1451 -2485 -2961 2825 4923 -502 -4138 -1394 1961 2362 204
2471 204 -3317 -1758 3150 2261 -3391 -4213 564 3134 2099 -1839 -4711 -1148 3764 1564 -3908 -3016
2487 -3016 873 1870 160 -3727 -4095 1673 3992 -784 -4662 -1802 2698 2947 466 -3423 -1906 4389
2503 4389 4327 -2419 -4185 1224 4954 3251 -787 -3556 -59 5381 2179 -3621 -2708 2689 3820 334
2519 334 -3538 -3992 2476 5470 -482 -5499 -1393 3324 2530 -1331 -3934 -1185 4337 3714 -3491 -4817
$$ packed form
2408g94k431L607L350J33l204m481J980N071j749m934M81L407J022j616l270j557
2424d985M667M396m431m226J939L720O23j746l760P78O064J227o119k679L763
2439g69L156M51k510l448J700N055q19n772N62M553J671j156m409j917M467M984
2455E799l726m938J602L279R05j470l936m76N786K098n425l636K744L355M01k158
2471B04l521J559M908q89n652q22M777K570j035l938k872L563M912k200n472Q92
2487c016L889R97j710l887l68N768K319m776l878K860M500K49k481l889J517O295
2503D389o2o746j766N409L730j703m038k769L497N440l202n800R13N397J131l486
2519C34l872m54O468K994n952n017M106M717p94l861k603K749N522o23p205j326
$$ plain form
2535 -4817 1459 3432 947 -2556 -3172 583 4313 422 -5416 -2474 3560 3004 -1326 -4017 -2625
2550 -2625 2596 3613 -1704 -4964 120 3563 1361 -2361 -3329 -278 4257 2767 -3478 -3835 2232
2565 2232 4028 456 -2242 -1899 1373 4543 1362 -3565 -1389 3825 3495 576 -1483 -1532 2064 4199
2581 4199 327 -3037 -301 2902 1809 -944 -2250 -1985 1526 2437 -1709 -4248 -1195 1241 341 -1709
2597 -1709 -3253 -2045 1801 1493 -3346 -3496 618 1658 87 -1496 -2440 46 3210 743 -3317 -1066
2613 -1066 2928 2832 -13 -1859 -1299 2839 4184 -617 -3371 543 4013 2037 -561 -2216 -265 4043
2629 4043 2944 -2888 -3275 2703 4065 548 -2777 -2649 1494 4695 396 -5229 -2863 3235 3341 -1219
2645 -1219 -4058 -3066 2278 4016 -2209 -6149 -802 3866 2032 -2920 -4302 -1238 3829 2677 -4421
$$ packed form
2535d817O276J973k485l503o16L755L730l891n838K942O034n56m330k691J392
2550b625N221J017n317l260N084L443k202l722r68L051M535j490o245l57O067
2565B232J796l572k698L43L272L170l181m927K176N214l30k919k059m9L596K135
2581D199l872l364K736L203j093k753j306K65L511R11m146k539L053K436r00k050
2597a709j544J208L846l08m839j50M114J040j571j583r44K486L164k467m060K251
2613a066L994r6k845j846N60M138J345m801k754L914L470j976k598j655J951M308
2629D043j099n832l87N978J362l517l325J28M143L201m299n625K366O098J06m560
2645a219k839R92N344J738o225l940N347M668j834m952j382L064N067j152p098
$$ plain form
2660 -4421 -4909 1832 4372 647 -3690 -3695 1301 4861 1597 -4613 -2581 4082 4111 -931 -2905 -1165
2676 -1165 3437 4715 -1084 -4532 1026 5523 2310 -2470 -2697 912 4477 2479 -3531 -3732 3037
2691 3037 4389 -606 -4062 -2438 2144 3816 -537 -5335 -1812 4116 1670 -3962 -4300 -204 3336
2706 3336 1918 -3950 -5719 970 4938 555 -4442 -2922 1197 3321 411 -4387 -3313 3621 4609
2721 4609 -1293 -3958 -1049 2776 3451 -292 -3897 -364 4721 2660 -2685 -2603 767 3123 3036 -1303
2737 -1303 -3420 608 3972 917 -1906 -782 961 1919 980 -2405 -2602 1959 3077 -529 -2473 -1144
2753 -1144 474 1375 448 -2853 -2044 2355 1364 -2211 -2596 -1193 831 1990 22 -3603 -1608 2040
2769 2040 266 -2066 -1498 -142 1422 1661 -1818 -3872 899 4075 890 -2168 -1866 425 3037 2008
$$ packed form
2660d421m88O741K540l725m337nM996L560l264o210K032O663K9n042j974J740
2676a165M602J278n799l448N558M497l213m780k27L609L565j998o010k01O769
2691C037J352m995l456J624M582J672m353m798L523N928k446n632l38M096L540
2706C336j418n868j769O689L968m383m997J520M119K124k910m798J074O934R88
2721D609n902k665K909L825O75l743l605L533N085k061n345Q2L370K356q7m339
2737a303k117M028L364l055k823J124J743R58r39l385j97M561J118l606j944J329
2753a144J618R01r27l301Q09M399r91l575l85J403K024J159j968l625J995L648
2769B040j774k332N68J356J564K39l479k054M771L176l185l058L02K291K612j029
$$ plain form
2785 2008 -2530 -2441 3015 4465 -144 -2839 -997 2190 4263 986 -3663 -1115 3949 2782 -1779
2800 -1779 -2985 492 3539 3116 -2473 -5367 122 5262 1323 -3779 -3263 572 2630 369 -4841
2815 -4841 -3995 2861 4287 -2101 -5406 -1924 2302 3231 -1214 -4988 -1426 4721 2365 -3864 -3948 997
2831 997 4403 2800 -2583 -4377 1546 5483 960 -3626 -1174 3059 3806 484 -4201 -1716 4688
2846 4688 4941 -1935 -4741 302 3775 2625 -1516 -3920 49 4907 1915 -4140 -3364 1514 3070
2861 3070 620 -2971 -3402 1075 3982 -721 -4760 -1059 2623 2252 -1202 -3932 -2268 2805 2888 -2480
2877 -2480 -3601 62 2606 1306 -1401 -2980 -85 3657 1100 -3421 -2420 1802 1933 251 -1795
2892 -1795 -2054 1606 4081 -43 -3131 -452 2833 2415 105 -1781 -1068 2842 3335 -1193 -2630 811
$$ packed form
2785B008m538Q9N456J450m609k695J842L187K073l277m649K548N064j167m561
2800a779j206L477L047m23n589k894N489N140l939n102N16L835K058k261n210
2815d841Q46O856J426o388l305L482M226R29m445l774L562O147k356o229q4M945
2831I97L406j603n383j794N923L937m523m586K452M233P47l322m685K485O404
2846D688K53o876k806N043L473j150m141k404L969M858k992o055P76M878J556
2861C070k450l591m31M477K907m703m039L701L682l71l454k730J664N073Q3n368
2877b480j121L663K544j300k707j579K895L742k557m521J001M222J31j682k046
2892a795k59L660K475m124l088K679L285m18k310j886P13L910M93m528j437L441
$$ plain form
2908 811 2775 1857 -851 -2328 -787 3135 2337 -2843 -2623 804 1941 847 -1817 -3178 -288 3480
2924 3480 429 -3179 -2493 606 1550 419 -1821 -2758 968 3053 -910 -3519 -1369 1630 2002 -101
2940 -101 -2419 -2116 2266 2924 -1483 -2605 443 2481 1665 -833 -2696 -281 3895 1780 -2410 -1528
2956 -1528 1444 2150 895 -1637 -2068 1911 3972 -220 -3991 -964 2896 2708 -133 -2769 -1623 3366
2972 3366 2906 -2497 -3956 826 3442 1117 -2142 -3744 -214 3807 1147 -4346 -3076 1710 2883
2987 2883 -779 -4551 -3425 2096 4291 -1197 -5286 -1719 3272 2586 -1138 -3335 -1177 3764 3162
3002 3162 -3185 -4274 1390 4521 2162 -2009 -3099 569 4768 1960 -3199 -1758 3212 3706 320
3017 320 -2530 -2027 2507 3966 -73 -3637 -411 3103 1231 -1769 -2482 -230 2668 1631 -3181 -3634
$$ packed form
2908H11J964r18k708j477J541L922p98n180K20L427J137j094k664j361K890L768
2924C480l051l608O86L099R44j131k240r37L726K085l963k609K150K999L72k103
2940a01k318L03M382O58m407j122L048K038q16k498j863K415M176k115m190Q82
2956a528K972P06j255k532m31L979K061m192l771L027L860j88k841k636J146M989
2972C366m60n403j459M782K616k325l259j602L530M021k660n493J270M786J173
2987B883l662l772J126N521K195n488m089L567M991o86l724k197K158M941o02
3002C162o347j089N664L131k359m171j090L668M199k808n159J441M970M94l386
3017C20k850N03M534J459m039l564L226L514j872l000p13K252K898j037m812m53
$$ plain form
3033 -3634 879 2681 -405 -2509 -2003 249 1947 -109 -3744 -1610 2783 1981 -1925 -2661 -895 1801
3049 1801 2373 -974 -3171 395 3481 629 -2077 -1995 404 3163 2306 -2095 -3061 1650 2987 598
3065 598 -1450 -1160 1061 2692 1160 -2284 -1607 2536 2879 107 -1602 -1359 762 3229 332 -2925
3081 -2925 -1070 2063 2057 -971 -2212 -1405 1507 2258 -886 -3544 -743 1821 816 -1231 -2414 -1049
3097 -1049 1868 1471 -2655 -2799 753 2365 -82 -1886 -1719 537 2794 912 -3066 -1637 2472 2428
3113 2428 -592 -2071 -906 2313 3054 -418 -3144 351 3579 1578 -1467 -1776 650 3290 2174
3128 2174 -2379 -3173 1954 3699 262 -2818 -1490 1602 3209 184 -4038 -1893 2721 2791 -1996 -3159
3144 -3159 -544 2250 2436 -1975 -4275 188 3776 1001 -3134 -2729 91 2979 1508 -3114 -3417 1518
$$ packed form
3033c634M513J802l086k104N06K252J698k056l635K134M393q02l906p36J766K696
3049A801N72l347k197L566L086k852k706Q2K399K759q57m401r66M711J337k389
3065E98k048K90K221J631j532l444O77M143L43k772j709K43K121K467k897l257
3081b925J855L133ol028j241Q07K912P51l144k658K801K564j005k047j183J365
3097a049K917l97m126j44L552J612k447j804J67K256K257j882l978J429M109m4
3113B428l020j479J165L219P41l472k726L495L228k001l045l09K426K640j116
3128B174m553p94N127J745l437l080J328L092J607l025m222K145M614P0m787j163
3144c159K615K794J86m411k300M463L588k775m135M05K820K888j471m622l03M935
$$ plain form
3160 1518 2961 -553 -3198 -1615 1399 2646 -409 -3835 -1564 3257 2513 -1730 -2462 81 2477
3175 2477 2091 -1507 -3245 835 4071 1203 -2224 -1112 1247 2626 1317 -2173 -1924 2116 2936 -823
3191 -823 -2511 -230 1697 2148 -465 -2851 -1014 2784 1374 -2539 -2473 -344 1327 1010 -1597 -2664
3207 -2664 -201 2688 87 -2547 -1681 392 1225 281 -2116 -2106 1179 2673 -1008 -2327 -297 1028
3223 1028 1531 432 -1645 -828 2342 2181 -754 -1368 499 1556 1720 -116 -1659 -131 3065 1030
3239 1030 -1527 -1079 595 1911 1284 -1214 -1911 856 2943 291 -2314 -1018 751 1887 421 -2105
3255 -2105 -2367 1764 2556 -1101 -2483 -736 1259 1526 -682 -3509 -1507 2350 1500 -2138 -2540 -100
3271 -100 1682 1572 -1587 -3401 329 3193 608 -2476 -1517 1105 2375 822 -2249 -2241 2186 3225
$$ packed form
3160A518J443l514k645J583L014J247l055l426K271M821p44m243p32K543K396
3175B477l86l598j738M080L236k868l427J112K359J379j309l490K49M040Q20l759
3191h23j688K281J927M51k613k386J837L798j410l913O6K129J671l17k607j067
3207b664K463K889k601k634Q66K073Q33r44k397J0L285J494l681j319K030J325
3223A028N03j099k077Q17L170j61k935o14J867J057J64j836j543J528L196k035
3239A030k557M48J674J316o27k498o97K767K087k652k605J296J769J136j466k526
3255b105k62M131P92l657j382J747J995K67k208k827K002L857q50l638m02K440
3271a00J782j10l159j814L730K864k585l084R59K622J270j553l071QM427J039
$$ plain form
3287 3225 -485 -2432 -214 2278 2273 -179 -2802 -195 3415 2272 -2178 -2146 965 2692 1462 -1721
3303 -1721 -2277 1194 3543 212 -3160 -1114 1902 2100 -361 -3054 -2022 2141 2400 -1796 -3255 -239
3319 -239 2060 1055 -1809 -3012 -476 2993 1183 -3025 -2474 1568 2302 508 -2319 -2092 1301 3190
3335 3190 -71 -3253 -684 2251 1848 -383 -2369 -487 2402 2601 -1098 -2630 782 2658 1549
3350 1549 -970 -1681 231 3079 1417 -2153 -2029 1228 1689 239 -1400 -1592 824 2494 146 -2698
3366 -2698 -977 1197 969 -647 -1554 -1406 1225 1389 -1349 -2236 265 1540 145 -968 -1715 -426
3382 -426 1608 925 -1992 -1729 1108 1582 -150 -1213 -1378 482 2180 215 -2165 -545 1781 1700 -66
3399 -66 -1378 -597 1636 2419 -526 -1922 342 2157 1496 -359 -1668 -283 2423 2051 -1356 -1972 670
$$ packed form
3287C225l710j947K218K492nk452k623K607L610j143m450L2L111J727j230l183
3303a721n56L471K349l331l372K046L016J98k461k693J032M163K59m196j459L016
3319b39K299j005k864j203K536L469j810m208N51M042P34j794k827K27L393J889
3335C190l261l182K569K935m03k231j986J882K889J99l699j532L412J876j109
3350A549k519p11J912K848j662l570J24L257M61j450j639j92K416J670k348k844
3366b698J721K174k28j616r07J48K631J64k738q87K501J275j395j113p47J289
3382d26K034o83k917K63K837M74j732j063j65J860J698j965k380J620K326q1j766
3399f6j312P81K233P83k945j396K264J815o61j855j309J385K706l72l407o16K642
$$ plain form
3416 670 2015 660 -1228 -1962 -169 2239 551 -2458 -1934 1213 1577 -26 -1749 -2104 844 2447
3432 2447 -491 -2870 -1035 1729 1315 -814 -2475 -935 2094 1925 -1450 -2723 427 2554 827
3447 827 -1216 -1703 519 2618 1183 -2417 -1311 2169 2387 -12 -1297 -1060 1749 2914 -215 -2482
3463 -2482 -118 2732 1719 -1181 -1725 81 2217 1469 -1943 -2384 1186 2946 110 -1970 -1515 678
3479 678 2344 -124 -2919 -1637 1842 1686 -1162 -2383 -868 1471 1633 -1315 -3115 -306 2419 760
3495 760 -1642 -1957 113 1849 1326 -2057 -2124 1360 2196 -44 -1432 -959 888 2572 660 -1830 -654
3512 -654 2250 1693 -710 -1385 -46 1326 1738 -420 -1911 307 2013 1047 -1378 -1172 202 1361
3528 1361 924 -1528 -1540 627 1818 -184 -2009 -972 117 1264 485 -1660 -1396 1238 1057 -961
$$ packed form
3416F70J345j355j888p34J793K408j688l009N24L147L64j603j723l55K948J603
3432B447k938k379J835K764m14k129j661J540L029j69l375j273L150K127j727
3447H27k043m87K222K099j435l600J106L480K18k399j285K37K809J165l129k267
3463b482K364K850j013k900n44J806K136p48l412m41L570J760k836k080M55K193
3479F78J666k468k795J282L479j56k848j221J515K339J62k948j800K809K725j659
3495G60k402l15K070J736n23l383o7L484Q36k240j388M73J847J684j912k490J176
3512f54K904n57k403o75J339J372M12k158j491K218J706r66k425K06J374J159
3528A361m37k452j2K167J191k002j825J037J089J147p79k145K64K634j81k018
$$ plain form
3544 -961 -1692 -801 425 1132 -199 -2238 -792 1650 940 -972 -1202 -213 1105 1244 -1038 -2063 230
3561 230 2304 546 -973 -993 348 1960 810 -1341 -1389 1747 2502 78 -1103 -565 1187 2055 622
3578 622 -1717 -627 1977 1309 -1133 -1660 94 1209 1635 -1122 -2424 -169 2060 412 -1740 -1305
3594 -1305 202 1805 251 -2252 -2226 1183 2187 -577 -2385 -1147 981 1651 -506 -2820 -884 2143
3610 2143 1313 -1517 -2050 -75 1775 1343 -737 -2219 504 2756 673 -1681 -1087 1200 1955 861
3626 861 -1735 -1532 1735 2570 -424 -1785 -362 1162 1785 -286 -2004 -257 2249 1544 -1474 -1616
3642 -1616 489 1476 868 -1427 -2093 79 2079 -400 -2287 -982 744 1157 -303 -2039 -1219 1005
3658 1005 1658 -1108 -2136 -106 1740 385 -515 -1952 -382 2033 759 -1112 -1107 464 1264 615 -855
$$ packed form
3544i61p31Q91J226P07j331k039J446K442p10j912k30R89J318J39k282j025K293
3561B30K074j758j519k0J341J612j150k151m8L136P55k424j181N38J752Q68j433
3578F22k339J090K604o68k442n27J754J115M26k757j302K255K229j648k152M35
3594a305J507J603j554k503K6L409J004k764j808J238K128O70k157k314J936L027
3610B143q30k830n33J975J850m32k080j482K723K252k083k354N94K287P55j094
3626H61k596K03L267Q35k994j361J423J524O23k071j718J747K506p05l018j42
3642a616K105R87o08k295o66K172K000k479j887J305J726M13j460j736Q20K224
3658A005O53k766j028K030J846j355r00j437J570K415j274j871NJ571Q00o49j470
$$ plain form
3675 -855 -1030 785 2199 268 -1691 -595 1496 1361 366 -1086 -920 1449 2063 -118 -1455 49
3691 49 913 1220 -81 -1250 -921 1375 1074 -782 -1172 74 905 443 -477 -1659 -221 1380 756 -1085
3709 -1085 -1216 -374 279 382 -893 -1664 240 1445 -215 -1584 -756 491 985 295 -1157 -1183 966
3726 966 1441 -519 -1363 127 1278 1196 -65 -1289 -118 2090 1067 -1009 -1147 543 1209 651 -943
3743 -943 -1535 976 2126 315 -2177 -711 1307 1419 113 -1304 -1474 1138 1868 -1296 -1963 -11
3759 -11 1884 941 -1103 -1999 -577 1914 489 -1868 -2066 538 1280 409 -1460 -1915 762 2120 -18
3776 -18 -2052 -879 1624 1241 -35 -1110 -660 1584 1720 -943 -1875 556 1337 675 -481 -841 -64
3793 -64 1937 975 -1336 -783 1211 1640 353 -1135 -859 810 1881 222 -1899 -235 1509 623 -839
$$ packed form
3675h55j75J815J414j931j959J096K091j35r95j452J66K369O14k181j337J504
3691D9Q64L07j301j169L29K296l01j856l90J246Q31m62r20j182J438J601o24j841
3709a085j31Q42O53J03j275p71J904J205j660j369Q28J247M94o90j452k6K149
3726I66M75j960q44J490J151q2j261j224J171K208j023k076j38J690O66n58j594
3743i43n92K511J150j811k492J466K018J12j306j417j70K612P30l164o67J952
3759a1J895r43k044q96J422K491j425k357j98K604P42q71j869m55K677J358k138
3776a8k034J173K503l83j276j075M50K244J36k663r32K431P81o62j156l60P77
3793f4K001r62k311N53J994M29j287j488K76J669J071j659k121J664J744q86j462
$$ plain form
3810 -839 -1424 -241 1589 1205 -1672 -2256 197 1050 -80 -1152 -1002 168 1475 101 -1810 -1060 1117
3827 1117 1302 -620 -1551 -908 145 1376 -192 -1598 -170 1172 554 -457 -702 134 1081 1413 -267
3844 -267 -1260 375 1122 585 -534 -244 35 1332 565 -831 -457 863 1178 320 -257 -681 259 1027
3862 1027 422 -1095 132 885 504 -662 -535 -745 293 993 -583 -1746 -351 762 -94 -758 -423
3879 -423 -499 859 527 -1013 -1596 -237 880 199 -509 -1175 -516 1256 532 -999 -591 1025 1332 -77
3897 -77 -1061 -999 802 1872 459 -1100 -181 1325 972 -165 -1125 108 1667 1248 -1055 -1769 347
3914 347 1633 558 -541 -740 154 1193 575 -1782 -1417 1462 1075 -315 -1516 -915 828 1036 -512
3931 -512 -2036 -201 1508 560 -1144 -1349 -207 1317 704 -1640 -1509 791 1642 3 -1263 -613 613
$$ packed form
3810h39n85J183J830l84k877n84K453Q53j130j072J50J170J307j374j911P50K177
3827A117J85j922r31O43J053J231j568j406J428J342o18j011k45Q36R47L32j680
3844b67r93J635P47n37j119K90K79J297p67j396L74J320L15q58n77m24R40P68
3862A027o05j517J227P53l81j166J27k10J038P00j576j163J395J113q56o64L35
3879d23p6J358l32j540n83J359J117o81p08o66O59J772p24j531M08J616L07j409
3897g7r84O2J801J070j413j559R19J506l53j137r60J233J559m19k303p14K116
3914C47J286j075j099j99Q94J039o18k357L65K879l87j390j201O01J743K08j548
3931e12j524J835J709r48j704k05J142J524o13k344J31K300Q51j639j266O50J226
$$ plain form
3948 613 1645 -7 -1887 -617 1382 1285 -551 -870 -110 1517 1236 -352 -1208 475 1945 1069 -1163
3965 -1163 -636 443 1636 946 -887 -1311 902 1137 -141 -1285 -298 587 1176 -4 -1284 -657 588
3982 588 939 -641 -843 -377 223 178 -585 -1186 0 1084 113 -1001 -875 158 724 355 -875 -983
4000 -983 358 1139 -99 -910 100 624 476 239 -778 13 802 998 -234 -496 294 769 628 139
4018 139 -844 106 1661 266 -311 -364 556 556 384 -530 -997 417 1259 -301 -886 -479 269 647 443 -790
4038 -790 -1358 210 1000 -560 -727 -582 -43 732 -151 -1512 -745 1071 507 -788 -811 -35 315 627 -672
4057 -672 -1402 -238 834 425 -705 -337 199 627 772 -745 -970 634 1554 150 -851 -209 732 986
4075 986 78 -987 -137 833 815 -795 -667 79 1096 637 -587 -1588 -69 1531 335 -1176 -584
$$ packed form
3948F13J032j652j880J270J999r7j836l19P60J627k81j588q56J683J470q76k232
3965a163N27J079J193o90j833m24K213K35j278j144R87Q85N89j180j280O27J245
3982E88L51j580k02M66O00m5p63o01J186J084r71j114J26J033N66l69j230j08
4000i83J341P81j238q11J010N24j48k37j017P91P89J96j232k62P90M75j41m89
4018A39r83R50J555j395n77n3R20%j72r14m67J414Q42j560n85M07P48L78k04j233
4038g90n68J568P90j560j67J45N39P75q83j361P67J816n64j295k3P76L50L12j299
4057f72p30J164J072m09j130L68N36M28J45j517k25J604R20j404j001O42R41K54
4075I86r08j065Q50R70j8j610J28P46J017m59j224j001J519J600j196j511N92
$$ plain form
4092 -584 571 657 198 -1199 -1047 747 1239 -539 -1494 -393 596 470 -521 -1442 -486 1298 730 -899
4110 -899 -967 208 1081 727 -386 -1157 150 1396 9 -888 -328 649 842 204 -602 -535 990 1413 -181
4129 -181 -903 -208 736 403 82 -591 -104 1161 514 -1159 -717 555 822 255 -797 -741 -178 896 77
4148 77 -1228 -31 311 169 -165 -633 -748 453 954 -428 -1029 43 413 -55 -168 -670 -375 938
4166 938 374 -776 -513 -22 692 342 -427 -416 -135 1106 152 -769 -374 644 665 314 -441 -742 457
4185 457 1035 295 -682 55 610 696 -29 -443 -363 498 1018 -502 -636 -37 387 120 -149 -653 -172 625
4205 625 358 -799 -927 302 561 293 -302 -781 -434 602 -209 -1269 -551 443 236 129 -793 -593 713
4224 713 672 -613 -1009 -19 526 48 -445 -529 34 1300 546 -866 -761 630 924 245 -425 -459 732
$$ packed form
4092e84J155Q6m59j397J52J794M92j778r55J101R89j26r91r21R56J784n68j629
4110h99o8J175Q73l54j113p71J307J246j387q97N60R77J93o38q06O7J525M23j594
4129a81p22O95R44l33l21o73M87J265o47j673M42J272K67n67j052N6N63J074q19
4148G7j305J197L42j42l34m68j15J201N01j382o01J072L70m68j13n02K95J313
4166I38n64j150K63M91P14l50p69J1K81J241r54r21L95J018K1l51p55l01J199
4185D57N78p40r77P37N55Q6p25m14Q0Q61N20j520j34N99M24k67k69n04M81P97
4205F25k67j157j28J229K59k68n95m79L47J036q11j060P18R94k07j07r22K00J306
4224G13m1j285l96R90N45m78m93q4N63J266p54j412J05J391K94o79o70l4J191
$$ plain form
4243 732 1406 4 -1233 -71 1054 718 -348 -982 -328 823 1199 -663 -1160 154 529 -169 -688
4260 -688 -811 -66 866 301 -1289 -1133 363 617 -215 -744 -429 254 728 -319 -1065 -335 891 60 -712
4279 -712 -732 -180 578 455 -269 -785 589 648 -15 -444 -408 212 904 487 -687 -490 944 559 -127 -362
4299 -362 -119 402 862 67 -965 184 791 448 -264 -116 -341 197 345 -288 -799 -122 471 -113 -486
4318 -486 -362 -258 321 582 -698 -795 271 210 -317 -446 -240 -89 382 -45 -948 -598 396 462 165 114 -356
4339 -356 237 563 127 -668 122 949 232 -237 79 -170 405 570 -309 -803 394 1162 -2 -280 -473
4358 -473 9 884 407 -788 -610 358 695 -12 -501 -334 323 745 -325 -1201 -362 845 66 -706 -709 -255
4378 -255 584 459 -889 -1249 242 841 -27 -739 -740 231 778 233 -951 -473 882 820 -244 -693 -187
$$ packed form
4243G32O74j402j237J162J125l36j066o34O54J151L76j862m97J314L75o98n19
4260f88j23P45R32n65j590J56J496K54q32n29L15O83M74j047p46P30J226q31p72
4279g12k0N52P58j23p24n16J374N9o63m29L6O20O92m17j174J97J434l85o86k35
4299c62K43N21M60p95j032J149O07l43p12J48k25N38J48o33n11O77N93n84l73
4318d86J24J04N79K61j280r7J066o1n27j29K06J51M71m27r03L50R94O6k97n1m70
4339c56N93L26m36p95P90Q27p17m69L16k49N75J65q79m94J197P68j164k78j93
4358d73M82Q75m77j195J78R68L37p07m89J67O57M22j070q76Q39J207p79p72lM54
4378b55Q39j25j348l60J491N99q68p12jR71N47n45j184M78J355o2j064m49N06
$$ plain form
4397 -187 441 765 135 -1021 -254 857 646 -588 -211 104 733 644 -543 -773 501 968 -56 -583
4415 -583 -73 366 561 271 -669 -169 976 648 -734 -524 230 368 480 -341 -688 -199 571 -126 -893
4434 -893 -516 84 432 -343 -894 -742 328 696 -461 -964 -439 -9 145 166 -766 -494 730 617 -292
4453 -292 -450 -20 583 400 140 -517 33 759 134 -373 111 270 335 526 -201 -702 279 1032 93 -438
4473 -438 71 73 92 248 -378 -658 186 457 -461 -405 81 -97 234 51 -378 -777 85 -23 -250 -369 -134
4494 -134 -10 443 -185 -694 -223 620 371 -264 -70 -44 514 476 -208 -503 227 1022 31 -315 -19 121 893
4515 893 268 -433 -271 973 303 24 -476 323 372 501 -48 -845 74 1025 201 -534 -13 -69 534 498 -431
4536 -431 -1075 80 767 -182 -848 -330 183 293 196 -868 -901 669 176 -519 -637 141 8 555 -149 -1017
$$ packed form
4397a87O28L24o30j156P67J111k11j234L77L15O29q9j187k30J274M67j024n27
4415e83N10M39J95k90r40N00J145l28j382K10P54J38J12q21l47M89P70o97p67
4434h93L77O00L48p75n51J52J070L68j157n03N25M30J54K1r32K72J224j13r09
4453b92j58M30O03j83k60o57N50P26o25n07M84J59O5J91p27n01R81P53r39n31
4473d38N09KJ9J56o26k80Q44K71r18N6M86j78L31j83m29l99Q62j08k27j19K35
4494a34J24M53o28n09M71Q43k49o35J94K6N58l8o84k95P30P95r91l46K96J40P72
4515H93o25p01J62J244o70k79n00P99M9J29n49p97R19R51q24p35N21n6O03l6r29
4536d31o44J155O87r49o66N18N13J10r7j064l3J570m93o95j18P78j33N47p04q68
$$ plain form
4556 -1017 -86 1105 167 -1115 -209 518 578 215 -374 -538 458 999 -155 -820 125 630 513 -14 -551
4575 -551 -273 988 872 -517 -174 525 714 281 -314 -594 49 746 173 -483 -326 587 295 -168 -563
4594 -563 -607 2 440 -153 -856 5 206 330 71 -396 -676 428 352 -895 -743 130 229 -115 2 -247
4614 -247 -135 576 228 -585 -251 7 200 17 -255 -280 327 616 354 -248 38 462 -144 397 -78 -48 577
4635 577 625 -25 -463 166 113 116 106 -79 -390 278 393 -416 -34 133 187 -71 -5 -435 -67 645 -160 -1193
4657 -1193 -99 348 59 -319 -359 -573 168 348 -143 -598 72 130 -17 329 -316 -495 498 926 -176 -268
4677 -268 563 273 473 7 -419 -168 922 763 -485 -331 465 544 339 -260 -778 324 778 77 -765
4696 -765 -264 344 -6 -200 -699 -327 201 464 -600 -476 169 145 226 -376 -483 -226 792 -165 -735 -242
$$ packed form
4556a017R31J191r38j282R06P27O0l63n89j64R96N41j154o65R45N05j17n27n37
4575e51K78J261j16j389L43O99J89m33n95k80O43O97n73o56J57R13k92m63l95
4594e63m4O09M38n93p03Q61K01J24k59m67k80J104p6j247J52Q73R9l44J17k49
4614b47J12P11l48q13L34K58J93j83k72k5O07K89k62o02K86M24o06N41m75L0O25
4635E77M8o50m38O29n3Lj0j85l11O68J15q09L82J67N4k58O6m30L68P12q05j033
4657a193J094M47k89l78m0k14P41J80m91m55O70N8j47L46o45j79R93M28j102r2
4677b68Q31k90K00m66m26K51J090j59j248J54P96P9k05n99n18J102M54p01q42
4696g65N01O08l50j94m99L72N28K63j064J24O45k4Q1o02j07K57J018r57n70M93
$$ plain form
4716 -242 559 189 -310 -489 -302 280 562 -408 -904 54 257 -83 -46 -266 -77 145 503 -171 -315 467
4736 467 623 321 -73 -303 210 746 215 -643 112 508 572 23 -184 -18 164 616 -358 -387 96 82 47
4757 47 -113 -39 -23 446 379 -487 -449 -50 322 -198 -325 -91 -128 477 -65 -558 -588 206 -167 -296 -139 -256
4779 -256 -145 267 -91 -499 132 243 -78 -181 120 -147 282 571 -20 -256 317 492 8 140 -275 -20
4799 -20 498 762 -376 -155 452 231 240 207 -207 -17 487 235 -803 -153 388 502 301 -344 -322 150 473
4820 473 -151 -502 -142 39 -172 -345 -212 -340 218 222 -467 -611 191 183 -69 -507 -585 -366 379 193 -798 -210
4842 -210 239 366 -236 -225 166 158 673 0 -538 349 662 490 -245 -175 -265 262 449 -300 -480 709 596
4863 596 -278 -128 112 348 282 73 -528 -532 250 37 -248 -52 -19 19 388 -273 -875 -407 587 149 -360 -217
$$ packed form
4716b42Q01l70m99j79J87N82K82r70m96R58K03l40L7k20J89K22L58o74j44P82
4736D67J56l02l94k30N13N36n31q58P55L96O4n49k07J66J82M52r74k9M83j4l5
4757D7j60P4J6M69o7q66L8L99L72n20j27K34l7O05n42m93l0P94l73j29J57j17
4779b56J11M12l58m08O31J11l21j03L01k67M29K89n91k36N73J75m84J32m15K55
4799b0N18K64j138K21O07k21Rl3m14J90N04k52j038O50N41J14k01o45K2M72L23
4820D73o24l51L60J81k11j73J33j28N58Mo89j44Q02qk52m38p8K19P45j86r91N88
4842b10M49J27o02J1L91qN15o73n38Q87L13j72p35P0r0N27J87p49j80J189j13
4863E96q74J50K40K36o6k09o01mP82k13k85J96L3L8L69o61o02M68R94m38n09J43
$$ plain form
4885 -217 -34 299 190 -347 -320 199 526 -250 -265 4 0 594 176 -263 -153 259 -2 -130 -150 -110 62 143
4907 143 200 -460 253 650 221 155 -217 197 285 446 -302 -157 261 558 -583 -506 52 109 378 -55 -261
4928 -261 -199 388 -191 -333 -217 -281 -226 73 -164 -472 -238 312 -85 -110 -137 131 -7 320 8 -362 305 1008
4950 1008 -149 -184 -358 -199 329 218 -232 -248 251 319 -127 -195 -74 54 475 227 -552 -182 706 608 -147
4971 -147 -156 49 165 408 -59 -111 110 569 67 -389 -325 -58 31 206 -395 -427 81 367 -323 -310 -216 -198 269
4994 269 371 -597 -568 357 20 -562 -297 -45 -15 305 192 -728 71 365 132 -359 -185 37 436 280 -474
5015 -474 -166 351 445 128 -232 -182 208 735 418 -360 -5 591 383 -439 -237 156 172 272 -56 -549 23
5036 23 794 306 -291 -430 147 88 284 -642 -572 287 448 -391 -593 -61 -50 116 -112 -408 -343 454 61 -264
$$ packed form
4885b17J83L33j09n37K7N19L27p76j5K69mN94m18m39J10M12k61j28k0M0J72Q1
4907A43N7o60P13L97m29o6l72M14Q8J61p48J45M18K97j141P7N58N7K69m33k06
4928b61O2N87n79j42J16o4N5K99k37l08K34N50l97k5k7K68j38L27l12l70O67P03
4950A008j157l5j74J59N28j11m50j6M99O8m46o8J21J28M21k48p79L70Q88r8p55
4971a47rK05J16K43m67n2K21M59n02m56O4K67Q9J75o01l2N08K86o90J3R4J8M67
4994B69J02r68K9R25l37n82K65K52L0L20j13r20P99K94k33m91J74K22L99j56p54
5015d74L08N17R4l17l60N0L90N27l17p78L55N96k08q22K02L93J6J00l28m93N72
5036B3P71m88n97j39N77n9J96r26P0Q59J61q39k02N32J1J66k28k96O5P97l93l25
$$ plain form
5058 -264 -270 310 114 -111 -164 -708 92 490 -15 -103 160 262 154 269 -145 -116 317 651 12 157 327 -84
5080 -84 -23 303 -69 -130 452 284 -168 -162 94 63 371 -44 -323 -176 -54 163 -406 -582 -5 19 -109 -370
5102 -370 -430 -292 309 193 -295 -244 -54 -50 185 -120 -315 34 546 -581 -512 277 -117 317 16 -93 -429
5123 -429 487 498 -518 -264 -9 205 194 -197 -437 102 691 164 -308 1 167 40 360 -4 -294 652
5143 652 476 -418 -379 -82 91 400 -100 -570 -494 238 199 -220 -670 -100 155 272 -31 -488 -215 538 296
5164 296 -512 -331 612 294 -110 -121 -197 318 327 -70 -152 -296 360 160 16 -533 161 603 166 -364 -102 443
5186 443 220 234 49 -224 64 721 -76 -443 216 449 -79 70 -172 128 183 280 -101 -343 272 245 -160
5207 -160 -110 63 -181 187 4 -469 -436 152 62 -71 -336 -152 140 317 -147 -392 -105 286 172 -114 -16
$$ packed form
5058b64oN80j96k25n3n44Q00L98n05q8K63J02j08J15m14K9M33L34o39J45J70m11
5080h4O1L26l72o1N82j68m52OK56l1L08m15k79J47J22K17n69j76N77K4j28k61
5102c70o0J38O01j16m88N1J90MK35l05j95L49N12j127O9P89l94M34l01j09l36
5123d29R16J1j016K54K55K14j1l91k40N39N89n27m72L09J66j27L20l64k90R46
5143F52j76q94L9K97J73L09n00m70P6P32l9m19m50N70K55J17l03m57K73P53k42
5164B96q08J81R43l18m04j1p6N15Rl97q2j44O56k00j44n49O94M42m37n30K62N45
5186D43k23J4j85k73K88O57p97l67O59K33n28J49k42L00N5R7l81k42O15k7m05
5207a60N0J73k44L68j83m73L3N88r0j33k65J84K92J77m64k45K87L91j14k86R8
$$ plain form
5228 -16 -351 165 456 20 -409 255 144 -81 -76 -436 -4 408 633 175 -252 175 114 9 175 -64 -85 298
5250 298 318 -491 -44 376 -5 276 117 -232 -9 471 14 -113 -10 189 138 19 -308 -230 -155 319 -65
5271 -65 -341 72 55 114 36 -352 -195 468 356 -308 -427 165 235 -245 56 -97 146 395 -242 -503 -75 207
5293 207 489 -27 -63 37 247 444 -266 -286 150 433 447 -27 -157 -133 340 411 -234 -401 276 363 -13 -207
5315 -207 -115 -52 472 -69 -631 -224 -155 362 -5 -309 -265 -19 479 -187 -367 47 261 -308 -469 -337 -283 205
5337 205 172 -549 -504 206 136 194 -354 -56 90 272 34 -361 -136 475 437 -101 -255 -165 227 515 126 -43
5359 -43 77 431 156 -111 -173 -105 161 387 -98 -125 360 399 -208 -250 -105 185 316 15 -458 -279 477 83
5381 83 -157 -444 -303 141 245 -54 -465 74 444 69 -139 -129 -298 84 198 -287 -347 87 240 208 -152
$$ packed form
5228a6l35N16K91m36m29O64j11k25Nl60M32M12K25m58m27M27o1j05J66k39k1L83
5250B98K0q09M47M20l81K81j59l49K23M80m57j27J03J99n1j19l27P8P5M74l84
5271f5k76M13j7N9p8l88J57O63j12o64j19N92P0m80L01j53K43K49o37k61M28K82
5293B07K82n16l6J00K10J97p10k0M36K83J4m74j30K4M73P1o45j67O77Q7l76j94
5315b07R2O3N24n41n62M07O9N17l67l04M4K46M98o66j80M14K14n69j61J32N4M88
5337B05l3p21M5P10p0N8n48K98J46J82k38l95K25O11l8n38j54R0L92K88l89j69
5359d3J20L54k75k67o2O8K66K26m85k7M85L9o07m2J45K90J31l01m73J79P56l94
5381H3k40k87J41M44J04k99m11N39L70l75k08J0j69L82J14m85o0M34J53l2l60
$$ plain form
5402 -152 85 -187 40 451 -102 -311 250 124 -30 -71 -180 50 286 233 -468 171 156 61 -79 -140 100 255
5424 255 745 -414 -274 -41 169 -177 -661 -24 -127 71 -65 -304 -378 279 266 -40 -314 -338 -131 373 -122
5445 -122 -519 -362 257 360 -243 -230 -160 336 121 -329 -442 122 708 114 -155 -100 38 282 634 -289 -370
5466 -370 23 398 -83 -256 -231 275 231 -72 -249 -80 783 300 -356 -242 349 364 16 -209 -540 186 580
5487 580 -170 -559 55 311 -157 2 -349 -305 205 304 -412 -462 -147 43 253 124 -375 -421 391 111 -384
5508 -384 -372 121 396 306 -180 -302 -192 445 86 -338 -115 449 -6 -33 -274 -240 277 342 170 -120 23 190
5530 190 91 213 -419 -483 359 186 -239 -80 212 -115 -41 -171 -403 -52 343 123 -212 -137 -60 94 182 -28
5552 -28 -464 247 437 -306 -410 101 419 120 23 -16 6 194 333 -364 -387 53 23 -16 1 37 -367 438 74
$$ packed form
5402a52K37k72K27M11n53k09N61j26j54m1j09K30K36n3p01O39j5r5j40o1K40J55
5424B55M90j159J40K33K10l46m84O37j03J98j36k39p4O57j3l06k74k4K07N04m95
5445a22l97J57O19J03o03J3P0M96k15m50j13N64N86n94k69N5J38K44L52r23q1
5466c70L93L75m81j73K5N06m4l03j77J69Q63m83o56J14N91J5l48k25l31P26L94
5487E80p50l89O14K56m68J59l51M4N10R9p16n0L15J90K10j29m99m6Q12k80m95
5508c84J2M93K75r0m86j22J10O37l59m24K23N64m55k7k41L4N17O5j72k90J43J67
5530A90r9J22o32o4Q42j73m25J59K92l27P4j30k32L51L95k20l35P5P7J54Q8k10
5552b8m36P11J90p43j04N11L18k99r7l9K2J88J39o97k3M40l0l9J7L6m04Q05l64
$$ plain form
5575 74 -66 -276 14 82 201 79 -492 236 348 -96 -273 100 318 335 164 113 -212 254 371 -303 -391 70
5597 70 202 76 -141 -358 -82 353 113 -330 -343 -30 -53 15 -283 -287 2 463 -31 -690 -217 124 472 248
5619 248 -357 -344 43 366 -335 -329 -35 321 54 88 -445 -27 698 118 -217 -87 357 515 110 39 -270 266
5641 266 588 139 -401 -152 319 458 -86 -238 54 441 394 -334 -476 -16 -58 193 -284 -603 -193 410 282
5662 282 -615 -182 343 -124 -205 -449 -546 -297 401 105 -648 -89 -109 10 -397 -368 -409 338 215 -104 -484 -38
5684 -38 109 233 51 -359 -133 574 357 -44 -110 -119 252 7 -46 -220 -89 327 -2 -370 -126 294 260 210
5706 210 -195 96 424 40 -275 -408 -64 212 11 -324 -152 -107 -30 325 -282 -511 82 1 194 -72 -161
5727 -161 -51 411 220 -300 -266 125 152 71 -223 -233 -249 450 235 -366 15 104 448 34 -32 -94 335 708 46
$$ packed form
5575G4j40k10K90O8J19j22n71P28J12m44j77L73K18J7j71n1l25M66J17o74q8M61
5597G0J32j26k17k17K76M35k40m43j3L13k3O8k98mK89M61m94o59M73L41L48k24
5619B48o05J3L87L23p01OK94L56k67L4n33M18P25n80l35J30M44J58m05p1l09N36
5641B66L22m49n40K49M71J39n44j52K92L87m7p28j42M60m2K51m77l19M10O03j28
5662B82q97M33N25m67q1k44r7K49O98k96p53N59k0J19m07K9m1P47j23l19l80M46
5684c8J47J24j82m10K26P07k17m01o6rL71k45n3j74J31M16l29l68K44M20l4n0
5706B10m05K91L28l84l15j33L44K76k01l35J72M5P7L55o07k29N93q1J93k66q9
5727a61J10M62j91n20L4L91K7q1k94j0j6O99k15o01L81Q9L44m14o6o2M29L73o62
$$ plain form
5750 46 -227 84 215 340 -142 -383 -178 395 362 -439 -227 412 114 -21 -97 -278 -49 437 249 -729 -96
5771 -96 209 230 -177 -202 -418 -15 406 -343 -351 307 335 43 -353 -153 -166 463 326 -233 -85 241 265 -13 -67
5794 -67 -248 104 335 378 -346 184 307 214 -164 -306 -9 329 245 -217 -374 147 280 225 -35 -732 -14 390
5816 390 -21 -670 -188 101 379 -59 -165 -236 -64 -151 13 -483 -192 424 191 -94 -192 107 389 140 -226
5837 -226 -213 -38 176 -140 99 -150 85 140 -40 -234 -12 352 493 -101 -255 -69 223 657 -145 -186 -57
5858 -57 466 269 -226 36 48 229 329 -151 -147 135 520 -170 -301 89 -225 304 213 -112 -66 269 38 -37
5880 -37 -144 -386 -8 190 -12 -274 -331 374 220 95 104 -217 129 87 -143 -398 -37 318 219 123 -194 -62
5902 -62 211 -159 -206 -313 489 275 -309 -228 -109 186 273 145 -383 65 345 56 -220 -326 -124 243 273 -30
$$ packed form
5750D6k73L11J31J25m82k41K05N73l3q01K12O39k98j35p6j81K29M86j88r78O33
5771i6L05K1m07k5k16M03M21p49qO58K8k92l96K00j3O29j37n59J48L26K4k78n4
5794f7j81L52K31M3p24N30J23r3l78j42K97L38q4m62j57N21J33n5k60o97P18M04
5816C90m11o49M82K89K78m38j06p1J72q7J64m96K91O16k33k85r8K99K82k49l66
5837b26J3J75K14l16K39k49K35N5j80j94K22L64J41n94j54J86K92M34q02m1J29
5858e7N23j97m95K62J2J81J00m80MK82L85o90j31L90l14N29r1l25M6L35k31p5
5880c7j07k42L78J98k02k62n7P05j54j25Rl21L46m2k30k55L61L55r9r6l17J32
5902f2K73l70m7j07Q02k14n84Q1J19K95Q7j28n28M48K80k89k76j06K02L67L0l03
$$ plain form
5924 -30 -400 14 406 8 -168 -142 138 97 247 -337 -537 199 700 113 -133 -150 99 79 41 3 12 501 611
5947 611 -297 -289 -133 94 96 -184 -494 -194 201 308 -36 117 88 140 489 -38 -274 -287 477 -221 -365 -1
5969 -1 -97 -28 39 -225 -273 51 503 71 -102 73 4 164 138 -322 95 613 136 -501 38 429 -23 244 -8
5992 -8 -622 281 142 56 -111 -358 10 291 44 45 -231 31 89 62 -35 -93 -46 193 -90 -211 -14 -97 258 -149
6016 -149 -115 -5 -9 117 -141 -262 -34 358 -124 -242 -37 99 344 147 -47 6 475 724 35 -101 -254
6037 -254 -252 55 149 -357 -148 -19 464 -34 -443 88 384 -88 -11 -13 -265 258 -8 -589 -245 34 217 -170
6059 -170 -388 -471 -181 419 -334 -416 -10 331 4 166 -355 197 537 192 -176 -257 -61 309 156 175 -217
6080 -217 13 407 214 32 -191 284 530 243 0 -322 14 572 145 -360 -165 274 106 -46 -367 -36
$$ packed form
5924c0l70M14L92l98j76K6K80m1J50n84k00P36N01n87k46j7K49k0l8l8RM89J10
5947F11r08QJ56K27Kk80l10L00L95J07l44J53k9N2L49n27k36j3P64o98j44L64
5969ar6O9O7k64m8L24M52m32j73J75o9J60k6m60M17N18m77o37N39L91m52K67k52
5992ho14R03j39q6j67k47L68K81k47Jk76K62N8k7r7n8M7K39k83j21J97q3L55m07
6016a49L4J10mJ26k58j21K28L92m82j18K05J36K45j97j94N3M69K49o89j36j53
6037b54KL07R4n06K09J29M83m98m09N31K96m72P7kk52N23k66n81L44K79J83l87
6059a70k18q3K90O00p53q2M06L41l27J62n21N52L40l45l68q1J96L70j53J9l92
6080b17K30L94j93j82k23M75K46k87k43l22L36N58m27n05J95M39j68j52l21L31
$$ plain form
6100 -36 414 149 -194 -106 -46 114 90 -206 -495 -139 382 188 -209 -63 13 36 -193 -263 -126 26 276 140
6122 140 -387 17 371 11 -285 -67 -296 115 593 -311 -25 10 334 420 130 -233 -36 247 -20 -211 -205
6143 -205 163 190 55 24 -187 32 10 -236 -397 -84 356 -71 -7 -226 -396 72 171 -353 -287 13 64 79 -123
6166 -123 -393 -44 -40 170 -300 -69 -3 -135 57 -172 -156 100 217 295 -95 -51 353 227 -150 -53 -74 515 521
6189 521 -10 -188 95 494 260 75 -199 67 72 82 -94 -25 479 -1 298 13 -7 -53 341 206 -455 -215
6211 -215 121 -136 -257 -316 -379 175 273 5 -271 148 -27 87 -199 -147 -41 233 -254 -178 -292 51 109 -17
6233 -17 -204 -91 90 259 -54 -343 -174 53 39 147 -328 -565 582 316 -52 -536 45 317 257 -210 -363
6254 -363 -240 553 213 -254 -52 505 302 -56 -40 -177 -7 424 -107 -213 -119 362 478 -446 -183 -108 193
$$ packed form
6100c6M50k65l43Q8O0J60k4k96k89L56N21j94l97J46P6K3k29p0J37J52K50j36
6122A40n27M04L54l60k96K18k29M11M78r04K86L5L24Q6k90l63J97K83k67j91O
6143b05L68K7j35l1k11K19k2k46j61L13M40m27O4k19j70M68R9n24O6L00N1J5k02
6166a23k70L49MK10m70K31O6j32J92k29J6K56J17P8l90M4M04j26l77R7k1N89O
6189E21n31j78K83L99k34j85k74K66NJ0j76O9N04m80K99k85k0m6L94j35o61K40
6211b15L36k57j21n9o3N54R8k68k76M19j75J14k86N2J06K74m87P6j14L43N8j26
6233a7j87J13J81J69l13k89J69K27j4J08m75k37J147k66l68m84N81K72o0m67j53
6254c63J23P93l40m67K02N57k03l58J6j37J70M31n31j06R4M81J16r24K63P5L01
$$ plain form
6275 193 329 -228 -523 -93 118 19 -142 -331 -146 338 235 -404 -447 212 287 -307 -236 -186 -37 5 10 -291 12
6298 12 342 178 -53 61 -26 220 406 -237 -294 4 240 287 -67 111 -18 -65 339 -159 -328 327 239 31
6320 31 -265 -174 331 138 161 17 -182 363 371 -188 -351 -49 260 -188 -134 -634 -80 113 -220 -154 177 -71
6342 -71 462 -89 -246 -202 68 177 18 -81 -92 -101 -15 148 -199 -352 288 171 87 -359 24 160 536 62 156
6365 156 -129 265 129 33 -383 10 131 255 132 -5 289 457 -31 -420 -31 188 193 70 -189 -374 261
6386 261 -40 -72 -222 -108 -9 -80 -49 -329 -84 90 138 -255 -124 -79 230 -257 -239 -191 239 74 -20 -135 -292
6409 -292 77 259 75 -140 -357 121 379 1 221 218 55 523 8 -488 -93 405 110 -250 24 63 445
6430 445 249 -228 -231 17 -46 -33 -340 -314 155 367 -105 -368 -339 -47 -100 -290 -205 -131 -99 243 6 -148 -129 83
$$ packed form
6275A93J36n57k95M30K11r9j61j89J85M84j03o39m3O59P5n94P1N0J49M2Nl01L03
6298A2L30j64k31J14q7K46J86o43n7K98K36M7l54J78j29m7M04m98j69O55q8k08
6320C1k96R1N05j93K3j44j99N45Qn59j63L02L09m48N4n00N54J93l33O6L31k48
6342g1N33n51j57M4K70J09j59r9j1rQ6J63l47j53O40j17q4m46L83J36L76m74R4
6365A56k85L94j36r6m16L93J21J24j23j37K94J68m88l89L89K19Nj23k59j85O35
6386B61l01l2j50J14R9p1L1k80K45J74M8l93J31M5L09m87J8M8M30j65r4j15j57
6409b92L69J82j84k15k17M78K58l78K20lj63M68n15m96L95M98k95l60K74L9L82
6430D45j96m77lK48o3J3l07K6M69K12m72k63K9K92n3j90Q5P4L2L42k37j54J9K12
$$ plain form
6454 83 193 -262 -206 132 642 333 -271 -281 138 305 21 -74 -11 249 93 98 -162 16 451 309 10 306
6476 306 127 48 350 -52 -50 190 104 276 -254 -118 310 214 210 89 -65 193 36 46 -237 34 -62 65 33
6499 33 147 -476 246 -140 53 -2 134 6 160 -159 -90 -12 160 327 -438 -327 56 -6 129 6 -407 -77
6521 -77 422 4 -343 0 489 268 60 -29 -72 252 562 -259 -348 134 228 215 150 -296 131 9 196 -161
6543 -161 -254 95 41 194 -14 -436 -66 4 14 -173 61 281 -24 50 -119 -207 40 247 32 -388 63 471
6565 471 -51 34 -101 -319 43 41 -84 -142 42 252 11 -114 29 -136 309 189 -234 74 319 383 -285 61
6587 61 36 259 400 -212 -62 -148 256 2 -279 155 -40 8 129 -243 -389 -186 -67 -78 -363 -437 104 -27
6609 -27 -258 -309 -405 130 262 -58 -136 -189 9 236 72 -432 -36 348 -170 -261 -305 -39 19 88 -363 -51 90
$$ packed form
6454H3J10m55N6L38N10l09o04j0M19J67k84r5O3K60j56Nk60J78M35j42k99K96
6476C06j79p9L02m02KK40q6J72n30J36M28r6mj21j54K58j57J0k83K71r6J27l2
6499C3J14o23P22l86J93n5J36j28J54l19O9P8J72J67p65J11L83o2J35j23m13L30
6521g7M99m18l47L43M89k21k08q9m3L24L10q21q9M82R4j3o5m46M27j22J87l57
6543a61r3L49n4J53k08m22L70P0J0j87K34K20l05P4j69q8K47K07k15m20M51M08
6565D71n22Q5j35k18L62kj25n8J84K10k41j25J43j65M45j20m23L08K45O4o68L46
6587F1k5K23J41o12J50q6M04k54k81M34j95M8J21l72j46K03J19j1k85p4N41j31
6609b7k31n1r6N35J32l20p8n3J98K27j64n04L96L84n18r1m4K66N8O9m51L12J41
$$ plain form
6632 90 173 147 -226 -58 200 33 145 -30 -58 76 120 43 -280 56 123 133 -161 -183 30 237 57 -186 13
6655 13 49 60 341 -176 -215 -92 205 178 -98 -36 177 235 -118 -224 -36 122 199 -11 -444 -26 75 182 202
6678 202 -304 -96 61 -156 -171 14 -372 232 141 -159 -330 10 140 226 -2 110 -47 320 44 -234 -147
6699 -147 117 341 5 63 61 218 283 43 -444 23 247 54 -212 -36 251 79 110 -119 -562 80 -57 219
6721 219 -242 -124 -30 262 69 123 -111 -141 77 -378 -140 -181 244 164 242 -71 -153 278 54 6 -204 311 297
6744 297 196 96 152 26 -168 -211 -79 17 222 144 -87 -135 -120 237 339 -36 -4 -232 2 23 270 -150 -203
6767 -203 198 -128 -145 -205 -179 -58 24 10 -215 153 126 -428 245 -64 -250 345 113 -68 -335 -97 31 209
6789 209 -120 -283 31 32 -214 -307 -113 211 -19 -330 -38 157 22 -227 -84 31 -37 -67 316 96 -85 -75
$$ packed form
6632I0Q3k6l73J68K58j67J12j75k8J34M4p7l23L36O7J0k94k2K13K07j80k43J99
6655A3L6J1K81n17l9J23K97k7k76O2K13N8l53j06J88J58P7k10m33M18J01J07K0
6678B02n06K08J57k17j5J85l86O04r1l00j71L40J30Q6k28J12j57L67k76k78Q7
6699a47K64K24l36N8kJ57O5k40m87M67K24j93k66J76K87j72L1k29m43O42j37K76
6721B19m61J18R4K92j93N4k34l0K18m55K38m1M25q0P8l13q2M31k24m8k10N15j4
6744B97j01j00N6j26j94m3J32R6K05p8k31m8J5L57J02l75L2k28K34K1K47m20n3
6767b03M01l26j7o0K6J21Q2j4k25L68k7n54O73l09j86N95k32j81k67K38J28J78
6789B09l29j63L14Jk46r3J94L24k30l11K92J95j35k49J43J15o8l0L83k20j81J0
$$ plain form
6811 -75 -130 491 -44 -463 244 228 -149 -199 51 187 320 127 -12 -292 23 -32 26 -164 -214 481 -73 -6 -162
6834 -162 -9 63 160 -174 -270 146 50 17 -31 -109 134 38 -345 -167 -274 102 225 236 -152 -123 199 167 85 -162
6858 -162 240 59 172 -88 61 10 293 127 -164 -209 -19 55 -191 -247 -241 122 428 -48 -130 87 -91 660
6880 660 102 -269 -362 85 249 -146 17 -148 -376 161 -273 -256 -177 -23 -125 -127 136 -45 229 37 -37 -384
6902 -384 51 121 183 -198 8 69 138 257 58 60 142 252 24 -543 166 207 -70 -155 -244 -323 -163 97 -235 215
6926 215 -34 -41 87 -62 179 213 258 15 -161 -144 -23 35 -72 12 -266 83 198 -270 14 -53 38 -547 -64
6949 -64 -62 -62 -163 31 -146 -69 -11 72 -169 -136 -237 14 152 23 -324 -310 392 1 -21 -169 101 56 148 29
6973 29 -23 -86 15 53 302 107 -234 57 17 -3 17 247 101 260 11 -396 -38 354 -262 -442 -247 208
$$ packed form
6811g5n5O21n35m19P07j6l77n0K50J36J33j93j39k80L15n5N8j90n0O95n54O7j56
6834a62J53P2R7l34r6M16r6l3m8p8K43r6l83J78j07L76J23J1l88K9L22l2q2k47
6858a62M02j81J13k60J49n1K83j66k91m5J90P4k46n6OL63L06m76q2K17j78P51
6880F60n58l71r3M47J64l95J63j65k28N37m34J7P9J54j02kK63j81K74j92p4l47
6902c84M35P0O2l81K06O1O9J19j99KQ2J10k28n67P09M1k77q5q9p9J60K60l32M50
6926B15k49pJ28j49K41L4M5k43j76J7J21N8j07Q4k78L49J15m68K84o7R1n85M83
6949f4K%j01J94j77P7N8Q3k41L3j01K51J38j29l47J4P02l91k2j48K70m5R2j19
6973B9n2o3J01L8K49j95l41K91m0k0K0K30j46J59k49m07L58L92o16j80J95M55
$$ plain form
6995 208 -112 252 -211 -173 -172 82 8 -178 66 -5 -24 22 -378 46 -58 -25 -99 -173 19 130 -137 -424 -191
7018 -191 -109 -270 74 108 -110 348 153 202 -122 -80 105 226 120 -131 101 248 166 363 -38 -86 235 -7
7040 -7 -65 -9 108 -20 223 -185 -142 109 31 -432 -190 -176 343 -258 -322 -288 89 214 320 -318 -195 308 116
7063 116 114 -260 -31 37 52 188 -170 -222 -46 -6 192 -246 -259 125 9 307 -220 -222 94 286 98 -61 29
7086 29 55 187 -104 -84 45 140 64 -239 -123 88 308 356 -146 -88 15 188 121 -303 -81 83 64 -123 -50
7109 -50 -6 198 -227 -374 352 -129 -108 -33 -7 -135 -64 347 130 8 13 94 314 -97 -526 -288 -45 165 -1
7132 -1 69 85 182 128 0 -144 -112 220 150 -103 34 -75 127 136 189 91 -9 398 -118 -184 -169 -235 122 85 -156
7157 -156 50 111 -37 -83 -118 -128 19 110 115 -155 -37 -139 13 148 -65 -80 -162 153 14 -128 -113 91 247
$$ packed form
6995B08l20L64m63L8JK54p4j86K44p1j9M6m00M24j04L3p4p4J92J11k67k87K33
7018a91Q2j61L44L4k18M58j95M9l24M2J85J21j06k51K32J47q2J97m01m8L21k42
7040gn8N6J17j28K43m08M3K51p8m63K42J4N19o01o4L4L77J25J06o38J23N03j92
7063A16kl74K29O8J5J36l58n2J76M0J98m38j3L84j16K98n27kL16J92j88j59R0
7086B9K6J32k91K0J29R5p6l03J16K11K20M8n02N8J03J73o7m24K22J64j9j87P3
7109e0M4K04m25j47P26m81K1P5K6j28P1M11k17j22NQ1K20m11m29K38K43K10j66
7132aP0J6R7n4j28j44L2L32p0k53J37j09K02RN3r8j00M07n16o6J5o6L57l7k41
7157a56K06O1j48m6l5j0J47R1Nk70J18j02J52J35k13j5q2L15j39j42J5K04J56
$$ plain form
7180 247 -214 -129 -124 -137 21 -40 -247 191 207 96 -34 51 189 85 188 -109 -90 62 53 56 -208 -193 218 -63
7204 -63 125 -52 -105 277 367 56 62 -222 -56 177 127 -2 -167 178 89 40 -375 56 225 -59 -23 -56 9 214
7228 214 290 -72 247 -179 272 -65 -203 109 -110 138 -94 122 290 218 183 36 -217 164 142 -122 179
7249 179 23 117 142 84 15 -99 -376 -72 -148 147 -1 -112 192 -31 -322 -158 382 111 -187 120 176 207
7271 207 188 2 -93 -21 25 -72 71 110 -185 -70 -157 -82 -180 88 111 207 -127 60 84 20 156 108 -21 -132 94
7296 94 26 -41 -190 -127 69 188 60 47 128 117 137 228 235 297 -127 -58 54 113 -8 10 -85 167 116 156 -102 -133
7322 -133 -147 -18 48 36 58 -7 -18 175 -189 -263 -201 41 -23 -99 -117 -132 -17 -73 -83 -74 -7 212 240 -134 -40 22 122
7349 122 -120 -232 70 266 166 -246 -80 90 4 80 132 -110 86 186 10 -424 -54 5 -44 92 15 90
$$ packed form
7180B47m61Q5Nj3J58o1k07M38J6j11j30Q5J38j04J03k97J9J52rLk64J5M11k81
7204f3J88j77n3L82R0l11Ok84J66K33n0j29j65L45q9m9m15M31J69k84L6l3O5K05
7228B14P6l62L19m26M51l37j38L12k19K48k32K16J68p2l5j47k53L81k2k64L01
7249A79j56R4K5n8o9j14k77L04p6K95j48j11L04k23k91J64N40k71k98L07N6L1
7271B07j9j86r5P2M6r7J43L9k95J15q7P5r8K68K3R6l34J87K4o4J36m8j29j11K26
7296I4o8o7j49O3J96J19j28j3Q1j1K0R1PO2m24O9J12N9j21J8r5K52n1M0k58l1
7322a33j4J29O6j2K2o5j1J93l64p4O2K42o4p6j8j5J15n6j0RO7K19K8l74R4O2J00
7349A22k42j12L02J96j00m12J66J70q6P6N2k42J96J00j76m34L70N9m9J36p7P5
$$ plain form
7371 90 -189 280 167 -34 -190 251 346 279 -28 27 73 16 81 -148 -4 92 -92 96 75 20 227 138 -201 -260
7395 -260 -228 255 298 150 -12 -330 76 -356 -134 -160 -193 90 174 78 -45 141 -7 191 -224 -115 102 120
7417 120 172 -34 -15 170 258 -81 -181 307 166 30 -72 11 36 229 166 185 37 -257 -6 -188 193 127 127
7440 127 144 24 -195 42 -95 -83 -206 -97 450 68 148 -13 -278 -10 12 5 105 70 168 144 -129 149 122
7463 122 -273 115 -134 139 -240 285 304 132 -141 2 30 -60 -164 -37 43 -54 -67 -4 -104 -219 117 -74
7485 -74 43 -72 149 184 11 7 95 268 193 108 -100 -299 0 -15 157 -234 -266 338 -67 -87 -99 -160 105 26
7509 26 -211 -4 106 -144 -101 -2 -299 89 257 -10 -234 -129 294 170 -68 -30 -112 26 220 -315 21 171
7531 171 272 118 -161 55 95 39 242 198 -229 213 -16 -101 73 -64 251 35 7 -260 -389 48 -14 2
$$ packed form
7371I0k79M69j13k01j56M41R5o7l07N5M6n7O5k29J44R6j84J88k1n5K07q9l39n9
7395b60L2M83M3j48j62l18M06m32K22k6l3K83Q4r6j23J86j48J98m15J09K17J8
7417A20N2k06J9J85Q8l39j00M88j41j36j02Q3K5J93o3J9j48k94K51j82L81o6%
7440A27J7j20k19K37j37J2j23J09N47l82Q0j61k65K68K2pJ00l5R8k4k73K78k7
7463A22l95L88k49K73l79N25J9j72k73J43K8r0j04J27Q0r7j3O3j00j15L36j91
7485g4J17j15K21L5j73mQ8J73p5q5k08j99K99j5J72l91l2O04m05k0j2o1K65p9
7509B6k37K07J10k50M3R9k97L88J68k67k24J05M23j24k38L8q2J38J94n35L36J50
7531A71J01j54k79K16M0n6K03m4m27M42k29q5J74j37L15k16k8k67j29M37o2J6
$$ plain form
7553 2 -172 205 -395 133 57 -26 149 138 -139 62 -170 117 -25 -172 36 -43 40 -241 144 -84 -73 -17 270
7576 270 -54 146 -112 162 -116 139 -103 -233 0 227 -80 34 -263 36 216 226 -112 -274 -58 338
7596 338 -209 -113 -15 262 -60 -136 -167 -49 189 362 34 -121 199 -110 -239 -155 -64 -180 240 146 -300 -43
7618 -43 5 -17 90 92 35 -169 337 -211 -156 -63 -136 17 221 -381 -101 -147 354 230 -135 0 177 121 -76 -5
7642 -5 -92 52 -31 -278 273 260 495 41 -27 -296 121 51 55 -156 13 349 91 -96 66 -52 195 25 -145
7665 -145 73 -115 309 137 -263 -620 -43 -54 -139 15 -295 -64 302 -58 -36 124 204 347 81 65 278 364
7687 364 -193 -45 174 43 242 103 6 28 87 114 27 -193 -56 -41 -15 -35 177 -47 -55 95 -121 117 -185
7710 -185 -150 -129 104 -180 -183 265 -165 -142 82 100 187 8 -38 -18 255 -209 -174 -137 -9 55 -190 27 31 105 28
$$ packed form
7553Bj74L77o00N28p6q3J75j1k77K01k32K87j42j47K08p9Q3k81L85k28J1N6K87
7576B70l24K00k58K74k78K55k42j30K33K27l07J14k97K99J80J0l38j62K16L96
7596C38n47R6R8K77l22p6l1J18K38J73l28j55L20l09j29Q4R1j16M20r4m46K57
7618d3M8k2J07Kn7k04N06n48N5R3p3J53K04o02K80m6N01j24l65J35J77n6j97P1
7642eq7J44q3k47N51j3K35m54o8k69M17p0Mk11J69L36k58j87J62j18K47j70j70
7665a45K18j88M24j72m00l57N77j1q5J54l10K31L66l60K2J60Q0J43k66j6K13Q6
7687C64n57J48K19j31J99j39r7K2N9K7q7k20J37J5K6k0K12k24qJ50k16K38l02
7710a85L5K1K33k84lM48m30K3K24J8Q7j79m6K0K73m64L5L7J28O4k45K17MP4p7
$$ plain form
7735 28 54 -116 -35 -2 56 -160 -62 11 -100 211 172 -235 -6 67 -79 249 -173 -62 53 366 79 -353 67
7758 67 124 46 28 28 -156 100 157 -267 -539 228 67 127 273 80 -64 232 212 9 -199 -74 273 87 -302
7781 -302 -131 151 -22 -25 -233 -120 152 242 100 367 -303 79 123 90 329 -167 179 143 110 -116 -133 -124 -268
7804 -268 -108 -178 38 -262 -218 -70 259 115 54 -6 -74 -201 -189 295 215 -98 -301 142 390 -399 -220 165
7826 165 109 204 -143 -52 147 259 224 43 -134 -239 -70 61 210 23 -284 -290 -109 111 -350 -53 -48 -66 -95
7849 -95 -146 158 89 260 -189 -129 279 91 32 -88 104 -113 -69 -180 41 61 -66 242 -25 -12 -116 278 -243
7872 -243 -365 -78 95 59 27 101 -196 87 -321 -218 285 -113 -105 330 -100 -78 202 57 23 58 -175 10 21
7895 21 -31 -195 -106 54 75 -85 -68 66 85 62 -129 -62 86 -18 -5 -225 -23 60 -215 194 -103 106 -142
$$ packed form
7735B8K6j70Q1L3N8k16R8P3j11L11l9m07K29P3j46L28m22J11J15L13k87m32M20
7758F7N7p8j8%j84K56N7m24k72P67j61O0J46j93j44K96k0k03k08J25L47j86l89
7781c02J71K82j73lk08J13K72R0j42K67o70L82M4l3K39m96L46l6l3k26j7Rj44
7804b68J60p0K16l00M4J48L29j44o1o0o8j27J2M84q0l13k03M43K48p89J79L85
7826A65n6R5l47R1J99J12l5j81j77j05J69J31J49j87l07oJ81K20m61K97Nj8k9
7849i5n1L04o9J71m49O0M08j88n9j20J92k17M4j11K21K0j27L08k67J3j04L94n21
7872b43j22K87J73l6l2P4k97K83m08J03N03l98QM35m30K2K80j45l4L5k33J85J1
7895B1n2j64Q9J60K1j60J7J34J9k3j91O7J48j04J3k20K02Q3k75M09k97K09k48
$$ plain form
7918 -142 141 273 64 109 178 -23 -23 234 -111 150 37 227 -97 296 159 -101 -5 -267 -233 -218 127 -20
7940 -20 31 67 34 17 17 -124 -455 -255 119 -266 41 56 -64 -52 -14 -143 -183 -145 63 -123 -50 53 -122 98
7964 98 83 -60 160 123 76 80 89 160 133 -95 14 77 -44 32 -78 -12 -171 -128 -64 -190 14 -167 89 432 126
7989 126 -75 228 -48 -126 349 10 111 -46 1 28 -112 12 63 -47 -196 -95 -142 286 -166 -48 -32 -20
8011 -20 -193 -165 -150 174 207 316 -202 -177 -146 50 -84 -33 9 96 -37 136 -63 77 37 72 74 -67 171 -167
8035 -167 79 -50 161 -200 135 -11 -153 -92 -51 81 -55 -162 -290 -68 160 7 -102 -315 -106 369 -61
8056 -61 -237 -42 398 187 -91 -27 -168 -18 -122 332 -79 -142 81 168 85 73 19 -19 -93 123 -218 -191 -103 -101
8080 -101 -90 261 15 -56 -180 20 199 217 41 -72 -68 32 8 -127 414 -254 105 48 27 -520 -141 67 37
$$ packed form
7918a42K83J32k09M5O9k01%K57l45K61j13J90l24L93j37k60R6k62L4J5L45j47
7940b0N1L6l3j7%j41l31K00L74l85L07J5j20J2L8j29m0L8K08j86P3J03j75K20
7964I8j5j43K20l7m7MRP1k7k28J09O3j21P6j10O6j59M3O4j26K04j81K56L43l06
7989A26k01L03k76p8M75l39J01j57M7K7j40J24N1j10j49J01m7M28m52J18J6J2
8011b0j73K8J5L24L3J09n18K5L1J96j34N1M2Q7j33J73j99J40m0L5Kj41K38l38
8035a67K46j29K11l61L35j46j42O1M1J32j36j07j28K22K28j53j09k13K09M75m30
8056f1j76J95M40k11k78O4j41J50j04M54m11o3K23Q7q3j2n4l8p4K16l41K7Q8K
8080a01J1L51k46p1j24K00J79J8j76j13MJ00k4j35N41o68L59n7k1n47L79K08l0
$$ plain form
8103 37 -16 138 138 109 122 113 44 -364 -112 193 121 -111 47 -65 89 -132 -241 58 54 -92 -106 -80 -70 201 105
8128 105 -45 226 -205 -16 118 161 -98 59 38 0 52 84 27 361 79 20 -29 19 -148 -118 -193 141 -78 18
8152 18 -18 -147 -116 -25 78 -93 -293 -180 96 373 -55 82 15 -105 4 18 45 -279 112 106 -187 -29 8
8175 8 47 97 -77 195 -53 349 13 22 190 282 -271 62 -228 -322 133 135
$$ packed form
8103C7n3J54%k9J3ro9m08K52L05p2k32J58j12J54k21j09K99mj46j4K6J0K71r6
8128A05j50K71m31J89J34M3k59J57k1l8N2L2n7L34k82n9m9M8j67L0p5L34k19R6
8152A8l6j29L1R1J03j71k00J13K76K77m28J37o7j20J09J4K7l24L91ok93J58L7
8175HL9N0j74K72k48M02l36RJ68R2n53L33k90r4M55K
8191A35
$$ Imaginary data points
##PAGE= N=2
##DATA TABLE= (X++(I..I)), XYDATA
$$ plain form
0 0 0 0 0 8 -8 0 -8 8 -8 16 -24 24 -29 37 -45 48 -64 77 -85 101 -122 139 -157 183 -213 239 -272 311 -351
29 -351 396 -445 501 -558 625 -697 775 -861 956 -1060 1174 -1299 1440 -1594 1762 -1955
45 -1955 2174 -2415 2696 -3022 3403 -3854 4405 -5092 5971 -7151 8813 -11332 15587 -24131
59 -24131 47958 -248189 -916432 -313786 410435 335740 -285603 -505923 -174512 186895 34842
70 34842 -374076 -422684 14168 310344 70400 -365415 -360301 73051 308062 30715 -228150
81 -228150 -38883 245375 159394 -117619 -190061 19982 261617 260463 36102 -87097 3739
92 3739 75363 24096 21209 120098 184948 95178 -103377 -172872 37486 257009 156713 -97889
104 -97889 -138719 17735 89010 -19771 -127234 -45874 121988 105730 -86486 -177696 -85294
$$ packed form
0@%%%Qj6QqJ6j6K4m0M8n3O6q2R3j12J41j62J86k23K61k96L40l96M52n11N83o62
29c51P47q41R46j059J183j322J472j636J817k016K234k473K739l034L356l717
45a955M129m589N111n718O425p257Q259r497J1063j3122J5964k0145K6919l9718
59b4131P2089k96147o68243O02646P24221p4695o21343k20320L31411L61407j52053
70C4842m08918m8608M36852K96176k39944m35815N114M33352K35011k77347k58865
81b28150J89267K84258q5981k77013p2442K10043K41635j154k24361j23199R0836
92C739P1624n1267k887R8889O4850q9770j98555o9495K10358K19523j00296k54602
104i7889m0830J56454P1275j08781j07463Q1360J67862j6258j92216r1210R2402
$$ plain form
115 -85294 29922 51222 -30293 -108214 -19507 129679 40204 -196717 -181456 87041 228604
126 228604 93473 -126461 -201913 -65107 127896 159626 26035 -89574 -65063 44524
136 44524 66761 -58444 -118010 36620 175884 77702 -96110 -119667 -2359 125184 123791
147 123791 -30026 -120787 8041 156592 97851 -71010 -125742 2781 172653 151426 -68823
158 -68823 -199785 -87870 73316 99735 15865 -81954 -102838 -31887 10566 -41340 -81801
169 -81801 -41544 17865 22462 -45090 -106924 -38971 88412 74166 -47995 -74358 4218 63869
181 63869 68681 17988 -47509 -12227 100326 113296 9886 -52771 -14754 46411 53118 11143
193 11143 5799 51144 33737 -47764 -44326 45379 71476 7518 -60251 -73581 -1680 85439
$$ packed form
115h5294J15216K1300q1515p7921Q8707J49186q9475k36921J5261K68497J41563
126B28604j35131k19934p5452J36806J93003L1730j33591j15609K4511J09587
136D4524K2237j25205n9566J54630J39264r8182j73812k3557J17308J27543j393
147A23791j53817r0761J28828J48551n8741j68861n4732J28523J69872k1227k20249
158f8823j30962J11915J61186K6419q3870r7819k0884P0951M2453n1906m0461
169h1801M0257N9409M597o7552o1834O7953J27383j4246j22161k6363P8576N9651
181F3869M812n0693o5497L5282J12553J2970j03410o2657L8017O1165O707m1975
193A1143n344M5345j7407q1501L438Q9705K6097o3958o7769j3330P1901Q7119
$$ plain form
205 85439 41289 -85478 -84979 31506 61025 -33617 -101162 -41965 72960 63195 -88565 -134467
217 -134467 37460 165784 43789 -149861 -146680 54680 204188 87624 -151210 -154055 93045
228 93045 216020 42710 -166050 -124418 101286 185179 -16733 -203899 -71651 163905
238 163905 122311 -115680 -192353 -22363 152306 89613 -146334 -221961 -2344 199233 98557
249 98557 -134159 -175631 1227 142501 59883 -104079 -82233 79212 102816 -28426 -84427
260 -84427 1365 92262 75506 -32129 -89389 3177 107505 52239 -61900 -49937 54220
271 54220 97449 25774 -70836 -57193 50030 77975 -5714 -34245 33019 58461 -4610 -65679
283 -65679 -44760 53912 110960 17571 -115220 -96106 39041 104125 35652 -75161 -90693
$$ packed form
205H5439m4150j26767M99J16485K9519r4642o7545N9197J14925r765j51760m5902
217a34467J71927J28324j21995j93650L181K01360J49508j16564k38834k845K47100
228I3045J22975j73310k08760M1632K25704Q3893k01912j87166J32248K35556
238A63905m1594k37991p6673J69990J74669o2693k35947p5627K19617K01577j00676
249I8557k32716m1472J76858J41274q2618j63962K1846J61445K3604j31242n6001
260h4427Q5792R0897j6756j07635n7260R2566J04328n5266j14139J1963J04157
271E4220M3229p1675r6610J3643J07223K7945q3689k8531O7264K5442o3071o1069
283f5679K0919R8672N7048r3389j32791J9114J35147O5084o8473j10813j5532
$$ plain form
294 -90693 14938 78423 -13369 -106932 -47603 60713 66265 -17281 -89379 -65262 37311 68278
306 68278 -32324 -103401 -30528 76122 66986 -53875 -136116 -47989 114585 115106 -48249 -137992
318 -137992 -57055 64030 93770 14216 -69612 -31100 71384 61247 -41730 -62766 27189
329 27189 97926 61471 -39990 -68175 28498 102383 38859 -49586 -35104 33354 63903 28915
341 28915 -40811 -56551 16469 69247 31019 -24071 -36346 -28379 -11614 6421 10049 13247 6709
354 6709 -35610 -56620 -9391 29016 5872 -19544 -20512 -21471 -11336 2041 -7056 -7965 14325 11230
368 11230 -17267 -22302 -5465 11577 22560 2984 -22669 5592 49853 28898 -22998 -37777
380 -37777 -13304 37117 75772 32767 -55571 -62994 18182 77000 51543 -25919 -65294 -8246
$$ packed form
294i0693J05631O3485r1792r3563N9329J08316N552q3546p2098K4117J02573L0967
306F8278j00602p1077P2873J06650r136j20861q2241Q8127J62574N21j63355q9743
318a37992Q0937J21085K9740p9554q3828L8512J02484j0137j02977k1036Q9955
329B7189P0737l6455j01461k8185R6673P3885o3524q8445J4482O8458L0549l4988
341B8915o9726j5740P3020N2778l8228n5090j2275P967J6765J8035L628L198o538
354F709m2319k1010M7229L8407k3144k5416r68r59J0135J3377r097r09K2290l095
368A1230k8497n035J6837J7042J0983j9576k5653K8261M4261k0955n1896j4779
380c7777K4473N0421L8655m3005q8338p423Q1176N8818k5457p7462l9375N7048
$$ plain form
392 -8246 57803 19741 -53360 -37080 34418 54778 -2775 -79604 -73397 33625 87521 -9959
404 -9959 -111724 -61347 61872 87582 -18815 -122413 -72685 76164 107544 -19151 -109236
415 -109236 -52125 53480 80931 9591 -63614 -26791 61210 47018 -43306 -51450 32939 83597
427 83597 37970 -45476 -56405 29182 86999 30565 -40210 -24852 28244 47766 27000 -10320
439 -10320 -16359 22402 36446 643 -11866 12635 10492 -18020 -24153 -661 30071 22577 -39872
452 -39872 -77222 -27348 30218 14753 -32882 -54029 -39510 -1300 12512 -27538 -49622 -5503
464 -5503 27817 -5715 -49448 -41483 17915 64604 24994 -56234 -48103 44174 82010 19865 -53542
477 -53542 -49140 41212 112618 50341 -69062 -67121 47641 101157 32555 -54644 -46975 43102
$$ packed form
392h246O6049l8062p3101J6280P1498K0360n7553p6829O207J07022N3896r7480
404i959j01765N0377J23219K5710j06397j03598M9728J48849L1380j26695r0085
415a09236N7111J05605K7451p1340p3205L6823Q8001j4192r0324q144Q4389N0658
427H3597m5627q3446j0929Q5587N7817n6434p0775J5358N3096J9522k0766l7320
439a0320o039L8761J4044l5803j2509K4501k143k8512o133K3492L0732p494o2449
452c9872l7350M9874N7566j5465m7635k1147J4519L8210J3812m0050k2084M4119
464e503L3320l3532m3733P965N9398M6689l9610q1228Q131R2277L7836o2145p3407
477e3542M402R0352P1406o2277j19403J941J14762N3516o8602q7199P669R0077
$$ plain form
489 43102 79569 -5934 -79155 -18587 76498 59469 -44484 -102318 -39290 72142 70561 -55927
501 -55927 -117705 -24086 72224 39049 -60692 -90502 -11957 66577 31298 -54958 -47597 31195
513 31195 50011 -1327 -29843 2820 53772 48461 -22196 -50011 24819 86628 38327 -38142
525 -38142 -37969 19207 48938 8696 -43181 -21258 36261 19697 -45521 -47932 9852 38014 3434
538 3434 -54355 -60447 9252 57658 2082 -70460 -48021 27804 53032 3137 -59410 -50672 21149
551 21149 48382 -3196 -38859 -12205 20352 19718 -7748 -30293 -5401 45189 37008 -24001 -41282
564 -41282 5745 50144 47025 -313 -37934 -9954 43200 40924 -2096 -21079 -8069 19354
576 19354 37197 11837 -29673 -21458 16754 19312 -4772 -15915 -8239 10274 14548 -13473 -30397
$$ packed form
489D3102L6467q5503p3221O0568R5085j7029j03953n7834O3028J11432j581j26488
501e5927o1778R3619R6310l3175r9741k9810P8545P8534l5279q6256P361P8792
513C1195J8816n1338k8516L2663N0952n311p0657k7815P4830O1809m8301p6469
525c8142J73N7176K9731m0242n1877K1923N7519j6564o5218k411N7784K8162l4580
538C434n7789o092O9699M8406n5576p2542K2439P5825K5228m9895o2547Q738P1821
551B1149K7233n1578l5663K6654L2557o34k7466k2545K4892N0590q181o1009j7281
564d1282M7027M4399l119m7338l7621K7980N3154k276m3020j8983J3010K7423
576A9354J7843k5360m1510Q215L8212K558k4084j1143P676J8513M274k8021j6924
$$ plain form
589 -30397 661 30180 14677 -17949 -34441 -19717 21688 36145 -6711 -41476 -19579 10246
601 10246 9526 -5132 -18595 -18408 18 6574 -7534 -8197 3481 497 -3428 3134 4573 9916
615 9916 20350 7663 -10512 7759 34822 27424 5725 -4617 -4003 11038 21613 4475 -10049
628 -10049 561 3565 -12635 -21080 -15182 -1229 12027 -8841 -50415 -39535 17421 32259 -13509
641 -13509 -47686 -28696 20992 41091 -5224 -52716 -20800 44825 46163 -8066 -37950 -6896
653 -6896 47659 44791 -24697 -49215 25387 81492 26584 -55964 -48672 37443 91225 32525 -66825
666 -66825 -60460 41924 81733 6999 -65002 -39009 42554 62491 -18687 -85796 -30101 59312
678 59312 37065 -55303 -74533 -2515 55756 17616 -66606 -68703 24419 70671 2550 -67224
$$ packed form
589c0397L1058K9519j5503l2626j6492J4724M1405J4457m2856l4765K1897K9825
601A0246p20j4658j3463J87J8426O556j4108o63J1678k984l925O562J439N343
615I916J0434j2687j8175J8271K7063p398k1699j0342O14J5041J0575j7138j4524
628a0049J0610L004j6200q445N898J3953J3256k0868m1574J0880N6956J4838m5768
641a3509l4177J8990M9688K0099m6315m7492L1916O5625J338n4229k9884L1054
653f896N4555k868o9488k4518P4602N6105n4908q2548P292Q6115N3782n8700r9350
666f6825O365J02384L9809p4734p2001K5993Q1563J9937q1178o7109N5695Q9413
678E9312k2247r2368j9230P2018N8271l8140q4222k097R3122M6252o8121o9774
$$ plain form
690 -67224 -39158 35851 57186 3547 -45029 -9737 51750 28714 -42022 -36025 36745 61359
702 61359 1039 -61419 -39539 41462 59895 -19854 -72351 -17608 51023 34363 -34446 -59802
714 -59802 -3799 61536 35848 -46231 -50840 27051 59995 5011 -47400 -21878 48033 63685
726 63685 -9027 -68872 -24613 53980 56343 -6736 -50550 -29987 27269 41575 -10265 -43355
738 -43355 -4725 34124 13538 -26243 -33028 -2332 31036 21326 -20936 -30133 3085 20247 3821
751 3821 -17120 -20621 571 26630 13195 -24394 -29175 -2536 15216 16957 7016 -12483 -17194
764 -17194 -1249 7539 7448 10811 6891 -2911 -362 1025 -7249 -1017 14775 10238 -2713 -5402 -7664
779 -7664 -6724 3108 3567 -5100 -3646 1578 -1860 -2759 -4512 -9695 -173 16730 13167 -222 -5162
$$ packed form
690f7224K8066P5009K1335n3639m8576L5292O1487k3036p0736N997P2770K4614
702F1359o0320o2458K1880Q1001J8433p9749n2497N4743O8631j6660o8809k5356
714e9802N6003O5335k5688q2079m609P7891L2944n4984n2411K5522O9911J5652
726F3685p2712n9845M4259P8593K363o3079m3814K0563N7256J4306n1840l3090
738d3355L8630L8849k0586l9781o785L0696L3368r710m2262r197L3218J7162j6426
751C821k0941l501K1192K6059j3435l7589m781K6639J7752J741r941j9499m711
764a7194J5945Q788r1L363l920r802K549J387q274O232J5792m537j2951k689k262
779g664R40R832M59q667J454N224l438q99j753n183R522J6903l563j3389m940
$$ plain form
794 -5162 -12155 -10209 14800 29461 10013 -10101 -12925 -9175 2469 13569 5232 -7643 -6700 -3841
808 -3841 -5288 -4442 -8674 -9193 8968 15961 -7997 -23677 -9102 11448 18891 8316 -12904 -7406
822 -7406 26812 29507 -13623 -33759 1984 47288 46329 -7787 -52868 -20257 46183 44491 -15522
835 -15522 -38134 -75 33078 13801 -34880 -41344 16752 54768 7055 -55565 -43782 16337
847 16337 41851 1825 -49929 -33992 31955 39984 -27524 -61318 -14279 39096 30673 -18548
859 -18548 -43595 -10115 31800 14432 -27889 -15955 31997 37340 -7348 -40585 -13514 45242
871 45242 50836 -8365 -37305 5614 41582 15897 -22909 -19271 20281 41124 4396 -42868
883 -42868 -22670 33188 33055 -17925 -40158 -5976 34352 22709 -33630 -51736 5447 52397
$$ packed form
794e162o993J946K5009J4661j9448k0114k824L750J1644J1100q337j2875R43K859
808c841j447Q46m232n19J8161O993k3958j5680J4575K0550P443j0575k1220N498
822g406L4218K695m3130k0136L5743M5304r59n4116m5081L2611O6440j692o0013
835a5522k2612L8059L3153j9277m8681o464N8096L8016m7713o2620J1783O0119
847A6337K5514m0026n1754J5937O5947Q029o7508l3794M7039N3375q423m9221
859a8548k5047L3480M1915j7368m2321J1934M7952N343m4688l3237K7071N8756
871D5242N594n9201k8940M2919L5968k5685l8806L638L9552K0843l6728m7264
883d2868K0198N5858j33n0980k2233L4182M0328j1643n6339j8106N7183M6950
$$ plain form
895 52397 19214 -37715 -41039 2096 33509 15372 -26255 -25389 16424 27337 -8770 -30774 -11026
908 -11026 21015 28511 -2597 -35204 -17317 25410 25719 -8973 -21645 -4709 14894 17902 -3323
921 -3323 -22633 -8028 16859 15485 -2165 -10780 -7782 4596 10053 -4217 -11987 4149 11885
934 11885 -3191 -11640 -7017 737 10748 9561 -9267 -15841 1857 11991 4181 -3260 -5733 -2509
948 -2509 8905 8262 -4666 -3887 5741 2253 -3405 1865 5693 5095 3485 -5930 -10161 4265 13371
963 13371 1017 -8302 -5365 -587 4987 3763 -9225 -9666 6894 8129 -7962 -9750 -684 1819
977 1819 864 -3538 -8757 25 12301 2450 -13459 -12386 475 12557 15264 -1683 -18178 -7037
991 -7037 11489 9638 1462 -2347 -3810 3857 12251 -1251 -15120 -759 18327 13970 -3515 -15174
$$ packed form
895E2397l3183n6929l324M3135L1413j8137m1627Q66M1813J0913l6107k2004J9748
908a1026L2041P496l1108l2607J7887M2727L09l4692j2672J6936J9603L008k1225
921c323j9310J4605K4887j374j7650q615K998J2378N457j4270p770J6136P736
934A1885j5076q449M623P754J0011j187j8828o574J7698J0134p810p441k473L224
948b509J1414o43j2928P79R628l488n658N270L828n98j610r415m231J4426R106
963A3371j2354r319K937M778N574j224j2988m41J6560J235j6091j788R066K503
977A819r55m402n219Q782J2276r851j5909J073J2861J2082K707j6947j6495J1141
991g037J8526j851q176l809j463P667Q394j3502j3869J4361J9086m357j7485j1659
$$ plain form
1005 -15174 -7623 14642 17963 -8696 -19788 5321 23091 7363 -19503 -26960 -1832 29552
1017 29552 18700 -23218 -31821 -1108 16526 2671 -16608 -15473 7314 17243 -11517 -34791
1029 -34791 -9661 25423 20043 -9282 -22619 -9303 15381 16976 -9160 -16680 11276 26532
1041 26532 5845 -16523 -13095 9564 25363 11162 -11011 -2807 17093 6943 -13483 -6916
1053 -6916 15902 26148 12448 -17389 -25145 5174 26813 7976 -13859 -6777 8061 6473 -11785
1066 -11785 -24992 -7052 22189 13333 -22513 -29745 -6473 9220 3265 -13987 -18957 2373 19203
1079 19203 -1923 -29313 -19461 11629 26108 15060 -10741 -20580 684 19614 8313 -4065
1091 -4065 3183 12217 11492 894 -14543 -11119 16087 27982 5514 -17057 -15517 1206 15544
$$ packed form
1005a5174P551K2265L321k6659j1092K5109J7770j5728k6866p457K5128L1384
1017B9552j0852m1918q603L0713J7634j3855j9279J135K2787R929k8760k3274
1029c4791K5130L5084n380k9325j3337J3316K4684J595k6136p520K7956J5256
1041B6532k0687k2368L428K2659J5799j4201k2173Q204J9900j0150k0426O567
1053f916K2818J0246j3700k9837p756L0319K1639j8837k1835P082J4838j588j8258
1066a1785j3207J7940K9241q856l5846p232K3272J5693n955j7252m970K1330J6830
1079A9203k1126k7390R852L1090J4479j1048k5801r839K1264J8930j1301j2378
1091d065P248R034p25j0598j5437L424K7206J1895k2468k2571J540J6723J4338
$$ plain form
1104 15544 9036 -11076 -9201 12750 14510 -7329 -18120 -7967 10438 21138 7013 -16935
1116 -16935 -13729 6255 5957 -5808 -3309 6737 10243 178 -18112 -18258 8172 22448 5184
1129 5184 -10833 -7225 -174 1953 -568 -5013 3440 16425 4681 -17965 -15003 5191 11088 1847
1143 1847 -9196 -8318 5852 7736 -14848 -23748 1020 21385 11149 -10017 -20024 -9155 13352
1156 13352 14715 -4429 -5576 12921 14841 -3005 -13291 -4591 17053 27358 6527 -17737 -9690
1169 -9690 10781 10882 164 -4400 -2772 4892 7782 -7238 -16708 -4683 8116 6691 1825 -5923
1183 -5923 -12352 -5957 2697 1307 271 2931 -1597 -5078 -2891 -6777 -9602 2691 11185 967
1197 967 -10953 -13508 -7981 3812 9429 -1425 -8240 -24 3280 -2072 -2894 298 4253 11992 9640
$$ packed form
1104A5544o508k0112J875K1951J760k1839j0791J0153J8405J0700j4125k3948
1116a6935L206J9984k98j1765K499J0046L506j0065j8290j46K6430J4276j7264
1129E184j6017L608P051K127k521m445Q453J2985j1744k2646K962K0194N897r241
1143A847j1043Q78J4170J884k2584q900K4768K0365j0236k1166j0007J0869K2507
1156A3352J363j9144j147J8497J920j7846j0286Q700K1644J0305k0831k4264Q047
1169i690K0471J01j0718m564J628P664K890j5020r470J2025J2799j425m866p748
1183e923o429O395Q654j390j036K660m528l481K187l886k825J2293Q494j0218
1197I67j1920k555N527J1793N617j0854o815Q216L304n352q22L192L955P739k352
$$ plain form
1212 9640 -3907 -4270 7053 7131 2919 5734 6911 5185 2885 -4145 -7181 4847 12794 3991 -4220
1227 -4220 -3907 -4683 -1697 2687 -740 -2004 4929 1030 -11742 -10316 692 4181 1597 -4902 -11756
1242 -11756 -5365 3636 -3751 -13466 -7571 1449 2592 -1218 -11040 -15209 -436 12290 3555 -6827
1256 -6827 -1500 5852 7366 3817 -3524 567 18576 19952 -251 -10589 949 15343 18443 5309
1270 5309 -11818 -4936 16231 12666 -10706 -14637 1714 13309 6885 -12026 -19640 -653 15620
1283 15620 361 -17835 -9294 8189 9485 -5701 -19700 -10045 15298 15665 -12128 -21301 -799
1296 -799 13493 5067 -10839 -13105 4529 17417 75 -19531 -6574 17250 14733 -4404 -13401
1309 -13401 -2332 17989 16851 -9225 -16776 8127 22906 5528 -14196 -10407 7496 17091 1201
$$ packed form
1212I640j3547l63J1323P8m212K815J177j726k300p030l036J2028P947q803q211
1227d220L13p76K986M384l427j264O933l899j2772J426J1008L489k584o499o854
1242a1756O391R001p387r715N895R020J143l810r822m169J4773J2726q735j0382
1256f827N327P352J514l549p341M091J8009J376k0203j0338J1538J4394L100j3134
1270E309j7127O882K1167l565k3372l931J6351J1595o424j8911p614J8987J6273
1283A5620j5259j8196Q541J7483J296j5186j3999R655K5343L67k7793r173K0502
1296g99J4292q426j5906k266J7634J2888j7342j9606J2957K3824k517j9137q997
1309a3401J1069K0321j138k6076p551K4903J4779j7378j9724L789J7903R595j5890
$$ plain form
1322 1201 -19189 -8165 15811 10496 -12379 -16889 -592 14041 9723 -12419 -19046 4810 20991
1335 20991 3117 -15655 -7762 9519 14441 1785 -13223 -6211 13381 11104 -8897 -11295 3017
1348 3017 9647 3349 -8181 -12180 1014 12851 1727 -12232 -6247 4601 4368 -606 -5094 -3386
1362 -3386 5199 5532 -5151 -5850 3709 3769 -2287 -2130 -717 -36 2065 -2306 -8358 -1785 6013 648
1378 648 -4803 -2451 -1034 553 2117 -818 32 7519 4522 -5039 -2228 5874 6256 3939 2306 -1553
1394 -1553 978 6191 1201 -4550 1139 5472 1616 -1408 -3490 -4432 519 2781 -3320 -3209 2765
1409 2765 -512 -6914 -4486 -1334 218 2904 96 -7221 -4668 347 -3105 -4001 1355 1460 -1985
1424 -1985 -3519 -6803 -4887 5555 6066 -4357 -4770 3137 4841 2297 -1098 -2410 5409 13821 5823
$$ packed form
1322A201k0390J1024K3976n315k2875m510J6297J4633m318k2142o627K3856J6181
1335B0991j7874j8772P893J7281M922j2656j5008P012J9592k277k0001k398J4312
1348C017O630o298j1530l999J3194J1837j1124j3959N985J0848k33m974m488J708
1362c386Q585L33j0683o99R559O0o056J57J413O81K101m371o052O573P798n365
1378F48n451K352J417J587J564k935Q50P487k997r561K811Q102L82k317j633l859
1394a553K531N213m990n751N689M333l856l024k082r42M951K262o101J11N974
1409B765l277o402K428L152J552K686k808p317K553N015l452q96N356J05l445
1424a985j534l284J916J0442N11j0423m13P907J704k544l395j312P819Q412p998
$$ plain form
1439 5823 -7024 -3498 7900 10662 5454 -2621 -4063 7148 10673 -4416 -12829 695 12886
$$ packed form
1439E823j2847L526J1398K762n208q075j442J1211L525j5089q413J3524J2191
$$ [...]
8191a7
##END NTUPLES=NMR FID
##END=
