##TITLE=1H_EC-3099(II-5)
 CDCl3, 8 sc, 
 2.8.2019
##JCAMPDX= 6.0         $$ Bruker NMR JCAMP-DX V2.0
##DATA TYPE= NMR FID
##DATA CLASS= NTUPLES
##ORIGIN= UXNMR, Bruker Analytische Messtechnik GmbH
##OWNER= root
$$ XWIN-NMR		Version 3.5
$$ Fri Aug  2 14:43:57 2019 Russian Standard Time (UT+4h)  she@DPX200
##.OBSERVE FREQUENCY= 200.13155
##.OBSERVE NUCLEUS= ^1H
##.DELAY= (6, 6)
##.ACQUISITION MODE= SIMULTANEOUS
##.ACQUISITION SCHEME= undefined
##.AVERAGES= 8
##.DIGITISER RES= 18
##SPECTROMETER/DATA SYSTEM= spect
##.PULSE SEQUENCE= zg30
##.SOLVENT NAME= DMSO
##.SHIFT REFERENCE= (INTERNAL, DMSO, 0, 15.7039)
##AUDIT TRAIL= $$ (NUMBER, WHEN, WHO, WHERE, WHAT)
$$ ##TITLE= Audit trail, XWIN-NMR		Version 3.5
$$ ##JCAMPDX= 5.01
$$ ##ORIGIN= Bruker BioSpin GmbH
$$ ##OWNER= she
$$ F:/spectra/data/she/nmr/H-F/1/audita.txt
$$ ##AUDIT TRAIL=  $$ (NUMBER, WHEN, WHO, WHERE, WHAT)
(   1,<2019-08-02 14:42:34.07 +0400>,<she>,<DPX200>,
      <created by zg, POWCHK disabled, PULCHK disabled
       configuration hash MD5:
       00 E9 B6 7A A2 85 ED C7 34 08 36 98 17 FE 4E 26
       data hash MD5: 16K
       15 8D E0 23 E5 E6 A0 B0 AD 3D F2 C4 1C 8E 01 64>)
$$ ##END=
$$ 
$$ hash MD5
$$ 06 EB CD F9 40 4A 5E 1C C6 20 72 2D 78 95 E0 4A
##$RELAX= 
##$RELAX= 
##$RELAX= 
##$RELAX= 
##$RELAX= 
##$RELAX= 
$$ Bruker specific parameters
$$ --------------------------
##$DU= <F:/spectra>
##$EXPNO= 1
##$NAME= <H-F>
##$PROCNO= 1
##$TYPE= <nmr>
##$USER= <she>
##$AMP= (0..31)
100 100 100 100 100 100 100 100 100 100 100 100 100 100 100 100 100 100 
100 100 100 100 100 100 100 100 100 100 100 100 100 100 
##$AQSEQ= 0
##$AQ_mod= 1
##$AUNM= <au_zg>
##$AUTOPOS= <>
##$BF1= 200.13
##$BF2= 200.13
##$BF3= 200.13
##$BF4= 200.13
##$BF5= 200.13
##$BF6= 200.13
##$BF7= 200.13
##$BF8= 200.13
##$BYTORDA= 1
##$CFDGTYP= 0
##$CFRGTYP= 5
##$CHEMSTR= <none>
##$CNST= (0..31)
1 1 145 1 1 1 1 1 1 1 1 1 1 1 1 1 1 1 1 1 1 1 1 1 1 1 1 1 1 1 1 1 
##$CPDPRG= <>
##$CPDPRG1= <>
##$CPDPRG2= <>
##$CPDPRG3= <>
##$CPDPRG4= <mlev>
##$CPDPRG5= <mlev>
##$CPDPRG6= <mlev>
##$CPDPRG7= <mlev>
##$CPDPRG8= <mlev>
##$CPDPRGB= <>
##$CPDPRGT= <>
##$D= (0..31)
0 1.2 0 0 0 0 0 0 0 0 0 0.03 0 0 0 0 0 0 0 0 0 0 0 0 0 0 0 0 0 0 0 0 
##$DATE= 1564742553
##$DBL= (0..7)
120 120 120 120 120 120 120 120 
##$DBP= (0..7)
150 150 150 150 150 150 150 150 
##$DBP07= 0
##$DBPNAM0= <>
##$DBPNAM1= <>
##$DBPNAM2= <>
##$DBPNAM3= <>
##$DBPNAM4= <>
##$DBPNAM5= <>
##$DBPNAM6= <>
##$DBPNAM7= <>
##$DBPOAL= (0..7)
0.5 0.5 0.5 0.5 0.5 0.5 0.5 0.5 
##$DBPOFFS= (0..7)
0 0 0 0 0 0 0 0 
##$DE= 6
##$DECBNUC= <off>
##$DECIM= 24
##$DECNUC= <off>
##$DECSTAT= 4
##$DIGMOD= 1
##$DIGTYP= 9
##$DL= (0..7)
0 120 120 120 120 120 120 120 
##$DP= (0..7)
150 150 150 150 150 150 150 150 
##$DP07= 0
##$DPNAME0= <>
##$DPNAME1= <>
##$DPNAME2= <>
##$DPNAME3= <>
##$DPNAME4= <>
##$DPNAME5= <>
##$DPNAME6= <>
##$DPNAME7= <>
##$DPOAL= (0..7)
0.5 0.5 0.5 0.5 0.5 0.5 0.5 0.5 
##$DPOFFS= (0..7)
0 0 0 0 0 0 0 0 
##$DQDMODE= 0
##$DR= 18
##$DS= 0
##$DSLIST= <SSSSSSSSSSSSSSS>
##$DSPFIRM= 0
$$ [...]
##$SUBNAM2= <"">
##$SUBNAM3= <"">
##$SUBNAM4= <"">
##$SUBNAM5= <"">
##$SUBNAM6= <"">
##$SUBNAM7= <"">
##$SUBNAM8= <"">
##$SUBNAM9= <"">
##$SW= 24.9336996594482
##$SWIBOX= (0..15)
0 0 2 0 0 0 0 0 0 0 0 0 0 0 0 0 
##$SW_h= 4990.01996007984
##$TD= 16384
##$TD0= 1
##$TE= 0
##$TE2= 300
##$TE3= 300
##$TEG= 300
##$TL= (0..7)
0 120 120 120 120 120 120 120 
##$TP= (0..7)
150 150 150 150 150 150 150 150 
##$TP07= 0
##$TPNAME0= <>
##$TPNAME1= <>
##$TPNAME2= <>
##$TPNAME3= <>
##$TPNAME4= <>
##$TPNAME5= <>
##$TPNAME6= <>
##$TPNAME7= <>
##$TPOAL= (0..7)
0.5 0.5 0.5 0.5 0.5 0.5 0.5 0.5 
##$TPOFFS= (0..7)
0 0 0 0 0 0 0 0 
##$TUNHIN= 0
##$TUNHOUT= 0
##$TUNXOUT= 0
##$USERA1= <user>
##$USERA2= <user>
##$USERA3= <user>
##$USERA4= <user>
##$USERA5= <user>
##$V9= 5
##$VALIST= <valist>
##$VCLIST= <CCCCCCCCCCCCCCC>
##$VD= 0
##$VDLIST= <DDDDDDDDDDDDDDD>
##$VPLIST= <PPPPPPPPPPPPPPP>
##$VTLIST= <TTTTTTTTTTTTTTT>
##$WBST= 1024
##$WBSW= 4
##$XGAIN= (0..3)
0 0 0 0 
##$XL= 0
##$YL= 0
##$YMAX_a= 474320
##$YMIN_a= -664201
##$ZGOPTNS= <>
##$ZL1= 120
##$ZL2= 120
##$ZL3= 120
##$ZL4= 120
##$ABSF1= 10
##$ABSF2= 0
##$ABSG= 5
##$ABSL= 3
##$ALPHA= 0
##$AQORDER= 0
##$ASSFAC= 0
##$ASSFACI= 0
##$ASSFACX= 0
##$ASSWID= 0
##$AUNMP= <proc_1d>
##$AZFE= 0.1
##$AZFW= 0.1
##$BCFW= 1
##$BC_mod= 2
##$BYTORDP= 1
##$COROFFS= 0
##$CY= 11.3945322036743
##$DATMOD= 1
##$DC= 2
##$DFILT= <>
##$DTYPP= 0
##$F1P= 20.1537800932815
##$F2P= 0.134698688090026
##$FCOR= 0.5
##$FTSIZE= 0
##$FT_mod= 4
##$GAMMA= 1
##$GB= 0.15
##$INTBC= 1
##$INTSCL= 1
##$ISEN= 128
##$LB= 0.24
##$LEV0= 0
##$LPBIN= 0
##$MAXI= 10000
##$MC2= 0
##$MEAN= 0
##$ME_mod= 0
##$MI= 1.114404
##$NCOEF= 0
##$NC_proc= 0
##$NLEV= 6
##$NOISF1= 3.799351
##$NOISF2= 2.8
##$NSP= 1
##$NTH_PI= 0
##$NZP= 0
##$OFFSET= 15.70392
##$PC= 1
##$PHC0= -9225.853
##$PHC1= 21.00097
##$PH_mod= 1
##$PKNL= yes
##$PPARMOD= 0
##$PSCAL= 0
##$PSIGN= 0
##$REVERSE= no
##$SF= 200.130013532006
##$SI= 16384
##$SIGF1= 3
##$SIGF2= 2
##$SINO= 400
##$SIOLD= 16384
##$SREGLST= <1H.CDCl3>
##$SSB= 0
##$STSI= 0
##$STSR= 0
##$SW_p= 3612.71676300578
##$SYMM= 0
##$S_DEV= 0
##$TDeff= 0
##$TDoff= 0
##$TI= <>
##$TILT= no
##$TM1= 0
##$TM2= 0
##$TOPLEV= 0
##$USERP1= <user>
##$USERP2= <user>
##$USERP3= <user>
##$USERP4= <user>
##$USERP5= <user>
##$WDW= 1
##$XDIM= 8192
##$YMAX_p= 0
##$YMIN_p= 0
$$ End of Bruker specific parameters
$$ ---------------------------------
##NTUPLES= NMR FID
##VAR_NAME=  TIME,          FID/REAL,        FID/IMAG
##SYMBOL=    X,             R,               I
##VAR_TYPE=  INDEPENDENT,   DEPENDENT,       DEPENDENT
##VAR_FORM=  AFFN,          ASDF,            ASDF
##VAR_DIM=   8192,          8192,            8192
##UNITS=     SECONDS,       ARBITRARY UNITS, ARBITRARY UNITS
##FACTOR=    0.0002004,     1,               1
##FIRST=     0,             0,               0
##LAST=      1.6414764,     0,               0
##MIN=       0,             -664201,         0
##MAX=       1.6414764,     474320,          0
$$ Real data points
##PAGE= N=1
##DATA TABLE= (X++(R..R)), XYDATA
0@%%%qJ6j6J6k4L2l8N4p2Q8j04J28j55J79k16K64l10L59m23M92n65O54p54Q58
$$ 0 0 0 0 -8 8 -8 8 -16 16 -22 32 -40 48 -56 72 -83 96 -120 144 -166 193 -230 262 -303 351 -403 455
27D55r75J112j258J415j594J791k004K241k500K782l092L433l809M221m674N175
$$ 455 -520 592 -666 749 -845 946 -1058 1183 -1317 1465 -1627 1806 -2003 2218 -2456 2719
43B719n729O346p035P809q685R688j0845J2195j3803J5753j8172K1271k5408L1244
$$ 2719 -3010 3336 -3699 4110 -4575 5113 -5732 6463 -7340 8413 -9759 11512 -13896 17348
57A7348m0167N5679r0263L00892j13736n55329L21923M79226R8747m76509l49672
$$ 17348 -22819 32860 -57403 243489 129753 -425576 -103653 375573 474320 -2189 -351861
68c51861J58542M25868l8262m08310j76376K93063K38419j50214l60233m6487
$$ -351861 -193319 232549 194287 -214023 -390399 -97336 141083 -9131 -369364 -415851
78d15851L68676K94217k45937m04329L4736M19620K39940j75128l28891l2729
$$ -415851 -47175 247042 1105 -403224 -368488 51132 291072 115944 -212947 -245676
88b45676L21782K39054j54566k35899L5995J83712M6667j14535j08784O1365J48557
$$ -245676 76106 315160 160594 -75305 -39310 144402 191069 76534 -32250 29115 177672
99A77672l4064k16918o7938J63919J24054p2867j65498q9056Q9037J58616L960
$$ 177672 143608 -73310 -141248 22671 146725 73858 -91640 -180696 -91659 66957 70917
110G0917j27135m2808M8047K2659K1710M5037J0640k0676l4769m0556M5105J28263
$$ 70917 -56218 -99026 -50979 -28320 -6610 38427 49067 28391 -6378 -46934 -1829 126434
122A26434J8906j28611p9204M3887O8989L2204l5577q2020j9213L8407k1713l4513
$$ 126434 145340 16729 -62475 -18588 50401 82605 47028 -34992 -54205 -15798 -37511 -72024
134g2024N2677M0662o5593q7220j5723P7309J26318J3504j53485r5244J07270
$$ -72024 -19347 21315 -44278 -131498 -147221 -69912 56406 69910 -83575 -178819 -71549
145g1549J43853K6223o2164p7003o484R0745N9242l5827j6853K2271l0096m3083
$$ -71549 72304 98527 36363 -40640 -47124 43621 102863 67036 50183 72454 42358 -725
157g25K4265M5962K1202k0173q6405o5097O3602Q8431k0595o6047l3918j9365
$$ -725 23540 69502 90704 70531 -15874 -80971 -17369 71062 50467 -15580 -49498 -68863
169f8863J8664N7633J9791k0569k2612m9564k4694Q9832R8113m0232j06475l8356
$$ -68863 -50199 7434 27225 6656 -15956 -65520 -90214 -382 97731 57499 -48976 -87332
181h7332M9252R4391L5749r0502q2960M9193O0892l5928l9600K4662L8023l726
$$ -87332 -38080 56311 92060 1558 -81402 -32209 28683 -7245 -46845 -22183 15840 12114
193A2114p2744p4184P1319J59515j290j73936q8950J04505J63840M7678j25935
$$ 12114 -60630 -134814 -63495 96020 94730 -79206 -168156 -63651 100189 147867 21932
204B1932j37662O4140J70180J8720j10653l6693O2822M9140l2365q3474j16J23891
$$ 21932 -115730 -51590 118590 137310 26657 -10036 52786 101926 69561 -13913 -14029 109862
216A09862M1598j58608j35642P9099J57371K5586j39788j55446K4014J73017N4682
$$ 109862 151460 -7148 -142790 -63691 93680 119266 -20522 -175968 -151954 21063 75745
227G5745j34525r0811N9806P4232q559m9045l461Q4491N5838r7197j02446R7551
$$ 75745 -58780 -149591 -89785 -15553 -24112 -73157 -76618 7873 63711 -33486 -135932 -38381
239c8381J74532N704j46592j00203P0373J73240M7571j54812j16226R0998J15349
$$ -38381 136151 141855 -4737 -104940 -34567 138673 186244 31432 -84794 6204 121553
250A21553l7670j00428j4508P8909N1136r4552j34145N7575J87765J3167j96198
$$ 121553 83883 -16545 -31053 47856 98992 4440 -129705 -72130 115635 128802 -67396
261f7396j29589R8753J98318M8284j83809j68604J00438K10929M167j67373p1171
$$ -67396 -196985 -98232 100086 148370 -35439 -204043 -103605 107324 111491 -55882 -127053
272a27053J04017J21818l5383j55797k6901J83125J07925j55709j86642N0778
$$ -127053 -23036 98782 63399 -92398 -119299 63826 171751 16042 -170600 -119822
282a19822K11840R9717j50657k22043J9301K42865J07925j64798j68471M2462
$$ -119822 92018 191735 41078 -180965 -161664 81201 189126 24328 -144143 -101681
292a01681J58303O1676j10457j17709P2663J51334k9433j61750k9725J43059J15508
$$ -101681 56622 118298 7841 -109868 -37205 114129 84696 -77054 -106779 36280 151788
303A51788o0768j75573n9827J64367J61898p7908j86453l7646J18670J07396k3107
$$ 151788 91020 -84553 -144380 19987 181885 103977 -82476 -120122 -1452 105944 82837
314H2837j20159m9390Q7818O1832o4917n8198M2522N5836j2748o8375m8717N6086
$$ 82837 -37322 -86712 1106 62938 -1979 -60177 -17655 38181 25433 -42942 -91659 -35573
326c5573J05834j0329j19652m9762O7119P7337J6198n3265o8863R269O8207J8346
$$ -35573 70261 59932 -59720 -109482 -42363 34974 51172 -2093 -70956 -61687 6520 24866
338B4866k4814o40k06j9403M699K4071J5861J7221o621m4843j1024M8404K9983
$$ 24866 52 -588 -794 -20197 -15498 8573 24434 41655 35034 -9809 -20833 27571 57554
351E7554q977j0609k2560k4245K0151L5519L570j1320k8144m6597M770O2146J8924
$$ 57554 48577 37968 15408 -8837 11314 46833 50403 39083 10939 -35658 -30888 31258 50182
364E0182m8443m3759j2406J8354L9039J455m2977j0887K0037j1694j2964L1902
$$ 50182 1739 -42020 -54426 -36072 2967 4422 -38555 -49442 -29405 -41099 -54063 -22161
376b2161K9081q101k9933l3179J4422Q1007M0855o5530o3424K5337O1167L2643
$$ -22161 6920 -1181 -31114 -64293 -49871 31136 71991 6461 -56963 -31626 29541 62184
388F2184j6671n0006j0405M4563R114l8448O004M2560p093n1345l2141K1365O9944
$$ 62184 45513 -4493 -14898 29665 38779 331 6335 48895 41802 -9543 -41684 -20319 49625
401D9625L0412q2268q7816M1593R9697J6764o2931n7795R694O8903K6559n9273
$$ 49625 80037 -2231 -90047 -48454 51243 68007 5076 -52719 -43025 25878 52437 -6836
413f836l0854N8544L3131n3943n0296K6482P4408L1906p9607j05448L3311J31837
$$ -6836 -37690 20854 53985 42 -50254 -23772 50636 82542 2935 -102513 -69202 62635
425F2635K8397j07816q7536K7981R4942L7994p8283p8691N0514Q6381k7715q1996
$$ 62635 91032 -16784 -104320 -76339 18603 56597 -21686 -100377 -49863 36518 8803 -73193
437g3193L297Q3513N3854n2818j03906Q031J42511P3896j03149j15497L0830J22989
$$ -73193 -69896 13617 67471 14653 -89253 -81222 61289 135185 32036 -83461 -52631 70358
449G0358O1333p2546j10503J6447J16086K1913r8420m9767O2783O4005l1453r8863
$$ 70358 131691 59145 -51358 -34911 81175 103088 4668 -45099 17684 81689 50236 -48627
461d8627l5111J00420R2084p7853j42620q83J24029P5411o1819j21497k1915J13952
$$ -48627 -83738 16682 108766 30913 -111707 -112590 11439 86850 25031 -96466 -118381 -4429
473d429P7744p2703q8093L2113Q0246R585o2781m4249N4735R1979k2154j18713
$$ -4429 73315 612 -87481 -55368 24878 34463 -28318 -72567 -17832 74147 51993 -66720
485f6720k5430J10566Q3995m5755j07428l6941Q8452R9720l5926j08964j1513
$$ -66720 -92150 18416 102411 56656 -50772 -87713 739 100459 64533 -44431 -55944
496e5944Q0066L7397l8934m7057Q833O0156J5233p4668m4366O9585P5166l2765
$$ -55944 24122 61519 22585 -24472 -15639 44517 59750 -14918 -59284 10301 85467 52702
508E2702q6278l1911N6627Q1867q346r7046m1003O3727N2053k4998m4562j0277
$$ 52702 -33576 -65487 -8860 73007 64661 -32385 -73388 -9661 42392 17394 -27168 -37445
520c7445K6884K4096k7497m1187K9763N7309j6775o1759j4805M3651N2283N168
$$ -37445 -10561 13535 -13962 -55149 -25386 31923 15148 -46611 -61416 -17765 34518 39686
532C9686n8453m2489M3771N8961q095l4848p754R436J5199M944j5223J240K6339
$$ 39686 -18767 -61256 -17485 41476 33381 -1467 -9221 215 15414 20358 5135 6375 32714
545C2714q873m1584k009L5727J7962j1028l1537k8318J6878M2565k07l1095r884
$$ 32714 23841 -17743 -19752 15975 33937 22909 -8628 -36946 -20068 22497 22290 -8805 -18689
558a8689Q09J7J6458J4753r171r600n361r449J5841L3867l781l0189n591R822
$$ -18689 -17880 -17863 -1405 13348 4177 -5423 -10784 -20233 -4392 29475 25694 -4495 -10086 -264
572b64P602J3995J794j7601o135O09j2120P929L0670m983m1139k0032J4464K9566
$$ -264 7338 21333 23127 5526 -609 0 -12120 -4191 26479 21496 -19643 -39675 -25211 4355
586D355J9867k5623m8616M537M7773J0323k5021j0817Q758J4815N193j8864n495
$$ 4355 24222 -1401 -50017 -45480 2293 12616 -12405 -23222 -14464 351 5544 -13320 -18815
599a8815M2082K6276m1988m0916K5296N4214K1778l6567n9832K988P0171K8091
$$ -18815 23267 49543 7555 -33361 -8065 46149 67927 31360 -28472 -25484 44687 72778
611G2778n6153m5909J9241L6923L005l8795l2187K9430M6693l0551p2138K480
$$ 72778 16625 -29284 -10043 26880 29885 -8910 -41097 -11667 35026 4475 -67663 -65183
623f5183O9910L3751m4505p1582o744Q3592O0725n4889p9110J7424P5867L0513
$$ -65183 4727 38478 -6027 -77609 -84353 -761 59964 5075 -74035 -56611 19256 49769
635D9769l9217m8283J7226P0387J2629p0588k9964O6846N8561l3232p7425k3140
$$ 49769 10552 -37731 -20505 49882 62511 -8077 -38041 28805 87366 54134 -23291 -46431
647d6431O9979P6075l8942j08464j8481Q4645N2894m3899p5627j5591O2284M5288
$$ -46431 23548 99623 60681 -47783 -66264 18381 71275 27376 -48251 -63842 -1558 43730
659D3730n1515o6571L0278O9874m794o5357l1736M7438P4845l847q8765l8737
$$ 43730 -7785 -74356 -44078 25796 21002 -44355 -76091 -28653 46192 42345 -46420 -85157
671h5157P7762P7404k4730p3951k2833N2756O2045j6737o9277o366O3671K0870
$$ -85157 -7395 70009 45279 -28672 -51505 1251 63296 46559 -22718 -29084 34587 55457
683E5457m9427l5881K3878M9459O205o1248m7390M6063P0074j6700p0866k4111
$$ 55457 6030 -29851 -5973 43486 49691 -11557 -58947 -12884 57190 40490 -30376 -54487
695e4487M0533M8550m014n4413k3162M7281L3414l3775l3559K0381L6864L862
$$ -54487 -13954 34596 30582 -23831 -46993 288 33702 -73 -33632 -13251 23613 27475
707B7475l7586l3389K9116O0606n147o5050k4646M1784M1696l887m2424k9386
$$ 27475 -10111 -43500 -14384 46222 41075 -23975 -48621 -6837 34859 30972 -11452 -40838
719d0838K8439M1164j6305l9154P514K9634K431k3193j9324J3232M0472O847m8462
$$ -40838 -12399 28765 12460 -26694 -19180 10454 12885 -10308 -29632 -16400 24072 30919 -17543
732a7543k7968L6463M1458l416l1656k5907J1914M0561Q336l3232j2427J8999
$$ -17543 -45511 -9048 32410 28994 -2662 -28569 -16655 23906 32242 -990 -13417 5582
744E582P948p185m172n41Q661Q407j7018k0300J6617K5365o327j8460r403j306
$$ 5582 13530 6345 2173 1632 10293 18700 1682 -18618 -2001 23364 17037 -1423 -10826 -12132
758a2132J4650J6583j0327j7553M70K419N38J2541M645j8679j1319P786O592O162
$$ -12132 2518 19101 8774 -8779 -8309 -5890 -5352 7189 11834 -6845 -18164 -10378 -3786 2376
772B376O99j5936q270J5560N281j3928J88J2352J080p232r112l120K1645K4655
$$ 2376 3075 -12861 -21131 -5571 -290 -14218 -14030 -1678 -598 -7830 -16942 -20062 1583 26238
786B6238j8638l3679P502L3921J6533j0782k5506r252K9545K5592k0507k4931
$$ 26238 7600 -26079 -18577 15344 31877 21095 -4411 -13663 15882 41474 20967 -3964
798c964J2327J9042m112j7592j1212J1609K6153r928m5012r896L8128K1800k1702
$$ -3964 8363 27405 23293 5701 -5511 6098 32251 22323 -22689 -32585 5543 27343 5641
811E641l5293j3067K6519L2900j4756m0500J988L2072O458j8619j0263J2340K4579
$$ 5641 -29652 -42719 -16200 16700 1944 -38556 -36568 -4496 1962 -16657 -26920 -14580 9999
824I999K740l3539j2793M2619L3621k5219l8727q0L6238L1687j6410m7703l721
$$ 9999 12739 -20800 -33593 9026 42647 17428 -21299 -21379 14859 46546 30136 -17567 -21288
837b1288M6442J6529l5161k6805J5552K9253J897l7902k7196L5478M5950k3545
$$ -21288 25154 41683 6522 -20283 -4731 24522 26419 -11483 -38679 -3201 42749 19204
849A9204n8832o088M9047L8351k0756n8159j3948N9166M2471l8335n2740J2761
$$ 19204 -39628 -45716 3331 41682 20926 -37233 -51181 7985 50456 12121 -40619 -27858
861b7858N0687J8206l7299m3477J9926O2589M021o5816l2741M6096N3585q952
$$ -27858 22829 41035 3736 -39741 -19815 42774 46795 -19021 -51762 -5666 47919 38967
873C8967o1977l6341M4583O4657j6687p0469j7070N0327L9126j9384m9914j0205
$$ 38967 -23010 -59351 -14768 49889 33202 -37267 -54337 -4010 35116 15732 -34182 -44387
885d4387N0496L5752l9354m9002K0513N4867J2674m0836m0885J6566N9560J7845
$$ -44387 6109 41861 2507 -46495 -25982 28885 41559 723 -40162 -23596 35964 53809
897E3809n3033l9280K8698M4035L057l3135k7893J5300L6531k734l8454p163K9048
$$ 53809 776 -38504 -9806 34229 37286 4151 -23742 -8442 28089 25355 -13099 -20262 8786
910H786J2265j8345k2432j563K6079J8878k3593l2185J0546L0238M034j6039j3644
$$ 8786 21051 2706 -19726 -21289 4790 23668 75 -32110 -21564 8674 12708 -3331 -16975
923a6975l33J6991J0505j3687q904J3601N416j1249k321Q246O253K336q073j3440
$$ -16975 -17308 -317 10188 -3499 -12403 1198 6614 -4635 -6956 1290 7543 9879 1806 -11634
937a1634Q117J9893l488j6864j35O569K186J570m454n300P938M059j4210m667
$$ -11634 -3517 16376 12888 -3976 -4111 2458 4644 6214 1760 -3540 4398 8457 -5753 -10420
951a0420J4790O074q586q151n015N679J5990l11j8895m045J2344L930j786m78
$$ -10420 4370 10444 1858 -6293 -11308 -5629 10361 10050 -8845 -12890 -546 3384 1598 1120
965A120m530k84O917k612o458Q907N782r458m711M842J311L088L717q122n954
$$ 1120 -3410 -3694 3223 611 -5847 3060 8842 -616 -5327 -485 826 3914 7631 -491 -6445
980f445P024J831m144O058K503j1723n213P855O362M205m301j6724k626K1156
$$ -6445 579 2410 -1734 4324 6827 -4896 -10109 -2254 4108 8313 4012 -12712 -15338 5818
994E818R646j5929j1441M892R834P426p416j5892P338K1683m534k3218k361J9169
$$ 5818 15464 -465 -11906 -7014 2820 10246 2830 -13062 -5724 15959 11425 -11793 -14154 5015
1008E015J4372o953k4920j1884K7241K7026j7875l3602j64K6111J7155j1536k8938
$$ 5015 19387 12434 -12486 -24370 2871 29897 12022 -21580 -21744 4367 21522 9986 -18952
1021a8952n070L1690J6584k6981k3537J5430K7028L015k4673k2154J6342L8586
$$ -18952 -24022 7668 24252 -2729 -26266 -10836 16192 19207 -5466 -27620 -11278 27308
1033B7308j098l9107j5130K7604K6966n448k8917j6224K4106K9760j4233l4038
$$ 27308 26210 -12897 -28027 -423 26543 21095 -7822 -24046 60 29820 15587 -18451
1045a8451K409K8599R421j9139k3083L525L1219J1496l2888k5269K0584L0092
$$ -18451 -16042 12557 21978 2839 -20244 -16719 14500 25996 -6892 -32161 -11577 18515
1057A8515k423k6037j7103J4390K9704j779l1979p391K7112J4113j5947j8088
$$ 18515 16092 -9945 -27048 -12658 17046 15267 -16712 -24103 3009 17122 1175 -16913
1069a6913L115K2976J3301k2183k6358J6498L3503j332k8655j4249J5089K6575
$$ -16913 -13798 9178 22479 296 -26062 -9564 23939 22607 -6048 -20297 -5208 21367
1081B1367K679k9959j5924K4853K2967j4638k3726N93J9887J3739j4845k7314
$$ 21367 24046 -5913 -21837 3016 25983 11345 -12381 -11788 8099 21838 6993 -20321
1093b0321M821L3131O228l0165j9268J4436K5494N270k4968k3849J6031L0833
$$ -20321 -15500 17631 23859 -6306 -25574 -11138 14356 19626 -5342 -29191 -13160 17673
1105A7673m301k8327p505J7967J7276m144k2880q170K4770J8873j7327k3393O144
$$ 17673 13372 -14955 -22460 -4493 12783 8639 -14241 -22411 2359 21232 3905 -19488 -13344
1118a3344K1963J0637j1671k1884k77K6613J0653k0075j5075Q040J4399M089j0886
$$ -13344 8619 19256 7585 -14299 -14576 12037 22690 2615 -12460 -4420 9979 14068 3182
1131C182j3565N302J8181k240j8510l293J1701P298k264j1180q958R950J4902
$$ 3182 -10383 -5081 13100 10860 -7650 -10943 758 8056 5792 -5388 -14346 -4396 10506
1144A0506n452j3662J70O520M241K623m770o141M607O897l898k150M487j123j812
$$ 10506 5054 -8608 -8438 -1918 2323 4946 176 -5965 -1358 5539 1641 -509 3978 2855 1043
1159A043K806j758l290M319J505n224j048Q86l334K519N317n311q549K305N507
$$ 1043 3849 2091 -1199 3120 4625 -599 -1647 -761 -4095 -1576 3741 -1570 -10119 -7814 -2307
1174b307J858L84o253o777P952J0502m872p852K370M952L834P95n906j204J1224
$$ -2307 -449 -65 -6318 -13095 -5143 5359 487 -7365 -4995 -43 3791 4586 -1320 -2524 8700
1189H700M106j1012m085Q662N965j047o499p790M151J3276k750j5701k460R435
$$ 8700 12806 1794 -2291 6371 12336 11289 4790 -3000 1151 14427 11677 -4024 -6484 2951
1203B951K988m251p977m133Q288P695j0835j1746Q311J1931k061j0086n671N101
$$ 2951 5939 1688 -6289 -10422 -2134 5561 -5274 -17020 -8709 3222 1161 -8925 -14596 -9495
1217i495J4748J721j6478n543J5362J0422o984r045p18J0523J0033q094j5824
$$ -9495 5253 6974 -9504 -15047 315 10737 3753 -5292 -6010 4513 14546 6452 -9372
1230i372N994J9217j78j6619q296P914J5236K270j9143j4273J5158J8805p880
$$ -9372 -3378 15839 15661 -958 -9254 -1340 13896 16166 -2977 -17250 -2092 16713 8833
1243H833j9185l629J2593J2942n628k0165k495K2058R675j7894j4744Q081J8200
$$ 8833 -10352 -13981 -1388 11554 5926 -14239 -16734 5324 14999 -2895 -17639 -9558 8642
1256H642O292j5519j8693R774K6375M65k2846j0353J3862J6964j70j9059j1520
$$ 8642 14934 -585 -19278 -9504 16871 17336 -5510 -15863 -2001 14963 14793 -4266 -15786
1269a5786J5715J9431j0051k1437J49J6768R791r464j8671j562K1662J0308j8662
$$ -15786 -71 19360 9309 -12128 -11979 4789 14580 5116 -13555 -15117 6545 16853 -1809
1282a809j6401Q337J6891L638j2789j3958O491J9890P09j8819o389J3656J1520
$$ -1809 -18210 -9873 7018 10656 -2133 -16091 -9600 10290 10999 -7820 -14209 -553 10967
1295A0967m202j2674n852J3150J4709q796j7392K501J5181N101p869j0556o19
$$ 10967 6765 -5909 -11761 1389 16098 7302 -10090 -7589 7592 12693 4824 -5732 -6351
1308f351J3190P132j3104r974Q516R537k742r075m718N640J0408k870j4542j840
$$ -6351 6839 13971 867 -9107 -591 8946 6204 -2871 -7589 -1949 8459 5589 -8953 -10793
1322a0793J2791N059p568p864r17P956P230n626j0734L822J0476j018o249j381
$$ -10793 1998 7057 -511 -8375 -9292 -1336 5894 268 -10466 -6644 3832 2814 -3435 -4816
1336d816K634N890J848p737m302R262O209n726n975J333L772M799j401p971j913
$$ -4816 -2182 3708 5556 -2181 -6483 2779 8988 3262 -2713 -1380 2392 7191 5790 -2181 -4094
1351d094Q243J681n652k074J119N10J837r99m928J566M498j817m043J520J261
$$ -4094 4149 5830 178 -1896 -777 -267 1570 571 -4357 -2791 1707 -110 -4153 -2633 -1372
1366a372l01K107k58l884K055L056j051L8J151k230m02M491O77l792n3P86N07
$$ -1372 -1673 434 176 -3708 -1653 1403 352 390 1541 -689 -1091 3400 4077 285 232 1018 1525
1383A525K089o41m750N20N802j323n939p35K588K236J621n589o192N691Q149l965
$$ 1525 3614 2973 -1777 -1257 4545 3222 -2717 -3452 -864 1372 2993 -2596 -8788 -3097 5052 1087
1399A087p740m63M290N478Qp704l624R282O245o443o205L135O280L374m307q300
$$ 1087 -6653 -7116 -2826 2652 2660 -5044 -8668 614 6859 416 -5789 -2654 3626 7000 2693 -5607
1415e607K387J2319J213j1077n217O183Q030L44q406q186O990J1039l719j1911
$$ -5607 -3220 9099 10312 -765 -5982 201 8231 8575 169 -8017 -1027 10012 6293 -5618
1429e618j310Q223M706l328r314k325J0577O476r424r710N330R532J777p245q051
$$ -5618 -6928 1295 6001 2673 -6641 -8966 1611 8087 -1337 -11047 -5717 3815 5592 -1653 -9704
1444i704L664J2926R67j2533m810R519P761k952p913m405Q498R389n950j1863
$$ -9704 -6040 6886 7853 -4680 -9490 29 7790 4838 -3075 -7480 1018 10407 4457 -7406
1458g406J734J1441K824p260q157J094J0796M692j0826r272P661J0361k333r028
$$ -7406 -5672 5769 8593 1333 -6824 -5730 5066 9758 -1068 -10340 -2679 7682 5349 -3679
1472c679m113N578R666j412j3069k307J2012O448o988q938O33R046P128o817j1682
$$ -3679 -7792 -2214 7452 6040 -7029 -9336 2676 9124 2136 -6802 -6169 2877 10005 3188 -8494
1487h494K905J2232J708r106n493L428Q073K025q791p055P623Q927m717q934j126
$$ -8494 -5589 6643 8351 -755 -6248 -2820 5253 7278 -1513 -8568 -945 7982 3265 -5669 -6795
1502f795O547O292k663j0078k110J0705N123p359o519J769O503L648m309p226
$$ -6795 -248 6044 3381 -6697 -8807 1898 7021 -338 -6857 -5088 1415 5063 754 -6472
1516f472K092R206K40p509j940M405M259m3n284l884N718O339l884o223J054M388
$$ -6472 -4380 4826 5066 -2443 -4383 22 4281 4238 -1046 -4930 788 7127 3243 -2980 -1926 2462
1532B462J770j422m778j696O007K597n027l560L107K040M0j817k928R19M441l86
$$ 2462 4232 2810 -1968 -3664 2343 4940 -87 -3647 -540 1500 1540 -277 -3205 -2286 2155 1769
1548A769m809L15K926N47n86m69j926J089L005j179k654J499J442j281K98L32
$$ 1769 -3040 -2725 201 748 162 -307 -2233 -1144 1861 682 -1972 -473 969 -312 -14 318
1564C18j325Q11J928j862r89J476l68m03J601o16k507Q99K367q37m06k23j653
$$ 318 -1007 -196 1732 -130 -1119 357 -11 -414 1187 571 -1936 -1037 1330 493 87 -136 -1789
1581a789J163L093j427l250J164K134j38k29p21j603K616K660l795k350K953K944
$$ -1789 -626 2467 1040 -2210 -1046 1088 950 721 0 -1603 1013 3673 -122 -2472 481 3425
1597C425j549k155j730J064M504k54n826j885N270K358k375l101j465K890M409
$$ 3425 1876 -279 -2009 -945 3559 3305 -2521 -4406 864 3222 847 -2254 -3719 -829 3580
1612C580k448o004R94N870N72l647k571N19M700K675n247n061M654N825j466m827
$$ 3580 1132 -4872 -3878 1992 2564 -1083 -3654 -3135 1565 4240 -1007 -6068 -1414 4411 2945 -1882
1628a882k043L129N199J71o915k124O338M117m382m622K6M830L990l668p152J180
$$ -1882 -3925 -796 4403 4574 -2341 -4465 1873 5990 1608 -3014 -2988 1842 5832 2164 -4988 -3808
1644c808Q026O35o006l196J924N344J640n616n124M915O416k650n966o78M642
$$ -3808 4218 4853 -1153 -4349 -2425 2919 4559 -1057 -6181 -1266 5150 2500 -3466 -4144 498
1659D98M033j781o877j069P449L720n683n186K108N633K021l811o035J700P715
$$ 498 4531 2750 -4127 -5196 2253 5973 290 -4896 -2788 2845 4866 1055 -4980 -3280 4435
1674D435K3o835k432L818M438q08n015l284N089O101m104o767J255N555K766l161
$$ 4435 4458 -2377 -4809 -991 3447 2639 -2376 -5660 -571 5530 1426 -5341 -4086 1469 4235 1074
1690A074n351kO473L394n729m683L495N050J08l564l812K329O237k26o373j888
$$ 1074 -4277 -4279 2194 5588 -141 -4824 -1329 3721 3829 265 -3547 -1218 5019 4793 -1580 -3468
1706c468M991K951j985m232j664L900M558l010o266J207N024N79k959l229N96
$$ -3468 1523 4474 2489 -1743 -3407 493 5051 2041 -4225 -3018 2006 2585 -374 -3603 -3007
1721c007M000K104m500l226L227L687j111k786j598J150M035M23m284j377L867
$$ -3007 993 3097 -1403 -4629 -1402 2285 1174 -1612 -3210 -2060 1975 2398 -1886 -3263 604
1736F04J617j581j403m67J433K186r08k785O78K607k88j454m67k76J293J483j910
$$ 604 2221 640 -763 -1230 203 2389 1481 -1304 -626 1981 1693 239 -228 -504 789 2272 362
1753C62k411J811J728p64q44j46o66L78J516j013j259J036q6k42R83k96j128R65
$$ 362 -2049 -238 1490 726 -118 -264 -930 -552 964 -49 -1308 -272 -358 -600 383 87 -1041 -76
1771g6P87j149n29J455L6m16N26n41j078J642P53j594m20M98m9R12K89k268n37
$$ -76 711 -438 -967 488 524 108 634 93 -985 657 1410 -184 -604 -106 -155 757 1046 -1222 -1759
1790a759K615K6j745o00O98K91Q19n91k000P66K940o92k497J91J454Q69M45j711
$$ -1759 856 882 -863 -1463 -765 -474 345 -246 -2246 -1480 1460 768 -1729 -1538 -84 785 1230 -481
1808d81j680K741K283j981k114J179J504P63j080k295j09L658J051l843j676K229
$$ -481 -2161 580 2863 882 -1232 -53 1451 2214 1134 -1161 -1270 2388 3439 -404 -2080 149
1824A49K066L32l016k569J468M361q01m825p82L238J857j120k649j407L437L143
$$ 149 2215 2547 -469 -3038 -1570 2791 1990 -2835 -3617 -379 1478 358 -2291 -3698 -261 2882
1840B882k901m447J919M183O91k388k918O09M905J613m289l512L220M026m43l241
$$ 2882 -19 -4466 -2547 1636 2327 -61 -2979 -2370 2535 4148 -141 -3653 -433 3593 3150 -91
1856i1k703K344M390p48n311j048M463K125k363l244r65L657L120l056m581J094
$$ -91 -2794 -450 3940 3192 -2119 -3167 1296 3421 1058 -2186 -3151 506 3626 570 -4011 -2917
1872b917M603N63l101k359J138L682J284m081k585L417L338j373k666j056J899
$$ -2917 1686 2249 -852 -3211 -2073 1609 2893 -1188 -3773 -356 2982 1609 -1057 -2113 -214
1887b14L281m46m690l68M248J307k625k046J00K403J476k174l304J519L032n05
$$ -214 3067 2621 -2069 -2437 1811 3118 493 -1553 -1453 950 2426 252 -3052 -1533 1499 994
1903I94k655o73J333K038J41k940j805L405K141j695k492O81J971J517p56k669
$$ 994 -1661 -2334 -1001 1037 1178 -1762 -3567 -162 1979 284 -2208 -1527 444 1961 1205 -1464
1919a464l07L371J438l101j156J379J485K0j324j958J415K962r74k859l03J723
$$ -1464 -1771 1600 3038 -63 -1219 160 1645 1665 341 -1617 -202 2760 1786 -1073 -1376 347
1935C47J319n84k148j225K281J724j484k080O74R80P31l93j610m14K033J126k354
$$ 347 1666 1082 -1066 -2291 -10 1714 230 -1850 -1176 -196 535 142 -1468 -1882 151 1277 -1077
1952a077o98Q53J185J92l45j563K10K284M47j787m44P34K41O71M5j821N30J358
$$ -1077 -1775 -922 263 455 110 -1453 -1243 1041 1488 -299 -743 -9 232 903 948 -873 -343 1015
1970A015P0j239M4J52M07O39o54j715J058J200k11j013k84k94R98J209r67j807
$$ 1015 1085 -154 -110 42 449 1088 434 -1281 -223 977 766 -247 -531 -825 173 1382 415 -1392
1988a392O95J431l31k99p63j47J061J245j397j518J461J226o18j260k49N09J639
$$ -1392 -697 734 403 104 -659 -806 255 1500 103 -1415 46 1272 654 -606 -855 -346 1293
2005A293M91k755j109K217J462r69j451m21Q21J495l96k435K66J852M53j450q42
$$ 1293 1784 -971 -2080 137 1599 630 -821 -1242 -421 1074 678 -1757 -1491 361 814 -636 -1478
2022a478L9J842R95j750j861J871J950m43j611r11P96J910N93k759n30K347J442
$$ -1478 -1439 403 1398 -352 -2213 -342 1608 1165 -446 -1357 -561 1349 1942 -817 -1347 1000 2442
2039B442j870j339L51J366J321j419k695R43K986m50k488r98J048J769L91k160
$$ 2442 572 -767 -416 950 2271 852 -1843 -900 2086 1636 -852 -1850 -802 967 1358 -802
2055h02j889K161K374j631k431N42K091J053j174k481l00L768J268l065j664J569
$$ -802 -2691 -530 1844 213 -2218 -1676 415 1468 294 -2187 -2487 1281 2549 -516 -2180 -611
2071f11K035O83k107k232J278L655k41l337j129K591J494n37k413j133K243K850
$$ -611 1424 2107 0 -2232 -954 2701 2460 -877 -2006 585 2079 1542 -871 -2004 239 3089
2087C089k406l115Q82K802Q59j743k387k79L752J350k671k571J754J963J92j444
$$ 3089 683 -2432 -1550 1252 2111 368 -2019 -2298 1454 2804 133 -2438 -684 1279 1471 27
2103B7j765Q19K590R0k843o24K234J033r04j517q45J793K130j241l066Q37J846
$$ 27 -1738 -919 1671 1761 -1082 -1706 528 1561 657 -860 -1705 88 2218 977 -2089 -1252 594
2120E94N50j117j213l66J700J163j415j512Q87J700o14o14o37L74J807j34j637
$$ 594 1144 27 -1186 -1552 148 1311 -104 -1616 -729 971 357 -257 -894 -520 1287 1153 -484
2137d84o42J796P06p75n72l31J36J336m26j390P37J124l50r32R9r6O56M74j158
$$ -484 -1126 670 1376 601 29 -302 -166 1170 744 -646 91 1215 865 -67 32 -64 592 1066 -92
2156i2j292J247J179m88q94j25M4M67N50j035o22Q32M99j29l90K87p01Q87K48
$$ -92 -1384 -137 1042 554 -340 -465 -421 46 596 -439 -1061 -229 270 141 -249 38 -663 224 472
2175D72p52l52J086O2l65k49j70r6J229r2j674K22Q24K28J68l47p67k6J528K7
$$ 472 -280 -632 454 516 151 -98 -268 -364 865 773 -901 -679 145 373 541 194 -573 -599 929 956
2195I56j682K53P76K9J17n00q99P85J745j120j560O82J184K88k42j768J42J638
$$ 956 -726 -473 303 332 449 -51 -950 -165 1580 460 -1100 -418 766 1054 812 -956 -814 824
2213H24J155j799j594J196J123N5q33j376L7K168L25k202q25J436J050J47j870
$$ 824 1979 180 -1414 -218 905 960 127 -1249 -1212 956 1281 -921 -1746 -310 740 887 -983
2230i83q37J175K309o38k571p6J743R11m15j330p79J428J993j413k067J001J877
$$ -983 -1820 -645 1664 1026 -1545 -1621 122 1033 618 -712 -1491 -63 1930 517 -1550 -549 1328
2247A328m7j299r71K51K201O73k719j373J984J765o77j140j368P60K282m61k214
$$ 1328 1281 -18 -989 -738 1463 2136 -583 -1956 28 1793 1116 -24 -1392 -632 1650 1189 -1025
2264a025j3J761L33j165q32J15J431J157k197j517J263J995j28j568q17N96J799
$$ -1025 -1038 723 1056 -109 -941 -826 605 1762 -435 -1952 -689 1306 1178 -390 -1207 -611 1188
2281A188K38k270r90K031R48p88j082l22R15J155j029j704P43K225j7j985o78
$$ 1188 1426 -844 -1834 197 1145 357 -725 -1047 -132 1023 -6 -1710 -967 1258 1241 -744 -1422
2298a422Q76J071M53j164j491J028K237p75j665k31R72R50q6j385p24K115R03
$$ -1422 -546 525 978 -186 -1677 -649 1588 813 -852 -1083 -111 839 753 -632 -1356 759 1662
2315A662j400j264M38J000J175p30k038o3K170Q41j788n61K18N82O39q20j127
$$ 1662 262 -1002 -564 436 1611 881 -1157 -1220 950 1791 3 -558 -340 242 881 61 -1066
2332a066N54J584o82j211Q8P04N59j98r85p22J074J319j026r85J15O63O44j99
$$ -1066 -512 1072 390 -821 -733 -29 530 332 -653 -1375 -301 1018 -8 -993 -878 -215 429 230
2350B30o45n47P69R20o69o27N25K41L83m8j118J98J178K61j183j03N22k01N13
$$ 230 -415 -962 -193 727 58 -569 -44 197 580 532 -586 -388 790 1051 -132 -235 287 86 599
2369E99L60j428J35R27L31j168J0J74P0M13j68q52M3Q77j26q63P1M6R70M4n33
$$ 599 959 -469 -334 593 924 -244 -234 -60 10 423 255 -597 -554 323 197 -666 -595 -549 421 465 -68
2390f8j189R80J231m66q76l5J53N01P68j415n35J311N47j120j71J27O91M96o33
$$ -68 -1257 -277 954 488 -388 -423 -270 231 999 -416 -951 360 907 -213 -384 -257 434 930 297
2409B97j587L21J538K91j250l38n3Q04P06m58j624M68J411N4q32m59P48O11N18
$$ 297 -1290 -969 569 860 -390 -728 -781 23 729 271 -1353 -885 526 580 -252 -711 37 648 1166
2428A166j453p64J915J007r43j644J33J203J007m56k227k3J851O53j420j163N87
$$ 1166 -287 -1051 864 1871 928 -716 -583 620 1627 1171 -1056 -1079 772 1425 5 -1158 -571
2445e71P71K78o81j172L98J597k79j680p5R72P83K71j353r96J382K029j215j352
$$ -571 200 478 -203 -1375 -977 620 341 -1339 -1414 -442 341 612 -741 -1737 -355 1674 459 -893
2463h93k03J386J077m32j513k22J944P16j519j437Q18J237M35j223j314L94J742
$$ -893 -1096 290 1367 935 -578 -800 1144 1860 341 -1096 -278 959 1394 171 -1143 -749 993
2480I93M75j745r62J195Q01J4r70j137R21J443q38j191L91J138Q7l82j172k46
$$ 993 1468 -277 -1239 -44 757 771 -199 -1336 -415 1028 190 -1001 -610 528 615 233 -939 -1185
2498a185J427J513j600j504P44J140J21m59q02j51J208N26j505m20P03N60l12
$$ -1185 242 1755 155 -1349 -605 535 656 197 -605 -756 452 978 -527 -947 -244 316 4
2515Do62j56O29R58l59j377k0J522p6j26r80m08J160J116q40j413P76Q27N1l07
$$ 4 -658 -814 -185 773 414 -963 -983 539 463 337 -643 -1051 109 1225 385 -1028 -252 575 626 319
2535C19n57j18P58O06j561mJ130M22n59n33o86M43J598k63j626J33P62L09l55
$$ 319 -238 -356 402 1008 -553 -557 573 995 436 -97 -783 -340 1258 995 -631 -498 264 573 218
2554B18l92k17J14J005k99j196K08J244n39j54q94M8P81Q50o47j569J020O43K27
$$ 218 -174 -391 -277 728 429 -767 -559 685 146 -8 -902 -854 -73 777 130 -1439 -419 224 451
2573D51l40o56l02P65J014j152n80Q45M99l12n5n06J72Q50M66j284l00Q87L11
$$ 451 111 -545 -847 -82 932 -220 -800 45 544 232 177 -329 -157 693 1159 -125 -425 462 773
2592G73j05m80o06J66J377j67j602P7O13L12J50k43j011J87J335p44r42N08M29
$$ 773 668 188 -418 -252 1125 958 -644 -567 46 358 508 265 -746 -559 776 32 -910 -402 27
2611B7J6n6l06m94R78Q91j082q96Q45L13M40n31n12l48J011N28j099n60P59N49
$$ 27 43 -13 -319 -813 165 1056 -26 -922 -77 236 676 145 -367 -715 296 824 -275 -835 -76 473
2631D73n25k80l20N26Q81j30j456k90J329O19q54k53o35R80R33n94j153J87J495
$$ 473 -52 -332 -652 -126 755 625 -831 -1121 208 827 -27 -280 -915 65 998 404 -749 -562 933
2650I33m80k55p15K74J346K44j387r23J333J047n11j129n64K59J403O2j410o30
$$ 933 453 198 -517 -243 1103 1347 -40 -963 370 1417 906 -223 -787 -528 875 937 -473 -1103
2668a103J267L24p63k62n30J055P05p04j410M39J735R1j273n42K49J440N51j519
$$ -1103 164 488 -275 -537 -1067 -12 693 -11 -1421 -982 753 844 -429 -971 -722 718 1269 -250
2686b50j437J376J330k29j033l26J50J330J53j454n69J379P80r83n83r9P52Q28
$$ -250 -1687 -311 1019 790 -243 -569 -419 911 1064 -390 -959 420 1200 217 -366 -465 287 1115
2704A115l74j904K30J605L32r01o20k07J031P20n91j275O93J056l9j097m27M98
$$ 1115 741 -1163 -933 672 1004 103 -517 -724 307 1027 436 -839 -146 910 871 -226 -653 -155
2722a55O60J71r69q28R33J350o36j263J66O4J021K8r54n16J101K22o94k49L80
$$ -155 505 676 -293 -1121 -188 1162 526 -737 -571 -507 514 542 -412 -928 173 395 -299 -548 -168
2741a68N3K74J83j296M36J418m16p83j96K74M15K76k78j014N94P95q0n85M03j63
$$ -168 -115 159 342 -954 -518 900 484 -299 -495 -221 194 470 192 -822 -228 567 487 -98 305 142
2761A42k2L66n53l86Q54M51q37p36Q12J22L14J08j129m85J240O29j092k39j6L10
$$ 142 120 486 -67 -453 401 852 15 -721 91 213 527 635 -494 -979 261 890 -202 -441 -457 -147
2781a47L39L24j087n1R77k86n67l1L10M18j84l55p90P41J387o03j206M88J99M39
$$ -147 192 516 -571 -622 355 69 -498 -529 -219 199 15 -340 -1130 -389 998 395 -811 -323 -124 315
2801C15M10o75j128P02J272q88m01K71K41J33J06p79m43J316M94r90q11L63M39
$$ 315 725 50 -1078 -376 896 8 -393 -122 119 252 358 -421 -864 452 946 -44 -855 -492 -53
2820e3P49j00j121l40J671K08j102l88J74O07L39m55j068O25J130m75j395L24
$$ -53 696 596 -525 -865 806 1014 -88 -476 -302 305 644 189 -879 -254 876 401 -994 -670
2838f70N44L92M53j237j088J575J152j081o26J00R9O34K47q86m14J254L39r92
$$ -670 -126 266 719 -518 -1606 -31 1121 40 -586 -486 -387 247 494 -392 -806 448 787 -205
2856b05m81Q22J00K03l6j348J26J435L51j326n51P37P80J01n74j098O10J288m94
$$ -205 -686 136 236 439 403 -945 -819 616 967 -359 -910 -173 607 708 134 -964 -354 934 440
2875D40r99L02O83M6n5o51l92J255N28j160n84N07P19K0l96j046P7J456M7j248
$$ 440 -559 -257 426 472 417 -234 -626 629 1157 -3 -587 -80 639 659 263 -783 -706 750 797 -451
2895d51j73Q81J7O2n22n26M66J078m67j551L58J273r8r3j097j96J033R39p66j011
$$ -451 -624 257 274 336 -186 -712 -246 832 365 -1186 -828 445 347 254 -843 -1039 -6 933 167 -844
2915h44M71O84J62k26o87N6R94L01j222m77J183J75P3p94o75K85J816m0j525m42
$$ -844 -373 311 473 247 -440 -384 610 911 -311 -788 395 570 643 -151 -826 -541 1275 1235 -290 -732
2935g32Q66K75N52m69j256K71J067j51j086N03M02K01k45j40m00O36O62r40r29
$$ -732 134 409 961 492 -764 -493 574 423 -663 -160 242 443 198 58 -342 294 956 16 -913
2954i13M45J116k93n45j50m35Q46J033j437k81M67OL2N5l05j67Q07L6j094K77
$$ -913 -468 648 355 -190 -340 -775 71 1104 -333 -614 -147 -141 -109 -54 -359 -526 281 317 -777 -500
2974e00Q47p5l1j35n28J70J443p26p35n8O81j08k24p1j65P00N38j005n75Q10K57
$$ -500 347 272 241 106 -422 -252 1191 465 -270 -328 353 245 21 -50 -215 485 1023 18 -557 253 510
2995E10m90J09p48Q5J010N37j301n52P76K48k16N8o81n1J282R0r57k31Q45K81
$$ 510 20 129 -619 -534 476 1013 -288 -840 -64 184 -32 26 -655 -706 576 666 -291 -522 323 604
3015F04m79k49n60O51J133r25j415P28J158j76j49o37o26P90J061p22j203O60
$$ 604 125 -124 -684 -33 1100 175 -1240 -512 646 470 321 -316 -942 -152 909 187 -1016 -356
3033c56M74j6l66j27k67J259M1j293l94J212Q77n79k25r10N33J376m7j689n1Q64
$$ -356 118 102 -264 -391 -658 601 642 -651 -1045 167 1044 465 240 -670 -137 1239 1192 -497 -548 316
3053C16L03k60k63m84L11R40n87j171M19J123k80m13l34r6L92P39q50q23N99P66
$$ 316 619 359 96 -388 -77 863 276 -895 -476 647 367 -46 -380 -476 -84 655 -195 -1018 -419 347
3073C47m58o4j9n26R37K85p58m42Q73K99m43m36l2J72J002m70j182J55J364l9
$$ 347 -111 -175 -194 -720 217 502 -256 -698 175 474 31 -405 -437 -265 737 267 -915 -760 604 565
3093E65l85l05K3k35J109n98m76L7N75k45l3M2k18L95M54r15l75J032O45o51o52
$$ 565 180 -125 -102 -337 772 174 -302 -265 310 65 32 74 -144 251 705 -210 -585 447 1092 441 -211
3114b11k9K55Q23j43j192j46O31M69m65l48K52k7L68n1j008M31J097J7j066j16
$$ -211 -240 15 838 695 -497 -643 -12 457 -8 -356 -104 -131 237 186 -822 -391 706 723 -343 -459
3134d59K36M91M79p18r90O11Q49np89K49j49K70L77p03m27Q80Q44r88l96J40L02
$$ -459 -223 268 747 29 -961 -350 499 494 -295 -46 -195 75 452 -251 -678 202 1046 58 -338 -198 104
3155A04L73o1j000O1R52N28p43n80r6J69Q60K5j090m9J404m53n48k19M3N16M89
$$ 104 477 416 -584 -523 429 957 214 -366 -462 -293 567 592 -498 -547 857 404 -144 -363 -320 196 685
3176F85n41q54K22J314o29o30j91J6N76O46p05j026R49M28l41l25m0J16M65K18
$$ 685 144 -710 -488 826 197 -433 -624 -608 -32 614 -91 -1117 -168 260 -81 -406 -446 -330 135 353
3196C53r40k70J132J57n88l60MM89Q48m05j148J74J298j9o88k34L01N6O07o51
$$ 353 -587 -857 275 432 -156 -516 -512 -23 825 420 -728 -554 744 725 37 -197 104 160 767 116
3216A16o49N86P16o55m58K67M7L74j59o30m77J065O60m56o81R0n4L44M03r42L72
$$ 116 -533 53 769 114 -344 -77 -30 344 185 -445 -922 143 803 347 -334 -244 -298 46 449 -493 -121
3237a21N04Q8q81k09P99K67o2n21o88L42J413n05q36qK99K48K01k86r58O14R47
$$ -121 383 471 -410 -619 180 447 385 -136 -824 -482 931 426 -410 -418 -119 129 330 44 -914 -300 647
3258F47n27p12M32Q1P8L45q15j27J046O43j167o45L71M66L27J51j130J09O30N12
$$ 647 120 -592 -160 -79 -1 344 -471 -598 448 1091 -76 -721 -350 116 443 594 -536 -427 203 715
3278G15o32l62M37n1K60k22l38j48R38n45l66RK29K98j47j05q20N33J225p74o65
$$ 715 83 -279 158 107 367 145 -193 -341 597 52 -314 -305 -76 222 75 -30 -850 -317 908 134 -531
3299e31O8K64J77O00p74l48M11N57r63J78M33K25Nk9p71J81Q59K95j026k77K40
$$ -531 -463 -199 -22 578 -196 -544 -133 424 -539 -361 72 297 302 273 -498 -317 542 837 -189 -466 -226
3320b26Q5L10n8n96K10R20k61p28L34M00k16n7k9m41P04M72m52p87J36L41m5L85
$$ -226 -141 169 111 -485 -275 645 384 -344 -10 390 174 117 88 -353 351 823 371 -416 -280 61 16 401
3342D01n19m77N10P96j095k9K65K05j40J64l44j67Q52j57m63k56P45N2p3m60m09
$$ 401 -118 -595 -85 711 -384 -413 -148 57 -83 81 -263 -430 422 265 -198 -454 291 343 270 -190 -599
3363e99J38J094l70o20k4L65J20J3j63m98J39Q78l36p57N65N08j94k75l48j10
$$ -599 -461 633 263 -357 -381 -16 104 117 -46 -544 -405 473 137 -620 -55 453 259 -16 -364 -474
3383d74R63K85q63l60M73O53n92M6l83o5N98M35j158J5M90J14R4l37k28K52R85
$$ -474 489 774 -89 -449 24 677 85 131 -252 -317 281 716 -442 -427 63 177 271 -66 -294 -42 943
3404I43p04r19J55O62K16k98j56n83Q11K76m90n87L29O71k41j78j24o1P14j45
$$ 943 239 -680 -525 137 353 55 -101 -684 127 403 -87 -674 -345 326 85 -93 -217 -278 436 291
3424B91k09l63OO48l80j06Rm97P21K59n30j01L83j3K07k98k18K26L89l8q17K15
$$ 291 82 -281 -275 373 -7 -113 -104 -601 120 379 -151 -252 131 118 325 27 -191 35 424 386 -431 -216
3446b16P39l61j03j51k33M93O39r04j89K11M83k58n7m93r9O84J54l19m84M86L00
$$ -216 523 162 59 -92 -325 168 807 -97 -286 -75 408 150 93 -400 -499 185 339 20 -464 22 322
3467C22n98j21J18K50K56l1o43J67L03L7n5j43j0j22L16L73q73j0O28l04k6Rj02
$$ 322 -276 -397 -279 -29 227 196 -447 -280 23 60 5 -138 -148 -270 46 419 -454 -464 164 -140 -166 -157 -259
3490b59R0O58m98n32M86M40m18K4j89j25L93O61r18l35M76N58n17J65l70K51L27
$$ -259 -169 489 -9 -541 -55 385 -33 -9 -198 -323 70 731 -187 -522 -46 512 -5 160 -210 41 368
3511C68l1q62R5Q05j0l68k97j98N76M48j68q44k79Q10N5j42j87N6p2N31m29k95
$$ 368 337 -525 -430 375 365 -3 -300 -498 78 526 358 -486 -765 45 100 -42 -229 -173 -245 286 -143 -438
3533d38M62P4k89k1K52j77L47L23r09n1L01Q68l83m81n8q7N36O02j227j37P67
$$ -438 24 98 -191 -212 40 -137 210 533 -376 -427 -126 742 359 -122 -180 -267 269 871 -356 -493 274
3554B74k5l50K02j74k1P06k20n61j56J086m45k95j38k02N70K44j43r14L97N46
$$ 274 249 -101 101 -73 -94 612 392 -169 -325 761 316 21 -117 -319 251 495 352 -562 -165 381
3574C81m56L8Q5j92M70k01j20o29M59N90m99j1k31Q4L91K59n90o55R47n9l12J4
$$ 381 -75 -37 48 -144 326 125 5 -624 -165 425 -74 -85 -316 -232 159 418 -172 -827 120 61 -251 -237
3596b37%n1N23M8n83J49N77k64k94l71L58O15J33p46l62M47L31j32k39j30J88
$$ -237 -237 -288 235 283 -300 -151 426 162 -132 -503 -145 470 603 -143 -505 -58 273 141 -98 -228 -40
3617d0J79J43o60Q5Q64l06l51KL35m56P07k23n52O2N55k06k22k85j5L89J94p4
$$ -40 139 282 -378 -293 571 265 -86 -84 251 -205 502 279 -273 -211 344 138 -84 -369 -384 5 199 125
3639A25n72RO14k32l63M00j52L08K07m80k91K94O37n43l65q4N28N13m82j54j74
$$ 125 -447 -438 176 -56 -419 -19 -171 137 344 -136 -427 -133 504 -39 -404 -488 40 553 71 -83 -257
3660b57P4K13j71J19KJ54M4P3o47P1P76J13l88k23K49K5q8k0l85J90N60J45n49
$$ -257 -183 30 -141 -22 -20 134 178 251 -396 -325 451 564 176 -47 202 227 139 119 -266 -76 484 629 80
3683H0P8l9k85L93o9m26m2P37m98j01K67j01O4J65l04l25M09K25l43l97L42J42
$$ 80 158 119 -166 227 158 -268 -310 427 -71 -172 95 -6 58 223 -81 -406 3 228 -115 -512 -170 -28
3705b8K08K96q33k88O45K30m54K43o1r9L55J20o45j12O35j74l88M38k59L33M57
$$ -28 180 476 -357 -645 0 230 -224 19 -42 -141 214 334 -311 -423 212 38 -350 88 -171 162 619
3726F19o20k53L06O82k27p74K43p1K35J4j27k48K06J83k68j37P27o34N18k71k99
$$ 619 -1 -254 52 734 507 -267 -24 -95 140 154 27 -221 -15 168 -100 -237 490 -144 374 103 -196
3747a96j04N64J80m03l60J09j01O59l9q22M13N51l92m18J46K50O6M02p33k07N04
$$ -196 -300 264 444 41 -319 -210 -311 348 309 -513 -100 451 59 -359 -213 37 103 505 -228 -435 69
3768F9L93m00n84K06K55L47j29m46m5O21K22m95j32L56J10J02l10n70L63N54J5
$$ 69 462 62 -522 -316 -61 286 157 -289 -334 287 509 14 -118 238 348 450 140 -430 -67 487 502
3789E02q71J03M62J98q6j05m49%P68m43m08K12Q2N9N42o92j21O24j14m14k15M20
$$ 502 -369 -266 196 394 308 203 -246 -246 522 79 -329 -117 -35 24 566 -126 -247 377 263 -151 -366 54
3811E4N8J21k96k72j60R48K5r37%L20K84j62K31n27P8O03j67o31K77N33l96l9
$$ 54 112 233 -63 -335 -495 453 478 -459 -459 -139 145 -17 214 -313 -235 368 201 -430 -153 380 -16 -55
3833e5j38K4L5N61o76j90L37M35k93J17k57O6J43L91n34k89J94M29n6l16k09K26
$$ -55 -193 -169 -134 427 -249 -439 -102 333 40 157 -100 -34 109 500 -34 -323 -129 300 244 -72 -281 -55
3855e5M39K07p79k55P16n8k57j28p5J63M04k9l75k41N45m46J00Pl31M02L76m81
$$ -55 384 591 -188 -443 273 215 -42 -170 -245 -82 322 293 -82 -323 222 -224 -124 -117 -448 -46 330 -151
3877a51l98M39J96j08l13K83j97M40K93o40l30M32N21k47j87r8k15N62j27P0l26
$$ -151 -549 -110 86 -22 -335 -52 -249 191 484 -156 -486 -54 467 220 33 -65 -280 282 155 225 -101
3898a01L32K4l9j30k86r1O66k5p79K48L67k8j41O4k35j68Q31k66o52K65J41Q8
$$ -101 231 255 216 86 -200 -291 375 350 -429 -181 186 158 17 81 -154 -322 509 243 -409 -144 -3 85
3920H5l35J33j16J45L30j27o06K53M12l5J3l29r1J12N98q08j20M49L45o51N6N0
$$ 85 -250 -117 -233 -88 242 115 -491 -238 174 139 152 -177 -268 -156 442 -366 -486 -37 308 -343 -287 -237
3942b37k83R71k91n14m9P51j10k84J19n60M64N24k87n17J56N99m41J04L0j49O
$$ -237 -520 451 160 -354 -403 348 238 -46 73 -487 -23 501 214 -303 -147 452 11 115 145 -4 2
3963BL09l82l04O30Q3m35k5l7l9P03j45m87l63P51J22k18l87l02O06L51l56m98
$$ 2 311 -71 -375 255 338 -97 -122 -159 -198 505 360 -127 -490 261 383 165 -222 -524 82 433 77 -421
3985d21O6P63j63n07j02J92L86J20l83l40K71L27p8l26J43k97P72Q8o44l57M84
$$ -421 -355 408 245 -262 -364 -172 214 334 -49 -389 -118 209 131 -195 -52 -349 423 511 -133 -490 -6
4006fM30n05j99J69o4L84K95o13j19O30m47n4M9j27K84J50j04p21N98L39n0l31
$$ -6 424 -81 -280 -111 -175 209 504 -109 -228 402 -45 -99 -50 -177 107 257 153 -568 30 369 319 -12
4028a2q4k2K16K91m16J4j18N70l75m79L69k80J59K48j77k46K44J51k12n6K53l33
$$ -12 -96 -118 98 389 -27 -13 -131 439 64 -415 -46 -326 -167 81 -96 -342 -98 53 -159 -215 38 -295
4050b95O32l28j80J7L54O5m43j05K21K46q9o3k39L9K97j70j19L01o5k37M15r9
$$ -295 337 9 -171 -154 200 265 -178 -283 -62 184 95 32 -207 -168 129 -41 -160 141 76 -161 254 155
4072A55m76K31L00n5m61L64j61J94J20l04k4J03M19o24K60M6j10p4L01l07j81
$$ 155 -321 -90 210 155 -306 58 -103 91 211 -93 -117 -14 405 -219 41 87 -23 -97 204 -103 -284
4093b84J46M14m25j47J89MJ26P9k98j18N65j96l06J18K16l64M04J7m38J93M61
$$ -284 -138 276 -149 -296 -107 -103 23 102 -196 -314 251 55 -251 -133 83 -281 123 140 -298 -105 356
4114C56k50q1l36J76K00p2n4j15M15L78r26K87J05l7L16n4l04k88P35r7l29L0
$$ 356 106 25 -311 -135 65 -7 -61 -176 239 617 -309 -22 83 46 362 308 4 -284 451 354 25 55
4136E5k34L24J88j36l57O5L78J18m08p6j40K64n7M1n80L97M63l51l48L85J66k0
$$ 55 -179 145 333 197 -160 -95 283 401 -7 -83 -223 41 -16 25 -555 -158 305 -46 -394 -9 157 137
4158A37L0k66l18M70K64l75l76K17J12J62M8n72nP76P2n33K2L91j8j24O9m37K92
$$ 137 167 -99 -417 53 317 -58 -434 -217 -105 57 105 -467 -472 304 376 -157 -135 256 238 114 183 -254 38
4181C8N35m31l40L44o7L8P1jo43J77N33p4m14K2M30r4J03p10K81M29L26n34l86
$$ 38 573 142 -198 146 79 117 188 187 -456 -279 254 180 -234 -212 218 124 227 -483 -202 227 553 19 -367
4204c67L10M4J23j94q7p8O08q8l63j44L43k05L22j61j26m3L87l94m7K52j56l6
$$ -367 -57 -13 110 -84 -171 -249 359 271 -92 -236 107 -98 224 63 -63 -106 281 -113 -160 92 -64 -100
4226a00P4K46n45J78K64J0l10K17j28P6J36j58k5J49K14l25l85M56L98m53L10
$$ -100 -26 220 -325 -147 117 127 -183 34 -94 -18 118 -40 -65 84 298 -27 -412 44 442 -11 299
4247B99k32k81P69k41l95R3JO6J30J3l99L17J33n0l70o5K71k22M00l70l44M86
$$ 299 67 -214 555 314 -81 12 13 79 209 222 -177 140 273 223 -147 -212 59 -163 237 -133 -477 9
4269IJ45j21j76J04K62l41Q5m22K11J81K69l72k64N65j8l87K95O1k22K98J2k86
$$ 9 154 33 -143 -39 223 -118 -33 -455 -244 -63 206 -166 -430 135 117 -270 25 86 -136 162 174 -112
4291a12M3K30L3J4j36q3j39J75M64r90L49K93JL06k03k36N5J02K17m40M68qk33
$$ -112 -69 161 194 208 72 -11 -150 25 489 -501 -152 141 142 448 245 9 64 166 383 -57 411 403 170
4314A70j22Q8j45J07J41q4k33L39j54p9J24l89J0L87L35p08J47K5J80j89N5l53
$$ 170 48 136 -9 98 239 155 -78 261 107 28 152 -237 -227 160 495 -213 -66 -41 139 -50 5 -348
4336c48J59M01p1j05j54K45r1j17J92j9j78L88n99K0N8K76P4J03j92k13L42M15
$$ -348 -189 212 141 36 -118 127 36 -81 111 92 -86 302 -297 -277 -219 57 131 234 42 -171 171 586
4358E86m20r5j24J21n0l2M1O7J14K30o54k4M40p2k46j4o5K69K30l42l54K78m0
$$ 586 166 71 -53 68 18 -14 27 94 208 438 -216 -240 200 128 -118 -132 -197 72 302 -40 -394 -116 -156
4381a56L60k85L5p4j38N69m15N4q9O6n6J24k69M8M16J84m60l21M29K5M2k79O2
$$ -156 204 -81 -46 -120 -258 311 -104 -50 -139 -73 -129 -5 -274 -226 190 374 -86 -407 22 47 89 -190 -128
4404a28J31K66j89k21j30M79k21J73k49Q9M2K79j7o49L62K85j9k80J78m31L27
$$ -128 3 269 80 -141 -271 208 -13 160 -89 0 42 321 304 -345 17 302 283 3 181 -250 77
4425G7J83j24n05N04j34j35K1J07o9K49M5m24J05K50J52l80j38K52k01J79Q5o29
$$ 77 260 136 -369 135 1 -134 -113 -6 -75 174 219 -205 -100 150 302 -78 -216 36 -165 14 99 -530
4447e30J21N51k24L9Lj6R0K49J2o16k6M58j31J56J77m60J09J00L03o86K42N74
$$ -530 -409 142 -82 -43 -40 -56 34 283 295 -321 -347 111 -20 136 313 -147 -38 62 365 -321 -79 495
4469D95o71R7M68n16K15K18q8j62K7J68j91o4N7P1j81K89n45M05L3j6l86L08P3
$$ 495 -176 -79 389 -127 88 306 218 56 83 251 60 -4 53 124 -57 232 -313 92 125 109 -277 31 104
4492A04l56K01K2k30K68J47n03J67j72L22k94K25j85J24J23j0J29l74J15K01J6
$$ 104 -252 -51 -29 -259 9 156 -347 -180 -352 -30 -324 -99 -284 -160 -37 -47 82 -292 -177 24 40
4513D0J30n03r7N20K57n44J96L15m13K12J72n46K8M28J0k02M19l63K74j4m83j03
$$ 40 170 -333 -430 90 347 -197 -1 314 -99 113 285 -261 -233 195 205 3 422 59 333 319 -164 -267
4535b67J71J32N7k10K77j87M8K12j87j53K58q8om2n6j33J53L56m10j41J25M39
$$ -267 -96 36 93 -117 160 -27 21 233 46 -107 151 63 57 15 -41 -174 -21 335 -75 -216 -91 348
4557C48m10o5K30l73L41J12k90k29M48k51N7p7Q5LK71J55l75k17O71l44o60N09
$$ 348 -62 -127 103 -270 71 183 -107 -336 112 -139 -82 -159 -74 -71 200 355 -20 -237 434 90 -570 -61
4579f1K10J45q7k14rj6M26l81J13j44N9Q9N2k49q0L22J43k05j62l4J57m7j20n6
$$ -61 149 294 207 -7 -16 -32 394 13 126 -18 41 130 182 -67 -147 175 318 113 -49 -83 74 27 -93 -149
4603a49k60K27M2R4k8J05J14J09j15k81k9O69k83n33L75k74OJ98k06l5L62m2K8
$$ -149 -409 -182 -140 -46 -74 31 145 254 139 -142 -171 498 215 -318 57 -217 -211 -13 -219 -254 108 66 94
4626I4k52J88P3K9K92k89m96N31J04l07o8j40K58NP2m69M62O52o13m37M66l2n0
$$ 94 -158 30 103 132 424 135 -361 170 274 -33 -101 -241 17 22 94 -375 87 739 126 -311 155 123 73
4649G3N2j00j55K29J39j87k62J88JN8J58J23k93j09J10l1k19L07J98k21K23k97
$$ 73 125 25 -130 99 238 51 -211 -23 -22 36 194 317 24 -85 25 -6 -225 82 280 59 282 -15
4671a5Q6J50k01m98m1O94j76m3J21m54N28j7N2l09n9K32J2J24j86k73J97N00m22
$$ -15 71 221 20 -478 -519 175 -1 -44 77 -377 151 134 186 -123 -182 50 62 186 0 -273 -76 424 2
4694Bl50L13K99M8q7k16M3k08J16j8k34M09q2l43L39k01k5K27M27n38jK7J4L52
$$ 2 -348 -35 264 312 225 9 52 -156 -40 -58 -292 117 35 -308 31 -170 -195 32 459 -79 -80 -53 -39 313
4718C13k87j6n08N62R1m76J60L16k12q9K47l09l1J63J85n2k66M77k17p3K36o39
$$ 313 26 10 -498 64 155 -321 -161 155 -57 -146 101 -208 -239 -76 109 57 -209 268 51 -22 214 -425
4740d25K76L78m52J77K79J15n70L29k62R1k23N78m37j22L25N9j1M4n5m13P46k65
$$ -425 -149 229 -223 -46 233 348 -222 107 -155 -64 -287 291 -146 -268 57 116 105 149 94 -319 427 162
4762A62k10r2J68J62J30j69qk90K27J35l30KL42k33j23K39k95L36k62K27m78K54
$$ 162 -48 -140 28 190 320 151 143 -147 80 215 -115 -113 229 -4 -127 112 -183 153 -109 118 -360 -106
4784a06qK88l24K05j22r7L96k32k64R7K64k13l4j26NK86J84l13Q5M83q3k82N3
$$ -106 -114 174 -150 55 -67 -164 232 0 -264 -167 97 -116 -150 -276 -271 15 199 -114 -29 454 371 89 142
4807A42k70L2N79l42k68L8K27o9J61j28j79k0L36l29j65J74J67k02R1Q7r0R4M21
$$ 142 -128 -96 483 141 -127 -89 138 69 230 102 -77 -97 239 -90 -255 -81 86 -116 -25 62 -28 66 487
4830D87o31n3L37j75L4j92K24Q0j91L16q81L77N03p9j74l65N48l0J9j13n25N63
$$ 487 -144 -197 140 -35 -1 -193 31 111 -80 236 -645 -268 235 156 -18 -383 165 135 154 41 -484 79
4852G9q6P9k15N7j65K55L49r2m15j9J53j23J8k26K42J31M42m38k11L28j27J9j7
$$ 79 -7 72 -143 -86 -251 4 353 261 -154 -173 -20 -143 -125 -351 -109 22 464 26 -185 143 16 35 18
4875A8j85M37j34R0k1l60L56j75K08p9N1m9l5j02l87N77r4k15K19O0r8n3l2Pj27
$$ 18 -167 270 136 226 205 -155 201 26 234 155 206 157 122 20 -367 210 116 -99 120 180 82 29 -3 4 -123
4900a23L29k08j1l5j11j71J93p8j8K54r2M88k06l71L35j22k28L04q9k44K20M01
$$ -123 206 -2 -13 -48 -159 -330 -137 -215 -233 21 -71 417 211 -160 175 53 -175 129 40 -204 16 417
4922D17l07R9j9l8O1J31k51l8K36l97K72j82J18r3K11r3m30J03O41n85Q7J13J2
$$ 417 110 209 190 152 213 344 93 55 291 -106 166 -16 102 9 220 127 -303 -200 441 -144 -57 56 68
4945F8k18L20k22n2N5l4O7L2l9J83L5j82J35k70L52m03J1L17k01j97K64o3l76
$$ 68 -150 170 -52 -104 -49 -83 -16 16 -23 160 195 13 148 -122 230 -173 -162 155 -46 -243 21 -42 -418
4968d18K82M96j41j83r3K1p8J66k72kR2L07j67Q1k3o4K40L5m07L66j98K05k11
$$ -418 -136 360 219 36 -57 -36 -114 52 -220 -222 -130 177 10 91 68 4 244 279 -128 238 40 245 34
4991C4J93l07K35J83o05M55k43N89m55j80M65l13K5J28j14k89j11L75j04k3j20
$$ 34 227 -80 155 338 -267 188 -55 534 79 -101 364 51 76 204 90 -199 -310 65 -39 -62 -182
5012a82M3m7J77j4l28M68j39o4n4O8N2m1Q8j98M1J91K25n11j25J77J20K47J64
$$ -182 -139 -186 -9 -23 -351 117 -22 -86 -140 -72 -20 -61 27 -171 -130 61 286 -225 -350 -173 -53 194 358
5035C58m16L7M03l99j5N6kk26L27J24k60N2J36R4l1j77J43k14N4O5k42K76Q0j7
$$ 358 -58 -21 382 -17 -32 24 22 -204 123 247 -13 39 175 269 238 61 204 -10 44 109 -133 143 223 206
5059B06m30J88Q7j77N33m35k99M41J90n69K2J71r0J44j17n9L3M07m1l06j53J05
$$ 206 -224 -36 51 -126 407 -28 -327 114 304 -265 -243 -72 -162 -18 -135 -194 -161 246 205 -101 -254 -149
5081a49K78j28k22L5K26J53k45q1J88m12L34K24Q5k14J8K06l84j33K02J59j1m4
$$ -149 129 1 -221 -186 40 193 -52 -133 55 -357 -23 201 286 72 90 296 -88 -221 -19 140 129 85
5103H5J53m43K38J86J39p29O44j60k8K6l31P9K26J28k35K82k71r6K6j0J13j28
$$ 85 238 -205 33 219 358 -371 273 113 85 111 -220 -141 85 213 -22 260 -11 -107 -81 -91 22 -106
5125a06L81m9l72P9j04k39N60k13l7q6K86j43l04M33j6M1L7n8l56K04q4R6J27
$$ -106 275 226 -146 -67 -171 -410 150 -63 -100 -186 100 -43 -347 86 70 111 148 90 -266 -62 -146 -50 77
5148G7j06p9R5jM0k38L90J39m67j07K21K8K65j94k8j80M58l20m2K9j72J23j06
$$ 77 -29 -108 -13 -14 26 -212 178 317 -150 -257 -36 -8 257 63 35 -145 313 -7 -49 -20 -192 -69 -175
5171a75J48J18j24J09j36K75m24J90J5j1q4k4K95M1m11N2J63q1J3K50k70j83K62
$$ -175 -27 91 -33 76 -60 215 -209 -19 -4 -15 -99 -123 172 213 -198 -146 17 -64 -51 199 -71 -254 8
5194HJ61j24J14r1k32J39J66m14R3L48J18n31J98P8J18j31l41O8R1M84l33k52
$$ 8 169 45 159 68 -164 -25 141 -273 -180 168 286 -245 -47 31 149 18 -323 -255 -164 320 -13 -265
5216b65L98K50k92J15j84J09r5J71l14J83j2o3k57L05j4j6K89j9l38k3R0M0j30
$$ -265 133 383 91 206 22 131 36 207 -107 76 64 1 -256 49 35 19 308 289 -49 -72 18 58 -72
5239g2K12m04L79J5j81j8LK7J99k02M7R2o3K33k04r7k00L46o0p8K03j67R1j59
$$ -72 140 -264 115 130 -51 -69 -66 -39 160 -42 5 97 34 267 63 -34 -234 112 52 -26 177 10 101 -58
5263e8J33Q1k46Jk88M47j48M68l39J68l52K16q8J52K25n29K68k44N11k38k94J94
$$ -58 75 156 -90 -89 -377 70 -78 390 51 219 -133 83 -5 147 372 -157 111 -133 378 140 -154 40
5285D0k83M49J44n77J39J9J34qj17J62q9j01k29L18K30k97K94q1k42qP5o6Q0P2
$$ 40 -243 206 350 -227 -88 -69 65 57 -60 102 13 -88 -317 1 231 -66 228 147 -95 -103 -28 -94 -14 58
5309E8L6J18P7m07k22M83J6j35J94k32Mo2O6j29K90j96L18k63J25p1j43L01J33
$$ 58 94 212 289 -118 -340 143 159 24 218 -14 -10 -72 -6 -135 155 -41 277 14 139 68 -75 226 359
5332C59o71L14L1L31k93o0P8j45K39k53J81M5j02r0R7k08K73j04J38j09K56k92
$$ 359 -312 2 33 364 71 11 89 -56 183 -70 111 156 54 -36 61 -147 126 22 160 51 307 15
5354A5k27k20N10j24P2J39j03j79L01n6j7l00j22K34P1L6K03k58Q4j88J52j6J08
$$ 15 -212 -432 78 -46 26 165 62 -117 184 128 111 -189 -311 -77 -6 30 233 -25 59 -129 23 7 115
5377A15m92K45P9K69j46k05K10NK6j59L4O7rR5m22K93K03j36j03J6K18Qj01j90
$$ 115 -377 -132 -53 216 70 -135 75 80 106 -53 -19 48 39 134 -288 5 208 72 -31 -15 203 211 110 -80
5401h0k4K31K51l94L63k08rq7k41K57k91K88l19J47j31J99N4K2J95l73K70o8j81
$$ -80 -104 127 378 -16 347 139 130 43 -198 59 -232 56 -263 -116 -247 -48 6 28 223 -150 120 52 -129
5424a29L0J98R8J29k42k02j4L55k38K3L3j02J40R9m3l24R4L01n16L19j11J14j05
$$ -129 -99 99 197 326 84 -118 -132 223 -15 8 41 -61 79 178 135 -189 -95 206 -310 9 -102 12 -93
5447i3L06J3k00oM10l92j15K64k18j34K38N7j43p0K28j69J55l40N7k5N0K85l44
$$ -93 213 226 26 20 430 38 -77 187 -31 -165 73 130 -13 -83 145 -24 131 -209 -152 -177 -127 158 -186
5470a86J47l0P6j25L56m28J31k36J22O81n65L59n23K84KnK3K23j18j22p2J55l03
$$ -186 -39 -69 7 -118 238 -190 -59 -295 -173 508 -57 302 -221 63 65 60 83 306 188 66 -6 149 -154
5493a54N22l62J40r1K25l05K70j89J10k04K88l0k91J32R5l98L98K53n06L42M4
$$ -154 368 6 146 55 280 -25 245 56 166 -38 250 220 -71 61 156 -242 156 409 -97 245 289
5514B89l14K58l70n4L90m4j38k50K37%j7j0J2n68M83K64k65n7j2J24k7J80j15
$$ 289 -25 233 -137 -191 199 155 17 -233 4 4 -13 -23 -11 -579 -96 168 -97 -154 -166 -42 -69 111 -4
5537dk32L55k61K73p7j46K98j43L3J08m58K05R5p9J68k87K95J13j13j84QJ16q
$$ -4 -236 119 -142 131 54 -92 206 63 96 204 -254 -49 46 -33 135 -152 143 256 143 -41 -33 83 75
5560G5l54J57K03J79m37L92j10l6j4k82K32J33J35j74k76J01K07m50L07Lj37L02
$$ 75 -279 -122 81 260 -177 215 105 69 55 -227 5 138 273 99 -177 -76 131 -319 -12 -9 -146 156
5582A56Nk46k00R7m1r3N05j04m14N51j78p6K57j33j45M85k23k80J41Q6k83J16
$$ 156 161 -85 -285 -188 -229 -322 183 79 -335 216 38 -38 219 86 -59 426 203 -77 64 150 -133 -17
5604a7K11R5k57j87J90k17J82k34L60j15J10l11K08j01K87j96O4k19J36L6k12
$$ -17 194 289 32 -155 35 -182 0 -234 126 11 121 -190 18 -83 204 8 72 -147 -11 25 -187
5625a87K00P7Q3j3N4j40Qj2R1l19R6M01n83K1Q8L63l41n9p4p9L86K7q2j07J99
$$ -187 13 90 173 160 214 74 82 70 161 -158 -62 339 -244 -223 -135 228 -113 -172 -246 -325 61 88 6 -101 98
5650I8k12J91r1l38L55j38L4j30J44J07J33j35j59R6j00J05Oq4r4qK44K38m64
$$ 98 -114 77 -14 -352 3 -135 -101 -231 -87 20 153 18 -141 -45 -145 -40 -34 -118 -212 -220 24 262 -202
5673b02J28LL13k0k24l1J94j77K76l13q9R6K79k31o7Q7R3p1j64J28J25k32K46
$$ -202 -74 -71 242 222 -2 -33 161 -16 260 -53 -142 -46 233 2 -65 22 115 44 -120 8 133 -99 147
5696A47r8k29N22p5k33J8o8l46M24j45n1K37k17R9M1j00k39L2L88%l78L09j13
$$ 147 49 -180 342 267 34 52 -16 -362 62 -83 -134 103 -114 -15 26 -74 -313 -281 107 107 -271 38 -75
5719g5j08L04j97M5l6M9J40k71L19k19j59N9j22L58O4J6j65L88l44oOj56m0J20
$$ -75 -183 121 -76 -31 -67 -18 122 -149 170 -49 -208 -149 -271 87 151 167 2 390 46 40 46 -110 -150 -30
5743c0o4J53J91l60K02j42j39K23p4o5L67p4k36k92L76m28K98j45J91J69j34m
$$ -30 -94 59 250 -110 92 -50 -189 34 -40 -105 262 188 -48 -340 36 -392 -94 -239 -48 121 -13 -17
5765a7R1O2k06J2J03N4m0j11L23l10J06j06J70j64j31K19k63M80j09k94J24J95
$$ -17 74 136 -70 -58 45 99 59 -52 271 -39 67 -39 131 -33 -164 55 -208 272 163 -131 -7 188
5787A88j59p7N1J65k48K44J06l56J08Q3m2J6K8K03l49J68N3j06k60M34k45J0J29
$$ 188 29 -48 3 168 -80 164 270 -86 22 105 63 79 107 310 -39 129 182 76 -184 250 5 15 144
5810A44m01M09j78N5K9j23p1J76K11j29k99K4n9M24m02L25k00N0J68j83m8J33
$$ 144 -257 152 -26 29 58 -65 -136 40 251 122 -177 -153 -212 212 -190 135 -65 -15 153 -30 -78 55
5832E5l02K48Q5k82L77k64j45K55JJ4J17j83J2K8m1k19K27O1m3j48j2j78K63J49
$$ 55 -247 1 86 -196 181 -83 -228 27 28 42 159 -24 -12 16 -25 -244 -17 44 1 -147 -159 -337 -74 75
5856G5m30L98N8k42L56r2j04kk5K06j19l53J49J9J59Q0j86j63J31j4K23l6q5j35
$$ 75 -355 43 101 -141 215 123 19 17 -8 198 79 -274 -125 -106 53 133 -53 -216 -85 -99 124 88 3 -132
5880a32J96k3m13J11N4K59k36J88k09N67l47J99k90O1n9R7J07j98%N0p7j38L03
$$ -132 64 41 -372 -261 -207 52 -184 4 -205 362 15 214 -76 -15 -74 23 130 -68 -68 -18 -95 -233 70
5903G0Pl05J15J33j25R1K59j53j95K26M8l30P9L68j54K03k48j37J56m70P61l81
$$ 70 77 -228 -113 20 -105 -14 245 92 -103 123 171 -159 -80 288 134 337 89 -48 108 -362 399 18
5925A8J56j42j95L21r3j62J74l54K95k09K4K68n7m0k67L09J04l05J06M1J14o83
$$ 18 174 32 -163 158 65 -97 77 -277 18 -191 -167 101 44 4 -263 46 150 -155 -49 -8 106 -577
5947e77O65Pm06r1L40L00m35PK12J3J61j17k31J9J92j82J82J57m88J41J49N0J53
$$ -577 88 95 -311 -402 -62 238 -197 -190 22 35 196 79 -152 -133 59 -123 59 216 -272 -131 18 68 221
5970B21j70M6n1o6J10j6M9j1k56n5J7J7K46j38l19N04K1Pk40j70P5K26J01k49
$$ 221 51 97 46 -20 90 74 123 112 -144 -199 -182 -165 81 -57 -376 128 149 156 -84 -254 -179 47 148 -101
5994a01j92J11J33P9l38J85J1J92k81J40J19j94l7L7J15n4j49K72j0j20K76k22
$$ -101 -293 -182 -49 30 -308 -123 -112 80 -201 -61 58 -136 -173 -136 -21 -75 -224 48 38 -82 194 -28
6016b8J15J58k17o7J36N0J24m59K24J0j48M70j26k39J13k07K53j92j0J51O6l74
$$ -28 87 245 28 -39 97 147 271 -188 36 46 -102 368 242 3 116 -91 162 -30 -40 111 177 -197
6038a97M28p4l77l8OM76m53M03j11l67rL42N5k0k44l6J66J17p9m2k49L73j44j39
$$ -197 231 157 -220 -258 -252 224 -229 174 63 -304 -313 29 84 64 -180 -216 -50 67 -12 -54 -303 70 -74 -213
6062b13J13J48J9K62k77j89J80J62j21o0l55L69k17J02j42K74L10j78L8m79J14
$$ -213 -100 48 67 329 52 -137 43 205 84 24 -331 38 -179 -77 -219 55 365 187 225 -254 -140
6083a40L25k72L33k76m1L11k37L7k95M65j07o18M80J52l95K04J62k57K3K11J03
$$ -140 185 -87 246 -30 -71 240 3 40 -255 210 103 -515 -35 117 -278 -74 88 -169 -146 65 168
6104A68q1l60r3J81K16L2j40O2m14M26R7M0rM8r0j36o8L21Kj00k86L27j50N6K25
$$ 168 87 -273 -366 -185 31 63 -77 -15 -429 -3 94 134 125 173 83 -53 -121 200 202 102 -184 143 -7 49 274
6129B74n01L03k2L34l53j1m65N39PJ19m66L37k1q4K49m66L01l21J78J31q1M2P8
$$ 274 -227 76 54 388 35 24 -441 98 105 224 -242 95 74 -10 239 -227 74 -247 -69 62 -19 23 101
6152A01K5O8j01Ko2j6j61o3J66J16j40K9j47k02J69J43J63k74J74l4J01j73J07
$$ 101 126 194 93 95 33 17 -144 -207 -41 75 -65 -36 -183 -385 -216 -73 90 -184 -10 -44 57 -116 -9
6175ik34J00L70j93J15p7k22J17N8O5j41j42p6P3K95R2k13j7K23m7l05M26j98
$$ -9 -243 -143 227 34 149 72 -150 -33 25 90 -51 -193 -269 -196 99 191 -22 -39 184 137 -168 258 60
6198F0n2m9Q5j20J17j15J25l41L70n1J99j98j25N2R6J76k11k66K94jN3J15l08
$$ 60 8 -41 44 -76 41 -74 51 -290 80 29 228 30 -95 -43 53 229 18 -248 46 45 98 213 -95
6221i5K78j02J33k42k20L41m9l99M47k75J17J85j12m16M41lq8K66j06n0J74j4
$$ -95 183 81 214 -28 -248 93 44 -355 92 -183 -66 119 7 -409 32 29 -59 207 101 51 225 211
6243B11j90j2K73j11R5k21N0K3j79L72o13L73K49m55Rn6K59j8m7ok01M35j5k23
$$ 211 21 9 282 171 266 45 95 118 -61 311 -302 71 320 -135 -126 -182 77 59 12 6 -195 240 225 2
6267Bp0J66m94L83j12J91qO1l02J31j44M54l74j4K29q4qK53j95r5l2K8J46J08
$$ 2 -68 98 -396 -13 -125 66 58 119 -183 -52 -196 258 -116 -130 99 15 7 260 65 -30 -62 -34 112 220
6291B20j88O0j63lQk9K62N6k28l3M7q0K99L1m73J61M21k55k55L71m72K68k9J3
$$ 220 32 92 -71 -74 -66 -95 167 223 -5 -38 9 -71 228 259 -214 -53 368 113 -142 229 -243 25 -4 9
6315IK07p6L03k57l11R4K43j11O6l43J77p0K4k33Q7J41O2L72j88r0k84Q0L0J94
$$ 9 216 140 443 186 -125 -31 212 101 167 -176 1 -69 -45 -278 -191 -50 12 384 196 106 -178 -98 -68 126
6339A26m9k6K5p4K6k40K30l7n2p3P0Q9j50K78j95K13j05k47N35n36M47j90J0O
$$ 126 77 51 76 2 28 -212 18 -19 -71 -144 -74 15 -135 143 -52 161 56 -191 344 -192 255 65 75 81
6363H1k10O0P7l0j34J7K2R1K25l39J27K24k15j11k46L36PK47l84J64j56m8L56
$$ 81 -129 -69 8 -22 -156 -139 -117 -26 199 -140 -13 211 -4 -115 -361 -25 -18 229 -155 9 -147 -195 161
6386A61k66j08M61k30j95K01j32r1K15%R6k32K33k19L94j32m1q9j8l4j68K09m6
$$ 161 -105 -213 248 18 -177 24 -108 -199 16 16 112 -120 113 -106 288 156 115 26 8 -26 -194 15 -31
6409c1Q2n2k01k8j15L92o3N3K3j95Q2j57N61k03j17KJ96r7j93O5J40K8j77p1K01
$$ -31 51 -1 -202 -230 -345 47 -16 37 60 -135 -53 -210 351 148 31 33 229 132 -61 4 144 172 -5 -76 125
6434A25j93K6j7J64j07n3L59k24j54K28p8k00k4N80l80Plj35M3K79k80L7l6K9
$$ 125 -68 -42 -59 105 -2 -55 304 80 -74 154 76 -124 -148 432 52 59 56 -79 -36 243 -37 0 -36 -7
6458gK53QP7p72L28L99j11k33R0k1j11q2P2K29j25J10J23k19K01R9k43J82j05
$$ -7 246 254 331 -441 -113 286 175 -58 32 11 -100 -182 -110 119 -6 104 227 8 209 308 65 247 142
6481A42j11l35M11k57j61M33r2J92n7k00l9Q3l31J30J41J03Q8j23K20k85l7l5
$$ 142 31 -304 107 -150 -311 122 30 222 165 -35 -74 9 -322 -192 -51 52 140 17 237 -48 -85 -120
6503a20M7K99l85J96l7k70L35%j04j34J43j76N4J98R2L9m5j32RJ14l12J3L04m2
$$ -120 -73 226 -159 37 0 -270 65 65 -39 -173 -30 -206 -152 46 138 177 132 0 9 123 -189 -176 128 86
6527H6Ok09J18J62J7j58m14N42J28n91J59L7J74j59R9L75m62J25K40l19L9Q0q3
$$ 86 92 -117 1 163 180 22 -392 150 278 -313 -154 -117 57 -102 -3 372 -90 35 275 -44 -5 75 -8
6550hj59K03l10j35M84k85J00P3R4n4n3J54l14K48NK22n96l6l7N31j28J18NL7
$$ -8 -167 36 -274 -409 75 -210 -110 -37 57 3 -50 104 -210 38 43 265 -331 -367 -404 127 -1 117 122 159
6574A59j49m7j10K26j0l13L68R4m57J99l7K14Q4j93J2J11k19Rl6K34k19J65l06
$$ 159 10 -37 -147 79 69 -244 124 218 -239 -40 -77 137 221 28 40 151 -68 -59 -95 139 -80 85 -221
6597b21J93Q3K39l02R1p5j01K35k60L80m63N10k3k78m4L69j81k71R5J07j13n3
$$ -221 -28 55 294 -8 83 8 -93 142 -118 262 -201 309 286 8 -36 333 152 -119 -24 83 -30 -83
6619h3N7K14l2k66L45j45j11J13q6j10K85j31Q5j76J8q0o5L47n1Q5l98K70Q5J16
$$ -83 -26 188 156 -110 235 90 -21 92 6 -104 181 50 135 -41 -23 -103 -168 179 128 213 -185 85 170 286
6643B86l43L93l37j65J84L8j32l8M33k38k40J58j0j44O74o77J45K13j61j85L32
$$ 286 -57 336 -1 -166 18 56 -76 -114 319 81 -159 -1 -11 -155 519 -158 -13 200 39 -146 186
6664A86j16q7l98M11R1O2j92j38K7J77p0n5O6q2J15q7n4L11j97j68P1J5P9j9L03
$$ 186 70 -17 -415 -4 87 149 -43 -181 -154 23 -47 -102 -36 -118 -3 -90 -144 167 -30 -198 -127 -112 -33 -52 251
6689B51l66L5P8j40K27P6k10j17L22N7m22K58L8o8J93qj86J57j36l1o6k5O0K1
$$ 251 -115 -80 -2 -142 85 161 -49 -166 156 213 -209 49 87 19 212 204 18 175 39 8 -58 -83 -23 -2
6713bj85J95q0K0J76j04l8Q0j38N9Q2j31j25K16j1m09M32m2L31o17O27l20O8L9
$$ -2 -187 8 -72 -52 124 20 -18 62 -76 -17 65 -66 -191 25 14 -395 37 -5 326 -291 336 16 84 123
6737A23j14J65j61Q9n1m66L65j17J08K43n78LO38k1l01L60m34O6K8L56n48j1L49
$$ 123 9 174 13 102 51 -415 -50 -167 -59 184 -394 -391 247 226 -75 285 -149 -83 -55 301 -247 -258 91
6760I1rL7j42J29k27P6nk58N96k35j06J47R5m43K00J9j57K10j6L71o13J61Q9K44
$$ 91 82 119 -23 106 -121 -45 -50 -308 288 53 -53 94 189 -254 -54 -35 -192 18 2 373 -240 -79 10 254
6784B54k54j79M36l12J41K24l58n4J95J29k64J56j35k25L8J74L5K10j60k3q8j3
$$ 254 0 -179 257 -55 86 310 -48 -102 93 222 -42 114 -21 -246 -208 -34 1 211 51 28 -60 -73
6806g3J35J4k71J93rJq7l30N71K3k7j84l2o9r8J75K61p1j84n0N5Q6P5P0n4m8J2
$$ -73 62 76 -195 -2 -11 -10 -97 -427 144 167 140 -44 -76 -145 -243 -68 193 122 -62 -112 -57 29 104 174 120 72 84
6833H4j47J76kj75j78M20k55M22m7n02M24k97Q5j04J04L09l43j74J70p2N7J57
$$ 84 -63 113 111 -64 -242 178 -77 345 298 -204 220 -77 8 -96 8 317 -26 -200 -30 -102 -45 112
6855A12n0p4L05j11k57K23k6j58j98K22k3L8K79l55j4J35j60l7n4J00k10K49j19
$$ 112 62 -12 293 182 -75 148 122 -36 -234 -12 -35 3 282 -73 -87 48 -112 -149 -203 -103 -313 -64 -183
6878a83J08J01J15l14J54j55K28j43J20j51J74%j58K17j20M18m85L79m09J45r5
$$ -183 -75 26 141 -173 -19 -174 54 -89 31 -120 54 54 -104 113 -7 411 -74 305 -104 41 -54
6899e4J43k62L26L7l17l2M7K82k62K68k06J83k55K09p2M4K7K87p18L85K06k36
$$ -54 89 -173 153 190 -127 -159 -112 170 -92 176 -30 153 -102 107 35 79 106 393 -325 60 266 30
6921C0m01L70K95n33K72j05lJ74j53l5J67r1m5L18m25L03n6j83K3j64J98k2J88
$$ 30 -371 -1 294 -239 33 -72 -75 99 -54 -89 78 -13 -58 260 -165 138 82 -101 -78 -242 -44 -66 122
6944A22l26N05k59J2j66L8J22q5q9P6R1m6K5M6l5J28m02J64K91k01M8j81K94l10
$$ 122 -204 301 42 54 -112 -74 48 -37 -126 -50 41 -5 20 66 31 159 -243 -79 212 11 59 -122 172 -138
6968a38J40n4J08J72k73Q5ML3K6M3L28o75M03n6l4j39m8K55j40K8%j12P1Q9N8
$$ -138 2 -52 56 228 -45 40 44 77 103 146 474 -201 202 146 112 -27 -75 180 40 68 68 -44 27 116 174
6993A74j74r9J04Q9k25K17m7n4R4l4J31m02M92k40O5kk8k75J72J47%j4j44J24
$$ 174 0 -99 5 94 -131 86 39 -15 79 45 176 -226 266 26 91 89 61 -214 -42 105 105 91 -53 71
7017G1j92R6K17P3k74o3j5O3J82j18J55j43j39M62l03J63k24J7k4J84l42J09j69
$$ 71 -121 -25 192 265 -9 -72 -87 -24 158 40 195 52 -87 375 72 235 11 28 4 188 -154 -45 -214
7040b14j15M03J62k94l0J95K6k43M45j11j46K4r2K77o41L50K48m7j48l10L9N02
$$ -214 -329 74 236 -58 -88 107 133 -110 335 224 78 102 10 287 -354 -4 244 197 49 -261 -222 280
7062B80j95p2n9q2K67j45Q1l51K43n1K27l68J02K44R0Nk23J99l22LL09j35J26
$$ 280 85 13 -46 -128 139 -6 75 -276 -33 -84 143 -225 -123 121 211 216 -7 192 -130 -127 182 47 173
7085A73r5J98k25j3r6K56l10L6J40l49M73r1j20j3L63l94j43M33l78K90L9m31
$$ 173 78 276 51 38 -58 198 -112 -76 64 -285 188 97 -23 -36 327 -67 -210 223 -155 135 174 -257
7107b57L13K10l00P6l26j61K24J92kj38L43p9j46O5k8K0O4K46l95K37m32J94p8
$$ -257 56 266 -34 42 -284 -445 -221 -29 -31 -169 174 95 -51 14 -14 6 70 316 -79 158 -274 -80 -158
7130a58j35K86Q9j22m0MK32k1k35m6M04k80K41n9m9o1K28k58j70J53Q1o8j88J06
$$ -158 -293 -7 82 -40 -80 -76 156 135 -100 -146 258 -22 219 160 111 50 278 20 -150 3 84 16 -172 -66
7154f6j34L38j85L77n60K36j43j50L23K04j52p8K62k98p3J18K27l26L85j29k60
$$ -66 -200 138 -47 330 -230 6 -137 -287 36 240 88 10 272 -26 -99 19 246 -80 305 176 -84
7175h4L77k53p0J78l45R8k8K06J2J93l03q3R6j56J57r2N6j26J29J7j95O20m09
$$ -84 293 40 -30 148 -197 -99 -127 79 91 284 -19 -102 -6 -162 -5 -97 -41 -167 -38 -21 -216 404 -5
7198eN2q6r5J67Qq5J19N6k7n9n7J0k11M11k49j33Q9J75J70k08l9k0J37j71p1J01
$$ -5 47 -39 -134 33 41 -44 75 131 104 45 -12 -2 -213 198 -51 -184 -95 80 250 42 3 -17 120 -51 -122 -21
7224b1J02oJ39k19J0J5l5N3O2j87J31j45L82q9m37P7K07M5j80K23k68M9J18j03
$$ -21 81 75 214 -5 5 20 -15 38 100 -87 44 -101 281 192 -245 -168 39 84 -96 127 -141 -92 26 -77
7248g7M30m97K52j43K50j41j92L33N0j29k62l3J6j40K33Q0L1rn8j23M06j84k7
$$ -77 353 -144 108 -35 215 74 -118 215 265 136 -126 -159 -143 -283 -50 30 61 52 -6 -129 277 93 66
7271F6j82K00l1m5P8q8L08n36m8L28K2P7j96k16K76j46L8n1K52l87K05R7r0O0
$$ 66 -116 84 53 8 86 -2 306 -230 -278 50 72 149 -47 -263 13 -133 -95 -146 106 -281 -76 21 -69 -9
7295ij1o2k51K31l11M44N1K18n89J86L4oN1k12J05P7J64o5P9J1J19j25j14NJ98
$$ -9 -20 -82 -333 -102 -413 31 82 300 -289 -103 -69 -75 -24 -236 -131 -54 110 45 124 135 254 129 15 20 218
7320B18k76k04mJ52J83l10L1n3K79J69mk23L94l94j00N5J01R0J16K9k7j84pj33
$$ 218 -58 -262 -266 -114 69 -241 -210 -263 16 185 181 -42 352 -42 -142 -87 14 104 220 249 222 38 31 -102
7344a02L3M18r16Q25k1l45j9K2J43j14J71l9R0l48K01k00J13R3j42J78p1J95J12
$$ -102 -69 349 -567 258 237 -108 -127 -105 38 -76 95 56 146 -202 -1 -201 -88 5 -137 41 -30 165 277
7367B77k31nO7L9m81K96k31L62j87M5j08J93k11l6K74j26K02j81L35r4M6j74j16
$$ 277 46 41 108 147 -334 -38 -269 93 -94 -49 -157 36 -175 -211 63 -63 139 -42 293 199 245 71 -45
7390d5J12j13K47l56L05n24O8O18l36L56m93J48J78l61L2j11L11N0j53K70j21
$$ -45 67 -46 201 -155 150 -374 -306 312 -24 332 -161 -13 165 -196 -164 -275 36 86 -67 203 82
7411H2k08j04K53K0pr5L35m51qK42q3K09J98O8m17p8j17J97K68k96J2J32l72K21
$$ 82 -126 -230 23 43 36 -59 276 -175 -183 59 -24 185 383 451 34 -44 -161 36 304 8 20 152 -220 1
7435AQ7j04K1k2L8k1M1Q0K2k67J79m3l16N31k03p5K3K51l28P7P9J4o5p2o0J72
$$ 1 88 -16 5 -17 21 0 41 121 143 -124 55 12 -304 227 24 -51 -28 223 -105 -28 51 65 0 -72 -132 40
7461D0j25L54j63J5k29K43j30J66j1m63L46J6j07J35j73j18R9K10j74L8J38j86
$$ 40 -85 269 106 121 -108 135 5 171 160 -303 43 59 -48 87 -86 -204 -105 105 -69 -31 107 -79
7483g9j81M1M2K57R1L12n31n2k23L35m9k18K40J42j30J72J3q1k11J02l0K70k39
$$ -79 -260 -219 -177 80 171 483 -48 -100 -323 12 -37 -255 -15 127 -3 169 182 101 -110 -8 -38 232 -7
7506gL4J16j02l36J40K97k33J16k36J40n2K17j71J59j58J74J04l24K12j84K57
$$ -7 27 143 41 -295 -155 142 -91 25 -211 -71 -123 94 -77 82 -76 98 202 -122 90 -94 163
7527A63J6j90l2M7n6J00L35m20J39j75R7q8MJ89l55N58k89j18q9J8Q1j3K55O6
$$ 163 179 -11 -43 4 -52 48 383 -37 102 -73 24 -64 -60 129 -226 332 43 -75 -164 -146 -65 -78 177 243
7551B43k65P4Q6l82K16K17n7J35o1m91N25k79K2lK22j65l1J90j43j00j3J02J12
$$ 243 -22 52 138 -244 -28 189 132 267 206 -285 240 -39 -17 -20 202 37 6 196 53 -47 -60 42 154
7574A54j15k14J26J19M5j14l5j59L42j71K87k17j83J65K41j06m59M58k7qj52k4
$$ 154 39 -175 -49 70 115 1 -34 -193 149 -22 265 48 -135 30 271 165 -294 164 137 129 -23 -47
7596d7k18M10j65o7j12J80R7l4p6m7j71J57j06O8N6K77l25M2L44k94J23O0l59
$$ -47 -265 145 -20 -87 -199 -19 78 44 -32 -79 -250 -93 -199 -131 -75 202 -123 -81 263 -31 92 152 -207
7619b07K86k0L5j10n6J43lJ29j42j60J70j99L28j19l3k40K44j35J05Q1J09k22
$$ -207 79 59 94 -16 -72 71 68 197 55 -105 65 -134 194 75 42 -198 46 -89 16 97 206 -16
7641a6N9q3J97j36l05J84L84k50k1J1M6o5O3o2J1j71P4L67l1m7k03r3J04M4j02
$$ -16 43 -40 157 21 -284 -100 284 34 13 24 70 5 68 6 17 -154 -80 287 256 209 6 -87 17 61 -41
7666d1j9J08l1j36j23K20j97K42Q6o5r0k8n7J95o5j4j76J57K14k36M8K6m06J21
$$ -41 -60 48 17 -119 -242 -22 -219 23 109 44 -46 -74 -131 64 -1 -15 -191 -34 180 -56 -8 18 -388 -267
7690b67q2Q9N8J62n7J08O6J08j22k10M26l3j5k50L5k2m2o1L62k58N4j0O4k40j64
$$ -267 -349 -260 -202 -40 -97 11 77 185 63 -147 279 246 231 -19 16 -6 -48 -109 253 -5 49 39 103 -137 -301
7715c01M12k22j77L39j29n4p7K95p1J38j94r1K29K47j97j52L03m48L0n6K36M9
$$ -301 111 -111 -288 51 -78 -132 -209 86 15 153 -41 -132 97 344 147 -5 298 -150 -120 -176 60 109
7737A09r0k97J85L6L8k6Lj33J46J40J78j93O7K2m7r7R1n4K30k72m2Kk41L10J66
$$ 109 19 -278 -93 -57 -19 -45 -42 -175 -29 111 289 96 163 185 138 41 132 78 308 36 -6 -4 -245 65 231
7762B31l39J22K41l01Q7n4K75m02L47j52k63K91j88J16k86M38l35K69k72N00j60
$$ 231 -108 14 255 -46 41 -13 262 -140 207 55 -208 83 -105 11 -275 163 -172 97 -175 325 165
7783A65l71L4l4J64J22k71rJ31J8K20l66j5L26k37J2m1J20k9R9Q7qP6k56J18n5
$$ 165 -206 -172 -206 -42 80 -191 -200 -69 -51 169 -197 -212 114 -123 -111 -152 -32 -61 38 125 117 193 -63 55 0
7808@J9J12k74P3J51M3m61L68j05N4j2K26l17O0K07Ql1J9k04J33J89k78L21j28
$$ 0 19 131 -143 -70 81 124 -337 31 -74 -20 -32 194 -123 -63 144 152 121 140 -64 69 258 -20 301 173
7832A73po8j23j77J94m09M21j41K60J8l01l22J84K41K1L5j13L88l85j09K16J06
$$ 173 166 98 -25 -202 -8 -417 4 -137 123 141 -160 -482 -298 -57 -36 -1 -114 274 -111 -220 -4 102
7854A02j68J13K04k60J31Kk8q4j13R8kJ64j24J78K01m91N3j74J39J48j13J12k32
$$ 102 -66 47 251 -9 122 124 96 12 -101 -3 -5 159 35 213 414 -77 -24 -198 -59 89 -24 88 -144
7877a44L0K00o1j52J54j72J73j38J38k94M21j34p0J74J3p0j14r8l38L22K19K39
$$ -144 -114 86 25 -127 27 -145 28 -110 28 -266 155 21 -49 125 138 68 -46 -144 -482 -160 59 298
7899B98m57J10K32n3O2k80q6j90L87j85PJ64j4J14J27J32k77o8J72k20jJ90m6
$$ 298 -159 -49 183 130 192 -88 -174 -364 23 -162 -155 9 -5 109 236 368 91 23 195 -25 -26 164 118
7922A18k35l1K09m3j15K31j76n5L73j87m24M22pj15K26j73n5k8J52j9N5l61K97
$$ 118 -117 -148 61 18 -97 134 -42 -97 276 89 -335 87 80 -35 191 18 -37 -65 87 68 123 -238 59
7945E9m6J91m35K66Q0P2l89L59J57j14k65O6k78L98L1l57K20M6O4l6r2j60O9K53
$$ 59 13 204 -231 35 115 187 -202 157 314 200 -65 1 -277 121 152 -205 15 61 125 89 -3 -163 -94 159
7969A59j60k53K32J95l62L30p1j0pj34L00l27J96n8K6k2n2J52j56N8m89L67K65
$$ 159 -1 -254 -22 173 -189 141 70 60 53 -81 219 -108 88 30 56 34 -18 134 -22 36 -453 -86 179
7992A79j91j19J82j79L05J4n7k08o2K67J02k35J09L9k61MJ16p1J6L78k43K2mJ
$$ 179 -12 -131 51 -128 177 191 134 -74 -136 131 233 -2 107 146 -115 -111 5 -66 -50 328 85 107 103 104
8016A04l11O2P4j83M37k75J20j8q2J63l77L45J06j25J7k22j85K74J77k52K22J6
$$ 104 -207 -145 -71 -254 183 -92 28 10 -72 91 -286 59 165 40 57 -165 -350 -76 101 -151 71 87
8038H7k53L01j1M8Lj84K3K49j28p3K92l64O0o7j80N3J10K9Q1p7j60K75l0k73K39
$$ 87 -166 135 124 172 175 -9 14 263 135 62 354 -10 50 -17 -197 -144 -34 -5 76 -1 -161 114 84 -189 50
8063E0R5Q7l4k37J22Q4l91J67p5K61k71L45r1l3j38J02j33Nm7k2L99j68m27K04
$$ 50 145 232 198 -39 83 167 -224 -57 -132 129 -142 203 112 79 -59 43 -90 -85 -132 -154 245 77 -350 -146
8087a46J95o6J33k4J19k70MR9k10K18q7P9m5j45R8L81l39MJ06R1k10RJ02k2J84
$$ -146 49 -17 116 92 211 -59 -55 44 -166 52 -35 44 -1 -146 -48 333 -6 -2 104 195 -15 -6 96 74 258
8112B58n30L32j51J92l05J57j52J42j24L48k98j53J52L46l13RK84k45K4q7J41
$$ 258 -272 60 -91 101 -204 -47 -199 -57 -181 167 -131 -284 -132 214 -99 -90 194 -51 -27 -114 27
8133B7J31j80k13L9K78J68k30j8K64m86J8J01M9M2k39J82L88l11L12k71k36K10
$$ 27 158 -22 -235 -196 82 250 20 2 266 -220 -202 -101 -52 -10 -249 -67 321 10 322 51 -185 25
8155B5j2L5j71K51j09j01o2J13l81M58k62M37l26j09k9L11p0k52L21J24j31l63
$$ 25 13 48 -123 128 19 -82 -144 -31 -412 46 -216 221 -105 -214 -243 68 -2 -254 67 191 60 -303
8177c03N99l97O2J54j24oM18j70k79L2L01l36j75J54
$$ -303 296 -101 -39 115 -9 -15 403 233 -46 -14 287 -49 -224 -70
8191g0
$$ Imaginary data points
##PAGE= N=2
##DATA TABLE= (X++(I..I)), XYDATA
0@%%%Qj6QqJ6j6K4l8M5m7N6p2Q8j04J27j51J74k08K44k80L24l74M24m80N52o29
$$ 0 0 0 0 8 -8 0 -8 8 -8 16 -22 23 -24 32 -40 48 -56 71 -80 94 -114 130 -150 174 -200 224 -256 296 -333
29c33P07p97Q98j004J123j255J398j555J727j918K124k350K603k881L191l539
$$ -333 374 -423 475 -529 594 -661 737 -818 909 -1009 1115 -1235 1368 -1513 1678 -1861
45a861L926m360M855n427O089o872P814q962J0411j2309J4901j8675K4712l5915
$$ -1861 2065 -2295 2560 -2867 3222 -3650 4164 -4798 5613 -6696 8205 -10470 14242 -21673
59b1673O3593k53618m52503M83988M93196p1863n19608k21789L13649M27250r3285
$$ -21673 41920 -211698 -664201 -180213 312983 241120 -278488 -500277 -186628 240622 147337
70A47337m10706p3586L72078K12132k14796l02041O9347L79897J81040l24848
$$ 147337 -263369 -336955 35123 247255 32459 -269582 -200235 179662 360702 35854
80C5854l60881J49469M40779J10238l10333l05639P1610L43461J55394k43991
$$ 35854 -325027 -175558 265221 375459 65126 -240513 -168903 174558 329952 85961
90H5961k52859Q8577K16177J0837j45408p9817Q4593J25067n3021j91430j7228
$$ 85961 -166898 -78321 137856 148693 3285 -76532 8061 133128 80107 -111323 -128551
101a28551J97247R5127j33071j60423j5879J31169J32337m5561j59221l6384Q5399
$$ -128551 68696 163823 30752 -129671 -145550 -14381 117956 72395 -86826 -123210 -37811
112c7811L8843m578J3871j1717m0450k1400r05N1735R4353j3048j36070m9464
$$ -37811 1032 -3546 10325 -1392 -41842 -63242 -64147 -12412 81941 68893 -67177 -116641
124a16641R6864Q6055J092n2950o4701L462O3758M739l4015L6503L0081p1044
$$ -116641 -19777 66278 67370 14420 -50281 -46819 16939 21678 -12337 24166 54247 -16797
136a6797o8208L2021Q9584P2535m0096j52988n7187J42627J33003l8241j08574
$$ -16797 -85005 -52984 36600 109135 69039 -83949 -141136 1491 134494 96253 -12321
147a2321n7297K9255R6175M6493o0731m1847K5599q012l0108L5984M7451p921
$$ -12321 -69618 -40363 55812 102305 41574 -273 25326 17314 -12794 23190 70641 62720
159F2720m3616o2750k7661P7445P8770n1808r2408j8139J7533K7960M2715l005
$$ 62720 19104 -43646 -71307 6138 84908 33100 -59308 -77447 -59914 -31954 10761 7756
171G756n0512k9703j4779O045Q1332O7733o9245j06610P404R1724Q0270J418r2270
$$ 7756 -42756 -72459 -87238 -81193 139 67872 -1373 -107983 -100579 -8855 71415 72833 -19437
184a9437o1409P5602Q2573l4820m5077L2700L4998k0140n5809l1814P6872J17624
$$ -19437 -80846 -5244 77329 42509 -2568 30132 65130 44990 -10819 -42633 34239 151863
196A51863m7478j82174m7100J47137J31656l3466j58467j04463R4995J63314j9512
$$ 151863 104385 -77789 -124889 22248 153904 120438 -38029 -142492 -47497 115817 96305
207I6305j45968l3775Q3263M2171m5129o3179J8358J02971J5480j50054q9654
$$ 96305 -49663 -83438 -175 41996 -3133 -66312 -47954 55017 70497 -79557 -169211
218a69211J29012J54048l1842j59966r8074Q5172J75946K0626j60406p9788R8457
$$ -169211 -40199 113849 82007 -77959 -176033 -90861 85085 105711 -54695 -134483 -36026
229c6026Q8005k6912n4043N970O7238L0272q8658p1730J10930J47544m9356j67645
$$ -36026 51979 25067 -28976 -23006 44232 74504 -14154 -85884 25046 172590 123234 -44411
241d4411n2973J17507J45897j1189j74906r3502J21104J17285o7268j14800L520
$$ -44411 -97384 20123 166020 154831 -20075 -113577 7527 124812 57544 -57256 -53736
252e3736P9611K3326r4020r6493P6877J60772l2131k05222p2570J59040J74665
$$ -53736 25875 49201 -44819 -141312 -64435 96337 64206 -141016 -213586 -54546 120119
263A20119k4756j98638j11551J53319K07736m0022j89267l5503J42283J04248
$$ 120119 95363 -103275 -214826 -61507 146229 106207 -83060 -118563 23720 127968
273A27968o3699j35532Q704J74679O6212j78914j51772J10356K06047J9359j97574
$$ 127968 64269 -71263 -62559 112120 178332 -582 -152354 -41998 164049 183408 -14166
284a4166j74623Q4718K42463M4999k17791j51033J01859J69360J4503j35142r3889
$$ -14166 -188789 -104071 138392 183391 -34400 -185433 -83574 85786 100289 -34853 -128742
295a28742R2247J39142m9353j56160P625J62081P5268j06579j49321M264J82100
$$ -128742 -36495 102647 53294 -102866 -95241 66840 142108 35529 -113792 -109528 72572
306G2572J18064j29615j87400J6226J58091P6830p5185j25182k4698J01289N7251
$$ 72572 190636 61021 -126379 -110153 47938 124768 49583 -75599 -100297 992 58243
317E8243p8758o3554N1027N3208l1414o1929j3888O8946Q3498l3221j15967j5547
$$ 58243 -20515 -84069 -33042 20166 -11248 -73177 -87065 -18119 65379 32158 -83809 -99356
329i9356J05853P5797j9409o5439m3557L5701P9216J2156m6000j2141Q955j1944
$$ -99356 6497 82294 62885 -2554 -46111 -10410 68806 80962 34962 22821 31776 19832
341A9832L925K3876K274j0523j9347l9067o672M7454J8110l6374k9001j3141j0733
$$ 19832 23757 47633 49907 39384 20037 -19030 -25702 21752 39862 3488 -25513 -38654 -49387
354d9387K4045L2448j0631k8592j8855j6793K1841O2875R732n8578l2388K1807
$$ -49387 -25342 7106 -3525 -32117 -50972 -67765 -45924 16951 26683 -31895 -64283 -42476
366d2476L7603L2529m152m3326p991L3466L261j2515K5735K0395k4824l1987j0690
$$ -42476 -4873 27656 23504 -19822 -27813 5653 8914 -3601 22134 42529 17705 -14282 -24972
379b4972K6274O0878J2884q0107n6164M8822O7215O143l9813m5711n64M9177J4524
$$ -24972 1302 62180 75064 -5043 -61207 -12385 54830 60973 21160 -24551 -25115 24062 38586
392C8586m0190j944L8477j1113m9737j0262L9209N1650N86q3840o4153O5054R8795
$$ 38586 -1604 -3548 34929 23816 -25921 -36183 3026 54676 55262 -28578 -92731 -27677 71118
405G1118j3944q8153m3283L4590O5864J1251o5275l1658N8054L1062n7549l8668
$$ 71118 57174 -30979 -74262 -39672 26192 37443 -27832 -59490 -1436 29626 -27923 -66591
417f6591M5231O4278M08q0926o8892O3182J27304j911j25695o0828P1906R7693
$$ -66591 -21360 42918 43326 -37600 -106492 -43310 83994 82083 -43612 -104440 -32534 65159
429F5159R365q7504o1924O5141Q6234l7777q3367J8479Q4545K4079p1406p9384
$$ 65159 74524 -12980 -74904 -9763 76471 38694 -44673 -26194 58351 82430 11024 -68360
441f8360L5178J29614L2767j30841j00148P0643J25094J6455j03436r3646M1436
$$ -68360 -33182 96432 129199 -1642 -101790 -31147 93947 110402 6966 -86680 -45244
452d5244J16094K673j11938m0116P8753N3053n1923q4416j798J01648O2183r6009
$$ -45244 70850 73523 -38415 -78531 222 53275 1352 -83064 -84862 16786 78969 -17040
464a7040j23708M1599J41384M1408r6524j02741K1081J26463N8674r1865q4527
$$ -17040 -140748 -99149 42235 83643 -12881 -115622 -94541 31922 90596 -1269 -85796
475h5796N5525Q9545p656o7647k2966O2184P0029l9476j07691J441J21451N5536
$$ -85796 -30271 59274 51618 -16029 -38995 23189 93218 53742 -53949 -52508 68943 124479
487A24479q4326j02741K488J00974P1517o6224j14139P729R4866K4727o1141m5155
$$ 124479 40153 -62588 -60100 40874 112391 46167 -67972 -60243 34623 59350 -1791 -46946
499d6946K0614N1221J776o8527k9264P5755O0913n5366q3809J546P7077O1641
$$ -46946 -26332 24889 26665 -41862 -71126 4629 65542 10176 -73633 -72087 4990 66631
511F6631l3749r4369j8995Q4922N1728m3814n0415N568L4871J8603k5370l1944
$$ 66631 32882 -61487 -80482 4440 56168 12354 -38061 -32493 2378 20981 -4389 -36333
523c6333K9770M9655k5239o1834L896N7111L6432j9725n8650k5235N5377N6501
$$ -36333 -6563 43092 17853 -43981 -40085 17026 53458 33733 -24917 -50152 5225 61726
535F1726k5201m8723j942K1742J2670Q41j4741m304J8428p582l6053L987M0244
$$ 61726 36525 -12198 -14140 7602 20272 21113 6372 2068 20496 12914 -23139 -19152 21092
548B1092Q214k7878k8224j0988K5120L8547q925m0736p381J6951P216J1153J0082
$$ 21092 29306 1428 -26796 -37784 -12664 25883 16958 -23778 -31159 -14208 -6992 4161 14243
561A4243j4604j3414L300L121J3736K4402j0153l4830j107K1880Q059L267l992
$$ 14243 -361 -13775 -10475 -7354 6382 30784 20631 -14199 -15306 6574 14633 17900 13908
574A3908k0008p286Q552k585L785K0367j0302m0343q033L0728K6883K666k9408
$$ 13908 -6100 -13386 -4834 -7419 -3634 16733 6431 -33912 -41945 -11217 15666 18332 -11076
587a1076l6055J7135N3525O487l4975r477J8625J4538J301j2996l121L1584J5522
$$ -11076 -47131 -29996 23529 30016 -4959 -14436 4189 18727 20028 7032 3911 35495 51017
600E1017m4670l4231L6273M8805n855n1524m5526J7546O5291J1015p0364m2952
$$ 51017 6347 -27884 8389 57194 51339 -185 -45711 -28165 37126 48141 -22223 -65175
612f5175L5415L9979r414l8767j9263L3504L9859l0035n8605K1985P6645J8211
$$ -65175 -29760 10219 805 -37962 -57225 -23721 16138 -13897 -72502 -50517 26128 44339
624D4339n7068n1084K5214Q6396L9582o9069p1240L9511Q3508R525n8069m1271
$$ 44339 -12729 -63813 -38599 47797 87379 18310 -52930 -13419 70089 79614 21545 -19726
636a9726K6448N9117m002p5006k3916O7407M0261n7673p4059K819P4306M8174
$$ -19726 6722 65839 61837 -13169 -37085 30322 70583 12910 -61149 -58330 15976 64150
648F4150o0781j00163Q612J00996L8187o6084o6818J4115P3297L5318n3813n4774
$$ 64150 3369 -96794 -88182 12814 51001 -15083 -81901 -67786 5511 40829 -12984 -67758
660f7758M4433P2614j5687o6302r308O1872N5915k6228q4528j7655Q8317O1298
$$ -67758 -23325 49289 33602 -32700 -42008 19864 75779 49551 -34977 -52632 35685 96983
672I6983n4987q0580j912O4075M3622l6766p0283J914O6141J2217n8230k9526
$$ 96983 41996 -38584 -40496 23579 67201 30435 -39848 -37934 28207 40424 -17806 -47332
684d7332L7115M2311j0628n7316k6672N7191O1728l2430p3759l349N8742L9852
$$ -47332 -10217 32094 21466 -35850 -62522 -5331 56397 23967 -49792 -53141 5601 45453
696D5453k1477n3570j1189N1900L0705m1199l4314K7214L4572j0223l8100j8375
$$ 45453 23976 -29594 -40783 11117 41822 623 -33691 -6477 28095 17872 -20228 -38603
708c8603L4582M8085j8674o6351r967N6209L5068k1978m3892j4228L6953L8938
$$ -38603 -4021 44064 25390 -40961 -50928 5281 40349 18371 -25521 -39749 -2796 36142
720C6142k1763m0197J2079L5093k375k6283r217J9022L0841m373m7135j8251M5605
$$ 36142 14379 -25818 -13739 21354 18979 -7304 -16521 2501 33342 28969 -18166 -36417 9188
733I188L6544k1775l9070j4021K2390L5683j102l8953j2770K6069J0725j2555
$$ 9188 45732 23957 -15113 -29134 -6744 28939 27837 -11116 -23886 2183 12908 353
745C53n332L141N445L982j3344j4195J8240K3754j2758k3760k626Q862J3398R675
$$ 353 -4979 -1838 3607 7589 -5755 -19950 -1710 22044 9286 -14474 -17100 -8238 5160 14835
759A4835j4517j9839M072J1167N73N548J241j8059q449J4789J0036O14k341j1515
$$ 14835 318 -19521 -15449 -4282 -3709 1839 3080 -14979 -23428 -8639 1397 2011 -330 -11845
773a1845m285J7738R219j3310o65J4590Q53r132k738M206J7556J3884k1376l0106
$$ -11845 -16130 1608 10827 -2483 -3148 11442 12295 3163 425 4631 22187 36071 14695 -15411
787a5411J4071L5338M140k4818k3766j056K6828J7147k7343k9152J4434J9874
$$ -15411 -1340 33998 38138 13320 -10446 -11502 15326 32473 5130 -24022 -9588 10286
799A0286j0801j8850m794J3340J7812j2839l6849O48M4132J7370l1434k8899O084
$$ 10286 -515 -19365 -24159 -10819 6993 -5846 -42695 -42047 2085 19455 -11979 -40878 -34794
812c4794L4209K6801j9332l7211R893L9587M412k4258n958J6233J7808m170k9477
$$ -34794 -585 26216 6884 -30327 -20434 19153 23565 -693 -6651 9582 27390 23220 -6257
825f257o546L9208K3016l6281l8722J2477L8341J6053k8648m3314M743M7976J0039
$$ -6257 -12803 26405 49421 13140 -25582 -13105 25236 41289 12641 -30673 -25930 22046 32085
838C2085m2722k2816K4440K7436p423l4130j4107L8105L7780l1523n4140J0742
$$ 32085 -10637 -33453 -9013 18423 11000 -23130 -37237 868 38648 7125 -47015 -36273
850c6273N6906K3181l6300m9750L960O1515L0399n0192m9658K5980N3251K845
$$ -36273 20633 43814 7514 -42236 -38276 23239 53638 3446 -46212 -20232 33019 35864
862C5864m4914l1913K9102N4181r066o7197j8556N8506M4373k9471o0501j4498
$$ 35864 -9050 -40963 -11861 42320 33254 -33943 -52499 6007 50380 20909 -39592 -54090
874e4090N5737N3342l1431p0707l48O3220L0216l5018m4836M696N1782K4533m5632
$$ -54090 1647 54989 23558 -47149 -47497 15723 45939 10921 -33915 -29219 22563 47096 1464
887A464m2745L1796N3963n029m9340k7280K9371N3059L88o0267l0712M1988M2870
$$ 1464 -41281 -9485 44478 39449 -9891 -37171 -7800 45259 45647 -14620 -45332 -3344 39526
900C9526j3527m0979j7614K3868L2466r286l9542k741L4154R203k4829j7434R003
$$ 39526 25999 -14980 -32594 -8726 23740 14454 -25088 -27829 6325 15528 -9301 -26735 -17732
913a7732K4756J1352k5771k6664J8764L4000k309k3329q871P888J7048P806j4957
$$ -17732 7024 18376 -7395 -34059 -15295 18705 16396 -6933 -15804 -7916 9132 16938 1981
926A981j0050J3969P271j1941l732J0864L600l848p706q734Q264J7626p080k0456
$$ 1981 -8069 5900 13171 1230 -2502 8362 11962 8114 408 -8326 -62 17564 10484 -9972
940i972R37J1420P07k199l624m287N461M604j1023m346J5445N534j2405p201K439
$$ -9972 -9035 2385 3092 893 -2731 -7018 -1557 3047 -7976 -12322 3123 8657 -3748 -10949 -8510
955h510Q178J1485k919j8430j839J6798M742o899k100j631l44N983j069o789N715
$$ -8510 -332 11153 8234 -10196 -12035 4763 9505 2606 506 -1125 -1469 4514 3445 -3344 2371
970B371N561r876n781P274L251o47P03o614n446P890M330n003K244K997r692l351
$$ 2371 7932 -1944 -7725 -451 2800 2153 2856 -3758 -9204 -1314 3016 -1987 257 3254 -6438 -9789
986i789J1000O406j861o006j0683J406K0601O171j9175j1104J0317J1543J252
$$ -9789 1211 7617 5756 -250 -10933 -9527 11074 17245 -1930 -13034 -2717 8826 10078
999A0078q841j2192P161J8804o621k3431J712K1971P867j3815k0775k430K7345
$$ 10078 1237 -10955 -3794 15010 8389 -15042 -13330 8641 16508 2693 -18082 -20512 6833
1012F833K0687k3791l2053R807L1386R244j9105k3590L184L1636J1201k9960k0413
$$ 6833 27520 3729 -28324 -18517 12869 22113 3008 -20582 -17398 14238 25439 -4521 -24934
1025b4934K2468K5900o777k5861j2854K0812L1274r308m0822p243L4627K1638
$$ -24934 -2466 23434 16657 -9204 -22058 -1246 30028 20720 -20102 -27345 7282 28920
1037B8920j7057k9564o199K6901K3988j9857l3454Q354L1623L766k4697j6638
$$ 28920 11863 -17701 -23900 3001 26989 7132 -26322 -17968 13655 17421 -7276 -23914
1049b3914J1420K8316L867l3195j9132K8717K9049j1972k8944p577K1377K4835
$$ -23914 -12494 15822 19689 -13506 -32638 -3921 25128 13156 -15788 -23365 -1988 22847
1061B2847p539l1436l471L0759J1325k1575j5896R788K1282N412k3309k0547K0564
$$ 22847 15308 -16128 -19599 11160 22485 910 -14986 -5198 16084 21496 -1813 -22360 -1796
1074a796L0896r711l2512p029K2615K1414o727k9685j1002K7924K0594k1257k4269
$$ -1796 29100 19389 -13123 -20152 2463 23877 17150 -12535 -23537 4387 24981 3724 -20545
1087b0545P316K1841O185j8149k1335J0151L1405j40l3308j2798K3602K3530m368
$$ -20545 -13229 8612 14797 -3352 -24687 -14536 16869 16729 -16579 -29377 -5775 17755 13387
1100A3387k6278j5057K1697K9567j0197l0112j045K3831J3232j0392k0103k262
$$ 13387 -12891 -27948 -6251 23316 13119 -16993 -18038 5793 19025 8633 -11470 -13732
1112a3732K4775J4635k1923k1869J2441K3378K526j8276j7462N603K5422N370
$$ -13732 11043 25678 3755 -18114 -5673 17705 20231 1955 -15507 -9904 15518 20888
1124B0888k4606j4738J4663J5035k382j2947r894P899J6622m183j9078k33J5913
$$ 20888 -3718 -18456 -3793 11242 8860 -4087 -13981 -6082 10540 6357 -12721 -12954 2959
1137B959N340p308r423k995J1282J2705p506j4899K980J0786K545j757m305n032
$$ 2959 8299 991 -8432 -11427 -145 12560 5054 -9845 -6865 3921 6466 4709 404 -4628
1151d628M408P531n034m428L612j4l867K101R7l522K671K411n471j643L062q21
$$ -4628 -220 7311 2277 -2151 1461 1447 -2420 -319 -222 -3744 -1073 1338 -4133 -5776 -2714 -3535
1167c535O88M786m432o792N226P554J80k359l810l173Q509R434o160r294M711
$$ -3535 -2847 1939 -2493 -9285 -4059 3495 3675 1316 -2494 -5667 2842 12276 6116 -3178 1533
1182A533O634N24k064m751j308Q475K098j1992m686R668M451n911p527m191M727
$$ 1533 8167 8691 6627 1876 568 9043 11141 -851 -5537 4131 8582 2671 -4856 -9047 -4320
1197d320J0711m548j5315p62J3083K480p229n621M96Q488O721r433r524J1017
$$ -4320 6391 1843 -13472 -14234 -1151 1329 -5900 -11521 -11025 -2537 4184 -5249 -14773 -3756
1211c756J2621m789j0455j109Q714J1410j060j6162l068J6492Q772j1689j0142
$$ -3756 8865 4076 -6379 -7488 1226 12636 11576 -4586 -7654 8838 17610 5921 -4221
1224d221L376R841N170j0296j3549O899J7679m089j9445m304J2076J1774l447
$$ -4221 -845 8996 14166 3870 -9679 -2780 14899 10810 -8635 -12939 -863 10911 7464
1237G464j8569q672J7795J7019j1950j9726K316J6716Q776q947j6808J887K2209
$$ 7464 -11105 -19777 -1982 15037 3087 -16639 -14323 2393 11169 2222 -14586 -12699 9510
1250I510O615k0232j2128J3926J7428q05j7712j2753J3455K3162m814k5866n900
$$ 9510 16125 -4107 -16235 -2309 15119 14314 -3398 -16151 -2696 20466 15652 -10214 -16114
1263a6114J8936J4147p669j8947o500J7830J5829j3721k0950M759J9697M481j3846
$$ -16114 2822 16969 9300 -9647 -16147 1683 17512 3791 -17159 -12400 7297 11778 -2068
1276b068j4247M444K0774O298k0690j3347J3579J8005j860j5368q847R797J8121
$$ -2068 -16315 -11871 8903 15201 -5489 -18836 -5257 12748 10888 -4480 -13327 -3530 14591
1289A4591k321k0192l353J6997Q837q658j2494j524J3575J0547j1520j6835N833
$$ 14591 12270 -7922 -11275 5722 14559 5901 -6593 -8117 5458 16005 4485 -12350 -6517
1302f517J6519J326j2325q503L340J2280L925j3693r374J0628J0200o252r514
$$ -6517 10002 11328 -997 -9500 -6160 6120 10045 -3648 -13022 -2394 7806 1554 -7960
1315g960q16O976P998m144j2677j20J4730M010j0450o605L740Q313M890o626r326
$$ -7960 -8776 -1800 6198 2054 -10623 -10743 3987 7997 -2453 -9058 -5318 2995 7885 1259 -8067
1330h067N321J1055j552q848j73M938L634o27o814l097Q522N510q044o556L653
$$ -8067 -2746 8309 6757 -2091 -2264 2674 6308 5681 -1133 -4230 4292 9802 1758 -4798 -1145
1345a145M409J385k656o806q77P934J927p584j998L551J223N70j078l415J694
$$ -1145 3264 4649 1993 -4813 -5690 2244 4171 -3413 -5411 -1860 -637 -67 -1145 -4560 -2866
1360b866M978j388m245K160K454l26R44l55k707J438L787j533j760J711j201j470
$$ -2866 2112 724 -3521 -1361 1093 767 1711 1356 -1351 87 3874 2341 581 2292 1091 -379
1376c79L597N65m655l98K143j45L58r80m018N21N629j643o294N89M504J148j97
$$ -379 3218 3783 -872 -1270 873 728 1086 106 -3912 -3391 2238 595 -5699 -5110 -606 542 345
1393C45m193l332N611P546m398p829J876O372L564j464o481k171R069N306q035
$$ 345 -3848 -7180 -1569 5977 1579 -6250 -4374 1998 5562 4098 -2383 -4554 4515 9821 1786
1408A786o168N012O495m17n414o331L323J0739j147j2684l659R025O059k930q772
$$ 1786 -4382 630 7125 6708 1294 -5037 -1714 9025 7878 -4806 -8465 560 6619 3689 -5083
1423e083m936P789J0184n696j2176J511J0302K780n447o929L27J0291M993j0284
$$ -5083 -10019 -2230 7954 2258 -9918 -8407 1895 4675 -772 -7701 -7374 2917 7910 -2374
1437b374q259Q487J0037j865q459m897N700J1042j019j3199l361J1531O519o529
$$ -2374 -10633 -2146 7891 6026 -2433 -7330 -1630 9412 8393 -4806 -8167 3364 9883 3354
1451C354q208q83Q479O971p162j1665L867J2240K61r768n724M244R706K094j1064
$$ 3354 -4854 -5737 2742 9713 2551 -9114 -5247 6993 7254 -2514 -8238 -3994 5712 7806 -3258
1466c258p305R385J0115n032r625j043P542P178l777j1424n31J2874M596r689
$$ -3258 -10563 -1178 8937 3905 -5720 -6763 779 7957 4180 -7244 -7775 5099 9695 6
1480Fp611L495R138L414p882r989N109J2453j108j1091l732O115O839l43r131
$$ 6 -7605 -4110 5028 8442 560 -9429 -4320 8133 7025 -4066 -7798 -1683 5156 4813 -4318
1495d318m572Q694P968o500r163K213P796L898m474q793O89J1004L835r372o060
$$ -4318 -8890 -196 7772 1272 -7891 -5678 2118 6016 1542 -7251 -6562 4442 8277 -1095 -7155
1510g155N120O727J169n454n732L403Q921r93q876j052O195L189k501m939j920
$$ -7155 -2035 4692 5861 407 -5325 -1922 6999 6006 -2870 -3922 2273 5462 2961 -1978 -3898
1525c898N298N280n605o238K425N422N9k793l448m80N614K111n783l386M330K854
$$ -3898 1400 6680 1075 -5163 -2738 2684 2743 -50 -3498 -3978 1636 3747 -2036 -5422 -1092 1762
1541A762j479j935j319J253M043l33m997kM390K87j536l26j113J100K598r66l211
$$ 1762 283 -1652 -2971 -1718 2325 1992 -3005 -3007 1383 1670 134 -192 -1305 -205 2393 1427 -1784
1558a784J457K110j589l19P31r08M35J441j437j633J812M72j162R91J42k431J016
$$ -1784 -327 1783 194 -125 606 -302 133 1574 137 -1496 316 788 -374 617 759 -1672 -656
1575f56K528j141j380L66k74P63K502j687l058J340K761p99j637k32k09J940J380
$$ -656 1872 731 -649 -283 -557 206 2708 1021 -2037 -697 2064 1265 -372 -604 -813 1127 2507
1592B507l168k469L438K612k920j968l32J330L221o20m984j190N507K039l637
$$ 2507 -661 -3130 308 2920 0 -1968 -2300 -970 2251 1631 -3353 -4543 964 3003 -634
1607f34k669N1L506L020k787n261K000O027j61m781j505K480L911J237n479l797
$$ -634 -3303 -3252 254 3274 487 -4774 -2774 3253 3092 -1689 -3194 -714 3197 4434 -1045 -4842
1623d842N173N756l238n336m64L973L689j261o692j253P437K678n745m621K255
$$ -4842 331 6087 2849 -2487 -2951 1022 4711 3450 -3242 -4495 2942 5620 -125 -4746 -2491
1638b491M728K049m046o224K726P758J4p607k022M081M396l1n413l598N388N863
$$ -2491 2237 4286 240 -5984 -3258 4500 4514 -3093 -5115 -1034 3362 3331 -2082 -5680 -292 5571
1654E571m030o184J195N491K457l336n502L86P068K896p376m388M383N206j30
$$ 5571 1541 -4643 -3448 2043 4500 1164 -4338 -3952 3116 6012 -1364 -5752 -1369 3837 3707
1669C707m803m295L137O964q40p431j696N733L057k024m728j280N556M362m166
$$ 3707 -1096 -5391 -2254 4710 3870 -3561 -5257 476 3533 1509 -3219 -4499 1057 5419 1253
1684A253o405K716O196R22m431m027J345O553J653o694l973M751N242k013m499
$$ 1253 -5152 -2436 3760 4682 251 -3776 -2431 4122 5775 -919 -4892 -141 5101 3088 -1411
1699a411k097L368N028j492p065o44O030J924l598l251n02M196L036l483n597
$$ -1411 -3508 -140 4888 3396 -3669 -4313 1717 3641 43 -3208 -3710 486 3522 39 -5558
1714e558K608N234q4m051j776J443L708J196m320k664M264L757k171l276j98K086
$$ -5558 -2950 2284 2200 -1851 -3627 -2184 1524 2720 -1600 -4264 0 3757 1586 -1690 -1888 198
1730A98K766k92l993q05M020J570k526j800M47Q82J859r47l086Q74K820q20k377
$$ 198 2964 2672 -1321 -2126 1894 3464 938 -862 -415 467 2326 1379 -1707 -833 1987 1167 -1210
1747a210J35Q70Q35M75j579j630J305K284j051j360K40l18N31J410r46j615J350
$$ -1210 -1075 -205 630 1105 -474 -2104 -799 1485 434 -926 -686 -1004 -473 937 -9 -1624 -274
1764b74P82o95L73K54q71M30J096r97r65J270J99p20L16m3j332J553J022j780
$$ -274 508 -187 186 440 -431 -1 1095 98 -867 403 602 -118 198 155 -1177 376 1398 -382
1782c82r68J292K66p6L82j966j05K082Q50k668k72J866J27K41n28j534J145K472
$$ -382 -1350 -58 208 132 514 -1452 -1557 525 1375 -1293 -1565 301 428 669 141 -1393 -248 2224
1800B224p84k735M66K076M15k44j368j267K008K273k264k435J516K122m16j692
$$ 2224 1440 -1295 -829 1247 1662 1418 50 -1217 791 3064 800 -1635 -119 2003 1587 -105
1816a05j445J41L131L88m008j452K881K265j604k321j468K082L823j358m241Q7
$$ -105 -1550 -1409 1722 2110 -1898 -3350 -469 1796 192 -2129 -3597 -1515 2308 950 -3291 -3204
1832c204M258Q87j996k097K13L022K796l519l362K042M490n75k961k144J776M081
$$ -3204 1054 1941 -55 -2152 -1939 1083 3879 360 -3002 -960 3530 2955 -6 -2150 -374 3707
1848C707O34n010k951M390L380k118l724r56K526L327j450n141j13M806J453l166
$$ 3707 4341 -669 -3620 770 4150 2032 -1692 -2648 -122 3205 1755 -3386 -3499 1307 2760 -406
1864d06k952Q71L471J995l058m312K585M876q78l779j052J947L523J17l862k138
$$ -406 -3358 -2487 984 2979 -79 -4391 -1806 3070 2192 -1587 -2639 -692 2831 2948 -914 -3052
1880c052L600L291k448l383O92K286K169j798l957J73M047J094l329k161J443
$$ -3052 548 3839 1391 -1992 -1300 986 3155 1357 -2600 -2427 1620 2714 -615 -2776 -1333
1895a333K213R33k443k394J442L732j033l279O7K280J333m12k806o76L597K069
$$ -1333 880 1813 -630 -3024 -1582 2150 1117 -2162 -2095 185 1518 1106 -1700 -2376 1221 3290
1911C290k588k568J438K171N20j230k216K01K999N99l193q44J645J260n91j769
$$ 3290 702 -1866 -428 1743 2263 1033 -1183 -982 2017 2616 -577 -1421 224 1484 893 -876
1927h76j055J607K328j277l100K56K601N05q46j965l26J920K067k199j631Q65
$$ -876 -1931 -324 2004 727 -2373 -2117 484 989 143 -1822 -2148 -228 1839 -360 -1991 -1126
1943a126J840M4j059q48R4J826R38j903j193J737R12k65p38q89K97J801L36k319
$$ -1126 714 758 -301 -1149 -1055 771 1709 -194 -1387 350 1262 997 259 -630 -333 1468 1804 -515
1961e15l25J243L94M5m38j154P0J513K60k140M09Q62M5K40m76j378Q67J443l06
$$ -515 -840 403 797 842 404 -750 -680 833 1093 -1047 -638 224 269 509 33 -1345 -478 965 659
$$ [...]
8191f1
##END NTUPLES=NMR FID
##END=
