##TITLE=1H_EC-3099(II-4)
 CDCl3, 8 sc, 
 2.8.2019
##JCAMPDX= 6.0         $$ Bruker NMR JCAMP-DX V2.0
##DATA TYPE= NMR FID
##DATA CLASS= NTUPLES
##ORIGIN= UXNMR, Bruker Analytische Messtechnik GmbH
##OWNER= root
$$ XWIN-NMR		Version 3.5
$$ Fri Aug  2 14:37:08 2019 Russian Standard Time (UT+4h)  she@DPX200
##.OBSERVE FREQUENCY= 200.13155
##.OBSERVE NUCLEUS= ^1H
##.DELAY= (6, 6)
##.ACQUISITION MODE= SIMULTANEOUS
##.ACQUISITION SCHEME= undefined
##.AVERAGES= 8
##.DIGITISER RES= 18
##SPECTROMETER/DATA SYSTEM= spect
##.PULSE SEQUENCE= zg30
##.SOLVENT NAME= DMSO
##.SHIFT REFERENCE= (INTERNAL, DMSO, 0, 15.7039)
##AUDIT TRAIL= $$ (NUMBER, WHEN, WHO, WHERE, WHAT)
$$ ##TITLE= Audit trail, XWIN-NMR		Version 3.5
$$ ##JCAMPDX= 5.01
$$ ##ORIGIN= Bruker BioSpin GmbH
$$ ##OWNER= she
$$ F:/spectra/data/she/nmr/H-F/1/audita.txt
$$ ##AUDIT TRAIL=  $$ (NUMBER, WHEN, WHO, WHERE, WHAT)
(   1,<2019-08-02 14:35:47.79 +0400>,<she>,<DPX200>,
      <created by zg, POWCHK disabled, PULCHK disabled
       configuration hash MD5:
       00 E9 B6 7A A2 85 ED C7 34 08 36 98 17 FE 4E 26
       data hash MD5: 16K
       23 D0 80 BA D9 BD 3B 71 FD A7 F2 37 D8 83 DE 63>)
$$ ##END=
$$ 
$$ hash MD5
$$ DF A2 6C 04 67 F8 03 1A D9 D2 68 1B 99 F5 88 AC
##$RELAX= 
##$RELAX= 
##$RELAX= 
##$RELAX= 
##$RELAX= 
##$RELAX= 
$$ Bruker specific parameters
$$ --------------------------
##$DU= <F:/spectra>
##$EXPNO= 1
##$NAME= <H-F>
##$PROCNO= 1
##$TYPE= <nmr>
##$USER= <she>
##$AMP= (0..31)
100 100 100 100 100 100 100 100 100 100 100 100 100 100 100 100 100 100 
100 100 100 100 100 100 100 100 100 100 100 100 100 100 
##$AQSEQ= 0
##$AQ_mod= 1
##$AUNM= <au_zg>
##$AUTOPOS= <>
##$BF1= 200.13
##$BF2= 200.13
##$BF3= 200.13
##$BF4= 200.13
##$BF5= 200.13
##$BF6= 200.13
##$BF7= 200.13
##$BF8= 200.13
##$BYTORDA= 1
##$CFDGTYP= 0
##$CFRGTYP= 5
##$CHEMSTR= <none>
##$CNST= (0..31)
1 1 145 1 1 1 1 1 1 1 1 1 1 1 1 1 1 1 1 1 1 1 1 1 1 1 1 1 1 1 1 1 
##$CPDPRG= <>
##$CPDPRG1= <>
##$CPDPRG2= <>
##$CPDPRG3= <>
##$CPDPRG4= <mlev>
##$CPDPRG5= <mlev>
##$CPDPRG6= <mlev>
##$CPDPRG7= <mlev>
##$CPDPRG8= <mlev>
##$CPDPRGB= <>
##$CPDPRGT= <>
##$D= (0..31)
0 1.2 0 0 0 0 0 0 0 0 0 0.03 0 0 0 0 0 0 0 0 0 0 0 0 0 0 0 0 0 0 0 0 
##$DATE= 1564742147
##$DBL= (0..7)
120 120 120 120 120 120 120 120 
##$DBP= (0..7)
150 150 150 150 150 150 150 150 
##$DBP07= 0
##$DBPNAM0= <>
##$DBPNAM1= <>
##$DBPNAM2= <>
##$DBPNAM3= <>
##$DBPNAM4= <>
##$DBPNAM5= <>
##$DBPNAM6= <>
##$DBPNAM7= <>
##$DBPOAL= (0..7)
0.5 0.5 0.5 0.5 0.5 0.5 0.5 0.5 
##$DBPOFFS= (0..7)
0 0 0 0 0 0 0 0 
##$DE= 6
##$DECBNUC= <off>
##$DECIM= 24
##$DECNUC= <off>
##$DECSTAT= 4
##$DIGMOD= 1
##$DIGTYP= 9
##$DL= (0..7)
0 120 120 120 120 120 120 120 
##$DP= (0..7)
150 150 150 150 150 150 150 150 
##$DP07= 0
##$DPNAME0= <>
##$DPNAME1= <>
##$DPNAME2= <>
##$DPNAME3= <>
##$DPNAME4= <>
##$DPNAME5= <>
##$DPNAME6= <>
##$DPNAME7= <>
##$DPOAL= (0..7)
0.5 0.5 0.5 0.5 0.5 0.5 0.5 0.5 
##$DPOFFS= (0..7)
0 0 0 0 0 0 0 0 
##$DQDMODE= 0
##$DR= 18
##$DS= 0
##$DSLIST= <SSSSSSSSSSSSSSS>
##$DSPFIRM= 0
$$ [...]
##$SUBNAM2= <"">
##$SUBNAM3= <"">
##$SUBNAM4= <"">
##$SUBNAM5= <"">
##$SUBNAM6= <"">
##$SUBNAM7= <"">
##$SUBNAM8= <"">
##$SUBNAM9= <"">
##$SW= 24.9336996594482
##$SWIBOX= (0..15)
0 0 2 0 0 0 0 0 0 0 0 0 0 0 0 0 
##$SW_h= 4990.01996007984
##$TD= 16384
##$TD0= 1
##$TE= 0
##$TE2= 300
##$TE3= 300
##$TEG= 300
##$TL= (0..7)
0 120 120 120 120 120 120 120 
##$TP= (0..7)
150 150 150 150 150 150 150 150 
##$TP07= 0
##$TPNAME0= <>
##$TPNAME1= <>
##$TPNAME2= <>
##$TPNAME3= <>
##$TPNAME4= <>
##$TPNAME5= <>
##$TPNAME6= <>
##$TPNAME7= <>
##$TPOAL= (0..7)
0.5 0.5 0.5 0.5 0.5 0.5 0.5 0.5 
##$TPOFFS= (0..7)
0 0 0 0 0 0 0 0 
##$TUNHIN= 0
##$TUNHOUT= 0
##$TUNXOUT= 0
##$USERA1= <user>
##$USERA2= <user>
##$USERA3= <user>
##$USERA4= <user>
##$USERA5= <user>
##$V9= 5
##$VALIST= <valist>
##$VCLIST= <CCCCCCCCCCCCCCC>
##$VD= 0
##$VDLIST= <DDDDDDDDDDDDDDD>
##$VPLIST= <PPPPPPPPPPPPPPP>
##$VTLIST= <TTTTTTTTTTTTTTT>
##$WBST= 1024
##$WBSW= 4
##$XGAIN= (0..3)
0 0 0 0 
##$XL= 0
##$YL= 0
##$YMAX_a= 176680
##$YMIN_a= -330095
##$ZGOPTNS= <>
##$ZL1= 120
##$ZL2= 120
##$ZL3= 120
##$ZL4= 120
##$ABSF1= 10
##$ABSF2= 0
##$ABSG= 5
##$ABSL= 3
##$ALPHA= 0
##$AQORDER= 0
##$ASSFAC= 0
##$ASSFACI= 0
##$ASSFACX= 0
##$ASSWID= 0
##$AUNMP= <proc_1d>
##$AZFE= 0.1
##$AZFW= 0.1
##$BCFW= 1
##$BC_mod= 2
##$BYTORDP= 1
##$COROFFS= 0
##$CY= 11.3945322036743
##$DATMOD= 1
##$DC= 2
##$DFILT= <>
##$DTYPP= 0
##$F1P= 20.1537800932815
##$F2P= 0.134698688090026
##$FCOR= 0.5
##$FTSIZE= 0
##$FT_mod= 4
##$GAMMA= 1
##$GB= 0.15
##$INTBC= 1
##$INTSCL= 1
##$ISEN= 128
##$LB= 0.24
##$LEV0= 0
##$LPBIN= 0
##$MAXI= 10000
##$MC2= 0
##$MEAN= 0
##$ME_mod= 0
##$MI= 1.114404
##$NCOEF= 0
##$NC_proc= 0
##$NLEV= 6
##$NOISF1= 3.799351
##$NOISF2= 2.8
##$NSP= 1
##$NTH_PI= 0
##$NZP= 0
##$OFFSET= 15.70392
##$PC= 1
##$PHC0= -9222.267
##$PHC1= 17.60097
##$PH_mod= 1
##$PKNL= yes
##$PPARMOD= 0
##$PSCAL= 0
##$PSIGN= 0
##$REVERSE= no
##$SF= 200.130013532006
##$SI= 16384
##$SIGF1= 3
##$SIGF2= 2
##$SINO= 400
##$SIOLD= 16384
##$SREGLST= <1H.CDCl3>
##$SSB= 0
##$STSI= 0
##$STSR= 0
##$SW_p= 3612.71676300578
##$SYMM= 0
##$S_DEV= 0
##$TDeff= 0
##$TDoff= 0
##$TI= <>
##$TILT= no
##$TM1= 0
##$TM2= 0
##$TOPLEV= 0
##$USERP1= <user>
##$USERP2= <user>
##$USERP3= <user>
##$USERP4= <user>
##$USERP5= <user>
##$WDW= 1
##$XDIM= 8192
##$YMAX_p= 0
##$YMIN_p= 0
$$ End of Bruker specific parameters
$$ ---------------------------------
##NTUPLES= NMR FID
##VAR_NAME=  TIME,          FID/REAL,        FID/IMAG
##SYMBOL=    X,             R,               I
##VAR_TYPE=  INDEPENDENT,   DEPENDENT,       DEPENDENT
##VAR_FORM=  AFFN,          ASDF,            ASDF
##VAR_DIM=   8192,          8192,            8192
##UNITS=     SECONDS,       ARBITRARY UNITS, ARBITRARY UNITS
##FACTOR=    0.0002004,     1,               1
##FIRST=     0,             0,               0
##LAST=      1.6414764,     0,               0
##MIN=       0,             -330095,         0
##MAX=       1.6414764,     176680,          0
$$ Real data points
##PAGE= N=1
##DATA TABLE= (X++(R..R)), XYDATA
0@%%%%%%Lj1J6j6K4l3M1n4O4p5R0j12J36j60J85k18K57k92L34l87M43n02N72o49
$$ 0 0 0 0 0 0 0 3 -8 8 -8 16 -17 24 -30 34 -41 49 -63 73 -87 98 -120 137 -155 179 -208 235 -267 305 -344
30c44P31q22R24j036J157j292J438j597J774j968K180k413K672k960L280l635
$$ -344 387 -435 489 -547 610 -682 756 -841 933 -1035 1145 -1268 1404 -1556 1724 -1911
46a911M035m487N002n600O297p124Q127r373J0967j3090J6082k0646K8550m6075
$$ -1911 2124 -2363 2639 -2961 3336 -3788 4339 -5034 5933 -7157 8925 -11721 16829 -29246
60b9246J54827q1088k62930J84704J96426J3987j99191j22142R4457J95166o0635
$$ -29246 125581 44493 -218437 -33733 162693 176680 -22511 -144653 -50196 144970 84335
71H4335k00370k3287J53330N0948p7876j03988L612J21924O9385j21970q8471
$$ 84335 -116035 -139322 14008 64956 -12920 -116908 -113296 8628 78013 -43957 -132428
82a32428R3379R1618m6523o5181j9838L3999P0150L852p8655O024P4568k2734
$$ -132428 -39049 52569 6046 -59135 -78973 -44974 25176 29028 -49627 -43603 30965 8231
94H231p3166J3094N1264L1160J070o0868m0119Q4445O9156o7681o1446L8044M0082
$$ 8231 -64935 -51841 -577 30583 31653 -29215 -69334 15111 84267 16586 -44860 -6816 33266
107C3266N885j6252m1998J7259Q4360j2279j00571k927P4369J3224l5996m1027
$$ 33266 39151 22899 -19099 -1840 82520 70241 -30330 -33257 41112 54336 18340 -22687
119b2687k2189O4187P6832o1121j03082J9955O5859J2284r400l3224l5315L9310
$$ -22687 -44876 19311 96143 35022 -68060 -48105 17754 30038 20638 -12586 -47901 -8591
131h591M9117l2595k9230K0266m394n846K3510k3213l6729M3565M2184k9165k4673
$$ -8591 40526 7931 -21299 -1033 -5427 -11273 12237 -10976 -47705 -4140 38044 8879 -15794
144a5794q056j5079L8007M6004n0617n5138M2949M9748Q12j0513l9830l1204N6546
$$ -15794 -23850 -38929 -922 45082 -5535 -60673 -17724 32024 32836 22323 -17507 -48711 7835
157G835N3133m1890l7822J4715M098J5619L0959l2759m4802K9072K2785l0543
$$ 7835 60968 19078 -18744 -4029 69 15688 46647 13888 -30914 -1842 20943 -9600
169i600p362P917l859K9258J4527o1687k7583O0895K8956l2261k3869j3921J8847
$$ -9600 -16962 -9045 -12904 16354 30881 -30806 -58389 2506 31462 -799 -24668 -38589 -19742
182a9742O7621K790q3506j6789O4409K0194k3995k0478j8377K3809M9271l0968
$$ -19742 47879 50669 -32837 -49626 14783 34977 10982 -9496 -27873 -4064 45207 14239
194A4239o1710L2004N1624k7179l9848o599J1136M5668K2454o4454l6540O3180
$$ 14239 -47471 -15467 36157 8978 -30870 -37469 -26333 19335 41789 -22665 -59205 3975
206C975L3719m1597j8829J2426J2586K1301j1907l8619L4570N8782m6262p0108
$$ 3975 37694 -3903 -22732 -10306 2280 23581 11674 -26945 7625 66407 20145 -49963
218d9963K8880O0318J0764l2263n8370k943R3887L7131r9029o0119O6124O1992
$$ -49963 -21083 39235 49999 17736 -40634 -43577 50310 87441 -11588 -71707 -5583 56409
230E6409j5607n6868l9707N3689R1603l7882j18418Q535J05274K6431o3905o7545
$$ 56409 40802 -16066 -55773 -2084 89519 51637 -66781 -58246 47028 73459 9554 -57991
242e7991j237R1079O0507q7580r4830N1323Q1135j4869n6040k9705K2943O4128
$$ -57991 -59228 31851 92358 4778 -90052 -38729 42406 27537 -28503 -58208 -35265 28863
254B8863m75q2726j2048Q0435J9518n6518k7994J3700L6381L4965l1002n5856
$$ 28863 28388 -54338 -66386 14049 33567 -22951 -50945 -37245 -864 34101 3099 -52757
266e2757L1010N5520k3728l4900J4311J2238L137O500j8892j890M4279j888n6171
$$ -52757 -21747 33773 10045 -24855 -10544 1694 4831 11331 -7561 -9451 34828 32940 -23231
279b3231M193M7495L700j7942j0374j2498K2058L8128k7054m0904K6330K4546
$$ -23231 -19038 28457 32157 14215 3841 -8657 13401 51529 24475 -16429 9901 34447
291C4447k4619j0292N462j055K1194O371m6592j4014M4419O972l0333m545k263
$$ 34447 9828 -464 4998 3943 25137 31508 -15084 -29098 15321 22293 -8040 -12585 -14848
304a4848l641K9446O962l7043n029K1805q783l94J8378j7810j8015K4916R187
$$ -14848 -18489 10957 17919 -19124 -24153 -2348 -11131 -11525 6853 -10957 -28972 -4056 5131
317E131j4978R521O35k2404J2795J9485k4281n486L0851j430j6482M434o593l025
$$ 5131 -9847 -326 309 -22095 -9300 10185 -14096 -19582 11269 9839 -6643 -2209 -8802 -11827
331a1827L1711J274l9871J021L0366J020n94K253k5384k491L6046r25k9166N206
$$ -11827 19884 21158 -18713 -17692 12674 13694 13100 15353 -10031 -12522 23524 22599 -6567 -1361
345a361P936o507J5560M403l0104M78K6407j2606j8190J0984N96R71J8501j7064
$$ -1361 6575 68 15628 20031 -10073 -9595 16812 4206 -13984 -3000 -2404 -1433 17068 4
359Dl5546K1834L3921j6571k1045j425j901K0380K1857k9744k5782L2224J8251
$$ 4 -35542 -13708 20213 3642 -17403 -18828 -20729 -349 21508 -8236 -34018 -1794 16457
372A6457k4713p099Q134L619J6934j008l2844Q849M4384j0981l9186O483K1382
$$ 16457 -8256 -15355 -7221 -3602 13332 12324 -20520 -11671 32713 21732 -17454 -10971 10411
385A0411Q656L969k0606k0321L4112K5752l9755k2931L2843J7554j5381j8455
$$ 10411 19067 23036 2430 -17891 16221 41973 2218 -20713 12130 29684 14303 -4152
397d152j4898J9807M7339j7799o7521L575N7331R943l3239k8235k882M1321L1290
$$ -4152 -19050 757 48096 30297 -37224 -33649 23682 33625 386 -27849 -30731 10590 41880
410D1880m8235m9693L9021M6088k1801l7210p858K1835M0115n674o1987p955O5204
$$ 41880 -6355 -56048 -17027 29061 7260 -29950 -37808 -15973 24142 18468 -43519 -51474 13730
423A3730K0461m5146k7075J1721L0712K6122k5311m3033K5027M7615k0591l8101
$$ 13730 34191 -10955 -38030 -26309 4403 30525 5214 -37819 -12792 34823 14232 -23869
435b3869R850K4897J1746n923l2674o366M7679J4895m7827j6946L1851J6160n984
$$ -23869 -14019 10878 22624 16701 -15973 -22339 25340 40235 -7592 -24538 7313 23473 17489
448A7489j3656j7144J6640L3461k0254l7593K1010K9943j5818j9300k072O249
$$ 17489 3833 -13311 3329 36790 16536 -21057 -47 29896 14078 -5222 -7294 -1045
460a045K3996M717m1978j5278L8336J2300k6799r462L524L914J5856n326k7898
$$ -1045 22951 27668 -14310 -29588 8748 21048 -5751 -15213 -11689 -7775 8081 2755 -25143
473b5143R610K6894j3368j7656J2620L833k920J1715n147j4799J4763R733j7052
$$ -25143 -15533 11361 -2007 -19663 -7043 -3210 -6130 5585 438 -14361 402 10135 -6917
486f917K028J3110j3656m972J8781j247j0681N168p880q037K1932N966k5440p35
$$ -6917 -4889 8221 -5435 -10407 8374 7127 -3554 1614 -6266 -14303 7629 13595 -11845 -12580
500a2580J9034l253m178N128r150J678J9049j0316k1386J6893J7732j2398n981
$$ -12580 6454 3201 -977 4151 -4999 -3321 15728 5412 -15974 919 18651 6253 272
513B72J264o437J1511J1824k2758j3900K2421P771j3414J150p78p583J1930M779
$$ 272 1536 -4901 6610 18434 -4324 -18224 4197 11968 -1446 -296 -1074 -8657 3273 8052
527H052j8685J887J8518q125r067J0528k727n553J4000j677j8628O474J1429r038
$$ 8052 -10633 -8746 9772 1647 -7420 3108 381 -5172 8828 7151 -11477 -5003 6426 -2612
541b612K767P153j5149k775J8280m377j4163Q330L530o962Q675J285j2241J1747
$$ -2612 155 7308 -7841 -10616 7664 3287 -10876 -2546 984 -5978 2697 3982 -8259 3488
555C488J2073j9897p037K2363M744j2304j927n003L356K2210n003l2644L954K7351
$$ 3488 15561 -4336 -11373 10990 15734 3430 1503 -3500 -144 22066 17063 -15581 -11627 15724
569A5724m235j6711l812K34J3942J2985k5164k3106K7829K4329k0709k0191L870
$$ 15724 11489 -5222 -9034 -8800 5142 18127 -7037 -30143 -2314 22015 1306 -18885 -15015
582a5015J1954J8245k674l4635l722L9586O410l2400j0289J3039J4162P606j8857
$$ -15015 -3061 15184 12510 -22125 -25847 13739 20149 -12251 -22540 -9501 4661 12267 -6590
595f590k6520K1530L4515j8340l2934P022K2670J1989l248k4899q371L5429J8158
$$ -6590 -33110 -11580 22935 4595 -28339 -21317 1353 13342 10094 -14805 -23176 12253 30411
608C0411k9876j5034K0615J3015j837p239j3859Q069K6532j0488l0822Q262K2667
$$ 30411 535 -14499 6116 19131 17294 10055 -3804 4265 30797 20309 -10513 -2251 20416
621B0416n998j2193m474k681J2665Q992k2456j1956K2843O556j8834l162P878
$$ 20416 14418 2225 -2249 -4930 7735 16727 -5729 -17685 5158 11714 -7120 -10282 -2404
634b404J716O950l792j9246P442K2653j0401j7940P935O013l368M554m026j0374
$$ -2404 -688 6262 2470 -16776 -9334 13319 2918 -15022 -7087 -1074 -4442 112 -3914 -14288
648a4288J0271O040j6849J240J6749n578j0614P428J473m68R100n411j2441J4136
$$ -14288 -4017 2023 -14826 -13586 3163 -2415 -13029 -5601 -4128 -4596 4504 -907 -13348 788
662G88J2278j5250l173J3835j212m136L390o236L71J5787o668k0913J0064J7781
$$ 788 13066 -2184 -5357 8478 7266 3130 6520 284 655 16442 9774 -11139 -1075 16706
676A6706p657q988J16k852R020Q740j7308j0855K1499Q989j6881o424M071L498
$$ 16706 9049 61 177 -2675 6345 15085 -2223 -13078 8421 17410 529 -5895 -1824 1674
690A674J0941k924k3987R04K5339j066j8974j969L554L677R858q586j8727R935
$$ 1674 12615 9691 -14296 -13392 11947 10881 -8093 -10062 -6508 -2831 7027 -1559 -20286 -10351
704a0351J7751r300q836O315J229K087O680j0485q267J7775Q168j4850k107P396
$$ -10351 7400 -1900 -10736 -4421 -3192 -1105 5575 -4910 -13177 4598 12766 -2084 -4191 3205
718C205k706M169N347j2919m391J4390j321j1276M520L014n540P242J859j4236
$$ 3205 499 4668 10015 -2904 -7295 7095 5774 -5502 -982 2032 -3508 3734 5593 -8643
732h643L002J4745n139p540M599j320J997J2753o972j8143R635J5276o075p229
$$ -8643 -5641 9104 3965 -3575 1024 -296 1701 14454 7482 -10661 -1026 14250 8175 946
746I46j280m032Q061Q621j6108j1244J7922O629j6864o128N853M701P706n864
$$ 946 -334 -4366 3695 12316 -3792 -15036 2886 9515 -7349 -13477 -7624 -2923 4783 -1081
760a081j9531P283K4347n849k0501K952J1939O094J204j2880r452J9609J4430
$$ -1081 -20612 -13329 11018 5169 -15332 -12380 -441 5653 6857 -6023 -15475 4134 18564
773A8564k0216j2689J5263R426l041o365j0494L505K2315m44k4317r63J6150K723
$$ 18564 -1652 -14341 922 10348 7307 942 -9552 -6047 16268 15824 -8493 -9456 6694 9417
787I417l756k921o276O479J3558j0794j4168J2022R498q709l485J24k758P290
$$ 9417 5661 2740 -3536 2943 16501 5707 -8461 3561 13059 4350 865 989 -1769 5521
801E521M251j5814l871J4739J6j1220K206J209l631O059M64r454N592P386j1252
$$ 5521 9772 -6042 -9913 4826 4842 -6378 -4172 -2963 -6594 -535 -71 -9525 -3933 3453 -7799
816g799l966J2549J78p135K882n18j863P415k639j1195Q719J2129j1473r426Q847
$$ -7799 -11765 784 962 -6173 -3291 -3809 -5672 1743 -896 -12091 -3372 8757 -2716 -12142 -3295
831c295N282O18K81r610l415J8530M411j8568k164J3867K737k049k561p185N061
$$ -3295 1987 2605 2886 -6724 -10139 8391 12802 -5766 -7930 5937 8674 6625 4064 -3121 1940
846A940J3036r015j2369J0883R628r258n455N36j16P401K739j4583l791J5382
$$ 1940 14976 5961 -6408 4475 14103 4845 -610 -74 -190 7211 9950 -4633 -8424 6958
860F958Nj2366J447N237q7K526n198j0461R720J3156j1211j0875P788N622m98
$$ 6958 6963 -5403 -3956 1281 1194 3720 -1478 -11939 -2219 10937 -274 -11149 -3361 2261 1763
875A763j12r340m997J5098O053j4833m613J0187N29j365L33o412K108J2386m726
$$ 1763 1651 -7689 -12686 2412 8465 -6368 -10981 -794 -265 -1630 -1297 -7709 -5601 6785 2059
890B059j3559O397J0495k135j504j240o715O434J0611p836p920P857K839m368
$$ 2059 -11500 -5103 5392 3257 1753 513 -6202 232 10843 3007 -4913 2944 5783 1415
904A415L827j234p312N861N625p578j358N487m476j838P480l981p216P357L209
$$ 1415 5242 4008 -3304 2557 8182 604 -754 4733 257 -1581 5899 1918 -5298 2059 5268
919E268p189r9J291m079O213O246j0987o515R485J991m340K306k039l998O962
$$ 5268 -1921 -2020 -729 -4808 1405 7651 -3336 -9851 -366 1625 -2715 -409 -2448 -6446 516
934E16J609r324K101Q971n418m782O276k72j961M075l097m367R667K603j0828
$$ 516 2125 -7199 -5098 3873 -1545 -6327 -51 -323 -2284 1791 -1306 -5673 3994 6597 -4231
949d231N32Q744k778k675K636k265J891P184p322r553J0111Q671p867m279J174
$$ -4231 -3699 5045 2267 -408 2228 -37 1854 9038 1716 -7837 2274 10945 3078 -1201 -27
964b7k56M824L051j0451k984J2171k88j0282J367M405k067K735j598q084N001
$$ -27 -283 4541 7592 -2859 -5843 6328 6040 -4242 -2875 1530 -537 2198 600 -7484 -2483
979b483Q943p453p112O757K061k896K432j843m765O021K177p944K346Q606n949
$$ -2483 6460 -993 -8105 -1348 713 -2183 249 -1594 -6359 -338 1839 -6105 -3759 4847 -1102
994a102n717N491J155o22L503n118n059R665N236j0997j847Q442N72j666p19m986
$$ -1102 -6819 -1328 -173 -795 2708 -2410 -7469 2196 7432 -3565 -5412 3030 3602 1936 1217 -3769
1010c769L357J1131n191j2977N592J0652k155m795l294k768Q155P352j1673p650
$$ -3769 -412 10719 5528 -7449 -1857 8795 6640 1845 -1449 -4217 3938 11290 -383 -8033
1024h033J0762M409o977k021O04L88N676j382j1167L371J1703m118q760L353L227
$$ -8033 2729 7138 161 -1860 -1256 -868 4808 3426 -7741 -4370 7333 3215 -5545 -2192 1035
1039A035P6J520m773m757Q710L759j0820j549Q937j81n134k26k206K696Q421n489
$$ 1035 1111 2631 -2142 -6899 1811 5570 -5250 -6799 2138 1957 -3177 -3403 -5609 -2913 5508 19
1055A9j0932O254R711m504m364J473m90M639M279q336m189J0714K654p877o43
$$ 19 -10913 -4659 5052 548 -3816 -2343 -2833 1806 6085 -2251 -6440 4274 6928 -949 -1592
1070a592L203n53L806J43r067J485J0436l174o516K529L79j284M908j376o723
$$ -1592 1611 1058 4864 5007 -4060 -2575 7861 4687 -1829 700 1079 -205 4703 3327 -3396
1085c396M403M928o371j941M995j724j631L849l344m652O074P33o086K062L090
$$ -3396 1007 5935 -436 -2377 2618 894 -737 3112 -232 -4884 1190 1923 -4163 -2101 989
1100I89n340Q46M358m174j621M443k289k252O472k16o528K977L581l168K401L128
$$ 989 -4351 -3505 853 -3321 -4942 -499 -2788 -5040 1432 1216 -5312 -2335 1246 -1922 479 3607
1116C607m910r95N668j726k616M621p41n074L945K483n750J365M171l583k41L385
$$ 3607 -1303 -2298 3370 1644 -972 3649 2908 -2166 1779 4262 -1488 -123 4048 465 224 3609
1132C609m283j588O773o20p006L150L629k478P49n66n598L569P404n090o248M105
$$ 3609 -674 -2262 4511 3891 -3115 35 3664 1186 1935 1369 -4229 -660 6744 1654 -4594 -489
1148d89Q54k220K143j540l909N248J668p966k92P393r84l258J730j308n40N617
$$ -489 365 -1855 288 -1252 -5161 87 1755 -6211 -6503 890 -94 -3352 -1622 -2930 -3470 2147
1164B147j726n528M833M487n105n71M421k159r86L016k691q98O104k602p396M118
$$ 2147 421 -5107 -274 4213 -892 -1463 2958 799 -187 2829 138 -760 5344 2742 -4654 -536
1180e36N512l391j978J399k334K649L275o122k511Q399J473p198k99K018L73L664
$$ -536 4976 1585 -393 1006 -1328 1321 4596 -1526 -4037 4362 5835 -1363 -1662 356 729 4393
1196D393q90p786K171P899l751o691K985K548r23J341l765l735O662L423q274
$$ 4393 3503 -4283 -2112 5787 2036 -4655 -1670 878 -45 1296 -2469 -6204 458 3881 -4393
1211d393k024P522J098l099j029k733K754P608l257r163M470P218l784m122J057
$$ -4393 -6417 1105 2203 -896 -1925 -4658 -1904 5704 2447 -6716 -2246 4972 1188 -2934 -1877
1226a877Q32L828J376q165l206J0226L258q660j968M052J830K184k687o809L905
$$ -1877 -1045 2783 4159 -4006 -7212 3014 6272 -2388 -4356 -304 1526 3710 1023 -5786 -1881
1241a881R915l978p727L273L983m47J84l274k553O518L479q851l446O629J243
$$ -1881 8034 4056 -3671 -398 3585 3138 3322 48 -2505 4013 7492 -1359 -4805 1824 3067
1256C067j976n73k942p05N815j236o391K755N138l471k066J794j157J084L560
$$ 3067 1091 518 -2424 -3129 2686 1450 -4941 -2186 2952 -519 -2585 -791 -1948 -864 2696
1271B696m075l623O017J786n352k92K646j550J807J287m997k66N314j546l545
$$ 2696 -1379 -5002 1015 2801 -2551 -2843 -197 -1747 60 1347 -3650 -3916 1398 -148 -3693
1286c693L406J379k699J711Q03l278K812L967m041q14L943j508j786L425k37l119
$$ -3693 -287 1092 -1607 104 907 -2371 441 4408 367 -447 3496 1988 202 3627 3390 271
1302B71K932l0l678K069K307m480n38M165k448k649K785q49k059L114m49l404
$$ 271 3203 3173 -505 1564 3871 -609 -1147 3018 570 -2079 706 -143 -2202 912 463 -2941
1318b941K249K387m491l39M112j667j254K625j983k361L862O08m316K264K179
$$ -2941 -692 1695 -2796 -3135 977 -690 -1944 681 -1302 -3663 199 807 -3509 -1245 934
1333I34l668L04K919k190p51L401j757j855M135m4m079L344K640l155OK455k255
$$ 934 -2734 -2430 489 -1701 -2452 949 -808 -2663 1472 1428 -2651 693 3333 178 184 2639 384
1350C84J041K937m161j667N465L08m774K81J325j183K387N17n664J034N254k470
$$ 384 1425 4362 201 -1466 3999 4307 -467 -186 1139 -44 2343 2860 -2804 -1770 3484 1014
1366A014l662K480O12n90J282k036k886M500K873n502j834M238N68j289L5k898
$$ 1014 -2648 -168 444 -146 1136 -900 -3786 714 3587 -1915 -3749 489 1057 -232 -197 -3095
1382c095L31N512j381o366K390M603k226j729J18k57K555L122n257l322O565K851
$$ -3095 -2764 2748 1367 -4999 -2609 1994 -232 -1961 -1843 -2100 455 3577 -1680 -5002 1563 4414
1398D414m388j517J222R03K941q01n977J697O801j842n727J325K507J02P35l190
$$ 4414 26 -1491 -269 634 3575 2774 -3203 -1506 5295 3453 -2274 -949 1558 1660 2395 -795
1414g95k739N268L429n548l506M393J404o27l75k680l9N126k33o007J325M182
$$ -795 -3534 1734 5163 -385 -3891 502 1906 1279 904 -1776 -1815 3311 3078 -2929 -1604 2578
1430B578j825j628O78j693J229L041l417l250M177J730l811K9J629r23J277Q13
$$ 2578 753 -875 -197 -1890 -661 2380 -1037 -4287 -110 1620 -2191 -2162 -533 -1456 -179 634
1446F34l339O22M419j966l501K647J653j162M38m82j914K877K206m151j117M185
$$ 634 -2705 -2083 2336 370 -3131 -484 1169 7 445 -37 -1951 926 3132 -1019 -2136 2049
1462B049k51k097J011p66o58L161l7m071J456L230j965j289J386j003k0K610j947
$$ 2049 1798 -299 712 -54 -712 2449 2412 -1659 -203 3027 1062 -227 1159 156 136 2746 799
1479G99k475K829O27k807O35J616j979k2J426k196n91L281j507k441K309M42k255
$$ 799 -1676 1153 1780 -1027 -392 1224 -755 -777 649 -1547 -2138 1143 -364 -2805 -496 -54 -2309
1496b309J210J233k254O06K219k179m34K749j309j458K417K43k379K045P48k587
$$ -2309 -1099 134 -2120 -1514 705 -1474 -1908 841 -468 -1926 491 734 -1645 400 1148 -1439
1512a439J208J824j526j97J902k049p74L404m05k627J361J103j499Q10P37k665
$$ -1439 -231 1593 67 -130 1772 -277 -1051 2353 1948 -679 682 1785 286 1096 1833 -832
1528h32J303K675k219k355J936J029j164O51j366j357K825J207l922p41K974m13
$$ -832 471 3146 927 -1428 508 1537 373 1024 -342 -1699 1126 2333 -1589 -2330 644 231
1544B31p30M33k041j8L634j055l839K079K553j599j006P49j033J393K126l017
$$ 231 -499 -66 -2107 -2125 1509 454 -3385 -1306 1247 -352 -1358 -609 -1642 -249 1877 -1140
1560a140j531L279R22k993N42J011l78J759l16l200J249L732j956k483J760J143
$$ -1140 -2671 608 1530 -1463 -921 90 -288 1471 1155 -2045 -796 2936 980 -1503 257 1400
1576A400n62O50j549j520K990J848m069q98L041M81j392j20j270O29L267j543
$$ 1400 838 1488 -61 -1581 1409 3257 -812 -1710 1331 1812 420 300 -970 -341 2926 1383
1592A383m037J456L548j799j282J07n80J588J456l120j891L577J246l051m71R09
$$ 1383 -2654 -1198 2350 551 -731 -624 -1204 384 1840 -1280 -3171 406 1652 -1399 -1870 -961
1608i61K49J017K79l567J450L901j866k972J594J412q8L9j082j206K782J601l493
$$ -961 -712 305 584 -2983 -1533 2368 502 -2470 -876 536 448 487 -595 -1801 981 2582 -911
1625i11q65L267L82j654l14m28M87K468j365l067J911L016j520k177R13m8J115
$$ -911 -1776 1491 1873 219 -95 -523 -36 2432 1067 -2000 -89 2927 1407 -770 143 95 1210
1642A210P88k264j376L045P80k712m25J125j48O30q3k735Q55K908j316k502J279
$$ 1210 1998 -266 -1642 1403 2183 -529 -954 171 23 653 570 -2165 -1310 1598 282 -2220 -941
1659i41R21o91R72n93j856J794J479k181p33K295m83j025J174l93o94J871j17
$$ -941 -20 -711 261 -332 -2188 -394 1085 -1096 -1829 466 -17 -1042 132 -261 -955 916 799
1676G99k144J456J782j828m15J204o55k23J754j232j435J739Q41j749J20J045
$$ 799 -1345 111 1893 65 -350 854 199 -24 1730 498 -937 802 1643 -106 14 1059
1692A059q06M55Q00j280o10J749n21j165Q79J04j371N62O49j498M58J123j298
$$ 1059 253 708 1508 228 -382 1367 846 -319 560 664 -707 -145 504 -994 -536 587 -711
1709g11n88J364n96n15J377l83j741J507P68j754O73R06r44J45R18j236k43K080
$$ -711 -1299 65 -531 -1046 331 -52 -1793 -286 482 -1272 -599 307 -637 -492 426 -810 -1053 1027
1727A027o53j533Q27Q91o05M12J11j725J138J578j412j012J674on86P01m61o34
$$ 1027 374 -1159 -332 559 -46 366 477 -1248 -110 1468 56 -956 718 712 126 827 366 -268
1745b68J891J31k390l1K292n76j299Q52o42J77J492j365j884J799J297j735q41
$$ -268 1623 1754 -636 -667 1625 1049 -250 602 -40 137 1629 264 -1620 179 1476 -259 -1100
1762a100M74J29Q89M86k240o97L024K34k297J51O20K74N63k92j862J186J962j731
$$ -1100 -626 -497 392 878 -1362 -2059 965 1199 -1098 -947 -327 -53 510 218 -1644 -458 1504 -227
1780b27j349J207Q06l54j56r75l06K194L01k162k71K263n0p29N43r17K53J424
$$ -227 -1576 -369 437 83 -73 -1048 -1354 840 1141 -1021 -1292 971 921 192 735 -182 71 1495
1798A495p25j913J296J605j105p38M84k82L64R87j632j008K230K2k005O15L88
$$ 1495 770 -1143 153 1758 653 -85 399 117 481 1468 -164 -1172 1058 1080 -925 -310 78
1815G8k45O38k73j517Q41J962j628j257J361L64n51J22p27n36J291R85k093o2
$$ 78 -167 471 198 -1319 -478 1484 -144 -1401 -40 324 -227 -105 -832 -1368 -77 908 -1185 -1247
1833a247J471o8q46M74m95J1J270l35j633J455J304j462k75J061o24L83O64j152
$$ -1247 224 156 -690 -216 -711 -700 570 235 -1398 57 1361 -101 -376 685 61 444 1108 -44
1851d4n3J778n60j081K17N37p50N63K6j412P63J139j084j221J710q7n63L98m32
$$ -44 -97 1681 1121 40 257 794 44 607 633 -779 -16 1123 39 -1182 528 441 -122 276 -156
1870a56p42J325N04j941Q8J340k05n91K08l29m08J306l43j737J101Q60r59j07
$$ -156 -898 427 931 -1010 -922 418 213 -378 -170 -499 -907 399 56 -1681 -580 280 -679 -786
1888g86L96l67L27J148j183p36J374M91p33J22j89j87R34N92j781K20J674j27
$$ -786 -390 -757 -430 718 -465 -1201 173 664 -69 53 -136 -323 611 1203 -578 -358 1316 1189
1906A189j333O15n18k1J507q08j939J332J521j220o92M03k13L00J291j697q06
$$ 1189 -144 471 -47 -68 1439 631 -1308 24 1545 325 -367 36 -177 123 1414 -283 -1089
1923a089J829L88j787j8P56M9O84n16j958P16J943n59j983O40O57L2M02q20j230
$$ -1089 740 1128 -659 -677 79 128 812 296 -1662 -946 997 438 -1545 -905 -248 -216 186 -634 -1864
1942a864J818J041j813p22J368P14m42Q7q93j0K255m55k418R20J434m92m66l9
$$ -1864 -46 995 -818 -1540 -172 542 100 187 -706 -716 1539 1084 -1334 -414 1020 528 62 23
1960B3o00Q03J216r72j555J479Q62j045l41O17k43L89O22j822m7K031o14j145
$$ 23 -577 226 1442 470 -1085 394 1256 211 -130 487 244 633 1255 -567 -614 1417 803 -342
1978c42M80l06K85L82n78q22Q55J080j608m64R84j10k10K5n00K23Q74Qj691M89
$$ -342 138 -168 117 499 -79 -901 -46 1034 -574 -1038 -54 -164 -374 -349 -849 -626 248 256 -1435 -946
1998i46J580p37n33J80j9K17J140j182j139J858O35j540j9M45J69L53j16r03M1
$$ -946 634 -103 -636 -456 -475 -258 882 -300 -1439 419 1054 -486 -505 -60 109 462 346 -557 -516
2017e16J833o75j274P09N51k01J71N0j457J209J302j589j124J499M36p05P2p03
$$ -516 1317 642 -632 77 628 427 598 648 -809 400 1702 113 -1011 488 924 219 291 -412
2035d12K2J380m22j646K66J297k22q08j24l45Q40Q11j223j504J703J063j082l66
$$ -412 -390 990 568 -1078 -812 485 263 -545 -669 -1014 -174 637 -586 -2090 -387 676 -406 -772
2053g72L97n09J197N67j747m98K192J39j407j55M28R2Q23L5j791O69J680n62j132
$$ -772 -375 -884 313 880 -867 -1365 827 966 -441 -596 -168 -76 747 782 -1009 -340 1340 778 -354
2072c54O22O0J24O24r52j251J607Q25j245l47O28J76j18M06j237l75K048l82j575
$$ -354 268 328 452 1076 124 -1127 480 1305 60 -287 341 517 399 805 -432 -807 1241 859 -716
2091g16K54N38j57K53Q2j359O90J493j298q67N81O88o00K51m62m41J365M09j814
$$ -716 -462 76 -81 172 254 -1105 -415 1078 -220 -1087 -506 182 -418 -167 -629 -1070 295 704 -1110
2110a110rJ498k65l86K71n49j77J365n7j938Q27J446p13j56j24k19P73P18j313
$$ -1110 -1119 379 114 -272 -1 -550 -727 638 581 -1357 -530 916 203 47 -77 -296 477 1195 -118
2129a18p42J476Q82j226j63J01k05R80j11j737M09J683m06r92K84M47m56K93l14
$$ -118 -860 616 1498 272 109 210 5 985 874 -863 -454 1229 823 -169 115 562 106 399 85
2148H5q18R65Q83j643m96J015J38m58L41o11q2J023n36j337Q03J378o50o39J66
$$ 85 -733 232 1115 -528 -1024 -9 129 -329 12 -599 -681 342 -194 -1531 -728 650 0 -639 -473
2167d73j94L51J129j426n64J704K31j317p6O81m3K86K12j216K71J821j048j133
$$ -473 -667 -316 813 -613 -1177 527 758 -559 -635 46 3 289 501 -715 -444 1377 329 -804
2185h04R68N15r2j33n81l26J363N59j674m14J477k47l75n0k67k49J333m52j813
$$ -804 164 679 587 454 -127 -453 910 1469 -205 -619 858 611 236 186 -81 -330 1003 551 -1262
2204a262Q36J389r01p41M08l39K86J012j225j184J540Q69j364J86K40k62N82K26
$$ -1262 -426 963 62 -679 -271 -610 -324 688 -537 -1721 -181 688 -676 -490 -250 -512 70 296
2222B96j106j12J999p80j187M82K98j81N95j50j372J119J418j066j020Q48L99
$$ 296 -810 -922 1077 297 -890 -408 -110 -291 304 154 -1218 -99 1319 253 -767 81 480
2239D80k92L64p69m51J496L73j566k1J249n94J34K03j125L44J128k81j333O46
$$ 480 188 552 -217 -668 828 1201 -365 -386 863 269 403 606 -519 -175 953 672 -661 -15
2257a5N07n01m2k13n86P95J006j314r23J582L0o79K40k73j91R23M34j715qJ285
$$ -15 492 -9 -51 -264 -850 -55 951 -363 -1286 296 326 -353 -113 -386 -577 346 780 -935 -943 342
2277C42n93m92Q63n45j4Q46m41j155J166R63j058m06O32j69J39P76r14j21J205
$$ 342 -251 -743 120 -425 -439 407 -34 -1189 -23 940 -118 -524 108 -61 78 854 -60 -181 1024
2296A024K61j456K50M23r6Q0J18j044L30J163o49q63O63L44m67M83l66j253J227
$$ 1024 1285 -171 79 502 406 486 604 -440 -110 1053 404 -459 204 548 81 564 198 -1055 172
2315A72Q18j363l34Q71J77n94L67p12j29J124k88j267P57P61p31j17L29k94O2
$$ 172 990 -373 -707 164 341 -253 114 -598 -727 397 109 -1158 -401 360 -371 -488 -159 -453 -391
2334c91Q89j027n97J425K08j255M59M99n79L12J21q46N76J323o42j273J224K32
$$ -391 498 -529 -1126 299 507 -748 -289 210 -369 -57 64 -782 -206 1117 475 -798 426 658
2352F58m58L65m42p47J381P26j779k75J553j33p26M3j61J76Q41m90j662R94J438
$$ 658 200 565 123 -624 757 1483 -296 -571 982 849 123 166 5 181 1022 532 -1130 -136 1302
2371A302j077o56M09o14P85O76j326o44J581N18j715q5N40J38K0J06j201L16J790
$$ 1302 225 -431 -22 -636 149 825 -501 -1145 436 954 -761 -846 -306 -168 -148 -42 -1243 -927 863
2390H63o52j509J005O41m73M05n08m76Q99J369j592p25J131L71m30K87q77j90
$$ 863 211 -1298 -293 348 -125 280 -228 -704 195 1564 -28 -753 378 749 319 606 -271 -461
2408d61J436kj934L29J541k79l07n9p71L07J538j226j055J039Q62q04m04K48m64
$$ -461 975 973 -961 -632 909 630 323 264 -507 -200 1338 112 -943 96 958 154 -250 -2 -466
2427d66R01L40j336o72J766k57p08J4m9j98Q55K29j833M57J422n10j028Q12l11
$$ -466 435 775 -561 -1233 533 276 -432 -418 -467 -665 190 419 -1414 -957 465 -45 -1073 -261 -572
2446e72J58J130r77q82J358O62j069j73M43j96N11P03j125l50J314L5j213M88
$$ -572 -414 716 -261 -1143 215 877 -192 -365 78 -118 393 1096 -29 -379 935 970 -243 245
2464B45Q9n05O93K53j215L60J016p64p00P34M70r36Q21k25q58Q07N82j035l96
$$ 245 334 -171 522 775 -440 -80 936 172 -528 206 676 -260 561 336 -522 285 867 -168 -564
2483e64J252m17o82Q05o46l86R28j14j458J082K77q63M72N13r52J66Q92n94j037
$$ -564 688 271 -411 394 -252 -638 290 176 -1282 -200 77 -786 -314 199 -753 -587 305 -289 -1326
2502a326J416L52r94L88M38p05o6Q07p98Q8R38m91n89Q47N33j163O01L17p24O82
$$ -1326 90 442 -552 -164 274 -431 -497 310 -488 -400 538 47 -542 305 838 -325 276 593 -131 551
2522E51K50q80n1J187j96j316P67l01o2R58k55j465Q21J643j831m08Q07n8l5N43
$$ 551 801 -79 -130 1057 861 -455 312 11 -51 907 652 -813 8 1651 -180 -588 219 161 126 669
2542F69j053q86J538N07j693r7J218n71K40M04j392L66J621o38j469O27P46l85
$$ 669 -384 -1270 268 775 -918 -1015 203 -368 -128 276 -1116 -750 871 233 -1236 -609 137 -248
2560b48K64m64o39J046R95j664o97J427N82n59o2l11J99J179o3j871L17J474n8
$$ -248 16 -448 -1087 -41 954 -710 -1407 20 602 43 -19 -330 -131 1048 985 -886 -569 905 847
2579H47n01Q8m20M71J231j134j297J237Q65j168k87J52n24R41L60j680k18J717
$$ 847 346 434 14 485 1716 582 -715 522 1387 219 -68 84 -440 501 861 -819 -1037 680
2597F80L0j366K54J42l20Q48j1j556P13J024m03j059P78k39K41N78n79j029J008
$$ 680 710 -656 -402 -260 -580 268 257 -1299 -586 438 35 -1024 -246 -485 -244 334 -245 -1274 -266
2616b66J220j697J55O55l40N4R65q65n89J030K73j234O63M06o71P66M54j150j08
$$ -266 954 -743 -588 67 -273 -219 746 -119 -708 322 595 -639 24 430 -241 525 979 -171 -279
2635b79J274m48n32N68j37m16O82m6j190P29N36q61k18P01l85k9N87n38o78P39
$$ -279 995 547 15 583 446 30 712 666 -524 205 741 -120 -338 363 -22 -51 536 -2 -680 59
2655E9L92r75M65L35r96R2P54n27k39R18r54l89J394l29r02O65O88j259J18Q74
$$ 59 451 -524 -59 276 -720 -628 126 -401 -640 278 -676 -1065 329 0 -902 -237 451 -808 -690 184
2675A84o35L44N06o14n44J478K65j745N08P48q19O66M61j241M87J390q07j351
$$ 184 -451 -107 399 -215 -759 719 984 -761 -253 495 -324 342 803 -438 49 1439 632 -719
2693g19J010K31n64Q62n92r52J141Q09j432m72J096L13n61L51r93j22J492N1j920
$$ -719 291 522 -42 820 228 -724 417 1226 -206 -678 418 731 170 521 -472 -594 898 949 -971
2712i71J51J385k91p7l05p95P31R16q41j372R54O62m01L11m64o36J064Q60j693
$$ -971 -820 565 274 197 -108 -903 -172 744 -97 -1469 -515 147 -254 57 -407 -1043 21 881 -812
2731h12k10J489m5o59M7k51r7J216K1j351N04J082n96n75L35l75M87O62m27j474
$$ -812 -1022 467 422 -237 -190 -441 -538 678 699 -652 -148 934 338 -237 98 -277 210 872 445 -1029
2751a029J317J220j508P6N38o80P23L88j211q11J627o7q97p5N46k60R46n79j231
$$ -1029 288 1508 0 76 614 -66 657 1045 -166 -977 650 583 -314 -389 157 -103 843 264 -967
2770i67N00J093p45o41K94K67l09O14n09o72J037M70j133k65R42k19l4N41o58
$$ -967 -467 626 -119 -760 -466 -199 -508 106 -403 -1075 -38 432 -701 -966 -24 -243 -277 264 -394
2789c94m06J052J64j062N85L61p87O04O57q65k93R12k74l33N66l20l76N64N51
$$ -394 -800 252 416 -646 -61 300 -487 117 774 -91 -384 528 254 -79 487 167 -209 355 906
2808I06j039K59L52k95k07O74q86k3R73k70j058Q06L78n70Q1N37j353M93J004
$$ 906 -133 126 478 183 -24 650 -236 -259 714 444 -614 192 570 0 81 618 -735 -242 762
2827G62j007o99Q66J48p35P57k03r53R93L34p96l18R26n41K17N29p68k8O99r4
$$ 762 -245 -944 -78 70 -665 92 -111 -1064 -71 263 -533 -851 75 -466 -249 280 -488 -516 183 89
2847H9q56M94P47l31j53O90j209K42J295n45r35P63J16k61K92k2m01O11P38j735
$$ 89 -767 -273 474 143 -10 680 -529 -287 1008 463 -472 291 407 146 438 416 15 626 1364 -371
2867c71m5R49L52q96K05k11m10J361l43j450L07J373p34k13J9m78L47J208r54
$$ -371 -416 533 885 -11 194 -17 -427 934 591 -859 -552 821 87 -126 -107 -585 -238 970 16
2886A6j414J279L56n53l28J98l01P78O23j657k17J299L91r47K05j53l54J040M8
$$ 16 -1398 -119 237 -316 -644 -446 -747 31 654 -1003 -1220 79 470 -477 -272 -425 -779 261 309
2905C09r95K24J360p67n10O11m95J85Q89m48j299J338M89j053n0Q41n10L99K88
$$ 309 -686 -462 898 131 -379 232 -263 -78 811 363 -936 402 891 -162 -212 629 119 518 806
2924H06p73n96J186L45j281O94R7q17M67M48j099J14J130j145l58P12J01m8J53
$$ 806 33 -563 623 968 -313 381 478 -339 128 576 -523 -409 721 -424 -782 -70 31 -17 136
2943A36Lj018J047K56j221K18R07n57l40P38n28n17J247p8r34N38L26m59JM61
$$ 136 139 -879 168 424 -797 -579 328 -229 -569 169 -359 -876 371 293 -641 -103 223 -236 -235 226
2963B26o19P9J066n76p74J151n4q21P16O5k53k08P52p24Q4Q63n83n27Q42lq13
$$ 226 -393 -314 752 176 -598 553 499 -322 394 459 206 -2 750 26 110 973 390 -137 705 702 -111
2984a11K82J37q86Q27K36r10N29P33j102k48O37J3p26R17m77p84O96O16j088M5
$$ -111 171 308 -578 249 485 -425 104 837 -265 -513 124 137 -589 328 -149 -933 -237 379 -709 -664
3004f64Q81m19j51M91q19l78J530r8j145L23Q35o77K25k6l10L61P16p28o68Q77
$$ -664 217 -202 -353 138 -681 -1059 471 373 -772 -449 386 -291 -66 -92 -402 -41 675 -53 -721 156
3024A56O27q82K89q8q12J057O72j484M0J116L9r14O75n36l53J190l02j006N88
$$ 156 783 -99 190 102 -710 347 1019 -465 -425 691 730 -184 491 -45 -398 792 490 -516 72
3043G2M22p25m51N40N1n0P84r98q37J071O53q20JP2j52M78K75j162m1J376q7j400
$$ 72 494 -231 -682 -142 -91 -141 643 -355 -1192 -121 532 -288 -287 -215 -367 111 386 -776 -817 559 472 -928
3065i28N95K6M4M70j86j008P23J160p56p11P05j32L03L41n72p34J127K78p64l42
$$ -928 -333 -307 -263 207 21 -987 -264 896 140 -571 134 2 305 646 74 -660 467 745 -19 -361
3085c61R23l18j77O09q30r1J223m53j239Q36M03m92K49N8q21M40J025r45p18P57
$$ -361 562 244 67 676 -154 -245 978 525 -714 122 525 33 282 340 -481 -41 984 39 -679 78
3105G8P9n54M99j58q86J193p1q61J78O80l12m30N35o2l96M81m01j27R6M25m57
$$ 78 157 -397 102 -56 -942 251 180 -681 -503 177 -135 -565 -30 -92 -488 -7 -408 -535 -439 -14 -471
3126d71K29N49n82K4O21n36j03O93j73o84J050j32p46M15N80o16k76P04n95j31
$$ -471 -242 307 -275 -251 370 -166 -269 424 251 -433 617 485 -261 154 734 118 -158 546 -49 -180
3146a80J015m72p71P06J57p55P30o5q29J63P13n63j13N89l78j44J79L8q93Q59
$$ -180 835 363 -408 298 455 -300 430 365 -464 -301 412 -151 -264 325 -53 -197 -18 20 -873 -14
3166a4L14p76r2P70k95l59O45l04m95J018k42j162Q11M43n78p8N60p65O43R12
$$ -14 300 -476 -568 202 -93 -452 193 -111 -606 412 170 -992 -181 262 -316 -394 166 -599 44 956
3186I56r37j037R61M87l94j84Q4Q1N76J2j021K17R55m87o43L49j4m1R34p12p37
$$ 956 19 -1018 -57 430 36 -148 -64 17 593 605 -416 -199 756 269 -374 -25 -39 -80 854 142 -595
3207e95O17O80m66n57K67O6K60J06m69p58J093L43j081K41M78m24K00K2q12K19
$$ -595 22 702 236 -321 -54 12 272 378 -91 -849 244 587 -494 -253 225 -199 1 23 -789 -570
3227e70J166m92r51N02K17J34J80m96o16Q85O95j026m17Q37K5p0K04m01m02R15
$$ -570 596 104 -847 -345 -128 6 186 -310 -926 -41 654 -372 -789 48 73 3 207 -194 -596 319
3247C19J89o40k83R61m24J06J72m74k02R85m85o95K47P65n54J88K00p10K91Q18
$$ 319 508 -132 -415 546 122 228 400 -74 -276 709 224 -471 -224 541 -13 175 375 -335 -44 774
3267G74j003q1M71j4m47L35R2n01M47L23p48n1P95l39l04M71m20n38R41k80n76
$$ 774 -229 -310 161 147 -300 35 127 -374 73 396 -352 -403 392 53 -251 220 -200 -738 203 -77 -653
3288f53O44K11n28J14N51p36O9M72l47j44M95j02m33Q09J2q31M11N07q05K21L22
$$ -653 -9 202 -326 -212 339 -397 -328 144 -203 -347 148 46 -387 422 434 -397 14 521 -284 -63 259
3309B59j55l30R20j44q51M80N49j001N23K34p04L27M79r07r0O95j76l17J77j72
$$ 259 104 -226 694 550 -301 179 728 -273 250 484 -220 107 586 -321 -411 284 108 -209 -32 -204
3329b04k86Q45j37o69r9O58p2l13J26l9p0O55l23p50N91O76r43O5M26l91K15M08
$$ -204 -490 355 218 -451 -550 108 36 -277 -151 -190 -260 395 72 -678 -87 589 -354 -289 137 -254 -39 369
3351C69o72k05R85J09r30J76M6N1M48J11p75r3J104m89k95R8K45R6J57k52k88
$$ 369 -303 -508 477 586 -344 -168 -122 -71 377 488 -287 -380 724 235 -60 38 283 379 536 284 -4
3372dJ30O37p18l64N46m77M57N18j032r0O41K52q15K7J32n6N97n67l96jJ012l50
$$ -4 126 763 45 -319 227 -250 207 725 -307 -397 244 496 -319 -292 -160 -216 381 -186 -582 -583 429 79
3394G9p27L88J59P9j64P5m18M30N48o08m98O72j06P6J92m38l82R22K62q60L24
$$ 79 -648 -260 -101 -22 -186 -111 -529 -99 449 -159 -657 15 -91 -15 177 -261 -643 279 541 -319 5
3415EL72l8k6O0m82K40M31m65q39J220K17p15N93m07j48K85K27n10m03R00j46
$$ 5 377 339 313 373 -109 131 562 97 -742 478 695 -20 573 166 18 303 530 20 -383 517 371
3436C71l50J53Ql47J66P8k77r8O27p77L70K65m79q7M98k35n27O06j76j37j8L58
$$ 371 21 174 182 -165 1 79 -198 -296 331 -446 -76 189 -290 -377 121 -114 -641 -35 -211 -348 -366 -8
3458hk80JK36q4k21O11l39k60M48M9l45J95M13k83j95L44m02J42M66m73k40M42
$$ -8 -288 -287 -51 -135 -356 255 -84 -344 104 153 -192 3 416 133 -62 282 -120 22 488 15 -225 217
3480B17J87m55K86J43o31L22O11j011J3P77j31n51L17P0k46P3K00o08J39M60l60
$$ 217 404 -51 235 378 -253 69 680 -331 -318 459 328 -223 94 164 -82 -9 191 -417 -278 182 -178
3501a78j1m1l8Q9M77m52m59M18O84o80J23L51n61J40N15q80p7N70J76n36J34M63
$$ -178 -189 -230 -268 -179 298 -154 -613 -195 489 -191 -68 283 -278 -138 377 -503 -580 -10 166 -370 -236 227
3523B27q0M3q4o76L43O68l20p00Q23j72oK15l64p9K94L37m21m86P52j72M3N4n93
$$ 227 147 190 106 -570 -227 441 121 -579 244 72 66 281 -83 -162 132 469 48 -438 314 142 185 239 -354
3546c54K85O15k18o78J86N56k76M4q2n14K92N80o67q6J10M58n06J15r6j18L26
$$ -354 -69 546 328 -350 -164 392 116 160 78 -436 -144 436 -231 -317 -207 251 -255 -140 -236 -354 -28
3567b8r3m57J0J081m45l04K51m7p6M49q0n42M6P64m78j98l7L8N36K92n38o25R98
$$ -28 -121 -578 -568 513 68 -236 15 -32 -108 341 261 -281 -235 529 51 -147 -184 -146 390 682 144 -481 517
3590E17O4o01j6J93l26L70J29l76r9M67k78l26O2K53L6m9L51r36M36L66m23j05
$$ 517 581 -20 -36 157 -169 201 330 -46 -145 322 44 -282 -220 33 69 20 371 -565 -129 237 -186 -291
3612b91K45l62K61M68k45k78L16J46m43L3N22m16l32M85m53L47J59k74l19N50
$$ -291 -46 -408 -147 321 76 -202 114 260 -183 -150 372 -44 -376 109 -344 3 162 -112 -431 119
3632A19j13l10J92N28n93L08J44l62NP33n06l51P37k73l91M32j13k85O38p2l71
$$ 119 6 -304 -112 416 -177 131 275 -87 -82 651 145 -206 531 258 -133 299 186 -99 539 467 96
3653I6m14N61K6p5j82J03p6J59M9n49L57K04m85k45M56j4j41L90m48k41L43O75
$$ 96 -318 243 269 194 12 115 39 198 247 -302 55 259 -226 -471 -15 -29 -170 220 -228 -469 -126 549
3675E49j019K70J84j40Q8R7l32j48O76pm09J39J0j35N96p68K93J85L51n01p6K03
$$ 549 -470 -200 -16 -156 -68 29 -303 -451 225 218 -191 -52 -42 -177 419 -349 -56 129 480 -21 -97 106
3697A06K10r8K22k90j66N29K73q91k30O66J6l42M25o22J39P52m40m96p1O68j88
$$ 106 316 218 440 150 -16 513 786 -105 -335 331 347 5 430 -192 -53 699 259 -237 -308 360 172
3718A72j73K40m23L00K54l59n11O02q1o08L85p4O9J59J41p99J39Q44l78l61L62
$$ 172 -1 239 -184 116 370 11 -500 102 21 -587 -202 -276 -207 -48 93 -706 -567 277 -101 -462 -100
3739a00K76K1P0l37n12N19M67p31L8N30l56P5J23l8m50N84m5Q2k12P55q81L25
$$ -100 176 197 267 -70 -582 -63 404 -327 -289 241 -115 -40 83 45 -405 179 134 216 4 759 -122 203
3761B03J11k98K8L84k83k29N23o39R5J06K70n76L35J19m83K85M79l07k56J66j51
$$ 203 314 16 44 428 145 -84 439 -200 -105 1 271 -305 30 149 -334 -49 430 123 -133 33 -118
3782a18o33P26L22q10K00K99k32k45L49r0Q4K61o7p47P51J46p74O03J5j91J82
$$ -118 -751 -25 297 -513 -313 -14 -246 -491 -142 -232 -148 113 46 -701 50 196 -578 25 40 -151 31
3803C1l4j77mL83k15k38N54P8m96J87On4K59J22n98N0P72m50n73M40J19k07L48
$$ 31 -3 -180 -184 199 -16 -254 300 378 -118 69 75 21 280 402 -196 -146 626 176 -397 43 162 -45 303
3826C03k47k95J93K35p0n17N28qo4r8O4m71O76M9o10K27J17R6k83K10k99mN45
$$ 303 56 -239 -46 189 119 -398 130 122 58 -40 24 -447 229 278 -332 -105 12 108 -175 35 -264 -268 277
3849B77m29n38Q69j27l54K17K12m14M08R8k67m17O27J69m91R5kJ9N77l26m54N3
$$ 277 -152 -690 179 52 -302 -85 127 -287 121 219 -48 -465 162 331 -160 -65 -67 -48 529 203 -251 -198
3871a98M65j14k69N06n44K10J67R8o11J91M03l41J97L1l14K54J95l56n30R42j46
$$ -198 267 153 -116 390 -154 56 223 321 -290 -99 304 -37 160 191 -123 131 326 -30 -560 382 236
3892B36m22K08j14k34M58q9m00K96L66m60J6J25j58N2O8k58L6N05Q8o35K16K97
$$ 236 -186 22 -92 -326 132 43 -357 -61 305 -155 -139 -14 -172 -120 -52 -310 -274 231 319 -316 -100 197
3914A97k49M2q4pj57O23p5p64O43K31o44N95Rm09L13K43l17o61M81lm9J14J0J48
$$ 197 -52 -10 -94 -101 -258 365 290 -474 169 400 -244 351 360 -49 264 507 190 -471 10 7 -42 72 82 230
3938B30Q7l1k30j92N89l63l66M16j65r8K8Q6l45K27J46l50k03M22m5J71k32L9
$$ 230 317 286 56 -136 453 90 -276 140 -25 -123 -95 -9 -354 -127 19 -331 -534 -112 -157 14 -218 -179
3960a79j20M12m7l99L55K1l55J57K63m28K1N83n26j11L84J02l07J90J0p0J29M26
$$ -179 -299 113 66 -333 22 43 -312 -155 108 -320 -299 284 -242 -353 31 133 -174 16 26 -44 85 511
3982E11m95M3L71k0k08j0J03k93P9l5l27M29K43k00n33O14p1l32L98p0m54N38
$$ 511 16 59 430 410 202 192 295 2 81 46 -281 148 391 191 -342 272 201 -131 267 197 -257 281
4004B81l46k52N84J51o14L6K80p34K48P69n07k52M06N9q5j78r5m7J20O44p48r7
$$ 281 -65 -317 267 418 -196 -160 120 -614 -366 403 -104 -356 50 109 24 -154 -249 -296 -176 468 -280 -377
4026c77Q63m79j32M0j3R8L97k05m14j54Q59o0l88K26j38K02J79m71n38P90L73
$$ -377 486 7 -125 -85 -98 0 397 192 -222 -376 483 423 35 261 123 325 504 33 -505 285 658
4047F58m84n19N01k29L1K46q83M37P06k75o55K20L41k28oL65n88K86J81k65J29
$$ 658 174 -345 156 -73 -42 204 -679 -242 464 189 -466 -246 95 -133 -139 226 -362 -76 105 -160 -31
4068c1K15j20k84J18j5q5J80K7l81KN67j38m55N16O8l02K67n05J31J73L0q7K19
$$ -31 184 64 -220 -102 -117 -202 -22 5 -376 -374 193 55 -400 116 184 -118 149 -356 -225 -52 -22 -109 110
4091A10K84n00LM71l82r9O85l13j69L08k60k98l7N29m24J12K51j64q0o1K44m44
$$ 110 394 -106 -103 368 -14 -113 572 259 90 398 138 -160 -197 332 -92 20 271 107 27 -34 210 -234
4113b34L41Q7n58N74j56j6m17M79l53N2M82n03l53N45K87n50J75J77j74R7L55
$$ -234 107 194 -364 210 54 38 -379 100 -253 -201 281 -222 -575 -30 257 -293 -118 59 -115 -18 337
4134C37l47O6M4k38RL56j74j67RJ91k52L52j12n4K58J75l32l10N25j67j5J36l36
$$ 337 -10 56 100 -138 -129 227 53 -114 -105 86 -166 186 74 20 278 453 121 -189 336 169 154 290 -46
4157d6o6N53j68k83l92Q65k87l71K10k1k32M35N6q20M12L45j41k62R6L31l74L05
$$ -46 -112 441 273 -10 -402 463 176 -195 15 -6 -238 197 253 -567 -155 190 49 -213 -117 214 -160 145
4179A45k49l48M03R1j52j81L00j60P0L60p07K29O79o84o6K22L64l56L44l8n83
$$ 145 -104 -452 -49 42 -110 -291 9 -151 -81 279 -428 -199 480 -204 -270 -48 316 -40 304 266 -317
4200c17K45L80m17L36j28k01K11J53j35j81M67j40k94K21j7m27M57o2n87K60P51
$$ -317 -72 308 -109 227 99 -102 109 262 127 -54 413 273 -21 200 183 -244 213 151 -436 -176 575
4221E75m20l71r0L12m3K9L00p11L48L35m35o4J91L7k51M25j68m22K77J35k93L78
$$ 575 155 -216 -306 6 -37 -8 292 -419 -71 264 -171 -235 -44 -7 -258 167 -1 -423 -146 -11 -304 74
4243G4j43K00k05J12l22r2M01R0l44K96J25m36L80J37k75n5L83m01j5P09o35m0
$$ 74 -69 131 -74 38 -284 -376 25 115 -229 67 192 -244 136 273 -2 -57 326 -75 -90 619 -16 -56
4265e6J92J53j07j59L58l54p0K21m2k29O27n85n1N77k48j93J45p3k41R5L19p59
$$ -56 136 289 182 23 381 27 -43 178 136 -93 534 -51 -102 475 227 34 179 106 -135 -40 279 -480
4287d80K58N10k27l73M82J00p39M65J08m44j14M58nL1J81k59l9L08k05m72K61
$$ -480 -222 288 61 -312 170 270 -469 -4 104 -340 -454 4 -1 30 211 -48 -87 221 16 -456 -195
4308a95J64P4J4j62k7K06K71m12j29N04o2l22J75k12K5K68q4k39K30J35j29m5
$$ -195 -31 43 57 -105 -132 74 345 -67 -196 308 246 -76 99 -113 -88 180 96 -143 87 222 93 48
4330D8K06l95J63L22k30j59j52M66l09l3K78k91J61j09K7m29L28L43p55L24L95
$$ 48 254 -141 22 344 114 -45 -197 269 -40 -73 205 -86 75 -34 -7 -436 -108 235 -520 -196 199
4351A99k67j59L86l42k38N66o4m52N90j52l13M66k60l02M28J10n64L46J97j2m60
$$ 199 -68 -227 159 -183 -421 145 81 -371 219 67 -246 220 -40 -342 86 196 -368 -22 175 163 -297
4372b97M38J02l58M12j45k46K56J0M6l56L77m45J80K97k43l63O06o1k55J23L3
$$ -297 141 243 -115 297 152 -94 162 172 218 -138 239 -206 -26 271 28 -335 271 210 -45 78 111
4393A11m43O39j15m71K7L71k65o1L08m5k21K28q4l21L01L86l29j73Q8r4j64J08
$$ 111 -332 307 192 -279 -252 119 -146 -207 101 56 -165 63 -21 -342 -41 345 16 -157 -69 -163 -327 -219
4415b19Q1k4N4J2O9q0M97j75l22K99j44j74L80k79p8Q3k8K9K2K89l82K66K27l40
$$ -219 -138 -162 -108 -96 -27 -107 390 215 -107 192 48 -126 254 -25 -103 -20 -48 -19 3 292 -90 176 403 63
4439F3m5N24o29O1P5J84k07K39K7n97K44M55l56p7L36n91K08L41k99r8J45J22
$$ 63 18 542 -87 -26 49 233 26 265 292 -305 -61 394 38 -39 297 -294 -86 255 -44 -142 3 125
4461A25k51k02J67j12J71J48j52p7L21l2k20j3L67o18K28M33l76p8M23j77j93
$$ 125 -126 -328 -161 -273 -102 46 -106 -183 138 106 -114 -127 240 -378 -150 283 -93 -171 252 75 -118
4482a18K24m1r2K49k57j75L71M0n58R6Q05n60K3Ol5k35O43J03n32Km0j93J06K92
$$ -118 106 65 -27 222 -35 -210 161 201 -357 -261 544 -16 7 13 -22 -257 386 489 -43 -41 -81 -274 -168 124
4506A24j13j8j28k19K29j26K08j04rJ5K71j48K24m59O4K51K5k61L00J25n43J77
$$ 124 11 -7 -135 -354 -125 -251 -43 -147 -156 -141 130 -18 206 -253 -189 62 87 -174 126 251 -292 -115
4528a15p6m4K48K17m06Q9J77L5l83L95j87j11M77k63k1M1J09j65P9J84j99q5M03
$$ -115 -191 -235 13 230 -176 -87 90 125 -258 137 -50 -161 316 53 32 73 182 17 96 280 81 -4 399
4551C99p39K72r5N36n65r2L42k66J72J71k07L5R1j5j73j86K06r8M09M7n52p1M64
$$ 399 -340 -68 -163 373 -192 -284 58 -208 -36 135 -72 -37 54 39 -134 -320 -114 -212 197 244 -308 -379 85
4574H5j52j30K22j22M5K50l41j05M20j64j09j23M20l55J60J10k15Q9L97j79k86
$$ 85 -67 -197 25 -97 -52 198 -143 -248 172 8 -101 -224 196 -159 1 111 -104 -15 382 203 -83
4595h3M71k67p5K77j40r4j8J12J10k67K75k53j67K82o3r9j08M01m69J52K96m30
$$ -83 388 121 46 323 183 89 71 183 293 26 301 48 -119 163 100 1 -107 294 -175 -23 273 -157
4617a57N0J45l2P1k7l28M6K96K63l45m95M14j15k39M55j88j5L53j77mN1k43L00
$$ -157 -107 38 6 77 50 -278 -232 64 327 -18 -513 -99 -214 -453 2 -186 -201 152 -25 -29 22 -221 79
4640G9J66l28J7p2J62j33q4K6L97l32K33J05n10N78K65o79o2N84m60n8n0L23j02
$$ 79 245 -83 -66 -138 24 -109 -193 -167 230 -102 131 236 -274 304 569 -110 -172 412 -48 -106 -156 167 65
4663F5J91k13j61K72j41l70M95k56JK62j85j33n8J09j78J49K54L9r7l35l9M12
$$ 65 256 43 -118 154 13 -357 138 -118 -117 145 -40 -173 -231 -122 -300 -151 103 142 45 -290 -329 83
4685H3q9K27l81l19N86n4q2L19l67r3M09k20k2k8J39q0K03N3l33J39p0ok75M88
$$ 83 -6 221 -160 -479 107 53 -29 290 -77 -170 239 19 -3 -31 108 28 231 284 -49 90 20 14 -261 227
4709B27R2k13m5R3l80L86Q6n41J02M87Km91n7M65j83l46L60j16j97N21l74j23
$$ 227 319 106 61 154 -226 160 246 -295 -193 294 296 -195 -252 213 30 -316 44 -72 -269 252 -122 -245
4731b45N45j80m86M49k73m29L78J71k70L41j07N3m7J51k19j57N16N3n65J04M01
$$ -245 300 120 -366 83 -190 -619 -241 -70 -340 1 -106 -53 -100 51 -168 -325 191 244 -321 -217 184
4752A84l9k83j74O23l05J73k14q0p9L77q4N1k4k07L9M97l11j51J0J53l82Q7K32
$$ 184 145 -138 -312 311 6 179 -35 -115 -194 183 99 150 126 -81 -42 455 144 -7 3 156 -226 -139 93
4775I3k29N52Ro06K46O5k11j4K88j17l06J30J57m21L77j55k27L66J10j47q0lK1
$$ 93 -136 416 425 -181 65 130 -81 -95 193 76 -230 -100 57 -364 13 -142 -369 -3 107 -40 -120 -123 -102
4798a02k11J98o0k25P47j98r7q5J9J63j13R6k55J33K48k54j54N15k28j3M3M1l65
$$ -102 -313 -115 -175 -400 347 149 52 -33 -14 149 36 132 -123 10 258 4 -150 365 137 124 167 208 -157
4821a57J00L61j31j68l0L7k66M86r1k25M1N10n22J10M0j45r2N65n23j44L21j27
$$ -157 -57 304 173 5 -25 12 -254 232 141 -84 -43 467 -55 55 95 -50 -142 423 -100 -244 77 -50
4843e0o2j30J11j54K19jk81K09L04rl60J41n6O8J46j03Q1K75k33l67J11J78J90
$$ -50 -112 -242 -131 -285 -66 -67 -348 -139 165 156 -204 -63 -119 -51 95 -8 73 348 115 -252 -141 37 227
4866B27k8J08l22j6K19L0m26J38L18k12l77O26k05Q7K37l54k9J44J72m94L02J40
$$ 227 199 307 -15 -31 188 218 -208 -70 248 36 -341 285 80 167 404 50 21 165 337 -157 145 285
4888B85l36L06k44j88L7K46n5j83J72J76k46JL2k74N26p1l42J7Q0j37L0L35l98
$$ 285 -51 255 11 -177 -140 106 51 -132 40 216 -30 -29 3 -271 255 184 -158 -141 -61 -198 -168 167 -231
4911b31j10N87j81l27K92l1Q7l59K16J13k37L13k41k77M40K53m37N14l02k42K36
$$ -231 -341 246 65 -262 30 -1 86 -273 -57 56 -181 132 -109 -386 54 307 -130 384 82 -160 76
4932G6L01k76k42N18r0o35M42R3J47j31p4j0j1J12k87J57j95K1k9L73j60m36K51
$$ 76 377 101 -141 377 287 -348 94 187 334 203 129 119 108 220 -67 90 -105 -84 -113 260 100 -336 -85
4955h5M67m95J39r5j38M03k61P5r2k6J17k60L28k9l16M05k62m4J92O4k61L6M39
$$ -85 382 -113 26 -69 -207 196 -65 10 -82 -108 9 -251 77 48 -268 137 -125 -169 23 87 -174 -138 301
4978C01m45K90j78j08j3K58m1l74M20L13j02l70K82J1l12M12k24L8Q7R7n57K14
$$ 301 -144 146 -32 -140 -153 105 64 -310 110 423 321 -49 233 244 -68 344 120 158 245 342 -215 -1
5000aL67k56k3O4j57j9M08m71p9L2J64O2p8m9j07K8L38l38j5M79n23m1j39M94
$$ -1 366 110 87 151 -6 -25 383 -88 -167 -135 29 91 13 -36 -143 -115 223 -115 -130 349 -174 -215 -354 140
5024A40k48L0J74j08k49N24j05m76L56k77M00j86l2K9R6m6j16J9K53k07K7J64
$$ 140 -108 -78 96 -12 -261 263 158 -318 38 -239 161 -25 -57 -28 68 22 -94 -75 178 -29 -2 162
5046A62l24K04K24q5k32O8J51k86NmJ15M6K16p06M78KP4o5K6q8k74M65k02q0l0
$$ 162 -162 42 266 181 -51 17 168 -118 -113 -117 -2 44 260 -446 32 34 108 43 69 -19 -293 172 -30 -110 -140
5071a40L58J76m35J90j64l16K90j17O3J66J45l29J99k54K11j72L42l75k23N63
$$ -140 218 394 -41 149 -15 -331 -41 -158 -95 71 216 -113 86 -168 43 -129 213 -162 -385 178
5091A78l1q8l3J99m00M91q1l32L60j95K39j7m71L13j62K72k61K6k04N55l24l01
$$ 178 147 59 26 225 -175 316 235 -97 263 68 307 290 -181 132 -30 242 -19 7 -197 358 34 -267
5113b67M71j78mK07l31k76M50K38m26Pl4K83k67L05n98J75L51k02k00L08l94J13
$$ -267 204 26 22 229 -102 -378 72 310 -116 -109 -143 140 -127 178 -420 -245 106 -96 -296 12 -382 -269
5135b69J86P6l93J66N36l68j63J84J01l90L96l2k75K38K32m61K03J93k75R3M5
$$ -269 -83 -7 -400 -234 302 -66 -229 -45 56 -334 62 30 -245 -7 225 -236 -33 160 -115 -22 23
5156B3O7O8J86k20k39L19K2j89J82o0N5k25L28m20K3J99j2k80M99k36l09K44o9
$$ 23 90 158 344 124 -115 204 226 37 219 159 214 -11 317 -103 -80 119 107 -173 326 90 -219 25 -44
5179d4j83N3N10m47p8j55L08l48L19K60l16K05l8k52K21J11k91oJ65k7k27M31
$$ -44 -227 -174 336 -111 -189 -344 -36 -384 -65 195 -121 84 46 -206 15 126 -165 -171 -6 -33 -260 171
5201A71l03j10M11k78l15M77QP6k63K11m8m6K25K9l28L17j53j00J74Q3l43L92
$$ 171 -132 -242 169 -109 -424 53 61 137 -126 85 37 -9 216 245 -83 234 81 -19 155 238 -105 287
5223B87O1m49j53N41j50k99K10J0J76q5j47j20L44j77k04J13l7m7P7Q3k86K79
$$ 287 348 -101 -254 287 137 -162 48 58 234 149 2 -118 226 49 -155 -42 -79 -126 -49 34 -252 27
5245B7o2L17n29M9J50o3J66J13J07k56k5K30k96K55j73M1kR1j49L7K29m59O4M47
$$ 27 -35 282 -247 -198 -48 -111 55 168 275 19 -6 224 -72 183 10 51 49 140 -9 28 257 -202 -138 309
5269C09k06q4j02M9K6k59L91k17l32O22M4k0k44J58m05L52K78m57K20J6q9j28
$$ 309 103 19 -83 -34 -8 -267 124 -93 -425 197 241 221 -23 135 -270 82 360 -97 123 139 50 -78
5291g8p7Q9K3m8L74n94K62R7k83j36J24r2M44j25p1j75J98L21m87L67k71O1J49
$$ -78 -155 -66 -43 -91 283 -311 -49 48 -235 -371 -247 -339 105 -20 -91 -266 -68 253 -234 133 -138 -77 72
5314G2ql66M52J0m69L52M3k95J5k9N50m99M01J56k70j59M16q26N40R9J44M5k41
$$ 72 64 -302 150 160 -309 43 86 -209 -194 -223 327 -172 229 385 115 -44 372 -454 86 185 329 374 133
5337A33J17j32j22M0j70J97J31n04L49q7j27J71J14L3m37K12K4k28K23J00n14
$$ 133 250 118 -4 36 -134 63 194 -310 39 -48 -175 -4 110 143 -294 -82 -58 -286 -63 37 -477
5358d77L56K87j71J04j94K39l66J29L03k57P8L9k08k0L12k35J53k3J52m12K83
$$ -477 -121 166 -5 99 -95 144 -222 -93 210 -47 31 70 -138 -158 154 -81 72 49 201 -211 72
5379G2J08k54Q8K26r1j77mk18L08M07k03n31M62No9m9rj11L94k16k47J68J5k7
$$ 72 180 -74 14 240 149 -28 -32 -250 58 465 262 -269 193 198 129 80 71 -40 354 138 -109 59 74 47
5403D7l32K64j57J57Q0k46j06M6L10j40J8l45O96k56J52m57K8L01q0j77J94K93
$$ 47 -285 -21 -178 -21 59 -187 -293 -247 63 -77 -59 -404 292 36 188 -269 -241 60 -20 -197 -3 290
5425B90m57K53j48J61l03K53j14k1J52K68k03k06K43j82J8j20J65j34J98K87k59
$$ 290 -167 86 -62 99 -204 49 -65 -86 66 334 131 -75 168 -14 4 -116 49 -85 113 400 141
5446A41k19J04r4L17J27m38J35J76k49j47M38k21m47M49j57m0J64K6l43K83P5
$$ 141 -78 26 -68 249 376 -62 73 249 0 -147 291 70 -377 72 -85 -125 39 65 -278 5 80
5467H0m02L1N98n78L37j65J92m01M65k79n3L47j75r3r8M22l09n1L18n9p0rL33
$$ 80 -322 -291 307 -271 66 -99 93 -308 157 -122 -175 172 -3 -96 -194 228 -81 -132 186 127 57 48 381
5490C81p24O6M35l13K16J1kl01M41j34j82J43j25j02L81j05P4r9j42j94n5O40
$$ 381 -343 -277 158 -155 61 72 70 -231 210 76 -106 37 -88 -190 191 86 160 61 -81 -275 -330 310
5512C10l11l3J96J00l73J22J49k45j5K40k56l95K99J63j50K20k83K04o2M23m31
$$ 310 -1 -34 162 262 -111 11 160 -85 -100 140 -116 -511 -212 -49 -199 21 -262 -58 -120 303 -128
5533a28L25k65j43M90k16j18r6K91l27J30K78j98j50J63j8J7j50K55k47l6L55
$$ -128 197 -68 -211 279 63 -55 -151 140 -187 -57 221 23 -127 36 18 35 -115 140 -107 -143 212
5554B12j94r4M48pl74j9J44j21j14M83m76N7L09j18n7K9J58l28J25j81l6K02K23
$$ 212 18 -76 372 365 -9 -28 116 -5 -119 364 -112 -55 254 136 79 108 266 -62 63 -118 -154 48 271
5577B71m85j66M98j47K20m45j47R6J92Q8L4k95M55j15j73L14m28K72K55j97k26
$$ 271 -214 -380 118 -29 191 -254 -401 -305 -113 -25 9 -286 169 54 -119 195 -233 39 294 97 -129
5598a29J02L69o01M40j63JKK64l19j78M96j46j94K94k52q0J97j25r2ON56l73j37
$$ -129 -27 342 -259 181 18 19 21 285 -34 -212 284 138 -56 238 -14 -94 103 -22 -114 -108 448 75 -62
5621f2K87k79k6L37j49k25r9K81n3j56K13J02k62K89n5l15R2j83j39K82M09r6
$$ -62 225 -54 -80 257 108 -117 -216 65 12 -144 69 171 -91 198 143 -172 -80 -263 -402 -120 289 193
5643A93n79L28l5J52P0j98n0M26n43N5M60p5k28K1j28M5k06L54L85o72L91k8P9
$$ 193 -386 -58 -93 59 129 -69 -119 307 -236 -181 279 204 -24 -3 -131 -86 -292 62 447 -225 166 138 217
5666B17p1o6j07J15r3j96O44j97Ml17M51m76mM0p3k5j27L43P9k22K72m38J95L37
$$ 217 146 80 -27 88 -5 -201 443 246 250 -67 384 -92 -96 -56 -129 -154 -281 62 141 -81 191 -247 -52 285
5690B85l55j17L4N52n54K74K5m07J68O7j46k00L97J16m36L41k37m5L28K07o30
$$ 285 -70 -187 -153 399 -155 119 144 -263 -95 -28 -174 -374 23 139 -297 44 -193 -238 90 297 -333
5711c33J92K40k52J61k12J96K76m50J07K81n6l4o6j69L02k44L42j62k26J21J25
$$ -333 -141 99 -153 8 -204 -8 268 -182 -75 206 150 116 50 -119 183 -61 281 119 -107 14 139
5732A39k34m9L4K03q1q4r8j17J12K79j93l94O80n25J34R5J60l12N71j40j94j83
$$ 139 -95 -144 -110 93 12 -72 -170 -287 -175 104 -89 -483 197 -328 -194 -99 61 -251 320 180 -14 -197
5754a97j55J61J39k33L09k50J58Q6l60M18n0k12J14j0R6j99L51l51J30J00K60
$$ -197 -352 -191 -52 -285 24 -226 -68 18 -342 76 26 -186 -72 -82 14 -185 166 -185 -55 45 305
5775C05n08K60k9j48K09J45k83l52O34k10l10K50M2L15n7l90N2j12L50j18j04
$$ 305 -203 57 28 -120 89 234 -49 -401 233 23 -287 -37 5 320 263 -127 -75 -187 163 45 -59
5796e9K30m41M59j09q0n3O6J21k68K56k73M2K73l09m8R4j79K11o5M3K35j06k7
$$ -59 171 -270 189 80 0 -53 13 134 -134 122 -151 -109 164 -145 -193 -99 -278 -67 -132 -89 146 40 13
5819A3j41L23k86J65Nj20P1q4K07n07L79k71J13j36J84J93J41l67K28lk10K6Q5
$$ 13 -128 195 -91 74 79 -41 30 -54 153 -354 25 -246 -133 -269 -85 108 249 -118 110 107 -103 -77 8
5842HJ65k61O02m23j84J32K75n16L3J12n1n7O21m17n27Q78m63k67j17P6J96L74
$$ 8 173 -88 514 91 -93 39 314 -202 -169 -57 -108 -165 456 39 -488 390 -73 -340 -457 -381 -185 189
5864A89n5l67K94J14J60p86M35p2j8O8N9Q4j12J23ll59J45K98l20K78j82R6K71
$$ 189 134 -233 61 175 335 -451 -16 -88 -106 -38 21 105 -7 116 113 -246 -101 197 -123 155 -27 69 340
5887C40k70lj54K75J61l67n2k2J41K0%k47K38L0j45K98k28j64M3O8K3k62L61R
$$ 340 70 67 -87 188 349 -18 -70 -92 49 69 69 -178 60 90 -55 243 15 -149 -106 -38 -15 -277 84 93
5911I3K09k29J24l79L95L3n22L18J56l5m26J04Km1M83k13j06Q4jk66L69j53p8
$$ 93 302 73 197 -182 213 246 -276 42 198 163 -263 -159 -157 -198 285 72 -34 50 49 -217 152 -1 -79
5934g9K73L98n14l76M31L7j84j18J10k98N45k49K88l07L1K23k64L20j12o8k48
$$ -79 194 592 78 -298 133 170 -14 -132 -22 -320 225 -24 264 -43 -12 211 -53 267 155 87 -161
5955a61K0j7L09k23j97Q2J07j06k17N06Qk52N19j80k80K56n0l5j19L33m38N2j58
$$ -161 -141 -158 151 -72 -269 -187 -80 -186 -403 103 111 -141 378 198 -82 174 124 89 -30 303 -135 -83 -241
5978b41J03n9J34M3K1J75l78J89J4k66K26K7K6l0j08J51J88n43M34m5J73n40J83
$$ -241 -138 -197 -63 -20 1 176 -202 -13 1 -265 -39 -12 14 -16 -124 27 215 -328 106 61 234 -306 -123
6001a23j80K76K99j14n7j02L9q5K45Q6n73K50K40j83m41L32q5K54l6j81l1J85
$$ -123 -303 -27 272 158 101 -1 38 -47 198 284 -289 -39 201 18 -423 -91 -176 78 42 -139 -170 15
6023A5Rj31K43k41J07n7N2R1p7J91K2j69j22M42m01J12m49J69L30k69J26%j21
$$ 15 24 -107 136 -105 2 -55 -3 88 11 202 224 55 -67 375 -26 86 -363 -194 136 -133 -7 -7 -128
6046a28K18j19l0L31k55L04k89J62r1k1J14j83K61m45J26J93j03q8j44J52m7K41
$$ -128 90 -29 -59 272 17 321 32 194 103 82 196 13 274 -171 -45 148 45 -43 -187 -35 -82 159
6068A59k34k95J54M32k90j00M50m87J16j67K55r1J19L48n04R8K76k18l74R8K75
$$ 159 -75 -370 -216 216 -74 -174 276 -211 -95 -262 -7 -98 21 369 -135 -37 239 21 -353 -255 20
6089B0j84L86j54k39J67K73n96K22J57o9j35J60j01K9J91p8L20m67K86p1P3m06
$$ 20 -164 222 68 -171 -4 269 -327 -105 52 -17 -152 8 -93 -64 127 49 369 -98 188 117 190 -216
6111b16N24n41L82m02L35rM6j33P3J49j4J1j21k16J38M0l10L27L15p0l70J4O8
$$ -216 308 -233 149 -253 82 73 119 -14 59 208 194 205 84 -132 6 46 -264 63 378 308 -62 -48 20
6134B0Pl9j01P8j41P5N9J58j03k81K54k19J69j81P9J84j5J0M1J15k19K91Pj92
$$ 20 27 -12 -113 -35 -176 -101 -42 116 13 -268 -14 -233 -64 -245 -166 18 3 13 54 169 -50 241 248 56
6158E6k10m2J58L8J68q04P27K5j76J54K18j91j38K12l57K15m8J49k3j89p2M16
$$ 56 -154 -196 -38 0 168 -636 91 116 -60 94 312 121 -17 195 -162 53 5 154 131 -58 -130 286
6180B86k86m3L12m09K50J68rn1j1o79O51nl05O2J84k95o7K48j7j27K12j62J76
$$ 286 0 -43 269 -140 110 278 269 218 207 -472 179 174 -131 -69 115 -180 -247 1 -16 -143 69 -93 83
6203H3J32l21P3J6j71j47J42L68r8j35L05j89r1L9K64k18p2J52j70j14K84j52
$$ 83 215 -106 -33 -17 -188 -335 -193 175 77 -58 247 58 -33 6 270 52 -20 132 -38 -152 132 -20
6225b0MK29k13j62L15j53L21k89K23n43K67K81k16j83L27P5k88P6J76j83O9N4
$$ -20 -16 213 0 -162 153 0 321 32 255 -288 -21 260 44 -139 188 263 -25 51 227 44 113 167
6247A67q6l57L05l43K66pJ57j12j10l5k33N21k68L4j44K36k40r0L68j78j42M82
$$ 167 81 -276 29 -314 -48 -55 102 -10 -120 -155 -388 133 -135 -101 -245 -9 -249 -339 29 -149 -291 191
6269A91j78l15K75j40K20Pq7m4q4K59j50Pj0J59k49J49j83J88l6J51k61K42l43
$$ 191 13 -302 -27 -167 53 60 -27 -71 -155 104 -46 -39 -49 110 -139 10 -173 15 -21 130 -131 111 -232
6292b32J64k59L22K22l97Q0lJ46k21L22m0R9n8r1r0J59r5j63J62j19j02P7P8O0
$$ -232 -68 -327 -5 217 -180 -100 -103 43 -178 144 104 203 145 54 -36 123 28 -135 27 -92 -194 -117 -39 21
6316B1N1O2l72L4M00k03j8Q8K90j64l77J80J1j93K94r9Jm3j63J75J96n2m12M79
$$ 21 72 134 -238 -204 196 -7 -25 63 353 189 -188 -8 3 -190 104 5 6 -37 -200 -25 171 119 -293 186
6340A86n6%L9l12K64j34k16J85J50j70k5j84L30J46k96P6l03K34J33j21K25j74
$$ 186 130 130 169 -143 121 -13 -229 -44 106 -64 -89 -273 57 203 -93 -17 -320 -86 47 -74 151 -23
6362b3K04k04J7JO9J24k59Q5Qn0k26L72m8k84M7R8Pj29N80l08j41K1L05J7k11
$$ -23 181 -23 -6 -5 64 188 -71 14 22 -28 -254 118 70 -214 -167 -69 -62 -191 389 81 -60 -39 266 283 72
6387G2l23K62O8J3k36K25k33K49J44m50M2L08j33J39K76k42o04M70N1j98J83j10
$$ 72 -251 11 79 92 -144 81 -152 97 241 -209 -167 141 8 147 423 181 -423 47 98 -100 83 -27
6409b7p5J35j20Q3L07k42M9l72O2O08k98J22k46r9L5J40m9r0J85j85K05j87p8
$$ -27 -102 33 -87 -4 303 61 110 -262 -200 408 110 232 -14 -113 -78 62 13 -77 108 -77 128 -59 -137
6432a37Q3n3O7Q2n2J84j69l4n0j7k19K00J91l8j57RK09j82rj43O39n5o9k77k92
$$ -137 -54 -107 -40 42 -10 174 5 -29 -79 -96 -315 -115 76 38 -119 -110 99 -83 -92 -235 404 349 280 3 -289
6457b89L93o8M8j2P0j99J51K40n80L11mk05K63k11p3K32J22l18N7kL4J82K31l61
$$ -289 104 36 84 72 142 -57 94 334 -246 65 61 -144 119 -92 -165 67 189 -129 -72 -74 -40 142 373 12
6481A2J35k72m7R5J91k56J43K26j83j28K0K46l36M6O9r2N3K9j65L26k22L03j74
$$ 12 147 -125 -172 -77 114 -142 1 227 44 -84 -64 182 -154 -108 -39 -131 -78 -49 -214 112 -110 193 19
6504A9M1j14L2q7K65r8k24J02jJ58j28m9L03k36p7L17j97n9J50j34p6K64l38R1
$$ 19 60 -54 -22 -109 156 58 -166 -64 -65 93 -35 -84 219 -17 -94 223 26 -33 117 -17 -93 171 -167 -76
6528g6r3q8K87j08p4PJ75L86l32O1k47k8j34L16r2M31l60J9l03m8K73k9j03J01
$$ -76 -169 -257 30 -78 -152 -145 30 416 84 145 -102 -130 -264 52 -40 391 31 50 -253 -301 -28 -57 -160 -59
6552e9o8j77K62Q0k31J98l8n5K12l41l6K73j72l44M49r1m8K67Q2l02O2J72J68
$$ -59 -127 -304 -42 38 -193 5 -33 -88 124 -217 -253 20 -152 -496 -47 -138 -186 81 163 -139 -77 95 263
6575B63p7Lj15l7m3L65k18k73r2L76k71o9J49j55JK08J03l70L50J94k02l15K35
$$ 263 186 189 74 37 -6 359 141 -132 -224 152 -119 -188 -39 -194 -193 15 118 -252 98 292 90 -225 10
6598A0Nm3J45n6j53J18R4K65n69L63n3K3k02j72K43O9j5j08M4l59K11K19j85K39
$$ 10 15 -28 117 61 -92 26 120 385 -184 179 126 149 -53 -225 18 87 72 -36 8 -351 -140 79 -106 133
6622A33j8k10qJ93q5j2J45l09K13M6n0J77k17Q4q0k05J44J37P9m74M05j21j46
$$ 133 115 -95 -103 90 5 -7 138 -171 42 88 38 215 -2 82 2 -203 -59 78 157 -317 88 -33 -179
6645a79L01k16J52p7J40m05K79k41N24k85J55j85Q1P3L3l07m1kK11l06K88LM2
$$ -179 122 -94 58 -19 121 -284 -5 -246 278 -7 148 -37 44 117 150 -157 -198 -200 11 -295 -7 -4 38
6668C8J6j45L93j73k42L46l78L36l4l64O12n60K87o0oj26p3r9j07L17q0K90j53
$$ 38 54 -91 302 129 -113 233 -145 191 157 -207 405 -155 132 72 66 -60 -133 -232 -339 -22 -102 188 35
6691C5k72MO06m03J53r6j11N4j80j99J56M39j35j01j98K40J13Mk37M29k32l4J2
$$ 35 -237 -233 373 -30 123 27 -84 -30 -210 -409 -253 186 51 -50 -248 -8 105 109 -128 301 69 35 47
6714D7l7j75J85R0J5k78J29j27J86j08L02k31j87k64M77%K4k31K44K26l93n8L85
$$ 47 10 -165 20 110 125 -153 -24 -151 35 -73 229 -2 -189 -453 24 24 48 -183 61 287 -106 -164 221
6737B21l84J21J9j56N1K50l73R3K83j95J07l6k87O69l25J9j78M32j62j62J57l64
$$ 221 -163 -42 -23 -179 -128 122 -251 -158 125 -70 37 1 -286 383 58 77 -101 331 169 7 164 -200
6759b00O19n61J56J19j63q7P8K75k13R4o4j12j13J61O5r7K97k62J96l95K36j60
$$ -200 419 -142 14 133 -30 -117 -39 236 23 117 53 -59 -172 -11 54 -43 254 -8 188 -207 29 -131
6781a31L75l55OJ49p1J18K36l33P5k54O6J47l3K1k66L55o4j33K79q9m1r0RL2j55
$$ -131 244 -111 -105 44 -27 91 327 -6 69 -185 -119 28 -5 16 -250 105 41 -92 187 98 57 -33 -24 8 -147
6806a47R5K76j25m07L34P8j35l13K49P4j18M01k29K5j80K37k66K77o1O3o8QO5
$$ -147 -52 224 99 -308 26 104 -31 -344 -95 -21 -139 262 33 58 -122 115 -151 126 65 128 60 68 133
6829A33N0k87N1O2J34k8r7j02QJ5MJ61j06m1k3L93k00j24l8n1O0R3j37nL1Q6K4
$$ 133 183 -104 -53 9 143 115 18 -84 -76 -61 -57 104 -2 -43 -66 327 127 3 -35 -86 -26 67 -70 -75 -44 42 66
6856F6K33l33o4Q6J49j50Pl2o4K90J82m63J60l4q5o9J58J03k06L9j15Q4k8K4K30
$$ 66 299 -34 -98 -12 137 -13 -6 -38 -102 188 370 -93 67 33 -52 -121 37 140 -66 -27 -142 -58 -86 -62 168
6881A68L5k36l99K65K72J7j64J4m4K09J60l28J67m69K50j02K68j71K49p3n8N6
$$ 168 203 -33 -432 -167 105 122 -42 -28 -72 137 297 -31 136 -333 -83 -185 83 -88 161 88 30 86
6903H6l39L66j10k08j73M55j7l7J65J6k24J20m54M30J68m47k1K8N16oj71j7P3
$$ 86 -253 113 3 -205 -378 77 60 23 188 204 -20 100 -354 76 244 -203 -224 -196 320 314 143 126 199
6926A99j85L2j6l1j2j66L81l23p5K26O9K06l68P5j79K48jk90K53K3M7j72N2M44
$$ 199 14 46 30 -1 -13 -179 202 -121 -196 30 99 305 -63 12 -167 81 80 -210 43 66 113 -59 -7 437
6950D37o94J17J97K46l80J24j84k8L35q5k74RJ13J54m4L5L1j99j41L21j14J41
$$ 437 -257 -140 57 303 -77 47 -137 -165 170 85 -189 -180 -67 87 43 78 109 -90 -231 90 -24 117
6972A17l2j34J48J31n72N67k82J49j03k0O5J35j80l3O2j3k34J66j7M2j37J98j77
$$ 117 85 -49 99 230 -342 225 -57 92 -11 -31 34 169 -11 -44 18 5 -229 -63 -80 -38 -175 23 -154
6995a54J30J61j53j97K8P2J75j11K8J11n0p4L6Q4M2k6q7K23o33L56Pk68K35j97
$$ -154 -24 137 -16 -213 -185 -113 62 -49 -21 90 40 -34 2 86 128 102 15 238 -395 -39 -32 -300 -65 -262
7019b62M22j94m8L96j67m5j68J1J51m8k54L21j59K43p2k0m1J37n7J61k74k66J30
$$ -262 160 -34 -82 314 147 102 -66 -55 96 48 -206 115 -44 199 127 107 66 203 146 307 33 -233 -103
7042a03R6J68k35o6k1L23j49j9J3j69L12j48J27j56J39l09M07k07q3Q2P9p5m2
$$ -103 -7 161 -74 -140 -161 162 13 -6 7 -162 150 2 129 -27 112 -197 210 3 -80 2 81 6 -36
7065c6p8rN6L3J66n9R7p3j9o8j53L89k59p6Q4j97K17l02P6L24r9o2R5r5lo0R0
$$ -36 -114 -123 -67 -34 132 73 170 97 78 10 -143 246 -13 -89 -5 -202 15 -287 -211 113 14 -48 47 -48 -51 -111 -21
7092b1N0r8O7k63K05J48J60k15j69J64N5k76K47J16k61J2J25J63j35M5O8k12m8
$$ -21 29 -69 -2 -265 -60 88 248 33 -136 28 83 -193 54 170 -91 -79 46 209 74 119 187 -25 -73
7115g3K34J00j90r0O8j64P6r6J59l31K57M4J54P9m97P51l29j83P6P6K4k45K19
$$ -73 161 261 71 -19 49 -115 -39 -135 24 -307 -50 -6 148 227 -270 481 152 -31 45 121 145 -100 119
7138A19q1k25k2q5K04n4J44M8p3N8O5j80M1j12k4J47K8J77j82Q3j04j27K60o20
$$ 119 38 -187 -209 -294 -90 -144 0 48 -25 33 98 -82 -41 -153 -177 -30 -2 175 -7 76 -28 -155 105 -515
7162e15O85m5j10l53K81j1K7J66l8j14L67l64l00K87K63j35K9o1l02K39J49l64
$$ -515 170 125 15 -338 -57 -68 -41 125 87 -27 340 -24 -324 -37 226 91 120 59 -243 -4 145 -219
7184b19J06K02l46o0K2K28J00J05j37K69k51J17j52N6K11j80j32kl1J7M50l46
$$ -219 -113 89 -257 -317 -295 -67 33 138 1 270 19 136 -16 40 251 71 -61 -63 -94 -77 373 27
7206B7J72k5j16j06j15J38n7j62L29j5j11p0j14M75m30J59J34m8j16j36j80L85
$$ 27 199 174 58 -48 -163 -25 -82 -244 85 70 -41 -111 -225 250 -180 -21 113 65 -51 -187 -367 18
7228A8lj4L01k09QJ28k02J87Q5m37j31J72K94l31pN1p9J23q2J27q4O2k10J01Q7
$$ 18 15 1 302 93 101 229 27 214 299 -138 -269 -97 197 -134 -141 -90 -169 -46 -128 -1 -85 -23 -233 -132 -45
7253d5K84j1l61J51n8J88j94Q5j11J03j42J22k68J41K06j02P9J62k92j71J55J51
$$ -45 239 228 -133 18 -40 148 -46 39 -72 31 -111 11 -257 -116 90 -12 67 229 -63 -234 -79 72
7275G2J40j87J86l70K05j20o0K14j80m1q1K65l22J87J12O5L1j81M7J29l8K5k51
$$ 72 212 25 211 -159 46 -74 -134 80 -100 -141 -222 43 -279 -92 20 85 116 -65 -18 111 73 98 -153
7298a53L08l07KL11j85Q2j69q9L56m22N44j27j18k46J27K39k47J20L4O9J02m5
$$ -153 155 -152 -150 161 -24 58 -111 -200 156 -266 278 151 33 -213 -86 153 -94 26 60 129 231 186
7320A86k84J65j74j0L56j48j91J38K85jj79J83j41l51K12j09Q7P9n%k94Q3J27
$$ 186 -98 67 -107 -117 239 91 -100 38 323 322 143 326 185 -166 46 -63 24 103 98 98 -196 -113 14
7343A4Q2P7j03J0NJ59j19k29k14J55K66m04J4K28K4J67j0j41L68n54J76Lq7n0
$$ 14 96 173 70 80 85 244 125 -104 -318 -163 103 -301 -287 -59 -35 132 122 -19 349 -205 -29 -26 -113 -163
7367a63J58J19j54l1j8J99N2k32n2J94J1J39j93j83k63N11j32j56K27p6J60l45
$$ -163 -5 114 -40 -71 -89 110 162 -70 -122 72 83 222 29 -154 -417 94 -38 -194 33 -43 117 -228
7389b28J37K00J8q3L79l49j21n3j64R7L38k64J97M7k88k2N3J1r7L67o6k8j02L6
$$ -228 -91 109 127 44 423 74 -47 -100 -264 -167 171 -93 104 151 -137 -159 -106 -95 -192 175 109 81 -21 15
7413A5J05j3k53K95j06m8J36k96o1M96m55J36j05J85m05M01r0j40J02j59K23j96
$$ 15 120 107 -146 149 43 -5 131 -165 -226 270 -185 -49 -154 31 -374 27 -63 -203 -101 -260 -37 -233
7435b33R1Q4K09K6j63L65l20l8k09J22J19M9NK2k69Q6K26j59K2p4K3j32J37J0
$$ -233 -142 -58 151 177 14 379 59 21 -188 -66 53 102 107 129 -140 -54 172 13 35 -39 -16 -148 -11 -1
7459ar2J25P2j52J56l3k6J2l8q9M8P1J3p0Q6J34n52M65Q3k68K70k88N4K4L8J1
$$ -1 -93 32 104 -48 108 75 49 61 23 -66 -18 53 66 -4 82 216 -336 129 212 -56 214 -74 -20 4 42 53
7485E3l91L20n9J05o1RR7M9J66m50K79j34N7j0j42J38J90P5l75K90l96L61m27
$$ 53 -338 -18 -77 28 -33 -24 73 122 288 -162 117 -17 40 30 -112 26 216 291 -84 206 -190 171 -256
7508b56J49J29q7J58J01k43j25K82ml54J16J44k7k54L31j9P9k24j83K92nJ73l38
$$ -256 -107 22 -65 93 194 -49 -174 108 104 -250 -134 10 -17 -271 60 41 120 -104 -287 5 0 173 -165
7531a65J22n4J59K6j6l90M49K8J11k06j7j12L7J08O5J30n44L52j90J0J57k2J50
$$ -165 -43 -97 62 88 72 -318 131 159 270 64 47 -65 -28 80 145 275 -269 83 -107 -97 60 38 188
7554A88k84L71k72p5o9M22l08J37p6r9J67k46K13r7r7m6K96k43l82N45j73J05
$$ 188 -96 275 3 -72 -141 281 -27 110 34 -65 102 -144 69 -28 -125 -171 125 -118 -500 45 -128 -23
7576b3j74J40J62q8M3r5j12M9J38p8j86M20j0n1j13L1P6j51j59J89J26j00l09
$$ -23 -197 -57 105 17 60 -35 -147 -98 40 -38 -224 196 186 135 22 53 129 -22 -181 8 134 34 -275
7599b75J76P2R4k36J84R8Rk29J47J10q5kJ31p1L8N1l85L13j73J52j44Q7n2R2q
$$ -275 -99 -27 67 -169 15 113 122 -107 40 150 65 63 194 123 161 212 -173 140 -33 119 -25 62 10 102 94
7624I4O9k26M14n21N0pJ79j42n3R5n6J84j21j43P0J00k4j27M59l1j35m5J23k30
$$ 94 163 -63 351 -170 -120 -127 52 -90 -143 -48 -104 80 -41 -184 -114 -14 -38 -165 294 263 128 83 206 -24
7648b4k3L00j90j56L26j88j4p1j87J72K39j75R0Ln6L96l87l9k38P0M12k45Q0l34
$$ -24 -47 253 63 -93 233 45 31 -40 -227 -55 184 9 99 102 46 442 55 16 -222 -152 260 15 95 -239
7672b39M93k91J45J33l61K37Nj58P9m8k16R7R3k3R1j71J48j2j19P0jJ22L5p6j92
$$ -239 254 -37 108 241 -120 117 122 -36 43 -5 -221 -124 -31 -54 37 -134 14 2 -117 -47 -48 74 109 33 -159
7697a59J90k52K90N7rj59O8J5R5j39k70K06n4J89n1k16L62l03K29l6j15L18k3
$$ -159 31 -221 69 126 117 -42 26 41 136 -3 -273 -67 -121 68 17 -199 163 -140 89 53 -62 256 233
7720B33p4k30J62M13m13Q9O6j20m03M74m03M7N1K53k02o1K64k40P3j91M39J38
$$ 233 159 -71 91 504 91 180 246 126 -277 197 -206 -159 -108 145 -57 -118 146 -94 -21 -212 227 365
7742C65k90k05O3mJ07l1k7j63j23L73Ql97L83N9k31l6J34K06k64K02j89j46L30
$$ 365 75 -130 -67 -71 36 5 -22 -185 -308 65 73 -324 59 118 -113 -149 -15 191 -73 129 -60 -206 124
7765A24q8j45Q1jO9M5j54j00L0k7L68l17J41k54K49R8l6j69K16j15J20J7o8j15
$$ 124 36 -109 -28 -29 40 85 -69 -169 -139 -166 202 -115 26 -228 21 119 83 -86 130 15 135 152 84 -31
7789c1K11k29m7J10l35J32K72k32R0j12J68r4J03l8J90k28p0N7J06j6o3J07K52
$$ -31 180 -49 -96 14 -321 -189 83 -149 -59 -171 -3 -97 6 -32 158 -70 -140 -83 23 7 -56 51 303
7812C03n63K84k63K60j53R3q0k23K43J55K16k92P4j28K69k56K64l5j39o2k9J71
$$ 303 -260 24 -239 21 -132 -39 -119 -342 -99 56 272 -20 54 -74 195 -61 203 168 29 -33 -62 109
7834A09l78J93J73k20L9K65q9J22K6k46J78k16J28l08M8N19k54J52j33o1o2j91
$$ 109 -269 -76 97 -123 -84 181 92 214 240 -6 172 -44 84 -224 -176 343 89 241 108 47 -15 -206
7856b06K39j99L55n8l65M99j86j8j96L91l19J72m3n4r8j72L61l26mN98p27L22
$$ -206 33 -166 189 131 -234 265 79 61 -135 256 -63 109 66 12 -86 -258 103 -223 -227 371 -356 -34
7878c4J14j77L13kr4O8j9k2Q3l17L08j11l25j21L51N6k21K82m29M34j71J31j00
$$ -34 80 -97 216 214 120 188 169 147 230 -87 221 110 -215 -336 15 71 -150 132 -297 137 -34 97 -3
7901cJ61l05L16j81L18k31r4J19k51K36k03M05k55l7l02M77N0j69j41K44l51J16
$$ -3 158 -147 169 -12 306 75 -19 100 -151 85 -118 287 32 -5 -307 170 220 51 -90 154 -197 -81
7923h1J66J5o1Q5J42l66p7K94J74k12J35k87J16M2k54P7M14j79J49l39K68l43
$$ -81 85 100 39 124 266 -100 -177 117 291 79 214 -73 43 85 -169 -92 322 143 292 -47 221 -122
7945a22O8j27J77J29r1q4R2J03n9l48M00l38K24j98J30J14j56K05l5j49J90o2
$$ -122 -54 -181 -4 125 34 -50 42 145 86 -262 138 -200 24 -174 -44 70 -86 119 84 -65 125 63
7967F3N6n07R5K21n9L04k62J31k65Q9k16L98j98K38j00J21k18P1L29j60j60k31
$$ 63 119 -388 -293 -72 -131 173 -89 42 -223 -134 -350 48 -150 88 -12 109 -109 -38 291 131 -29 -260
7989b60m8M45j33j16K78j57J40l2k09K62l6k51m7J61P6k00J61j14K23k41O1j01
$$ -260 -308 137 4 -112 166 9 149 117 -92 170 134 -117 -164 -3 73 -127 34 -80 143 -98 -37 -138
8011a38L18o3O2l2K3J18j7m13j0K06j22nK15J39l61J22K89l76M1J80L5k09L10
$$ -138 180 117 179 147 170 288 271 -142 -152 54 -68 -73 142 281 -80 42 331 -45 -4 176 211 2 312
8034C12m76j07M00L8l68J56mM5m3L78l43m7J69k08k1j67L43p1rq0J38j15Q3j79
$$ 312 -164 -271 129 167 -201 -45 -49 -4 -47 331 -12 -59 110 -98 -119 -286 57 -14 -23 -103 35 -80 3 -176
8058a76L13j18K03j52r2K20l36R7m9J60j52Q8P8l87K82P1L37l80k17M02l80J88
$$ -176 137 19 222 70 -22 198 -138 -41 -90 70 -82 6 84 -303 -21 50 387 7 -210 192 -188 0
8080@p0k21N3M7K25o5L2j43K98j42J7k78K18P9J32o0l15L34J32k77r4K50l67Q5
$$ 0 -70 -291 -238 -191 34 -31 1 -142 156 14 31 -247 -29 50 182 122 -193 141 273 -4 -98 152 -215 -130
8104a30N2O2J78j84Q5k70L46P2o0o8j20K7L01k30j98O3J97k40J40Rq0J89l13N00
$$ -130 -78 -16 162 -22 63 -207 139 211 151 83 -37 -10 291 61 -137 -74 123 -117 23 32 -48 141 -172 328
8128C28j91l59J16J87j05m2K09l60l7K40o5J47l01J80k01K59j93M87l48K73k67
$$ 328 137 -222 -106 81 -24 -66 143 -217 -254 -14 -79 68 -233 -53 -254 5 -188 299 -49 224 -43
8149d3K54k39n8k17lL72j53P4j6l7K34o14K25N3J94j29L2J05j22K74l61M52l79
$$ -43 211 -28 -86 -303 -306 66 -87 -13 -29 -66 168 -446 -221 -168 26 -103 -71 34 -88 186 -175 277 -102
8172a02J68k28J49j71K2J21K8J13k93J20J81k91J14j1J46k27J64M0l3
$$ -102 66 -162 -13 -184 -162 -41 -13 100 -193 -73 108 -183 -69 -80 66 -161 3 43 10
8191A0
$$ Imaginary data points
##PAGE= N=2
##DATA TABLE= (X++(I..I)), XYDATA
0@%%%%%%%Qj6J6j6J6k4L2m0M8n6O7p5Q8j04J23j45J66j92K22k50K84l23L65m13
$$ 0 0 0 0 0 0 0 0 8 -8 8 -8 8 -16 16 -24 24 -32 35 -40 48 -56 67 -78 88 -104 118 -132 152 -171 194 -219
31b19M62n16N78o45P19p99Q87r86J094j212J341j484J644j821K019k245K501k793
$$ -219 243 -273 305 -340 379 -420 467 -519 575 -637 704 -780 864 -957 1062 -1183 1318 -1475
49a475L134l537M021m615N363o341P679r628J2746j8528L2772j28728k22958K58530
$$ -1475 1659 -1878 2143 -2472 2891 -3450 4229 -5399 7347 -11181 21591 -107137 -330095 -71565
63g1565K11492o6983k15832o6220J40380J73096q0568j97752J6670J89888M0547
$$ -71565 139927 72944 -142888 -209108 -68728 104368 23800 -173952 -157282 32606 73153
74G3153j09322p5289M7862J18954M2815j23155p9166J11208R6828p2187p8204
$$ 73153 -36169 -111458 -63596 55358 98173 -24982 -104148 7060 103888 31701 -46503
85d6503J5316N3078N0093j0575p8403k529P5361j5556p3982K3837O6524Q702k6643
$$ -46503 -31187 21891 71984 61409 -16994 -19523 55838 40282 -33700 -9863 56661 65363 38720
98C8720m7128k2955P4914N6586q1041p0461N3439N0420j8003k8260k5955J2745
$$ 38720 -8408 -31363 43551 100137 19096 -51365 2074 52494 34491 6231 -19724 -6979
110f979O1679j9539j00440K658Q9322N681n8163k6308P668N4577N0697o8244r6334
$$ -6979 54700 35161 -65279 -62621 26701 32382 -25781 -52089 -44421 10156 60853 -7391 -103725
123a03725M2808R1088m49l6865k3031j5100L8929M7836l6891m1604K7048J2275
$$ -103725 -60917 30171 29722 -7143 -30174 -45274 -6345 41491 4600 -37004 -9956 2319
135B319j3421J6974o715k9315L7325M2117l9914l6438J2329O722K6298L3908m5268
$$ 2319 -11102 5872 -843 -30158 7167 49284 9370 -27068 -14739 -8017 18281 52189 6921
148F921n1956N1443N6212k3497l3439k3557j2427N1349M5061n2848n0443K7694
$$ 6921 -45035 6408 62620 39123 5684 -17873 -30300 21049 66110 13262 -37181 -9487
160i487K0357n83J3330k8635m4133L0175L5119l0976j3734K2720J655J0237Q689
$$ -9487 10870 10287 23617 -5018 -49151 -18976 16143 -14833 -28567 -5847 -4192 6045 14734
173A4734m7870k0807O6391L0345m8416k5865J2109K3499M3070q912q1123j2249
$$ 14734 -33136 -53943 12448 42793 -5623 -31488 -19379 4120 47190 38278 -42845 -55094
185e5094P7263J9560m6248k0463J812K1196L5616k7367n8751L2503N8342l1721
$$ -55094 22169 41729 -4519 -24982 -23170 -1974 33642 6275 -52476 -19973 38369 6648
197F648m5452J5195K8603K9100P798n7119l0768O7268L8323n3191k5646K7946
$$ 6648 -38804 -23609 4994 34094 41892 -15227 -45995 21273 59596 6405 -19241 8705
209H705J5929N550r988l1244K0680M7834m4518o7864M0952O7165j1817m9113l5281
$$ 8705 24634 30184 20196 -11048 9632 57466 12948 -54916 -13964 53201 41384 -7729 -43010
222d3010J4353P8239K0300j02710n1481Q5824O2280m2061n9980j2143N5147O6042
$$ -43010 -28657 49582 69882 -32828 -84309 1515 63795 21734 -38246 -50389 4758 70800
234G0800m8600j11059K3572J15024P341q8903m8514L2045Q1785L2453r3977q3220
$$ 70800 22200 -88859 -65287 49737 57078 -31825 -80339 -48294 33491 65944 -28033 -111253
246a11253P1683R2162l2755o8573n937M0750M9438q697p3737n854Q5889J7233
$$ -111253 -39570 52592 19837 -48736 -54673 -13923 35515 26818 -46919 -52773 33116 50349
258E0349o9884k1482L9078L4999J2945l3374m7566L1289N8763k7242m6472K0664
$$ 50349 -19535 -41017 -1939 33060 46005 12631 -34935 -3646 55117 27875 -18597 2067
270B067K3870n514l01j0403n969L1190j039n3105L194N4324j436l5242p397J025
$$ 2067 25937 20423 20122 9719 3750 34940 33901 -19204 -16010 38314 36878 1636 -5761 -4736
284d736J5085K5611k7271m4010K5026L2449k7662j7952J6013L031N584L082l6637
$$ -4736 10349 35960 8689 -35321 -10295 22154 -5508 -23460 -7447 -4416 1168 4250 -32387
297c2387j1566M7516J1035l9138n119J5356J108J8061O465l5491o825L2112o83
$$ -32387 -43953 3563 14598 -24540 -29659 -14303 -13195 4866 11331 -24160 -30985 1127 444
310D44j0321J5763q831j8326K4043J5408k1217O74Q224j7453P567K2746j7836
$$ 444 -9877 5886 -2945 -21271 2772 18180 -3037 -2363 5861 -11592 -4025 18721 885
323H85j1378K9314J707k5518L689N636m353K0694K678l7968J30L7535l90j6761
$$ 885 -10493 18821 20528 -4990 -1301 4335 -18 20676 23354 -14614 -14484 23051 22661 5900
337E900l82j4108l758L2040J046l4870K357J9049o832L928M982k5534l082K8772
$$ 5900 5518 -8590 -12348 19692 20738 -14132 -11775 7274 442 4370 9352 -16182 -19264 9508
351I508p027k3023J3515J0309o126Q921r712k8020K1200L6717k0129k7945R220
$$ 9508 2481 -20542 -7027 3282 -2844 6077 -3635 -31655 -10455 26262 6133 -21812 -12592
364a2592J0747J2170J4150k6126k5464L2731K3716k9423j1884J8256N231M676
$$ -12592 -1845 10325 24475 -1651 -27115 5616 29332 -91 -11975 6281 11512 16188
376A6188j238k5952M158L9460j0723m3668R202L1391K65r265j5053j4954K7627
$$ 16188 14950 -11002 -6844 32616 21893 -21775 -12573 18818 19083 9818 -5235 -20189 7438
389G438K3125l9001k6243L7337J9773k6557j7582N12J8533L1395k1062o0336J1184
$$ 7438 30563 -8438 -34681 2656 22429 -4128 -21710 -21198 -2665 28730 7668 -52668 -41484
402d1484O5209K991m6886j9094J5647L5984J8365m6037m2050M5345N0724l1336
$$ -41484 23725 26716 -20170 -39264 -23617 12367 30732 -15305 -57355 -12010 38714 7378
414G378m0924Q944L1372K5238j3111n1811q73O7256J5729n7296k3023L0150L0332
$$ 7378 -33546 -24602 6770 32008 18897 -32914 -33787 33469 49198 -8098 -31121 -971 29361
427B9361Q809k8454l6600K5131M6822k4199m3649J6466L1829m55j5562k2955j734
$$ 29361 38170 9716 -26884 -1753 45069 20870 -22779 -6313 25516 25061 9499 -13456 -15190
440a5190M1285J0484n0207j7159M0921J7014j9945j4841p239J4686K5556j9423
$$ -15190 26095 36579 -13628 -30787 10134 27148 7203 -7638 -14877 -191 25365 5942
452E942l7867K0807L3340k0187k5032P323J2596J2286j125l5493j1329M2252J5437
$$ 5942 -31925 -11118 22222 2035 -22997 -15674 -3078 9208 8083 -27410 -38739 3513 18950
465A8950l3753j0395J5949P070P534l525k1811P649K9838j1256k2596J5289J1670
$$ 18950 -14803 -25198 -9249 -2179 5355 1830 -19981 -12332 17506 6250 -16346 -1057 10613
478A0613p679N200j003j4768J0505J3066j7290m546J5858q426r735J7914J232
$$ 10613 2934 8134 7131 -7637 2868 15934 -1356 -5902 9956 1530 -8205 9709 10941
491A0941j6435K737J576o254J5811P732k4688l777K4291j450j2216N238l093k827
$$ 10941 -5494 -2757 -1181 -7435 8376 16108 -8580 -12357 11934 10484 -1732 3506 413 -2414
505b414J4472n617k1429J4185K0042j6045j2969O864j166M540R940j8508j4193
$$ -2414 12058 6441 -14988 -803 19239 3194 -9775 -2911 -4077 463 10403 -8105 -22298
518b2298K4452J2120j9210l319O766n467P396P561j5969j389K0276n412j4396
$$ -22298 2154 14274 -4936 -8255 -1489 -6956 440 8001 -7968 -9357 10919 5507 -8889
531h889J0350L191r452R210J698j7554M919J5990q191m357Q858r813n458J8315
$$ -8889 1461 4652 -4800 4410 6108 -11446 -6527 9463 1272 -3085 5773 -4040 -9498 8817
545H817m38j7495Q205R416p732L349N676j1543M349J2605j6341r957K2253M993
$$ 8817 8379 -9116 -911 8505 773 4122 9798 -1745 2604 15209 -1132 -11089 11164 16157
559A6157j8972l548L534J065J3413m988k9596M015L1008m634k3210J119Q744Q315
$$ 16157 -2815 -6363 -2829 -1764 11649 6661 -22935 -18920 12088 7454 -15756 -14637 -5893 2422
573B422P303j9905j8672K8394K4449k5116k2714J4081J6528P497p353k7354j077
$$ 2422 9725 -10180 -28852 -458 23991 -1125 -23839 -9758 6770 14267 6914 -20440 -21517
586b1517L8682N087l6836p989K3823J1965k163j5955j7494K1308L2914k0182l4203
$$ -21517 17165 22252 -14584 -22573 1250 13215 11052 -4903 -22397 -1089 31825 11643 -22560
599b2560J4386K9985L133j2296j8749k880L1159J4256l4312j7706K5958J3553
$$ -22560 -8174 21811 24944 12648 -6101 -8981 22178 36434 2122 -15584 10374 23927
611B3927j2752j1040p533O024J9454j0556l0990Q715K6559q788j7732O11M291
$$ 23927 11175 135 -7398 -1374 18080 7524 -23466 -14751 11808 3020 -14712 -14101 -9810
624i810Q143O051j7774j1147K3348J0529k1612l746J4308K153j74k052j3849N930
$$ -9810 -1667 4384 -13390 -24537 -1189 9340 -12272 -16018 -1710 443 269 -1783 -15632 -9702
638i702K1970q744k1658J0037J2371n682J71J0q301P460R553j3179j645J8078
$$ -9702 12268 3524 -18134 -8097 4274 -1408 -1237 -1227 -9528 -2068 7485 -5694 -7339 10739
652A0739k690j3574Q226O504l994M642k047j1081J0342J2787j5234q288J5050
$$ 10739 8049 -5525 2701 9205 5211 9853 7806 -3275 7067 19854 4620 -3668 11382
665A1382M40r837J720j494k563J0614l746j9577Q466J9846r698j4080L757K878
$$ 11382 11822 1985 3705 2211 -352 10262 6516 -13061 -4595 15251 5553 -8527 -4770 -1892
679a892L919O242j3565j0654J9887R936k0348p803J0736M710K729l536j8365J971
$$ -1892 2027 8269 -5296 -15950 3937 13873 -6475 -14278 -3542 1168 3897 361 -18004 -16033
693a6033K5723j489k2876L8J1452L150L872n271j4672R916J9827q713j3038Q827
$$ -16033 9690 8201 -14675 -14637 -3185 -35 3837 -1434 -16106 -6190 13637 4924 -8114 713
707G13N288k479L710o065q065J4874Q590j7414n292J1329j089k306M130r071n955
$$ 713 6001 3522 7232 1167 -6898 7976 16566 -848 -6140 5189 4100 1794 5924 -3147 -9102
722i102J4313J050j3354L688P274n480K870L712j0836P26J5417l836j1781N431
$$ -9102 5211 6261 -7093 -3405 3869 -1611 1259 4971 -5865 -5139 10278 6442 -5339 92
736I2L363j688P086n351j6703Q160J7144q595j2365J634J358M037O555j2634j0398
$$ 92 3455 1767 8853 3502 -13201 -5041 12103 3508 -8857 -7223 -5865 -1828 4727 -7907 -18305
751a8305J7687Q750j7803n591J2955N942J459m536j3775O839K3826n847k3107
$$ -18305 -618 8132 -9671 -15262 -2307 3635 5094 558 -13217 -6378 17448 11601 -11506
764a1506N670J6997J461n496r124n999J6289J2626k0571j4180J8232J1065r981
$$ -11506 -5836 11161 12622 7126 -1998 -7997 8292 20918 347 -13833 4399 15464 5483
777E483p980m126N070J7308j967k5104m50K1276J790j0189k506k705M354J0146
$$ 5483 -2497 -6623 -1553 15755 13788 -11316 -11766 9510 11300 1111 -1395 -4100 254 10400
791A0400r477j4611J1046J2304j1604p725M821j28L320L566j2459m178J6145K062
$$ 10400 923 -13688 -2642 9662 -1942 -9667 -4846 -4974 -1654 1912 -10547 -14725 1420 3482
805C482j3597J552O731k813L733K313p937K918Q968q609n206J3504K118j0609
$$ 3482 -10115 -8563 -1832 -4645 -912 1401 -6536 -3618 5350 -3259 -8465 5039 7157 -3452
819c452J831M115l161M374O83r735N974J2528j0473j1180J1139P945m377k151
$$ -3452 -1621 2494 -667 3707 4390 -5345 629 13157 2684 -8496 2643 10588 6211 4060
833D060n440j864J5125L610j9051l516J6689K350q323l157l316K776J0434p263
$$ 4060 -1380 -3244 11881 15491 -3560 -7076 9613 11963 3640 483 -2833 -57 10377 3114
847C114j4063J0165J0931j1438q171M901K218L381J890j2019m001J6071J852j4266
$$ 3114 -10949 -784 10147 -1291 -9462 -4561 -2343 1038 2928 -9091 -13092 2979 4831 -9435
861i435J131R167q30j298k269o558P710J2647j1152j2335J0307Q553m764k678
$$ -9435 -8304 863 33 -1265 -3534 -10092 -2382 10265 -887 -13222 -2915 5638 874 -1804
875a804l789k839J2774O414j5650n408J3184K837n188N48k485P31J0044k966j3769
$$ -1804 -5593 -8432 4342 10756 -4894 -10302 2882 5719 531 1079 -1406 -675 9369 6403 -7366
890g366O367J3237m849o580L14l089M464R053p841j0145Q033N155o599K19J262
$$ -7366 -999 12238 7389 809 1123 -1966 2498 11551 3710 -6435 1598 6753 154 373 1635
905A635n890L107O637o982m251O859j800m321O536j130q190O413N069p942j758
$$ 1635 -4255 -1148 5489 -1493 -5744 1115 -685 -5006 1530 400 -7790 -1377 3692 -4250 -6008
920f008M639j644K339N652q897o870J0542M801o915K51J734l271M792L614q824
$$ -6008 -1369 -3013 -674 4978 -3919 -10789 -247 4554 -2361 -2110 -376 -3647 1145 4759 -4065
935d065P55R738l681o772O334K272m427K502m20m143O509L405j0482j045J0125
$$ -4065 -3310 6428 2747 -4025 2309 4581 154 2656 2236 -1907 4602 8007 -2475 -3520 6605
950F605j931o178L099K99j177M402n187q214Q778R532r850p073M567J731J557
$$ 6605 4674 -1504 1595 1894 717 5119 -68 -8282 496 10028 178 -6895 -2328 -597 960
965I60J915p872l786J1889J002j1458P59P738j925o04L95o005L458R402o751q220
$$ 960 2875 -4997 -8783 3106 4108 -7350 -6591 1147 -778 -1382 -987 -6992 -3534 5868 -883 -9103
981i103Q352M477n166R11J060m377L981M129o992J51R140m801p155O309M174l259
$$ -9103 -751 3726 -1440 -529 531 -3846 135 4264 -2728 -2577 6563 1762 -5393 916 5090 1831
997A831J106k329m426Q163N079j0361l507R904J056n721j03j947J397Q498m364
$$ 1831 2937 608 -3818 4345 9424 -937 -4444 5460 6516 795 692 -1255 142 8640 4276
1012D276j2684N357J2103m403q145j038Q78N999N062j0900p738J1426O493r516
$$ 4276 -8408 -3051 9052 4649 -3496 -4534 -3656 2343 7405 -3495 -11233 193 6686 -2830
1026b830k915L993Q43K811r91q723K935J1726m185j0797M296O384k279l9k681
$$ -2830 -5745 -1752 -909 1902 911 -7812 -4877 6849 2664 -8133 -3837 2547 268 229 -2452
1041b452l696O635N019r828k902J0526L35p124M29J630J844N456l766r732O186
$$ -2452 -6148 487 5506 -4322 -7224 3302 3637 -3487 -3058 -1428 416 5872 2106 -7626 -1440
1056a440J1121n386o984L134J373K052K894o836m595R930L476j0018j655N378
$$ -1440 9681 4295 -2689 445 1818 3870 6764 -72 -4667 5263 8739 -1279 -2934 2444
1070B444l74M80K09o814L66J0565k554r517K656L597k037K263P2o626L070N841
$$ 2444 2070 2550 2759 -4055 -3689 6876 4322 -5195 -2539 1058 -979 1284 1356 -5270 -2200 3641
1086C641n555l688N953j21l845L279j373m188M668L142o222L81N199l998j075
$$ 3641 -1914 -5602 351 230 -3615 -336 -1709 -5897 -1229 1913 -4309 -3928 1271 -2727 -3802
1101c802N757k452k929M866J84l086M833R76o309J784N568l139j296M148m039
$$ -3802 1955 -497 -3426 1440 1624 -1462 3371 4347 -1962 -178 5390 2251 955 5103 1064
1116A064k387N596n81m521L133Q56n266K052L793n099n52M787k530k665L842k190
$$ 1064 -1323 4273 3692 -829 2304 3160 -2106 -54 3739 -1360 -1912 2875 345 -2320 1522 -668
1132f68k651N556O99p409J902N405k825j819R99l462J567O826m539p280M660M138
$$ -668 -3319 2237 2936 -4473 -2571 2834 9 -1810 -811 -4273 -2706 4120 -419 -7699 -3039 1099
1148A099l422N30O85l046L460L422o688q63Q737m87n027J800R93j116M063o61
$$ 1099 -2323 -1793 -1108 -4154 -694 2728 -3960 -4823 3914 3427 -1600 200 1193 77 4140 3479
1164C479n459L434N388n549k732M893q88k800K610j359k421M809j042p268L366
$$ 3479 -1980 1454 6842 1293 -1439 3454 2566 -234 2376 1017 -1404 3405 2363 -4905 -1539
1179a539O641m140l449K382o18M78L157m175l543P873K174q635p90M799N8L54
$$ -1539 5102 962 -2487 -105 -723 -245 2912 -1263 -4806 3067 5241 -3394 -4184 615 673 1027
1195A027n93n559J382P961l416p819L748M789j847r27j212k547N214M344p417
$$ 1027 434 -5125 -3743 4218 802 -7017 -3269 1520 -327 -1254 -2466 -5013 201 4545 -2872
1210b872k783Q837J552n812q60R70J879M992k779q924M016Q554m411n815K577
$$ -2872 -5655 3182 4734 -1078 -1938 -968 911 5903 3124 -5800 -1784 6770 2359 -3456 -879
1225h79K155J195J178o876k352R724L283r629k387O386K059n38k147m957L059
$$ -879 1276 2471 3649 -3227 -5579 4145 7428 -2201 -4588 1798 3857 3319 1172 -3785 -726
1240g26Q754l861r158L332N928k241k314j545j799M618L323q234l779P807K876
$$ -726 8028 4167 -4991 -1659 4269 2028 -286 -1831 -3630 988 4311 -3923 -7702 105 2981
1255B981n052p92j01k10M412M61o695K060O000k932l494K858K76m80L180k817
$$ 2981 -2071 -2863 -2964 -3174 1238 1699 -4996 -2936 3064 132 -3362 -504 -228 -708 2472 -345
1271c45l479M683L050o137j069M558q23l45K011l791p81N968o24m816L137L070
$$ -345 -3824 859 3909 -2228 -3297 1261 438 93 2104 -1687 -2468 3500 2876 -1940 1197 4267
1287D267l643N64J844k436J030L518l475k753L964k79l753K655P13l837R29J661
$$ 4267 624 1188 3032 596 1626 5144 1669 -1084 2880 2601 -1152 1503 2216 -1621 -692 969
1303I69l629L47L158l256j367M352j225l374K829R35k747K460R00l206J527K888
$$ 969 -2660 -2313 845 -2411 -3778 574 -651 -4025 -1196 -261 -3008 -548 352 -2854 -1327 1561
1319A561l477j074M427r98k247K150k32k642L035J932m412J246L521l092j211
$$ 1561 -1916 -2990 1437 439 -1808 342 110 -2532 503 2435 -1977 -731 2790 -302 -1513
1334a513L732q00k074L091n38k460L157N99l945K023L528l794j602K842j554m29
$$ -1513 2219 1419 -655 2436 1898 -562 2595 3194 -751 1272 4800 1006 -596 2246 692 263
1350B63K470l151k717M822P65n095r7K744r26N71R26m358K31N591j483m820K716
$$ 263 2733 -418 -3135 1687 2452 -2643 -2740 4 -922 -351 575 -3783 -3552 2039 556 -4264 -1548
1367a548K560j890M19k60k541L565L222n443k655N229J323k903j36o62l59M510
$$ -1548 1012 -878 -459 -719 -3260 305 3527 -1916 -4571 658 1981 -922 -1058 -1720 -2079 2431
1383B431l64o179J954N815j947l208J539L76J435J994l848l587O303L392n623
$$ 2431 2067 -4112 -2158 3657 1710 -1498 41 417 1852 3846 -2 -3589 2714 6106 483
1398D83k669K946J003P47p68m634J154O033j700o224J354M306r27r34j276k394
$$ 483 -2186 760 1763 2510 1742 -2892 -1738 4295 2595 -3629 -2275 2031 1104 170 -1106 -3500
1414c500M186L524n538l713N414K167k694o79j189r4M138j85n793J149N114j936
$$ -3500 686 4210 -1328 -5041 373 2540 -154 -833 -2022 -2116 2022 1837 -3956 -2807 2307 371
1430C71k899J228K8J30K579k209l170M031K501l890n50L035p85l37J371k358j6
$$ 371 -2528 -1300 -1272 -1142 1437 -772 -3942 89 2590 -1300 -1850 1185 400 63 1434 -924 -940
1447i40M023j198m171K744K664k266o10R26j620J726K475l870j645L701O64l515
$$ -940 3083 1885 -2286 458 3122 856 246 1172 -448 1278 3753 -117 -1762 1939 2603 -912
1463i12O97Q29j009K066Q4l640Q04L631k007k287J613j3p95J659p09l073K482
$$ -912 -215 614 -395 1671 1755 -1885 -1081 2550 543 -1744 -131 -144 -939 720 11 -3062 -580
1480e80J693l331L16K242j868m00K125j492r61K841m45k917K330J765k465O33
$$ -580 1113 -2218 -1902 340 -1528 -1928 197 -1295 -2256 585 140 -2777 -447 1318 -1147 -514
1496e14J640j623J78K192j510j473K835k0k646K146Q07k119J074J438k661K08
$$ -514 1126 -497 -319 1873 363 -1110 1725 1705 -941 1205 2012 -107 967 2405 -256 -48
1512d8K174j438p47J532j050j499K773K24l202J100J611j689k25J340k155J63
$$ -48 2126 688 -59 1473 423 -1076 1697 1921 -1281 -181 1430 -259 -484 856 -1299 -1136
1528a136K962j840l259K755J274j843K76l6j681K432J753l897r91L859J65j967
$$ -1136 1826 -14 -3273 -518 756 -1087 -811 -847 -2528 -96 1657 -2240 -3231 628 793 -1174
1544a174N85n93k22K837jl808J281L477j843j722J491m12L23J956k060k064L646
$$ -1174 -589 -1182 -1404 1433 1432 -2376 -1095 2382 539 -1183 308 -104 219 2175 115 -1949 1697
1561A697J030l230k11K202m92q1N45k201J53L516j374l380J880J730r95p97n4
$$ 1697 2727 -503 -714 1488 996 915 1460 -741 -588 2928 1554 -1826 54 1784 789 -8 -62
1578f2j541K533J779l800j657M001K44k206j17k86L36K378p77m262J630L871j762
$$ -62 -1603 930 2709 -1091 -2748 1253 1497 -709 -826 -1112 -776 1602 825 -3437 -1807 2064 302
1595C02k232N07N62J035Q61k102k102L853J570l495p70K238K80J27j58j997J114
$$ 302 -1930 -1423 -861 174 1035 -1067 -3169 684 2254 -1241 -2011 227 507 634 476 -1521 -407
1612d07L144j374l595J705K742j183l97o65r06K427J509l565j340L761P5k202
$$ -407 2737 1363 -2232 -527 2215 1032 635 -30 -936 1491 3000 -565 -1905 1856 1931 -271
1628b71j65L41J82J891r97l089J349L170j761k615J648M90J57N41j858j577K940
$$ -271 -436 -95 87 1978 981 -2108 -759 2411 650 -1965 -317 173 330 871 -987 -2564 376
1645C76J176l299o40K224Q6l87K00j442M8L233q58l380J934J558q90ol00n73J154
$$ 376 1552 -1747 -2387 -163 -77 -464 -264 -1706 -1658 1575 717 -2663 -729 829 -61 -67 -367 -940 214
1664B14J869k420j233K942j04j573R46k7p80J177M86k048L75J954j383j037J537
$$ 214 2083 -337 -1570 1372 1268 -305 641 614 -166 1011 1497 -551 -176 1778 395 -642 895
1681H95j7q78J057n05j573J751O97k046J39J286q21p80J416j238p82K132o98j645
$$ 895 878 0 1057 552 -1021 730 1427 -619 -480 806 -15 -795 621 -617 -1399 733 35 -1610
1699a610J084M09j037N71L85j095N17J232j012r11J519J28j206J363j29j359J174
$$ -1610 -526 -117 -1154 -583 -198 -1293 -776 456 -556 -1467 52 180 -1026 337 208 -1151 23
1716B3J373j934j42J371m54m02J094r95n10J803%j909Q06R15p66k7N23j144J36
$$ 23 1396 -538 -680 691 237 -165 929 -66 -576 1227 1227 -682 124 1039 273 246 769 -375 -239
1735b39K217j432j505J694N52j309J4K77p95J507j2k114K9K237p76j639O67L80
$$ -239 1978 546 -959 735 1287 -22 -8 269 -526 981 969 -1145 -1116 1121 345 -1294 -627 -247
1753b47j43Q34r74j981K027J918k191j176J674L26J32J42j430m86K676M23k567
$$ -247 -390 444 -530 -2511 -484 1434 -757 -1933 -259 67 199 341 -1089 -1575 1101 1524 -1043
1770a043R5J593j05j05k86j079O44J863j237k003J532J550j173J95o55l74J787
$$ -1043 -948 645 540 435 149 -930 -286 1577 340 -1663 -131 1419 246 441 -214 -588 1199
1787A199P60k269p31K286O1j224O9j55K97J012r13j809J148J931j263j308N86
$$ 1199 1959 -310 -1041 1245 1306 82 151 -4 293 1305 392 -1417 -269 1662 399 -909 -323
1804c23K14R5L34r90j034J999N10k072J3J298o8j04qj246O08J899j177j652J466
$$ -323 -109 -14 320 -670 -1704 295 805 -1267 -1254 44 -24 -128 -136 -1382 -774 1125 -52 -1704 -238
1823b38R43q07l43L03q41J404Q57k048k35J877j75j012M28K08j64R35m27j423
$$ -238 705 -102 -445 -142 -983 421 1278 -770 -1005 872 697 -315 113 321 157 1092 665 -758
1841g58J043J565j536o30J558n00n25O52r68m70J253K24j848M50J194n76n30L65
$$ -758 285 1850 314 -316 1242 742 217 869 -99 -569 684 908 -940 -490 704 128 -402 -37
1859c7o04J24J080q02j397J524Q00j602M50N0o62R04N99j124o36K065n17r81M64
$$ -37 -641 -517 563 -239 -1636 -112 688 -914 -464 -414 -1076 -172 427 -697 -1333 732 215 -766 -302
1878c02m28L26Q05L2j596O44J392n62p90P60j97p0J079o95j178J290Q01r47k63
$$ -302 -730 -404 401 433 -1163 -519 873 311 -479 281 84 14 1093 398 -780 510 1311 364 101
1897A01P30o94N64O56j351o71J819m15j312L71J23k76P90k58j507R78J287q83
$$ 101 831 137 701 1357 6 -665 1154 739 -573 -202 -79 -355 435 177 -1330 -352 935 52
1915E2j133P57K00j37O60r06j057K052N57j943o28J547K55l51L06j523K73K092
$$ 52 -1081 -324 -124 -261 399 -507 -1564 488 1045 -898 -1526 21 276 -75 231 -1292 -1019 1073
1933A073o23k252Q27J429l71M5m93q95J881J019k073p14J929P39r90p33J58Q4
$$ 1073 450 -1802 -975 454 83 128 -365 -1260 621 1640 -433 -1147 782 1521 531 -202 -44 40
1951D0J263j13k002L22J672j35j156J66j96N45O20r72j247J510Q78j193p71N12
$$ 40 1303 1190 -812 -490 1182 1047 -109 57 -139 406 1026 54 -1193 317 1195 2 -769 -257
1969b57M31J03J4j167j50J590J1j978P11N04r2J14o8r16O33J538j591q14J370
$$ -257 174 277 291 -876 -1026 564 575 -1403 -692 -188 -280 -166 -234 -1150 -517 1021 -570 -1384 -14
1988a4M95j019J90P8o54J316L43j732N14J655n39j061N51j02L81L88n62j086J289
$$ -14 481 -538 -348 -270 -924 392 735 -997 -483 1172 633 -428 123 21 402 790 228 -858 431
2007D31R37j429n70J284k71K41l3r95K01J366k45j806N67J371q43j27r9n17L72
$$ 431 1368 -61 -631 653 382 623 590 -405 -204 1162 917 -889 -322 1049 206 79 -20 -537 -165
2026a65R57j182j084J449O07j170j15J28m47J246J30j709RJ648l51q24M57q3M92
$$ -165 792 -390 -1474 -25 582 -588 -703 -575 -1022 224 354 -1355 -1346 302 -49 -873 -416 -499 -7
2045gP56j076j179J567J271j066q81N42L76L22L86j356n44K017J39k029L07P88
$$ -7 749 -327 -1506 61 1332 266 -615 -73 303 625 1011 -345 -889 1128 1267 -762 -455 333
2063C33K94J75j93j172L61J759p10j801Q29P16l29K55n34j108J196J104j331p35
$$ 333 627 802 609 -563 -202 1557 847 -954 -125 591 262 517 -17 -1125 71 1175 -156 -891
2081h91J128k66k11K46r69k61J689K33k223M17J059J8k14j4r23M14J803j143j206
$$ -891 237 -29 -240 6 -963 -1224 465 698 -1525 -1108 -49 -31 -245 -259 -1182 -768 1035 -108 -1314
2100a314Q16J234n71n33K15o85J043Q80j571k22J596J55r03K43k64j11J120k66
$$ -1314 -498 736 165 -368 -153 -838 205 1085 -486 -708 888 1043 140 383 119 8 1128 862
2118H62j356M82J308n83r06L97j36K15J064j414q04J316R20j747m44J206l19J25
$$ 862 -494 -12 1296 713 -193 204 68 283 1347 -67 -871 445 1365 -382 -826 380 61 186
2136A86O1j116P7J436m84j292O61M98M3j0l22q93R58Q33j326n95J260K61p02L86
$$ 186 247 -869 -792 644 160 -1132 -471 27 70 60 -262 -1155 -197 636 -690 -1285 -25 236 -466 -80
2156h0p5n90J345m11j199O17J648j046j076Q68o6L93L40o08o92J542L33j556k37
$$ -80 -155 -745 600 189 -1010 -393 1255 209 -867 1 -65 328 668 60 -632 910 1243 -313 -550
2175e50J022j53M18l3j414K75J715q15j263P41J135q37j34q0q77J246N69j616
$$ -550 472 319 737 704 -710 -435 1280 465 -798 -57 1078 241 107 27 -850 396 965 -651
2193f51l50J389K72j222K27j61J3P96l83j195L27J762p39j385J007J22j74J088
$$ -651 -1001 388 660 -562 -335 -496 -483 313 -70 -1265 -938 824 85 -1300 -293 -171 -345 743
2211G43j103r71J265R49j073o15J107M7j34K56j073J98J613l22j409J13J328o7
$$ 743 -360 -1331 -66 883 -190 -805 302 349 215 471 -602 -404 1209 887 -522 -409 919 852
2229H52j46m64r85J106J016j145j080J099M17n60M42p24m37R47P08j827q9J580
$$ 852 706 242 -743 363 1379 234 -846 253 670 110 552 -172 -609 338 1046 -781 -870 710
2247G10k90n72j03k11j0J015j11j797R89J137r20m10J72l38P40Q29j343p89J441
$$ 710 420 -152 -255 -466 -476 539 428 -1369 -380 757 -163 -573 -401 -739 1 830 -513 -1302 139
2266A39N02j226J25Q26m62M03J42j158j59J713m90j006Q17j31J26M52j15j237
$$ 139 641 -585 -460 366 -96 307 449 -709 -868 845 355 -651 166 35 161 613 498 -739
2284g39J104J053j299l99Q69l23K1O76o24j098J631J7j072j36P54m22J19K41j074
$$ -739 365 1418 119 -280 589 266 287 963 339 -759 872 889 -183 -319 435 13 132 373 -701
2303g01K79R20n20r97O61O42o57j95K59p95Q13R13j340n64J611Np87M88j07r84
$$ -701 -422 498 -22 -1019 -358 284 -373 -568 -309 -1104 -291 622 -718 -1282 329 334 -453 35 -72 -1056
2323a056J185J07j180M01J183o79m83O15m16L33P52q14r72J452K52p38k45J425
$$ -1056 129 236 -944 -543 640 -39 -522 93 -323 10 762 -52 -1024 428 680 -58 -303 1122
2341A122q05M7j7m23J77J230n24j551Q39J032q34m01J99n78P93P44j513p58J722
$$ 1122 317 364 347 -76 101 1331 807 -744 95 1127 293 -108 91 -487 306 1050 -463 -1221 501
2360E01J05r66j21K82k36O57m49q89P04J071q46j044P95M18k15L27o71r69J587
$$ 501 606 -360 -481 -199 -435 222 -227 -1116 -412 659 -187 -1231 -436 -18 -233 94 -577 -1546 41
2379D1P48j696n4J141p3Q2L4j052N08J399m84j647J413M12k09k64P7p98J014J054
$$ 41 789 -907 -961 180 107 189 223 -829 -321 1078 594 -1053 360 772 563 299 376 -422 592 1646
2399A646j465j259J849L38j040k9r1j01P06K76j709j06J845q8j497M29k44J69
$$ 1646 181 -1078 771 1109 69 40 -51 -152 554 830 -879 -985 860 772 -725 -296 -540 -371
2417c71J071p62j203J131R26j120k16J96K4J79O17j146o12J256P32j402J71J91
$$ -371 700 -62 -1265 -134 792 -328 -544 -348 -324 -145 472 -674 -1286 -30 702 -700 -529 -338
2435c38l29J155O8j492R2J644m78r73O35L62j5N83m27r65O05J328j254m96Q60
$$ -338 -667 488 556 -936 -844 800 322 -651 -16 346 331 914 487 -478 127 1455 201 -295 565
$$ [...]
8191G1
##END NTUPLES=NMR FID
##END=
