##TITLE=1H_EC-3099(II-3)
 CDCl3, 8 sc, 
 2.8.2019
##JCAMPDX= 6.0         $$ Bruker NMR JCAMP-DX V2.0
##DATA TYPE= NMR FID
##DATA CLASS= NTUPLES
##ORIGIN= UXNMR, Bruker Analytische Messtechnik GmbH
##OWNER= root
$$ XWIN-NMR		Version 3.5
$$ Fri Aug  2 14:54:16 2019 Russian Standard Time (UT+4h)  she@DPX200
##.OBSERVE FREQUENCY= 200.13155
##.OBSERVE NUCLEUS= ^1H
##.DELAY= (6, 6)
##.ACQUISITION MODE= SIMULTANEOUS
##.ACQUISITION SCHEME= undefined
##.AVERAGES= 8
##.DIGITISER RES= 18
##SPECTROMETER/DATA SYSTEM= spect
##.PULSE SEQUENCE= zg30
##.SOLVENT NAME= DMSO
##.SHIFT REFERENCE= (INTERNAL, DMSO, 0, 15.7039)
##AUDIT TRAIL= $$ (NUMBER, WHEN, WHO, WHERE, WHAT)
$$ ##TITLE= Audit trail, XWIN-NMR		Version 3.5
$$ ##JCAMPDX= 5.01
$$ ##ORIGIN= Bruker BioSpin GmbH
$$ ##OWNER= she
$$ F:/spectra/data/she/nmr/H-F/1/audita.txt
$$ ##AUDIT TRAIL=  $$ (NUMBER, WHEN, WHO, WHERE, WHAT)
(   1,<2019-08-02 14:53:18.31 +0400>,<she>,<DPX200>,
      <created by zg, POWCHK disabled, PULCHK disabled
       configuration hash MD5:
       00 E9 B6 7A A2 85 ED C7 34 08 36 98 17 FE 4E 26
       data hash MD5: 16K
       3C 12 44 F8 46 F5 43 62 E8 8D C8 D5 46 31 C6 D7>)
$$ ##END=
$$ 
$$ hash MD5
$$ ED 9D 61 3B 06 49 D7 7E 5A 05 F2 A5 3C 66 55 CC
##$RELAX= 
##$RELAX= 
##$RELAX= 
##$RELAX= 
##$RELAX= 
##$RELAX= 
$$ Bruker specific parameters
$$ --------------------------
##$DU= <F:/spectra>
##$EXPNO= 1
##$NAME= <H-F>
##$PROCNO= 1
##$TYPE= <nmr>
##$USER= <she>
##$AMP= (0..31)
100 100 100 100 100 100 100 100 100 100 100 100 100 100 100 100 100 100 
100 100 100 100 100 100 100 100 100 100 100 100 100 100 
##$AQSEQ= 0
##$AQ_mod= 1
##$AUNM= <au_zg>
##$AUTOPOS= <>
##$BF1= 200.13
##$BF2= 200.13
##$BF3= 200.13
##$BF4= 200.13
##$BF5= 200.13
##$BF6= 200.13
##$BF7= 200.13
##$BF8= 200.13
##$BYTORDA= 1
##$CFDGTYP= 0
##$CFRGTYP= 5
##$CHEMSTR= <none>
##$CNST= (0..31)
1 1 145 1 1 1 1 1 1 1 1 1 1 1 1 1 1 1 1 1 1 1 1 1 1 1 1 1 1 1 1 1 
##$CPDPRG= <>
##$CPDPRG1= <>
##$CPDPRG2= <>
##$CPDPRG3= <>
##$CPDPRG4= <mlev>
##$CPDPRG5= <mlev>
##$CPDPRG6= <mlev>
##$CPDPRG7= <mlev>
##$CPDPRG8= <mlev>
##$CPDPRGB= <>
##$CPDPRGT= <>
##$D= (0..31)
0 1.2 0 0 0 0 0 0 0 0 0 0.03 0 0 0 0 0 0 0 0 0 0 0 0 0 0 0 0 0 0 0 0 
##$DATE= 1564743197
##$DBL= (0..7)
120 120 120 120 120 120 120 120 
##$DBP= (0..7)
150 150 150 150 150 150 150 150 
##$DBP07= 0
##$DBPNAM0= <>
##$DBPNAM1= <>
##$DBPNAM2= <>
##$DBPNAM3= <>
##$DBPNAM4= <>
##$DBPNAM5= <>
##$DBPNAM6= <>
##$DBPNAM7= <>
##$DBPOAL= (0..7)
0.5 0.5 0.5 0.5 0.5 0.5 0.5 0.5 
##$DBPOFFS= (0..7)
0 0 0 0 0 0 0 0 
##$DE= 6
##$DECBNUC= <off>
##$DECIM= 24
##$DECNUC= <off>
##$DECSTAT= 4
##$DIGMOD= 1
##$DIGTYP= 9
##$DL= (0..7)
0 120 120 120 120 120 120 120 
##$DP= (0..7)
150 150 150 150 150 150 150 150 
##$DP07= 0
##$DPNAME0= <>
##$DPNAME1= <>
##$DPNAME2= <>
##$DPNAME3= <>
##$DPNAME4= <>
##$DPNAME5= <>
##$DPNAME6= <>
##$DPNAME7= <>
##$DPOAL= (0..7)
0.5 0.5 0.5 0.5 0.5 0.5 0.5 0.5 
##$DPOFFS= (0..7)
0 0 0 0 0 0 0 0 
##$DQDMODE= 0
##$DR= 18
##$DS= 0
##$DSLIST= <SSSSSSSSSSSSSSS>
##$DSPFIRM= 0
$$ [...]
##$SUBNAM2= <"">
##$SUBNAM3= <"">
##$SUBNAM4= <"">
##$SUBNAM5= <"">
##$SUBNAM6= <"">
##$SUBNAM7= <"">
##$SUBNAM8= <"">
##$SUBNAM9= <"">
##$SW= 24.9336996594482
##$SWIBOX= (0..15)
0 0 2 0 0 0 0 0 0 0 0 0 0 0 0 0 
##$SW_h= 4990.01996007984
##$TD= 16384
##$TD0= 1
##$TE= 0
##$TE2= 300
##$TE3= 300
##$TEG= 300
##$TL= (0..7)
0 120 120 120 120 120 120 120 
##$TP= (0..7)
150 150 150 150 150 150 150 150 
##$TP07= 0
##$TPNAME0= <>
##$TPNAME1= <>
##$TPNAME2= <>
##$TPNAME3= <>
##$TPNAME4= <>
##$TPNAME5= <>
##$TPNAME6= <>
##$TPNAME7= <>
##$TPOAL= (0..7)
0.5 0.5 0.5 0.5 0.5 0.5 0.5 0.5 
##$TPOFFS= (0..7)
0 0 0 0 0 0 0 0 
##$TUNHIN= 0
##$TUNHOUT= 0
##$TUNXOUT= 0
##$USERA1= <user>
##$USERA2= <user>
##$USERA3= <user>
##$USERA4= <user>
##$USERA5= <user>
##$V9= 5
##$VALIST= <valist>
##$VCLIST= <CCCCCCCCCCCCCCC>
##$VD= 0
##$VDLIST= <DDDDDDDDDDDDDDD>
##$VPLIST= <PPPPPPPPPPPPPPP>
##$VTLIST= <TTTTTTTTTTTTTTT>
##$WBST= 1024
##$WBSW= 4
##$XGAIN= (0..3)
0 0 0 0 
##$XL= 0
##$YL= 0
##$YMAX_a= 321795
##$YMIN_a= -614066
##$ZGOPTNS= <>
##$ZL1= 120
##$ZL2= 120
##$ZL3= 120
##$ZL4= 120
##$ABSF1= 10
##$ABSF2= 0
##$ABSG= 5
##$ABSL= 3
##$ALPHA= 0
##$AQORDER= 0
##$ASSFAC= 0
##$ASSFACI= 0
##$ASSFACX= 0
##$ASSWID= 0
##$AUNMP= <proc_1d>
##$AZFE= 0.1
##$AZFW= 0.1
##$BCFW= 1
##$BC_mod= 2
##$BYTORDP= 1
##$COROFFS= 0
##$CY= 11.3945322036743
##$DATMOD= 1
##$DC= 2
##$DFILT= <>
##$DTYPP= 0
##$F1P= 20.1537800932815
##$F2P= 0.134698688090026
##$FCOR= 0.5
##$FTSIZE= 0
##$FT_mod= 4
##$GAMMA= 1
##$GB= 0.15
##$INTBC= 1
##$INTSCL= 1
##$ISEN= 128
##$LB= 0.24
##$LEV0= 0
##$LPBIN= 0
##$MAXI= 10000
##$MC2= 0
##$MEAN= 0
##$ME_mod= 0
##$MI= 1.114404
##$NCOEF= 0
##$NC_proc= 0
##$NLEV= 6
##$NOISF1= 3.799351
##$NOISF2= 2.8
##$NSP= 1
##$NTH_PI= 0
##$NZP= 0
##$OFFSET= 15.70392
##$PC= 1
##$PHC0= -9216.136
##$PHC1= 9.600969
##$PH_mod= 1
##$PKNL= yes
##$PPARMOD= 0
##$PSCAL= 0
##$PSIGN= 0
##$REVERSE= no
##$SF= 200.130013532006
##$SI= 16384
##$SIGF1= 3
##$SIGF2= 2
##$SINO= 400
##$SIOLD= 16384
##$SREGLST= <1H.CDCl3>
##$SSB= 0
##$STSI= 0
##$STSR= 0
##$SW_p= 3612.71676300578
##$SYMM= 0
##$S_DEV= 0
##$TDeff= 0
##$TDoff= 0
##$TI= <>
##$TILT= no
##$TM1= 0
##$TM2= 0
##$TOPLEV= 0
##$USERP1= <user>
##$USERP2= <user>
##$USERP3= <user>
##$USERP4= <user>
##$USERP5= <user>
##$WDW= 1
##$XDIM= 8192
##$YMAX_p= 0
##$YMIN_p= 0
$$ End of Bruker specific parameters
$$ ---------------------------------
##NTUPLES= NMR FID
##VAR_NAME=  TIME,          FID/REAL,        FID/IMAG
##SYMBOL=    X,             R,               I
##VAR_TYPE=  INDEPENDENT,   DEPENDENT,       DEPENDENT
##VAR_FORM=  AFFN,          ASDF,            ASDF
##VAR_DIM=   8192,          8192,            8192
##UNITS=     SECONDS,       ARBITRARY UNITS, ARBITRARY UNITS
##FACTOR=    0.0002004,     1,               1
##FIRST=     0,             0,               0
##LAST=      1.6414764,     0,               0
##MIN=       0,             -614066,         0
##MAX=       1.6414764,     321795,          0
$$ Real data points
##PAGE= N=1
##DATA TABLE= (X++(R..R)), XYDATA
$$ [...]
2612B342K961l736m101o24K090K628J27l415j81L455J417k992k940q19K308M605
2628C125Q07m104k807O33J022J846R82j585j206J317Q90j268j057l6L30L176J681
2645C746k236l754p06J278L499K433k391l876M71J996O62m73j585n47L209K533
2661D259k803m728l74K983L538J876l492m596L09L265J257q64j078r54J951K154
2677B703k513l921K6L234L144J028l176m639L31L500J968m14j336j077O60J700
2693A218j016k893Q76K520J770L98j805m314l00L416K704O12j581k816j491L052
2709C50J252j723j177J452J488J474k012m678p40M415M170o71l531l327J02L551
2725C95J974k468j515J628J410k52j829k895J14M718K291j733k143k506m55K645
$$ plain form
2612 2342 5303 1567 -2534 -3158 -1068 1560 1687 -1728 -1909 1546 2963 -29 -2969 -3788 -1480 3125
2628 3125 3932 -172 -2979 -2346 -1324 522 1504 -81 -1287 30 920 -348 -1405 -1441 -1111 2065 3746
2645 3746 1510 -2244 -2950 -1672 1827 4260 1869 -2007 -1536 460 1122 649 -936 -1483 1726 4259
2661 4259 1456 -3272 -3646 -663 2875 4751 1259 -3337 -3028 237 1494 630 -448 -1402 549 2703
2677 2703 190 -3731 -3705 -471 2673 3701 525 -4114 -3783 -283 1685 1271 -65 -1142 -482 1218
2693 1218 202 -2691 -1815 705 2475 2873 1068 -3246 -3546 -130 2574 3186 1605 -1211 -2702 350
2709 350 1602 -121 -1298 154 1642 3116 1104 -3574 -4314 101 4271 3600 69 -3258 -3156 395
2725 395 2369 -99 -1614 14 1424 1172 -657 -3552 -3438 1280 3571 1838 -305 -2811 -3266 -621
2741f21K761r13j325k96n75L20J246j535j130J938K595J74k056l348j773M051
2757d87N187p09m113k074L30K650J508k042k891K704L928j114l619k967M31M766
2773A488L638k486m600n30J438J414Q72o16j690J399J335j778j467k69L1J588
2789b33L014n85k939k587r8K463L709k2l514j891J721J327L3j559j374K429L911
2806C805o32n050k714J919L961K979j233m482j264K684J322o71m14q06J107K420
2822B931m37m360j354J831K947K114n71m364k464K301K410L03j62j416k30J294
2838G73N60k496j782J995K293J596o11m286k630K615K902J062k55k196k252J662
2854a050K029j448j252P34J640J887J29m607k852K422M735J442j592l459k188
$$ plain form
2741 -621 2140 1227 -98 -394 -969 -649 597 -938 -2068 -130 2465 2639 583 -2765 -4538 -487
2757 -487 4700 3991 -122 -2196 -1866 784 2292 250 -2641 63 3991 2877 -742 -3709 -3278 1488
2773 1488 5126 2640 -1960 -2490 -1052 362 1234 618 -1072 327 1662 -116 -1583 -1852 -1821 -233
2789 -233 2781 2196 -743 -3330 -3428 -965 2744 2722 -792 -2683 -962 365 398 -1161 -2535 -106 3805
2806 3805 3173 -1877 -4591 -2672 1289 4268 3035 -1447 -2711 -27 1295 624 210 -596 511 2931
2822 2931 2494 -1866 -3220 -1389 1558 3672 3101 -1263 -3727 -1426 984 1287 1125 -291 -521 773
2838 773 1333 -1163 -2945 -950 1343 2939 2328 -1958 -4588 -1973 929 1991 1736 -460 -2712 -1050
2854 -1050 979 -469 -1721 -987 653 2540 2669 -1938 -4790 -2368 2367 3809 2217 -1242 -3430
2869c430K640K967j011k441O14K051P64q43l387j948L338M205J92k822k236j658
2885c005J575L602n48j404L11n82j51N25n41j794Q13K925J318j054l465k963J533
2902b905N217J807l447k934l22J959K156j282l000R43M160J011l050l751o13L115
2918i36M803k87m115j897R43J309J008j14j297P14J825o85j878n18m11O40L468
2935B572J082k697k611q70R75L107J602k065k427R77J234o5j319j340K79L650
2951B084J878l852l511l25K898L309R68l715k757J656J959l69p13n96L00K483
2967A697J008l379k883N84K686K705R59k976l335O59K409R78q6p64j135J238J444
2984A809j702k516L75K309K587R46k811m231K56L563J997o74j198j850K01K548
$$ plain form
2869 -3430 -790 2177 1166 -1275 -661 1390 2154 1311 -2076 -4024 -686 3519 3711 889 -1347 -3005
2885 -3005 -1430 2172 1624 220 531 -51 -202 323 -218 -2012 -1199 1726 3044 1990 -1475 -4438 -2905
2902 -2905 2312 4119 672 -2262 -2584 -625 1531 249 -2751 -1808 2352 3363 313 -3438 -4051 -936
2918 -936 3867 3580 -535 -2432 -1489 -180 828 714 -583 131 1956 1271 -607 -1125 -1536 -896 2572
2935 2572 3654 957 -1654 -2524 -1549 1558 3160 1095 -1332 -355 879 814 -505 -1845 -1566 2084
2951 2084 3962 110 -3401 -3726 -828 2481 3449 -266 -3023 -1367 592 223 -490 -1086 -786 1697
2967 1697 2705 -674 -3557 -2973 -287 2418 3377 401 -2934 -2275 134 1112 1026 262 -873 365 1809
2984 1809 107 -2409 -2034 275 2862 3808 997 -3234 -2978 585 2582 1908 710 -1140 -939 1609
3000A609j174k255M13J800J644P58k584m036J99M166K085j49k362k656J83L254
3016H95J65k115m25J446J452L20k062l366R21M148J388r14k161k213M8K478J383
3033A388j195k32K15j44O46n41j618l79K820K040m58j920k989j049L717L266j263
3050B304k454j187Q00J460K65k555p21K746L008j411l387k357O19L937K784k429
3066A422k809l71O69Q75P07j171n60J837J096j715j255q32n7K558K523j014k640
3083g37j320l21J934K233m1k257n44J551N92o60j651r28K739L656j301m410j868
3100c333J544L054K093j481l334Q6K177K16j184p13J02J575K180j615l451o71
3116b755J453K135J709l08l319j443J528J477O3j42j388K86K088l3l059j086J421
$$ plain form
3000 1609 435 -1820 -1407 393 2037 2795 211 -3825 -3626 540 2625 2476 114 -2542 -2359 895
3016 895 1060 -1055 -1480 -34 1418 1738 -324 -3690 -2769 1379 2767 1853 -308 -2521 -2473 5 1388
3033 1388 193 -39 176 32 678 137 -1481 -1860 960 3000 2542 622 -2367 -3416 301 3567 2304
3050 2304 -150 -1337 -537 923 1188 -1367 -2088 658 3666 2255 -1132 -3489 -2870 1067 3851 1422
3066 1422 -1387 -1758 -1089 -214 493 -678 -1238 599 1695 -20 -1275 -2107 -2164 394 2917 1903 -737
3083 -737 -2057 -2378 -444 1789 1748 -509 -1053 498 1090 430 -1221 -2149 590 4246 2945 -1465 -3333
3100 -3333 -1789 1265 3358 1877 -1457 -1371 806 1022 -162 -875 -773 802 2982 1367 -2084 -2755
3116 -2755 -1302 833 2542 2234 -1085 -2528 -1000 477 540 398 -990 -704 1384 1351 -1708 -2794 -1373
3133a373K214K073j060l667j829K493K226J39m84j492j98J707N27k581o66J408
3149e63J758J559q04l469j821K130K710J040r23k087j270J528J414r50j223Q63
3165a08J295R81n93k970j941K503K916P06j332k249j920J991J906n35p08J49M53
3182E44j04lj722j588J869K815L75j162k302j816J088L180R62j933r66k07Q24
3199a46J076j399k226J387L418Q90j848l072j782K446M331j57k771j325P37L25
3215a16J109m50k015J381K307l83j790j442l29J090L108K77k229j639n16Q79J473
3232G15J156j628j070J307M58r24j039j565J239L528J074l201k740j65J925K768
3248A838K86k356j623J341J333r28j007l08R43K252P60l056k099N30J861K139
$$ plain form
3133 -1373 841 2914 1854 -1813 -3642 -1149 1077 1216 732 -760 -958 749 1276 -1305 -1971 -563
3149 -563 1195 2754 1950 -1519 -3340 -1210 1500 2540 1617 -470 -1740 -212 1202 252 -971 -108
3165 -108 1187 2168 1575 -1395 -3336 -833 2083 2789 1457 -792 -2712 -721 1185 650 -58 91 544
3182 544 440 437 -1285 -2873 -1004 1811 2186 1024 -1278 -3094 -2006 1174 2136 203 -763 -970 -146
3199 -146 930 -469 -2695 -1308 2110 3000 1152 -1920 -3702 -1256 3075 2918 147 -1178 -441 -116
3215 -116 993 543 -1472 -91 2216 1833 43 -1399 -1728 -638 2470 2747 518 -1121 -1637 -758 715
3232 715 1871 243 -827 480 938 14 -1025 -2590 -1351 2177 3251 50 -2690 -2855 -930 1838
3248 1838 2124 -232 -1855 -514 819 -109 -1116 -1424 -481 1771 2531 -525 -2624 -2094 -233 1906
3264A906Q74k257k448P10J437J20J14l77m90J759R89k265k001J23J911K391J054
3281C550k815l173N46K293Q03l22r01q52J086J339j768k021N32J912J950O1k373
3298a53l016R31K453J055J29j208j765J27J830j0j591J62J107J475M70k085l294
3315c383N99L411J867m47j770k362R40K211p3j639M51Q75P23k61j088k325O59
3332a612K803J489o86j661k277m17K819J250n13j066o95K70J406o89k054o74K996
3349F89K126j004k649k458L64L598K022j824k136j22N60J229m2j923k79K650J254
3366B055j427j776j202N13K837J715j661j924l39M6J269J393j211p28N91J244
3382A395n65j022j277l85K652K380r74k901j783P43K315K061j248k804R24J658
$$ plain form
3264 1906 2780 523 -1925 -1215 222 342 456 79 -411 1348 2337 72 -1929 -1806 105 2496 3550
3281 3550 735 -2438 -1892 401 1204 882 -19 -871 215 1554 -214 -2235 -1703 209 2159 2220 -153
3298 -153 -3169 -2238 215 1270 1399 191 -1574 -1447 383 373 -1218 -1056 51 1526 1996 -89 -3383
3315 -3383 -2784 627 2494 2047 277 -2085 -1145 1066 993 -646 -195 680 1403 1142 54 -2271 -1612
3332 -1612 1191 2680 1994 333 -1944 -2361 458 1708 1195 129 -566 -296 1110 421 -1633 -2307 689
3349 689 2815 1811 -838 -3296 -2932 666 2688 864 -1272 -1394 -834 395 353 -1570 -1849 801 2055
3366 2055 628 -1148 -2350 -1837 1000 2715 1054 -870 -1209 -1163 106 1499 288 -440 151 1395
3382 1395 830 -192 -1469 -1854 798 3178 2204 -697 -2480 -1737 578 2639 1391 -1413 -489 1169
3398A169k68j278r47O2K196K006j748l167l06R55J975J699j170k357P8Q12K03
3415h6k03o7l67R00J692j013k508j227J491K220J707q30l469n14J802J237j3p01
3433E1r72O86J733m24k632l31J543J578J686j429k882q69K006J251N43j13k107
3450f82j55J573N96k107p52R29J586J281o78l266j592K559K368O01j484k134n10
3467a867J636R89j772k47J016R45M65q92k124q77K403J779K11q56j774j427J583
3484h09J886k83m58n1m75M46O62j567j712J607K628N90j149k734j557K223L231
3501B478l83j770j288Q18Q28L08j834r69K098K249m66k371j946P4K015K592q44
3518A589j987n66K48J51Q33R0j118M32J373n27o81j008j032J212K822M12k504
$$ plain form
3398 1169 901 -377 -1324 -1262 934 2940 1192 -1975 -2281 -1326 649 2348 1178 -1179 -1101 -289 -86
3415 -86 -289 -356 -723 177 1869 856 -1652 -2879 -1388 832 2539 1709 -1760 -2274 -472 765 752 51
3433 51 -921 -235 1498 1074 -1558 -1889 -346 1232 2918 1489 -1393 -2262 -256 995 1538 1425 -682
3450 -682 -837 736 1332 -775 -1527 -598 988 2269 1591 -1675 -3267 -708 1660 2261 777 -1357 -1867
3467 -1867 -231 758 -1014 -1261 -245 700 1165 273 -1851 -2728 -325 1454 1665 809 -965 -2392 -809
3484 -809 1077 794 336 285 -190 256 918 -649 -2361 -754 1874 2464 1315 -1419 -2976 -753 2478
3501 2478 2095 325 -963 -145 683 991 -843 -1812 286 2535 2069 -302 -2248 -2174 -159 2433 1589
3518 1589 -398 -964 -716 -565 268 358 -760 -328 1045 518 -163 -1171 -2203 -991 1831 2243 -261
3535b61j526r2R89K154j25j788n09J705L61j026q17m69J211K855l11k914j359
3552a922L6J949J424O62k303q15J048J79J8n35j59O60J630j23k505j188N53J254
3570a37K110K80k074j869O25J127K23j95n99j02J159Q60k276j170M69J413K016
3587A860k6k170j955M58K011Q94j59r87j069J038R68j039j167M26J177J607O9
3604A936k130k673J381K237R12k05j369j087R59J117r78j003P02J253P55m87k134
3621h14j356J204K058O37o44j040j307pJ586j64q9K7p2J82L88j002j424k07K557
3640E13J391k92j991k277M06K557J483j852q18N0Q06Q43j129j773Q42K731O32
3657B122j423j627j268J095K449O95j786o48J26J29M13o0p45M89J174L28j069
$$ plain form
3535 -261 -1787 -1879 -890 1264 1139 -649 -1158 547 908 -118 -935 -1404 -193 2662 2351 -563 -1922
3552 -1922 -1886 63 1487 2149 -154 -969 79 258 276 -259 -418 242 1872 1749 -756 -1944 -1391 -137
3570 -137 1973 2253 179 -1690 -1065 62 285 90 -509 -611 548 1408 -868 -2038 -1569 -156 1860
3587 1860 1834 -336 -2291 -1833 178 1072 913 -74 -1143 -105 863 -176 -1343 -917 260 1867 1936
3604 1936 -194 -2867 -1486 751 1663 1458 89 -998 -39 1078 100 -903 -201 1052 1807 1320 -814
3621 -814 -2170 -966 1092 1729 1085 45 -1262 -1269 317 153 64 91 19 201 589 -413 -1837 -2044 513
3640 513 1904 1612 -379 -2656 -2250 307 1790 -62 -880 -830 -24 819 -310 -2083 -1241 1490 2122
3657 2122 699 -928 -2196 -1101 1348 2043 257 -391 -265 -136 277 217 -528 -39 1135 1463 394
3674C94n74j367j84K780J319j130j878j143P89J694M69r90j196J000J038m31j031
3691d41j348K34K307J390j700k012m15R59K038N25j455j234O49R28k74q00k61
3708i10M73J705L12j226j537l49O61J402J224o85j930L1Q22L53P0l77n38J045
3726E46Q85j198j010r45Q50K118P04p38k270n85J421P89L25m35j081K26J343n03
3744D42j700q3R26J210J157j170k685k35J683J431J11r22j222J98J421j3j635
3761a086k70J417Q97K55o04k147k93J646J637k26m99j695l14J240M72l46j40P06
3779F50j84L13Qj763r51K073J011O40r41j634j214J506J839n31r55n58M92Q54
3797F55K01k128p15J983J810j36j475j902j31K005J325o46j411J42J23J92N8o30
$$ plain form
3674 394 -180 -1547 -1731 1049 2368 1238 -640 -1783 -994 700 1169 179 -1017 -17 1021 590 -441
3691 -441 -1789 -1555 752 2142 442 -1570 -1985 -1026 1012 1537 82 -1152 -503 425 151 -649 -910
3708 -910 -437 1268 1580 354 -1183 -1532 -871 531 1755 1070 -860 -829 -7 346 416 39 -499 546
3726 546 1431 233 -777 -1722 -872 1246 1950 1212 -1058 -1643 -222 567 892 457 -624 -398 945 442
3744 442 -1258 -1341 -415 795 1952 782 -1903 -2138 -455 976 1087 165 -1057 -859 562 549 -1086
3761 -1086 -1356 61 958 1213 609 -1538 -1831 -185 1452 1226 727 -968 -1282 -42 430 84 -56 650
3779 650 466 779 787 -976 -1927 146 1157 1797 856 -778 -1992 -486 1353 822 -133 -691 -199 655
3797 655 856 -1272 -1987 -4 1806 1670 195 -1707 -1838 167 1492 846 -565 -423 -300 -108 -50 -680
3815f80k38J204P66n10p03q03q03J092J941J61r55j199n22O69J441j87j319R3
3833e52R47P41q92j448m59J434K657m37k091j310M26J269J165o66j604N16J235
3850I31k59r42m06OP36J405Lk253n43n2J104J425L1j132r97L46P12j69l03j71
3870e28J63J461k29j305r76J69R29J839K37j780j605P00R73N12j91q64MJ492J52
3889A153j418j307O02J096J538K43k149j386R79J131O49K5j501j86M82Q73q90
3906f6p76J46J271P71k56j843j521J333J531O87m08j043j116N96Q80j83n74L78
3924a93N16N86j07j431j295M58J922J089l41j501j462K39K168M88j146n84M67
3941a27P01M46j448j360O88K202R42q23j899j051P57K081L11j247j98L8K09K5
$$ plain form
3815 -680 -918 286 1052 542 -161 -964 -1767 -675 1266 1427 472 -727 -1249 -580 861 674 -645 -552
3833 -552 395 1136 244 -1204 -1663 -229 2428 1991 -100 -1410 -984 285 1450 784 -820 -304 931
3850 931 672 -270 -676 -670 66 1471 1474 -779 -1322 -1374 -270 1155 1186 54 -943 -597 115 -54 -357 -528
3870 -528 -365 1096 867 -438 -1414 -1245 -316 1523 1760 -20 -1625 -925 48 560 369 -495 -491 1001 1153
3889 1153 -265 -1572 -970 126 1664 1907 -242 -1628 -649 482 1131 1156 -345 -531 -49 824 -66
3906 -66 -842 -696 575 1346 1090 -753 -2274 -941 590 1277 869 -174 -1290 -694 186 3 -571 -193
3924 -193 323 909 802 -629 -1924 -1466 456 1545 1204 -297 -1759 -1520 648 1136 -10 -594 -127
3941 -127 574 1020 -428 -1788 -1100 1102 2044 1221 -678 -1729 -972 1109 1420 173 -25 13 222 247
3959B47O4j016M31J439L09p27j239r27J0K006R79o87j201o95n5J162N68j040q90
3978a262J443P86l55j514r95N07K520J196j942j521p25J007J381K54r85k99J062
3995E58L85j168n41n32J099J715O02j911j216q8O37J310M73n87r00N7M11j71J88
4014C21m09o93J437J077j387j648l92Q90J719J024j378j812p7J253L03N05r11
4031a78l09P88P82j210j463L37P24J282Q99j186k042r7J226R63J68o54p03M22
4049b51R04n04j220Q1J025J141P10j502k264M0K032J055P4p02j116j26J058K3
4067D58q32m3P15N87Q2m01k037j16J669J289j77m52j810m43J652P30p41l54J54
4086g0J84L22n03j451l68J849J514J73j829j366k35K162R26j046p01L7K84J06
$$ plain form
3959 247 311 -705 -274 1165 1474 747 -492 -1419 -1409 597 1576 889 -312 -1007 -1062 100 668 -372 -1262
3978 -1262 181 967 612 -902 -1897 -1390 1130 2326 384 -1137 -1862 -855 526 780 -205 -504 558
3995 558 943 -225 -766 -1298 -199 1516 2118 207 -1009 -1097 -460 850 1323 736 -164 -107 304 133 321
4014 321 -88 -781 656 1733 346 -1302 -1694 -804 915 1939 561 -1251 -1328 -75 228 733 -178
4031 -178 -487 301 1083 -127 -1590 -1253 -529 753 1652 466 -1576 -1673 -447 516 684 30 -673 -251
4049 -251 653 149 -1071 -990 35 1176 1886 384 -1880 -1840 192 1247 1321 619 -497 -623 435 458
4067 458 -374 -417 298 885 967 566 -1471 -1587 82 1371 1194 742 -1068 -1511 141 871 130 -224 -70
4086 -70 114 436 -67 -1518 -1886 -37 1477 1650 -179 -1545 -1780 382 1308 262 -439 -402 -118 -12
4104a2P3j092k7J642O65p00q76j000jJ449J421n56q78o30J28N57Q61p75n49K80
4124b0J161M8r05j428o83K016J855n61j889q47N45R81N67n93q52P03R02n20j011
4143e31r05L94J537J483j298j427p05M93J065P37k28j457K56O84j47j11j53n67
4161h80J142J060k58j497j330Q24J128J301m19j496l72Q79J48N2k14n88O76J385
4179A541m59j697p87O71J468R59n51j415r75R57P27m0M6q11j33J425n6j668j62
4198i60L98J047R04n17j783j151J450J246J56o28p19k60Q17P68j259l18N89J177
4216I57n4l84j384q01J154J180N63n81r71p08M90J358o39k25J87J2M83J32j140
4235c71j265J427J656n7m04j488j183J399J541m02j059j82K34M32Q4q76r81J335
$$ plain form
4104 -12 61 -1031 -1058 584 1249 549 -327 -1327 -1328 121 1542 986 108 -522 -394 163 1024 249 -300 -20
4124 -20 1141 1189 284 -1144 -1827 189 2044 1483 -406 -1253 -708 273 840 247 -605 98 1000 480 -531
4143 -531 -1436 -1042 495 1978 680 -747 -1452 -959 106 843 615 -842 -586 98 -49 -160 -313 -880
4161 -880 262 1322 1064 -433 -1763 -939 189 1490 1071 -425 -797 82 230 282 68 -520 156 1541
4179 1541 1082 -615 -1402 -731 737 1696 1145 -270 -1245 -288 439 399 445 -366 -499 926 870 -798 -960
4198 -960 -562 485 1389 872 -911 -2062 -612 634 790 162 -557 -817 0 768 -491 -809 -220 957
4216 957 903 519 -865 -1666 -512 668 1231 650 -321 -1029 -539 819 180 -45 142 154 637 769 -371
4235 -371 -1636 -209 1447 1390 986 -502 -1685 -286 1255 853 -206 -388 -154 278 362 -514 -1495 -160
4253a60J231k70p47p56p25R05J499j00n96o67K62l94N63k06m02J94J199j60l94
4272B76q82j072J181J943O4j186j100k34N51J281j13j226J22J171Kp61n68n12
4290a063Q71J982m86j304j004M90M49Q39Q0j289L19K68J9l05m17k63M43J171L50
4309A150j120j065k93O84J097O40q98j276P39L13J06m1m63k3J124L40j263j087
4327a336J59J137J221K04j323j025L78N72o3M36k61k11Q59L29j075q67K68N09
4345h9J304K95r78j706L66R76N02k83l57o13N85P73j087n07N64N65P05j2j075
4364g2j357M91J074Q76k90m83r32m19J559m83k02l8Q4M25N26p49j415L89J177
4383A61O24p0p66j214K81J496M12r76k51K55J20P98q25j404L68J895L08k79j272
$$ plain form
4253 -160 1071 801 54 -702 -1427 -522 977 877 281 -386 -124 -518 45 -161 -563 -369 830 670 276
4272 276 -606 -1678 -497 1446 1510 324 -776 -1010 -459 822 709 -517 -395 776 778 17 -551 -1063
4290 -1063 -192 1790 1304 0 -1004 -514 -65 774 854 -435 -116 152 171 -134 -551 -814 -371 800 1150
4309 1150 30 -1035 -1328 -644 453 1093 195 -1081 -342 -29 77 36 -427 -450 674 1014 -249 -1336
4327 -1336 -1177 -40 1181 1385 62 -963 -585 -13 -76 360 99 -112 747 1076 1 -866 -598 -89
4345 -89 1215 1510 532 -1174 -808 168 670 387 30 -583 2 775 -312 -819 -255 310 1015 1003 -72
4364 -72 -1429 -938 136 1012 722 239 -693 -1112 447 -36 -238 -276 -192 233 759 10 -1405 -1016 161
4383 161 785 715 -51 -1265 -984 512 924 -52 -303 -48 72 870 45 -1359 -991 904 1212 933 -339
4402c39q72P18J034K22l79n08J4L23r5j28l19j68J197K23n31k59j072j54J142
4421D9J155j74j205l25k65O61P37o98o13N70J153o85r30q00K92J682Q83r48j247
4440g08j30K83N36N06l25p47O83L62j93m67m35J75R00P99m03j296m04K38P43Q75
4460I92k13j006l16O65Q2j92J86n41N37R04m31j216j38M8J075Q49k88j772N5N91
4480a29J76K91n63m89O34J075n55j270k63N58O82Q73o74j181n12R33Q21k1No74
4500b83r4N79K55j170L7K49P47O80l52j146m87P67O99K93j60p63m99N86N71n40
4520c1k20J40K80O20P5j551p37R94J227J72K46j586o63N00J116l95n63k47O91
4539F8N21q8j348n96J331J103j29o65r48m03R69P95k12n39l4p9L03nm24n25R01
$$ plain form
4402 -339 -1211 -493 541 763 384 -124 -110 213 118 -10 -329 -497 700 923 392 133 -939 -1093 49
4421 49 1204 1030 -175 -500 -765 -104 633 -65 -678 -108 1045 360 -570 -1370 -1078 604 1487 539 -708
4440 -708 -838 -555 -19 487 162 -585 98 460 267 -200 -635 -460 440 1239 836 -460 -864 -626 117 992
4460 992 779 -227 -543 122 204 12 198 -343 194 1098 667 -549 -687 -639 436 1285 997 -775 -720 -129
4480 -129 47 338 -225 -714 -80 995 440 -830 -1093 -535 147 1020 346 -835 -1347 -414 407 386 391 -283
4500 -283 -377 202 457 -713 -676 -427 320 1000 648 -498 -985 -218 481 774 614 -149 -648 -62 509 -31
4520 -31 -251 -111 169 789 864 -687 -1424 -430 797 969 1215 -371 -1034 -534 582 187 -376 -623 68
4539 68 589 501 -847 -1443 -112 991 862 197 -751 -1154 -185 610 398 -141 -175 -254 49 44 -380 -905 -4
4560dM51J08k06p69r41O74J221M69p07n78m96M06J185p27q43K66J310K74q15o59
4580c81j150J303J445K58j385p83L1M41P95j70o99j4J036l12m56m30m70O57J429
4599A145j58j212n13k44M79O25N54n19l53K2N1j22J11p42L78J484J75j098o91
4618f28m46R21J011L69q76j105O04K65K48j45n80K11J033K26j214q39N24K32J242
4637A053K86j007j410L48J056K38j42l24m89P96M7o99o20L23P34N09K19r02j127
4656a111J94Q12N17j19J35j009K08Q01o77k79p4N45M10N03o42j427K12R67O33
4675E99N19j303q30M15J102R2r29Q8P3R52K00o13j640N51J312M58p1j120q10N57
4695c98Q95Ro40K60n0N6J89q20m63J60J413O4l76n35m94k27J057P45l74m70l14
$$ plain form
4560 -4 447 555 349 -420 -1361 -687 534 1003 296 -282 -778 -372 813 86 -757 -491 819 1093 278 -381
4580 -381 -1531 -228 1217 1475 90 -693 -662 -221 574 404 -295 -309 727 415 -41 -471 -941 -284 1145
4599 1145 987 -225 -738 -982 -503 122 676 157 -196 -174 -123 -245 -134 -876 -498 986 1161 63 -628
4618 -628 -1074 -153 858 1227 351 -754 -150 115 363 218 -362 -151 882 1108 -106 -945 -421 -189 1053
4637 1053 1339 332 -1078 -730 326 564 422 98 -391 405 452 -247 -867 -544 190 699 918 16 -1111
4656 -1111 -917 -105 412 293 428 -581 -373 428 -249 -528 -602 -57 353 856 214 -1213 -1001 -34 599
4675 599 1118 -185 -1015 -600 502 594 -335 -247 -174 778 978 365 -1275 -724 588 1046 975 -145 -955 -398
4695 -398 497 506 -134 126 76 132 321 -499 -962 -802 611 675 299 -236 -730 -957 100 845 471 1 -313
4716c13k74Q14K88j179k04R63Q26m32n31j472J78J910P95q26r41k01j34Q09K10
4735B86p66L20O53M52q88l08q82O39J303N16o31p94n52O5O70Q03p27l22J95K91
4755C23j53k34j23n66R18J003n35j128l96L46P93P08o37r31J43L95p4J02l66k89
4775g01Q01P09n64r47j97k7J238Q32n70j300K35L14M29K6q4m48K55R90o19r14
4795e42m11O25P93Q98o25j300l23R21J17N25k42p13K16M85l00m24j81M21K73J130
4815A343p75j500n22Q70J180L68m27r19m58P77P20n01o52L00N66N03k30j922J27
4834a152J140O55K84n74r54j44R86L94m80o22L49M35M0j53p66J6O43M82qm0j001
4855d70m04N75Q83l29J05n61m7O09o6n21p81J181Q54n28q4j080p06J179J229l29
$$ plain form
4716 -313 -587 227 515 -664 -868 95 921 489 -42 -1514 -1336 574 1369 543 -398 -599 -733 76 286
4735 286 -480 -160 493 945 57 -251 -1133 -494 809 1325 694 -100 -652 -587 83 886 159 -163 32 323
4755 323 170 -64 -187 -753 165 1168 633 -495 -891 -545 248 956 319 -612 -469 -74 -148 -46 -412 -701
4775 -701 100 809 245 -702 -899 -926 312 1144 574 -726 -491 -177 252 278 194 -254 1 991 372 -542
4795 -542 -953 -328 465 1363 738 -562 -885 36 153 678 436 -277 -61 424 124 -300 -481 -60 213 1343
4815 1343 568 -932 -1454 -584 596 964 537 -382 -840 -63 657 156 -496 -196 370 873 643 -1279 -1152
4834 -1152 -12 643 927 353 -601 -745 241 635 155 -467 -118 317 357 204 -562 -546 97 579 571 531 -470
4855 -470 -874 -299 584 255 360 -201 -248 361 295 -226 -1007 174 1028 500 416 -664 -1370 -191 1038 709
4875G09p84l46j27N11M05m50o28M03R42j75n57o76m85J150Q46N8p94o62pK96P14
4896C43q7m21l6P13o15L21n93n40J193J002k67r96m75j28J51J199k9j012NN0M27
4917B05P9m88m33O98J338m54j447l77K06N98Q43P3j229l05M86K41J07Ln66K61
4937a61J007k43r20q20M08Q35O32J02j277p25P85M91P2J9n91L3M71o1n44j88L73
4958c02K72N64L85q56j158N29O96L88K99r13l94M79M62l51o44K20L73O66K87j562
4978e60m08N81N84P05n95m69m52M42M18j09l80K79K2M00k96l69p59M04Q47M91
4998G76Lq26r50L90O56J02N4l31m07J91N07P9j122M81P34J98J71r10n99j2J427
5019F12L42n93o58M5k14J015k52j023O02P79L4m98p54j12K26J092Q1l74o43j63
$$ plain form
4875 709 -75 -421 -548 -37 368 -82 -710 -307 635 460 -97 -773 -1258 -108 738 796 2 -660 -667 -371 343
4896 343 256 -165 -201 512 -103 218 -375 -915 278 1280 1013 17 -458 -586 -435 764 735 -277 -272 -222 205
4917 205 284 -204 -637 61 1399 945 -502 -879 -673 -75 768 841 -388 -693 -207 34 141 144 -422 -161
4937 -161 846 603 -317 -1137 -729 106 738 840 -437 -1162 -377 114 186 205 -386 -353 118 57 -487 -675 -302
4958 -302 -30 534 919 63 -1095 -566 130 518 817 -96 -490 -11 451 100 -544 -324 49 715 1002 -560
4978 -560 -968 -387 197 902 307 -162 -614 -172 246 137 -243 36 58 458 162 -207 -966 -562 285 776
4998 776 779 -47 -997 -607 49 151 205 -126 -533 -342 165 244 -878 -397 337 535 706 -204 -803 -815 612
5019 612 954 361 -297 -252 -466 549 297 -726 -124 655 689 191 -563 -675 -449 643 724 350 -293 -456
5039d56J11L01L52n27r8O62j13m36Q5l44j57J157K74m32q09j08l61Q65O52m43
5059A75p36L20K76J8k81l23K15Q08N58n07j079J26K6M56N81k22j036K53N31k01
5079d2m6K17l53O14M98p50o01K5K37O90M38m78j028j07L71K84J45p2k88K35O53
5100F42n43n28k77N09M97O21m27j066n87R18L60M61l34m28j71Q64l55k68l62K87
5120a87K64Q76k25j502j23N56N69N19n20p79P6P71K8k78k64J64K33P56p49o59
5140d74j59M19O63L2j16k85p99L44O79k36K40q2l20L19O1o55n49Q48K50M81n35
5161A26n18p63R88P92k70k36k06l7J94K17m26o31N18O97K96o78j059L20L55R63
5181F42k28n22j23r9M17K47k96k41J52M28Q7m19m34k85N71M71K43m63l32m12M66
$$ plain form
5039 -456 -345 -44 308 -219 -317 345 232 -204 -119 -463 -620 537 811 379 -430 -538 -899 -34 618 175
5059 175 -561 -241 35 53 -228 -551 -336 472 1030 523 -556 -430 -404 52 633 411 -625 -372 159 -42
5079 -42 -88 129 -224 390 888 138 -463 -438 -201 489 927 449 -579 -686 -315 -31 114 42 -246 -11 642
5100 642 99 -429 -706 -197 300 921 494 -572 -1159 -241 119 580 246 -182 -353 511 156 -112 -474 -187
5120 -187 77 953 728 -774 -897 -341 228 747 227 -552 -476 295 323 45 -219 -55 178 934 185 -474
5140 -474 -633 -214 449 481 365 80 -719 -375 304 68 308 226 -94 225 286 -369 -918 -70 180 661 126
5161 126 -392 -1155 -167 625 355 119 -87 -124 70 287 -139 -770 -252 445 741 63 -996 -676 -321 642
5181 642 414 -108 -231 -330 87 334 38 -203 -51 377 464 45 -389 -674 -103 368 611 148 -184 -596 -130
5202a30O77j68m78j40P46l69J6k85k49N16P31l29m22q41K30M10O55m1n32m19L56
5223f6J57j22P3o08L62O43J77n45p25j47N70J045r0p08m51J9M21O1q9o9j38N91
5245C61J79p20l26k30P94M41L85o80j012J78Q11N1L86m88l34O78k32m5m71l25
5265e99O09P62J27n79j241J3J035L34R5p65l97L97O09l80m98J14J64N71L13p66
5285h2p46j95J406pO4m14o50O02j07J42j22k7N8L03J64l73n31L6O91N38k7l65
5307C58j154J27R29M12l95J22l09r2N37n90m53j0P51N72k34p30n34j20J256n5
5327C88k22l74j60J95K88r2l98M0M78L28n95l02l05l93J228M05n6l52n02l57Q81
5348A23K14l80n66N64L13K4n23k97K2P23Q62o55q57k18J55N91L68l61m13j05P39
$$ plain form
5202 -130 547 379 -99 -239 507 138 154 -131 -380 136 867 538 116 -725 -495 -85 570 529 -3 -422 -66
5223 -66 91 -31 42 -566 -204 439 616 71 -654 -801 -231 814 724 16 -435 -416 5 66 -23 -92 -230 361
5245 361 540 -180 -506 -736 58 499 884 204 -808 -630 181 232 618 130 -204 474 242 197 -274 -599
5265 -599 10 772 899 320 -921 -908 127 461 556 -209 -606 -209 400 20 -478 -364 -200 371 684 -82
5285 -82 -828 -1023 383 376 440 26 -624 -22 -129 13 -109 -136 -78 225 389 16 -515 -479 212 750 723 358
5307 358 -796 -669 260 672 277 399 90 -2 535 -55 -508 -518 233 805 571 -159 -693 -813 443 388
5327 388 166 -208 -368 -173 115 23 -375 -335 143 471 -124 -426 -731 -1124 104 509 453 101 -401 -758 123
5348 123 337 -43 -609 -45 268 292 -231 -528 -506 217 1079 424 -433 -651 -496 95 463 102 -311 -416 323
5369C23q9j78o61J98P27P54l78q48l68n3R10L68j56r68ML70k56J47j25k41M82
5390c8Q60p14o71j57L12Q02L27k71j023RK43M94j22Q6n37M76J94j1l91l23J75
5411b80M05P78m81r16l73O53L74N63m60n45l1O47k9n15k23L92K00Q49l85j208
5431e85l05R20O46j62l83k55n18M29P51p89L27j31R1L73m70n80m6M85P49j27k48
5452A72n44n01N50J061r94M21l78O1L48L50j058l00O65P53M1l87q57m92R93P74
5472F78j21l44l48j12L21J78n82O5K22M52K89p86m34j62P16N92j82n8l42k63J12
5493a09L52J09o37M5M38N0q6n16m48K11J015Ln81n58K2M72P89o4m83l50K55L00
5515B29k61m38l37P05Q04k05p00l40p0L35Q84J16j030K46K32P0j2j59l13K21N75
$$ plain form
5369 323 234 56 -605 -407 320 1074 696 -152 -520 -573 337 705 549 -419 -415 -45 -301 -154 -279 -520 -38
5390 -38 822 108 -563 -720 -408 394 721 450 -573 -564 -321 173 51 137 -400 76 270 259 -132 -455 -280
5411 -280 125 903 422 -494 -867 -214 160 723 263 -282 -313 334 305 -210 -433 -41 159 1008 623 -585
5431 -585 -890 30 676 514 131 -124 -642 -213 538 -251 76 -55 36 409 -61 -641 -687 -202 547 420 172
5452 172 -372 -873 -323 738 -256 165 -213 -152 196 546 -512 -812 -147 606 647 260 -597 -1089 -96 678
5472 678 557 213 -135 -247 74 252 -330 -265 -43 409 698 -88 -522 -684 32 624 442 384 42 -221 -109
5493 -109 243 352 -285 -240 198 248 162 -354 -802 -591 424 427 -154 -712 -690 -218 571 507 24 -326 -71 229
5515 229 -32 -470 -807 -102 702 497 -203 -543 -613 -278 606 722 -308 -62 170 240 228 69 -244 -23 552
5536E52J15p81l85K0M51P75K3n76o38O5M06QK48m90K58M11j84l16m94k07N46P68
5558E75J22p72o14L17K77L65K08j13j221Q64M06k95o31L30J67N42j5o62r21N02
5578e69P24P4J41o18P0K33K46k48l18L64L4J65N37q41l64k51O37M41K17m88o23
5599d37J29P61J07k66k24m19M63L86n49p94K93O27N40j3p13p45M56P99J60p88
5619b27r9k9R7L30l78l20J74Q45k91M2m15o49M94P07Q8L34n87l16J50K18J69p30
5641c93L29M07J66k41j81m57k4R47M22k84j008l49J65O88L91l63o12J79Q01j00
5661D83p26k00j18Q47M59n94n66P1j0N37O13n31m69L00pl19K56l66k66R64M33
5682G91o66n56l67L95K23R01l77o12K6j1K73L9p5j63L54M06m14p11J3M37K69L46
$$ plain form
5536 552 667 -114 -499 -479 -28 747 770 194 -444 -379 27 35 283 -207 51 462 278 -38 -532 -739 -193 575
5558 575 697 -75 -689 -372 -95 270 478 365 -856 8 414 119 -512 -182 -15 527 512 -150 -1071 -569
5578 -569 155 229 370 -248 -178 55 301 53 -265 99 133 298 835 -6 -370 -621 16 457 674 186 -437
5599 -437 -308 453 560 294 70 -349 114 500 -49 -843 -550 77 617 604 -109 -854 -398 401 561 -227
5619 -227 -326 -355 -258 72 -306 -626 -452 393 102 144 -271 -920 -426 281 369 703 116 -200 -50 168 337 -393
5641 -393 -64 343 509 268 87 -370 -394 553 975 691 -317 -666 -501 187 578 215 -397 -218 583 483
5661 483 -243 -443 -561 286 745 151 -415 -344 -354 183 796 265 -204 96 89 -230 26 -340 -606 358 791
5682 791 125 -431 -798 -403 -180 721 344 -268 -242 -253 20 59 -16 -179 175 581 167 -544 -531 -94 175 521
5704E21K29j103k20L58L87M23o54k62M63J86j4p40J55J99m0Q41k89q04l01K90
5724c75M78M48n25k01k8M15r0n22J71J79K72K80m96n09l13N95L82Q6K88q73J14
5745b24K49Q2j63J6k06K03L78j6q02j15J64P34L28m80m54KN17J94j54n07J92J48
5767H6M03k37q39K56O4N67J80l2p08l62M26P34k27K1n58k64L77K8j43j92L48N03
5789D31j71j76k53n28J29R19J29m75j22l84K33M89K3n56J50L99J31m69k12k17
5809e30L31P56J85p34k18k21K70K49M26r00J27M69J8j96j61k79K16P23K88o37
5829A82o13r2M52O04K6j22p00J87J17j55K84m06o6N98q8k94k46m11K55J074q8
5850D98m20n11j28L17K38J54m16J37L20J08m81j45l77N26M22M38p42m48l6M81
$$ plain form
5704 521 750 -353 -573 -215 172 595 -59 -321 142 328 314 -426 -271 -72 -112 729 440 -364 -665 -375
5724 -375 103 551 26 -175 -203 212 122 -400 -229 -50 222 502 6 -503 -816 -221 161 247 535 -338 -224
5745 -224 25 107 -56 -40 -246 -43 335 319 -483 -598 -434 300 628 148 -306 -304 213 407 253 -254 -62 86
5767 86 489 252 -587 -331 -267 300 480 448 -260 -622 -196 538 311 332 -226 -490 -113 -85 -228 -420 -72 431
5789 431 260 84 -169 -697 -568 351 480 5 -117 -501 -268 221 244 -312 -162 237 368 -101 -313 -530
5809 -530 -199 557 742 8 -210 -431 -161 88 514 -386 -259 210 228 32 -129 -408 -192 531 819 182
5829 182 -431 -523 -71 533 559 437 -263 -76 41 -114 170 -236 -302 296 208 -86 -332 -743 -488 586 498
5850 498 78 -433 -561 -244 -6 148 -268 -131 189 297 -184 -329 -706 -180 242 680 -62 -510 -546 -65
5870f5N36Q4r38J8K69P16o36j46j01K18M48J96m68p50O50o1K56L12k23m94j75
5891c54N20lr1J13l43L10M08m74n44N6L41O20K5m75p01J23N11K45k94j16l2J85
5913C0L26n23m91P2R12M11p0q49m13J39O57J59k98l5q7J46J45j41k24P7J11K62
5935C16J27l00p32m3O11O43j24l41o70P5P24J87o43p3K56L07J46l73q09J9O82
5956a5Q28p12k00k29l52N71L48j38j47M1J67j99p5o48M41L51M00j29n82m29J44
5977e64N24L46k51k24R4J88o2q3j80R0L82M72k32o48j20k54L94P82J37r21k99
5998d29K16K70J48l98mN0L39j12k23l39J03M68N28k2p40k43N3L83J41l2m53L19
6020B3P0r9j15m05J45N63M30n3q35l07J82N86L04r4p19j29O53m20l8K0j0J14M49
$$ plain form
5870 -65 471 555 -383 -365 -96 620 -16 -162 -263 -45 403 599 131 -619 31 -30 226 538 315 -179 -354
5891 -354 166 163 72 185 -158 152 560 86 -458 -402 -61 559 584 109 -592 -469 42 287 -7 -123 -155 30
5913 30 356 -167 -658 -586 326 737 667 -182 -595 -456 201 360 62 27 -60 86 231 90 -134 -57 54 316
5935 316 443 143 -589 -632 -21 622 498 157 -513 -438 286 473 -170 -243 13 320 466 93 -716 -697 -15
5956 -15 813 101 -99 -328 -680 -109 239 101 -46 -5 162 -37 -112 -760 -319 32 432 303 -279 -708 -564
5977 -564 -40 306 55 -169 -75 113 51 -32 -212 -122 260 732 500 -148 -268 -522 -128 654 791 -130 -429
5998 -429 -213 57 205 -193 -197 -147 192 80 -143 -482 -379 89 617 595 -145 -388 -335 48 189 157 -296 23
6020 23 93 -6 -121 -526 -381 182 612 559 -276 -583 -401 185 489 395 -324 -453 200 -220 -258 -238 -248 -134 315
6043C15n7m96n76N20M44O86k10p22m35O83K92m32l8k8J03M83j55p66k49O74O65
6064G01j78k86q13J16M42L88m43o0K41j37O7J19k70m34M97K50J39L24p16n97L90
6085b60P18q8o7n48m86N60K08k18m36J84O04M99l64o81k43L43Q85J93n19m15n86
6106g17J071J17l10m88J85O77m12r3l74k54M58P17L5m92o72J54j0P08L96q92J8
6127a78M4pjJ28j19JP59j04m93n09m76P63N92P0o47j72o2L12K85l74j51L41P5
6150G7M95p43nk71M67M17J42m45n86J63O3K81P9j83j31N25J59n97J09l13L8O95
6172D36J38l77p63N1L74K57K92l02k83m0L32m96Q3n6j5P02k2n37n68K85L43L90
6194B24J04l74l76J05M60J83k16k49j09N88J99m82n77K31M90M7J13l26m78J24
$$ plain form
6043 315 258 -238 -814 -294 150 836 626 -96 -531 152 444 12 -26 -54 49 532 377 -389 -638 36 701
6064 701 523 237 -576 -460 -18 370 -73 -133 108 -29 38 157 -113 -547 -50 200 339 663 -53 -650 -260
6085 -260 458 370 303 -245 -731 -171 37 -181 -617 -433 171 670 306 -375 -618 -275 610 803 284 -131 -717
6106 -717 354 471 161 -327 -142 535 123 30 -344 -598 -140 577 612 120 -552 -398 -408 300 696 -196 -178
6127 -178 -134 -141 -142 -14 -133 -132 627 523 30 -479 -955 -192 400 470 -177 -349 -411 -99 186 -188 -339 2 77
6150 77 572 -171 -176 -447 20 437 579 134 -452 -289 -226 55 134 -49 -180 345 504 -93 16 -297 -259 436
6172 436 574 197 -566 -515 -141 116 408 106 -177 -217 115 -381 -298 -354 -369 333 311 -226 -794 -509 -166 224
6194 224 328 -46 -422 -317 143 326 110 -139 -248 340 539 57 -520 -289 201 248 361 35 -443 -319
6214c19M05J92K10l49o4R2Q8k8j031M30O10l4J04j94m40j52P42J32j29k86K08
6235A87n34N13j18k43OM0O01O4k68p69j3N09Q67o55m98j94J4O75q5k78k26L25
6257h0L15j82J53p18K58N77L83m24n85L47l75P02o4l95J64k4j50M0O5l35j18J129
6279F83j6m21l36q6J9K38L85k43l52J25j06n8J97j38k9M8M94j41l49rl37N01N04
6302E73k70n85q1J34K63n4J48n68O04j11J69l43j85P0M60L80m76n01j86L82O4
6323a13L48k62j47j56M87k69M8M4N0M25K96m10n05k37J64M41K31j0m97j52K65
6344D1J94l15Q8l86M00K58j67k93j45J61M65L16n23j65n04L20N66k49j11J30O3
6365A44K10k12l73o1K98o3N23K8p94K0j10L98J84J26o84J23M31K26n35j34M18
$$ plain form
6214 -319 86 278 488 139 75 167 255 227 -804 -374 236 202 306 112 -328 -480 262 394 265 -21 187
6235 187 -347 166 48 -195 -189 -149 452 516 248 -521 -534 -25 842 187 -311 -505 -491 184 99 -179 -405 -80
6257 -80 235 53 206 -512 -254 323 706 282 -303 44 -331 371 307 -88 76 52 -98 -58 7 -328 -446 683
6279 683 667 246 -90 -176 -157 81 466 223 -129 -4 -110 -168 29 -109 -138 -90 404 263 -86 -95 -432 69 573
6302 573 303 -282 -363 -229 34 -20 128 -440 164 53 222 -121 -306 -236 224 604 128 -373 -559 -177 -113
6323 -113 235 -27 -174 -330 157 -112 -64 -20 30 455 751 341 -164 -401 -237 204 435 425 -72 -224 41
6344 41 235 -80 8 -378 22 280 113 -180 -325 -164 301 617 94 -71 -575 -255 311 62 -49 81 144
6365 144 354 142 -231 -292 6 -57 466 494 -300 -280 -390 8 192 318 -366 -243 188 414 -121 -255 163
6386A63q7M52j72o92j86N71pN92l76o64J57K12L05j20j72J1J26J83l80kl73K92
6408a67P71l51m78K70l41P8M56q9k77K46M0j4N1m14l56L84L98L36k89n37O9j29
6430c43N55R5l48R9j40L60%j49k57k2P19l44j82l88n7K19M16L71l35k30j2M6j12
6453c9J38o5%J97K16m80M6l26o5O31J71m19l73p9O59j51r9p7k46M76k2j59j74
6476b40j25K73L02J46r1m93l49K77M41J53j77o78Q13J28l70j74j6r8M57J64j55
6497A88n01j30K02O77K90m62o54K80L84j27k02P9j80K82J87k68o64K74O57j49
6517A63L33m96Rm90N96rJ29k08k7r2J0M64q52J89O9O14K54l68o36m09J042K62
6539E47m13k8m63K54M31l08q6j61J12L45J35n89k10j22R21Mm1k99m10j59Q93n9
$$ plain form
6386 163 76 528 356 -336 -522 49 42 634 258 -406 -249 -37 268 148 -24 -13 113 296 -84 -86 -459 -167
6408 -167 604 253 -225 45 -296 -218 238 149 -128 118 158 144 195 -219 -575 -191 207 543 254 -283 -214 -343
6430 -343 212 307 -41 58 -82 278 278 129 -128 -150 569 225 43 -345 -402 -183 233 604 269 39 27 73 -39
6453 -39 99 34 34 231 447 -33 13 -313 -378 253 424 5 -368 -447 212 61 -38 -115 -361 115 93 -66 -240
6476 -240 -365 -92 210 356 265 -228 -577 -300 141 294 117 -561 252 380 10 -164 -180 -278 179 343 188
6497 188 -313 -443 -241 436 726 264 -390 -110 274 147 -55 24 -156 126 313 45 -619 -345 312 163
6517 163 496 0 9 -481 115 106 235 27 0 -92 -82 382 -470 -281 -212 402 656 288 -348 -757 285 547
6539 547 134 106 -357 -103 328 20 -66 -227 -115 230 365 -224 -434 -556 365 369 328 29 -381 -540 353 294
6561B94m08K29j10L77K1k87n68N5Q89j34k82J68n36K04M97r4j89k19J84K49j84
6582A56M7m09j38J20R93r7n81p24j02J114j68j30l77o7M84j35J26k52m23N75J60
6603A72j0o01J01R9N37L09k88n83k67M36J86Q4p6K40j4J0k62j55l56K09O19J15
6625E05k24p23J01J18M17K34l22k85p1M62Ll78Kj33J39O00l14m57k74O42l5K39
6647B46K18n37j21K22J5m9k08R8K92K22l21n53j8O78p9K20Oo14j08K03L55p8J14
6670B03m27p5K17M55m76K82j17J32J69K21q88j06L96J25K75j45n52j09K44K22
6690D6j88k44M36m0M18j96p92J51K18Q42n74j10k63R6J54J45j67m60M61j84M26
6711A75l59Q1n41N71K23P1j89o0o09L89M86J5m98J68M1OK46l75j42J96P27j16
$$ plain form
6561 294 -114 115 5 382 403 116 -452 -397 492 358 76 244 -292 -88 409 315 126 -93 91 340 156
6582 156 203 -206 -344 -224 769 672 91 -633 -735 379 211 81 -296 -363 121 -14 112 -140 -563 12 172
6603 172 162 -439 -338 -239 298 607 319 -264 -531 -95 91 175 99 339 325 335 73 -82 -438 -229 390 505
6625 505 281 -442 -341 -223 194 428 106 -179 -250 212 215 -163 -161 -294 -155 445 131 -326 -600 42 7 246
6647 246 464 -73 -194 28 43 -6 -214 -116 176 398 77 -476 -494 184 105 325 331 -283 -391 -188 167 89 203
6670 203 -224 -299 -82 373 -103 179 62 194 363 584 -304 -410 -14 111 386 241 -311 -420 -176 46
6690 46 -142 -386 50 10 428 232 -560 -409 -191 651 77 -33 -296 -200 -46 99 -68 -528 -67 -251 175
6711 175 -184 -103 -644 -73 150 221 32 -28 -637 -248 238 253 -245 -77 -36 -30 216 -159 -301 -105 622 506
6733E06k85k31l55L36L81K07n57k17k94M88O6p5k62K35K82K30n38j36P9p1M32
6754B21m5j00n4j12M2Q1Q1k35N3k0L23m48k55J43K20N13n3m02j22j41l2Q3O86
6777D27p76J8M09J33j14k20J89j73M22L97n23n08l3M35J31K88p47j34M57J56l23
6798h9j98j04J70O18j5p78N3J17Q8J38M34l23p40K69L84j27K12o1K0J16J54l35
6820Cm08K65m6L96J16k44n89K10K65J61k80K16j78J95Q6q0o24M48K97L09p5j16
6842C27m06k18M30L33k13l32l61L01J95J15n77J52M60k73J46l33k92K84K50K51
6862B39j76J26n18L1L46j1o9k49J48J70p4j82l3J87M75l94l3k5M3o06M90L83j64
6885A04j54J20l5j58j13J90m55N56K05J40m61j97K73L66O9n39n2Q6j28K02K27
$$ plain form
6733 506 221 -10 -365 -29 352 559 2 -215 -509 -21 45 -30 -292 -57 225 455 -83 -219 -140 -211 221
6754 221 176 76 22 -90 -48 33 114 -121 -68 -88 235 -213 -468 -325 -105 408 355 -47 -169 -310 -342 -259 427
6777 427 -349 -331 78 211 97 -123 66 -107 315 712 189 -319 -352 83 214 502 -245 -379 78 234 -89
6798 -89 -287 -391 -221 397 382 -396 -343 -226 -138 0 434 111 -629 -360 24 -103 109 48 68 184 338 3
6820 3 -405 -140 -186 210 326 82 -507 -297 -32 129 -151 65 -113 82 168 88 -536 -88 209 518 443 327
6842 327 -79 -297 133 466 253 -79 -440 -139 56 171 -406 -254 206 -67 79 -254 -546 -262 -12 239
6862 239 63 189 -329 -298 48 37 -32 -281 -133 37 -37 -219 -252 -65 410 16 -17 -42 1 -605 -115 268 104
6885 104 -50 70 35 -123 -236 -46 -501 55 260 400 -61 -258 15 381 450 -89 -141 -55 -183 19 246
6906B46m22J80J93K64m15q2k07J9Q2O00m33K13m7o73N95K12k78m32P2M05r4J1
6928Iq6j0LK55R2o56K68j72J26O57l32k00k64J93p2P0J52l10O05q4J66m10K42
6951B42l85K64J6L08o92J23K1J22J56j71j56L7M83l44j17q3O2L71j97J2k21mM5
6974a08J30M42k12m60j1K67J50m08R5J49r6L02j95k15k33M28K3R7l31L44P5r4
6996A39j99m3l9J12R4r1J79k25j10p5K11J50J93j38m83J47K54k09L01k15J11N0
7018A14n8k99l89O17M7K53j44j49R5o1J68R9n19p4L7N65k37k90p3m6K22L82o3
7041A97m35J28j50L43j57Q4J03k99L30n0Q2k66j49L00j36l20Q4N7K82M17l40l45
7063b40k0J94n9L90m3j07j36n0K93l08r4k17K99M52J76o81P9J3J09K9r2k34K03
$$ plain form
6906 246 -176 4 197 461 46 -36 -243 -224 -142 458 25 238 191 -482 113 325 47 -385 -313 92 -2 9
6928 9 -77 -87 -84 171 263 -393 -125 -297 -171 486 154 -46 -310 -117 -189 -119 33 -277 328 244 410 0 242
6951 242 -143 121 137 445 -247 -124 -103 19 175 4 -152 -115 368 24 -93 -176 -114 257 60 72 -149 -153 -108
6974 -108 22 464 252 -208 -219 48 198 -210 -115 34 -62 240 45 -170 -403 25 48 145 -186 158 233 139
6996 139 -60 -103 -142 -30 64 -27 152 -73 -183 -258 -47 103 296 158 -325 -178 76 -133 168 -47 64 114
7018 114 56 -243 -632 -15 32 285 141 -8 87 26 194 293 -226 -300 -263 302 65 -225 -298 -344 -122 260 197
7041 197 -238 -110 -260 83 -74 10 113 -186 144 94 176 -90 -239 61 -75 -395 -311 -254 28 445 105 -240
7063 -240 -260 -66 -125 265 222 115 -21 -71 222 -86 -180 -397 -98 354 530 -151 -72 -59 50 79 -13 -247 -44
7086d4J62J80k56k55J08k14O96l7k98k63k5J28o5K76K59m17q9J02n8O5J50k04
7108i9L62L2k22k8m41K98K20Q6l03J27q3m1R0r3Q9j45R8K18j03j66j07J79J19
7131H7J45n2n04J08M04j29oJ92j58q6L23k03j32l34P69m33N00l48n87K55RM99
7153C19l73J66p4k55K68r5k60r9K83L30l4l88k01Q3M97j49J01j92j42p1J30M65
7175C09l65J47P6j09K01l20j96M5M69o5o6r9k28P9M05n5r8l55P5K30K00k91K61
7198B50l97K91R4o0k43j67M5J27O02l20l33j44J83j12K08j5J14j06K79m50l3K20
7220C3k63Q5L55Kj91l48K00J04L47j4m78L01r7j26M09m08L3n6M45o7n06J99n0
7243i1j99N05k00K15m26O37l19l03M3J47J68N7j78k09r5L05k5O2lj67k22K56k4
$$ plain form
7086 -44 118 298 42 -213 -105 -319 377 340 42 -221 -246 -118 -183 93 352 -65 -154 -52 -110 -45 105 -99
7108 -99 263 295 73 45 -396 -98 122 208 -95 32 -51 -92 -2 -95 -6 -151 -53 165 62 -104 -211 -32 87
7131 87 232 180 -324 -216 188 59 53 245 87 1 324 121 -11 -345 424 -9 491 143 -444 -189 -180 319
7153 319 -54 112 38 -217 51 -44 -304 -403 -120 210 176 -212 -413 -330 167 18 119 -73 -215 -286 -156 309
7175 309 -56 91 167 58 259 -61 -257 -212 257 192 126 27 -201 -122 283 228 130 -225 -150 80 280 -11 250
7198 250 -147 144 238 178 -65 -232 -187 -60 542 222 -111 -255 -72 -184 24 9 123 17 296 -154 -187 33
7220 33 -230 -145 210 212 21 -327 -127 -23 324 310 -168 133 36 -90 319 -89 -56 -112 333 266 -240 -41 -91
7243 -91 -290 215 15 230 -196 441 122 -181 -138 9 177 234 56 -153 -248 57 32 94 91 -76 -298 -42 -66
7266f6L73k41n77M66O6M4j74k10L55j77K84j9k56M2k58N43k94K83j37k0rR7l26
7289b11J36M3O4k8k83J36k02K71k4K49J63m62j38L76O3j29j2M9j22J98J38l19
7311d4j51J03N47m40Q7m5l80K87mM9J16j73L62QL7l95K9j24K32K76k44k43K4J22
7335C6o6L4l3k87L23p6P7j61j39L23N7J0o9j88j42J05M21Q1l35o5R8r4J27Q1l66
7360b48M61j21O4J82l28j07K50Q4q4p2k57K53k16K06j40j42L29r3L1j73L58n97
7382c60J80L94k81j52K14r9j20N29l99K87l06K91j82L0k87M32j1Q3k08J48j84
7403aj31j18M19Q2j33q7k55O3L92l85K39j31M45k16l67L08k47K96M8j30k64P0
7425a03Q6J03P1j28J3o2J20j52K07k46J9P6jJ70k10K9J07k15J17K01k16k3N3M01
$$ plain form
7266 -66 307 66 -511 -45 21 65 -109 -319 36 -141 143 124 -132 -90 -348 195 -99 184 47 27 18 115 -211
7289 -211 -75 -32 32 4 -279 -143 -345 -74 -98 151 314 -148 -286 90 153 24 12 61 -61 137 275 -44
7311 -44 -195 -92 455 15 102 57 -323 -36 -40 9 125 -48 314 322 359 -36 -7 -131 101 377 133 -110 -86 36
7335 36 -30 4 -29 -316 7 -69 8 -153 -292 31 88 98 29 -159 -301 -196 225 306 -29 -94 4 -90 37 118 -248
7360 -248 213 92 156 338 10 -97 153 237 153 81 -176 77 -139 67 -73 -215 114 21 52 -121 237 -360
7382 -360 -180 214 -67 -219 -5 -104 -224 305 -94 193 -113 178 -4 26 -261 171 160 243 35 183 -1
7403 -1 -132 -250 169 251 118 31 -224 -161 231 -154 85 -46 399 183 -184 124 -123 173 221 91 -173 -103
7425 -103 -17 86 157 29 42 -20 100 -52 155 -91 -72 4 3 173 -37 -8 99 -116 1 202 -14 -37 16 417
7449D17n26pK7J40RN7r4rQ2O3K10k38j13k35L57O0q1k7k48J99M8N9k0l14J11J04
7475C1Q9q5r6l27K01J93J86l29M3K34j19L06m30j67P5K06l5o0j37o9J88M4M32
7498C74n85J63J60K4j34k2R6k11L30J33n14R0J34k04L11j34L71m22M2j70K87M1
7520A60k63K72k0l67J30M28k23J69j34K74l07k88L3K91P7q5k24K62m38K19K2L8
7542B6l84L98r6P0L5l61N30k19m1L13m11l9J87k10K07q7m1j9J81O8k35J2p2K80
7566I2O8K21k21j22j48q6K53q4m2L85j03O3k0l03q1L43r0Q4L3l64k60M97k03J09
7590B1n3K5K16l40K45n22J54L55M2j4r5j83R6j51p6K22J00r8K86l59J46K9kj03
7614e9N1m9OL5j85K57j14K64k05K56l58O1M8k80M05q1k93J54jK6r0K22k4R0m28
$$ plain form
7449 417 -109 -116 -89 51 60 117 23 14 96 159 369 131 18 -217 140 200 119 92 -156 43 91 150 130 -184 -73 31
7475 31 120 35 -61 -388 -187 6 192 -137 -94 140 21 327 -103 -270 -195 11 -24 -84 -221 -290 -102 -58 374
7498 374 -211 -48 112 136 2 -20 76 -135 195 328 -186 -96 38 -166 145 11 382 -40 2 -168 119 160
7520 160 -103 169 149 -218 -88 340 117 286 152 426 119 -169 -136 155 232 147 -77 185 -253 -34 -12 26
7542 26 -358 40 -56 14 49 -312 218 -1 -42 271 -140 -179 8 -202 5 -82 -123 -142 39 107 -128 -116 -188 92
7566 92 160 381 160 38 -110 -196 57 -27 -69 316 213 276 256 -47 -128 215 125 209 242 -122 -382 115 -88 21
7590 21 -32 -7 209 -131 114 -408 -254 101 143 129 34 -149 -53 -204 -280 -58 42 -56 230 -129 17 46 44 -59
7614 -59 -8 -57 -51 -16 -201 56 -58 206 1 257 -101 -40 8 -272 133 52 -241 -87 -88 -62 -152 70 46 136 -292
7639b92J58k76J91L05j11j55J96P8l59K25j72k57O68j81N1k71J3K14J70r2lr5
7661EoL55m55j73L98kK17k62M7J7l56L09n7J63k47J54j82r7qM54j33l06L34k10
7685d1L85p74L12K57j60o9R3n0p1N4j23J46j21j57N06n1J33n54K15J19L3J93l21
7708d6J45l42J55L04j4l50J68p8Q0R2k41k7J17L30k11k21J45P1kl4J95j89j60
7731a13j83M3Q5J52K72j73Q3N6n7R2k42L9P1P3k84L43m24M12r3P4k45j70J42m2
7755h9O6J68o6n7K48l54J74K0k94M1M9J57l4j3k00L9J20p2p4K6R4K5jn5l1k90
7781d03P69m23Q3R7l91J30J41r8j11J44O2M5j11M4P3j45M59l11K9j49P7Q0O4L7
7805A92l81J23j32K35j56j6P6J52J25j24J95k06k77M34j93P3o8J73k66K08j22
$$ plain form
7639 -292 -134 -410 -219 86 -25 -180 16 94 -265 -40 -212 -469 199 18 69 -202 -189 25 195 103 100 5
7661 5 -1 354 -101 -274 124 122 339 77 124 141 -215 94 37 200 -47 107 -75 -172 -180 274 141 -165 169 -41
7685 -41 344 -430 -118 139 -21 -90 3 -47 -118 -64 -187 -41 -162 -319 187 136 269 -285 -70 49 82 275 -46
7708 -46 99 -243 -88 216 202 -148 20 -58 22 114 -127 -154 -37 293 82 -139 6 77 75 41 236 47 -113
7731 -113 -296 -253 -168 -16 256 83 166 222 165 257 15 54 125 198 -86 257 -167 245 152 226 -19 -189 -47 -89
7755 -89 -23 145 79 22 270 -84 90 110 -184 -143 -94 63 29 16 -184 -145 -25 -97 -171 -145 -51 -26 -27 -82 -113 -403
7781 -403 366 -57 26 123 -268 -138 3 -95 -206 -62 0 45 -66 -22 51 -94 365 54 83 -66 11 91 155 192
7805 192 -189 -66 -198 37 -119 -135 -59 93 218 94 289 83 -194 240 47 120 52 225 -41 167 45
7826D5J12j86k4J54O9k90q7L40j39J94r0j86l08K51R6J52j96p1JR1K57j97k39
7849b51L72j50J21j17j15p0K10k6J45l2J47k04k98K07J79l23K67j18K42k06k92
7870c12K81k92K56j68K52k56P1J41r3J0J46j20mJ58j31j55K07J39k71K74Q6m99
7892b80K01O1J02j23j34J22O0q1O7q0J05j90K06J47jj63m69K57L55K84j99r7j04
7915D6Q0n2Pj14m00M78l16N39m02n7O0M51k70Q9k63J02LK04j04k48K90k34J25
7938A4L97l44l35K09K13k33p5l9j32n0N54k5N7k47j37K41k00O1J17J22k93N13
7960C88l73J83l1k21L0M8k0j44k63O90l3j50k15k8L41J43n78N0j0j30M43J23j94
7983D9l61L63K6k20K01Kk2j52J61j10p0N22n87L33j56kj53J15J97j94R0j5J76
$$ plain form
7826 45 157 -29 -53 101 170 -120 -207 133 -6 188 98 -88 -396 -145 -49 103 -93 -164 -163 -72 185 -12 -251
7849 -251 121 -29 92 -25 -140 -210 0 -26 119 87 234 30 -268 -61 118 -205 62 -56 186 -20 -312
7870 -312 -31 -323 -67 -235 17 -239 -168 -27 -120 -110 36 -84 -88 70 -61 -216 -9 130 -141 133 219 -280
7892 -280 -79 -18 84 -39 -173 -51 9 -72 -5 -85 20 -170 36 183 182 19 -450 -193 162 446 247 150 46
7915 46 126 74 81 -33 -433 45 -271 268 -134 -191 -131 320 50 139 -124 -22 -19 185 81 -167 123 -111 14
7938 14 411 67 -268 -59 154 -79 -154 -193 -325 -375 179 154 211 -36 -173 68 -132 -71 46 168 -125 388
7960 388 15 198 167 -54 -24 24 4 -140 -403 287 254 104 -111 -139 202 345 -233 -183 -193 -323 120 243 49
7983 49 -312 51 77 -143 58 60 38 -114 47 -63 -133 389 -198 135 -21 -23 -176 -61 136 -58 32 17 193
8006A93l53J50J46j42r8K47k17L37M6m27k25n3O17p9r7n8jJ73k24L07k63kJ89
8029A66j93j28K49J9k29O4J36j05j21o2L17k23K84k03O1O8q2R7n07M88l07J78
8051c3J26k15k8j63K93J70J57k28q2j80O5K71J51k35j57N5J84l0k49J9J87M8L6
8074A62j26k00N3M00l12J43k02J31r6L66j96j33j0K36l48R8j73J28J04q8J41q5
8096gK1N0K00q9j35j01m4m6L87k26J3M4k16K99jj64R8k65j60K18N9p0K69MM7j8
8122A67j40k52K14L21l7k26k21N1N0R2J18j90o1l0J68k5l00M4L59o8L5j20k87
8145c38L17o4N8q8J80r2k29J01j0K60l16q0M76p1q3q8k20K27j65M25Q9n92J44
8168a59J71j00j46K88o2K47jl45Mq6N0J00P8L68q10J88N18n69L34j2L5J81j28
$$ plain form
8006 193 -160 -10 136 -6 -104 143 -74 263 309 -118 -343 -396 221 142 45 -13 -14 159 -65 242 -21 -23 166
8029 166 -27 -155 94 113 -116 -52 84 -21 -142 -204 113 -110 174 -29 32 100 18 115 -392 96 -211 -33
8051 -33 93 -122 -150 -313 -20 150 307 79 -3 -183 -118 153 304 69 -88 -33 151 121 -128 -109 78 126 162
8074 162 36 -164 -111 289 -23 120 -82 49 -47 319 123 -10 -20 216 -132 -34 -207 -79 25 -63 78 -7
8096 -7 14 64 264 175 40 -61 -105 -151 236 10 23 67 -149 150 149 -15 83 -182 -342 -124 -65 -135 134 138 185 167
8122 167 27 -225 -11 310 273 47 -174 -123 -73 19 137 -53 -114 -144 24 -1 -301 -257 102 34 69 -51 -338
8145 -338 -21 -85 -27 -115 65 -27 -256 -155 -165 95 -221 -301 175 104 21 -67 -287 -60 -225 200 289 -303 -159
8168 -159 12 -88 -234 54 -8 239 238 -107 -103 -189 -139 -39 39 407 -403 -215 303 -266 68 56 91 272 144
8191A44
$$ Imaginary data points
##PAGE= N=2
##DATA TABLE= (X++(I..I)), XYDATA
0@%%%%jJqJ6j6J9k7L2m0N6o8P6r0J12j34J55j81K10k43K81l22L70m23M81n45O15
30C26o94P80q73R77j091J214j350J500j667J848k043K264k508K777l077L413l793
47a997M224m720N298n978O796p800R064j0721J2990j6295K1594l1462N5928k23561
61a86640m27426M10659M48508L457l60083j85880J58676K54755p9477k65961k3133
72b52545K62023J53481q2617j78416p5394Q4514J21819L552j969O3276l0375j53667
84h6318l9615J13458R9202L142o0057m0390O6517N0388j28202j40863R4721K14926
96A46909P9931j19937k04122o7520J71790J65967o4091j33685k048O3149K3436
107E9779l9894q4033j1088J12927P4841m9680o9456n8834n7474L5227J15051N7184
$$ plain form
0 0 0 0 0 0 -1 0 -8 8 -8 11 -16 16 -24 32 -36 40 -50 62 -72 83 -98 112 -131 150 -172 198 -225 256 -289 326
30 326 -368 412 -461 516 -575 639 -711 789 -878 970 -1073 1191 -1317 1460 -1617 1796 -1997
47 -1997 2227 -2493 2805 -3173 3623 -4177 4887 -5834 7156 -9139 12455 -19007 36921 -186640
61 -186640 -614066 -203407 245101 248558 -111525 -297405 -138729 116026 36549 -229412 -252545
72 -252545 9478 162959 80342 -98074 -173468 -88954 32865 36417 34448 97724 67349 -86318
84 -86318 -125933 -12475 86727 89869 29812 -10578 55939 106327 -21875 -162738 -68017 146909
96 146909 226840 106903 -97219 -164739 7051 173018 108927 -24758 -26806 36343 59779
107 59779 19885 -64148 -75236 37691 112532 62852 -6604 -65438 -122912 -87685 27366 84550
119H4550k0126o0397r0901k0270R7375N3356n6372k1648M9302K6689k1413o6218
131d6073o4775N3479J34390L2001q4496q6650m8250L4064J17639M6624q2507n3674
143d8228L7619M2028P017n1382r0785K6089J71764Q5758j09689j53271m9097R2679
155c9498J55881K4297j42076q8365N8934P1976O150m8480p3020J3478J23953M9098
167A12328j09946j17171j1145Q6830J25134K5087j17134q0152N4640N8795j4326
178A2940l7684j9932M6609R5413o341j27616o5296N8019P4520M3787o373p1123
190c077n2962J6739K1852K0004M1286r272n8821N991M9932j1368n4738l6121K1914
203d8641J12874R2510r4249j76161j7260J30939R9969j9112j04478n3188Q6800
$$ plain form
119 84550 64424 4027 -86874 -107144 -9769 43587 -12785 -34433 14869 41558 20145 -46073
131 -46073 -110848 -57369 77021 109022 24526 -62124 -110374 -76310 41329 87953 5446 -48228
143 -48228 -10609 31419 38436 -12946 -103731 -77642 94122 179880 70191 -83080 -132177 -39498
155 -39498 116383 140680 -1396 -89761 -30827 41149 47299 -1181 -74201 -60723 63230 112328
167 112328 2382 -114789 -125934 -39104 86030 111117 -6017 -86169 -31529 27266 12940
178 12940 -24744 -44676 1933 97346 91005 -36611 -101907 -43888 30632 74419 68046 -3077
190 -3077 -56039 -39300 -17448 2556 43842 34570 -24251 -18260 31672 20304 -34434 -70555 -48641
203 -48641 64233 156743 62494 -113667 -130927 12 99981 80869 -23609 -76797 10003
214A0003P7158q3211j03932M3737J13142M5307n8203j11132l3441R0246O1510
225E1184l7506j1604M0331j3244o1042l0532K1600O3049L3801n7894m2350O6774
237B2567L5582r7909q6716N2288J33283P5540r1225j79616k2659J67810J02642
248A11587p6142r7073M988Q0165M9835p1640j07720L6760J37408M6630o1291p0305
260a6798m0585J4973O0649K7435r784K968j7358m2747R734L6916j8259k7120K9326
273I350M3185J3034m4207r6445k4842J19633J07179m4896j08935n0127L2119P6723
285C1771K0203p5000l8590O8957N8114l2863p1411n5979J3578R8326O5110m9225
297C2991p6484l0070R706N2182N1773k5870n0638J3359L1379p048k2828k6338
$$ plain form
214 10003 87161 3950 -99982 -56245 56897 102204 44001 -67131 -100572 -10326 51184
225 51184 13678 2074 42405 29161 -31881 -62413 -40813 22236 56037 -1857 -44207 22567
237 22567 58149 -39760 -126476 -74188 59095 134635 43410 -136206 -158865 8945 111587
248 111587 35445 -61628 -56640 23525 73360 1720 -106000 -69240 68168 114798 53507 -16798
260 -16798 -57383 -42410 18239 45674 35890 38858 21500 -21247 -11513 25403 7144 -19976 9350
273 9350 52535 65569 21362 -75083 -99925 19708 126887 81991 -26944 -77071 -44952 31771
285 31771 51974 -23026 -61616 7341 65455 32592 -38819 -94798 -81220 17106 82216 32991
297 32991 -43493 -73563 -63857 -11675 40098 14228 -36410 -23051 8328 1280 -21548 -47886
309d7886K476P3432O0577m8771q4688k2235K9212N7108M5479k8677n3480J0333
321g120K9457j0893j5359n710j065M0569M5661l2241o8103k2349K0222N0288N7497
334H0854j5087p6447l1562K2289K1326K0711N823k9990n959L4106r97m2821k6421
347d4175k622L1708O9312J5628p9608o8356J3618N6515N1097l710o8161k7507
359e6261O2404L4701n5490n2602J7848P1524O5381l2346j14793m2622P5910P2093
371D5747M424l0223l7529n363L5115M670l4650k101K3983Q276J9601J4553m6920
384d17o0995O234O0890O6991J1698q7246r0848L8692J00298J2998o1484l9106
396d2295K9350P0956N992j06400p2946P9796J15587P555p7098p2068j341O7848
$$ plain form
309 -47886 -45410 28022 88599 39828 -44860 -67095 -37883 19225 64704 36027 -17453 -7120
321 -7120 22337 11444 -3915 -9625 -10690 29879 75540 43299 -24804 -47153 -26931 23357 80854
334 80854 65767 -10680 -42242 -19953 1373 22084 27907 -2083 -8042 26064 25067 -17754 -44175
347 -44175 -46797 -15089 54223 69851 -9757 -78113 -64495 -7980 43117 39407 -28754 -56261
359 -56261 6143 40844 -14646 -67248 -49400 22124 87505 55159 -59634 -102256 -26346 45747
371 45747 50171 19948 -17581 -22944 12171 16841 -17809 -19910 4073 12349 31950 46503 -417
384 -417 -61412 -55178 5712 72703 84401 -2845 -93693 -55001 45297 58295 -3189 -42295
396 -42295 -12945 58011 64003 -42397 -115343 -35547 80040 87595 10497 -61571 -62912 4936
408D936L4956m3060k4717L6392J8137k0375j9665j6950j444L5358K9343J865j857
421C2919l5898o6169O156R0145N4439l1737o5853l7063L3998O2068j7366p0335
433d4696Q322P7490K9349m6606p2094l0096N8846Q1721n894n8681j9019N421k302
446a8239J0057J3762K493J0903J068k6867j0143P007k1963p166N4424M5552k4438
459C6450o3045n1282J3118Q4190M7992n5423n8482J8245M1601Q606k8844m1912
471d8786J4758Q0184L3168n9853o4942j4077L2927O7462L8094m4129n8662n931
483b9787J9258J9248J2112k1251j9178L6582L4479l2643n6376k0144K8665P0292
495D1257M0524n5363p7366j087M6631L2590M665l0784k6151L0946L4710l2591
$$ plain form
408 4936 39892 -3168 -27885 8507 26644 6269 -13396 -30346 -31790 3568 32911 34776 32919
421 32919 -2979 -69148 -62992 27153 81592 49855 -15998 -53061 -19063 43005 25639 -44696
433 -44696 -36374 41116 70465 23859 -48235 -78331 -19485 62236 56342 -2339 -21358 -15937 -18239
446 -18239 -8182 5580 8073 18976 20044 -6823 -16966 -9959 -31922 -39088 15336 60888 36450
459 36450 -26595 -77877 -64759 19431 67423 12000 -46482 -28237 13364 21970 -6874 -48786
471 -48786 -34028 46156 79324 19471 -45471 -59548 -26621 40841 78935 34806 -23856 -29787
483 -29787 -10529 8719 20831 -420 -19598 16984 51463 18820 -37556 -57700 -29035 41257
495 41257 81781 26418 -50948 -52035 -5404 27186 31851 1067 -25084 5862 40572 7981
507G981n2764o444L8887O0913K8403o2136q5017j220O2368M7570N561l9274m2715
520c7887J9627M4883j4006m3539j222L4431L8512J0238n0726o0318J1614N2197
532C804K6273L756j6908m0408j5113K3519J1900k174N882p26L368J9864j3781
545I256n3866j0092N2505N0389R737m0936o0725k719N8672K6900k3995j3067L948
558F007K959O128j1539l0259L054L5623J9435M213j1594n1001l8171L6991O4752
571C6598K1103k8973n2904k1815M7607M1927l7607m5566K5569N4068J4160m4731
583I436p0273r235P8996N7387l4094n6517j6429J3872K6967P855k5228n921L3033
596I849J2726k0725j7030j7705p951L7223M9363J913l7871m6355k0068M6156O5826
$$ plain form
507 7981 -44783 -51227 -12340 48573 76976 14840 -70177 -71397 -9029 38541 44102 4828 -37887
520 -37887 -18260 26623 12617 -30922 -32144 2287 40799 51037 311 -60007 -48393 3804
532 3804 30077 33833 16925 -23483 -38596 -15077 -3177 -5351 531 -195 3173 23037 9256
545 9256 -44610 -54702 -2197 48192 57929 16993 -43732 -46451 12221 39121 15126 2059 6007
558 6007 8966 15094 3555 -26704 -23650 11973 31408 35621 24027 -26974 -65145 -28154 36598
571 36598 57701 28728 -24176 -45991 1616 43543 5936 -39630 -14061 40007 54167 9436
583 9436 -60837 -70072 8924 66311 32217 -24300 -40729 -26857 110 7965 -17263 -23184 9849
596 9849 22575 1850 -15180 -32885 -40836 -3613 45750 47663 9792 -36563 -56631 -10475 55351
609E5351r633o2122j5682L6103K9703j3631n2680k3248O4618P1811k8919q2257
621c0586l1253L4324N5148K3262l4480l4146J8426J9305k2075j8176Q067J4526
633B342J9530P440k6966k7337j864J99J3351M0808J0591m3408l5886M007K6751
646a0442K9336o24l4071j285M1746P756m0789l0321Q705M4650M9272j1087o6665
659a3819l2279K6054L2506J7161m339k8923j2205K0988N349k3501j0316Q223K0271
672E170K9782l065n2243l2760K4213L8458K3890k536l5163k5079J9527J9019j1828
685b615j0117M545J1838K2681Q04m7064l6593K2225M7987L1130p214n2901m1750
698e7044K9714N1398L009k7789j4004J1617L0944O043m8474l5930L5008N5296
$$ plain form
609 55351 45718 -16404 -32086 4017 33720 20089 -32591 -55839 8779 80590 51671 -30586
621 -30586 -61839 -27515 27633 50895 16415 -17731 695 20000 -2075 -20251 -12184 2342
633 2342 21872 29312 2346 -24991 -26855 -26656 -13305 27503 38094 -5314 -41200 -37193 -10442
646 -10442 18894 18270 -15801 -17086 24660 32416 -8373 -38694 -29989 14661 63933 52846 -13819
659 -13819 -46098 -20044 12462 29623 25284 -3639 -15844 5144 10493 -13008 -23324 -15101 5170
672 5170 34952 31887 -20356 -53116 -28903 9555 33445 30909 -4254 -29333 -9806 9213 -2615
685 -2615 -12732 -8187 3651 26332 27136 -19928 -56521 -34296 13691 44821 37607 -15294 -57044
698 -57044 -27330 24068 27077 -712 -14716 -3099 27845 33888 -14586 -50516 -15508 39788
710C9788J4869k6203m7844k6136L0664M0222k742j7194l572l461Q20N559j5112
723a0342j5540K1022L0562N794j4687l4133l1262K2927N4065J4968k7549k9268
735a3443j2904J5397K6337j1594l0363J2749L6894N140k6730l4429j7019L0727
747a9238M9284O136k8721k2464j4465L359L1943J9779j5079j3497L726N605M459
760A0827j2490k9928P588N5437K5562m0301n1932j4219L2239M7456K649m1957
772i069j2410K6191O575k0355j2981M350K4090K7700p437l3162j4876J426O186
785a3772K9159K7903j4426l7550j9029P843K9278K0054k3491k8085K2647L3253
797C3784j6053m2606k1009K4788N7323K3253m9766n5828P720M0108K0842o470
$$ plain form
710 39788 54657 28454 -19390 -45526 -14862 25360 22618 5424 1852 -1609 -789 4770 -10342
723 -10342 -25882 -4860 25702 31496 16809 -17324 -48586 -25659 28406 43374 15825 -13443
735 -13443 -26347 -10950 15387 3793 -26570 -13821 23073 28213 1483 -32946 -49965 -19238
747 -19238 30046 36182 7461 -15003 -29468 -26109 5834 25613 10534 -2963 763 6368 10827
760 10827 -1663 -31591 -24003 31434 56996 16695 -35237 -49456 -17217 30239 32888 -9069
772 -9069 -21479 4712 11287 -9068 -22049 -17699 6391 34091 26654 -6508 -21384 -19958 -13772
785 -13772 15387 43290 28864 -8686 -27715 -19872 9406 29460 5969 -22116 531 33784
797 33784 17731 -24875 -45884 -21096 36227 59480 9714 -46114 -38394 1714 22556 16086
809A6086k2924p847K3503R871k9909k2104J4414K4010J9525J982l1080l2124M547
822c2050K3744K0770J3092j3693l1449r54K4471N345j3359p648N697K5767J9809
835C9542k9026m7930L01M3048L2376M64l1695l6069M885L3449Q458j4463p584
848d244K001J0955J2319j7313l4856K311L6003K5899k998k9080l4741M894L8457
861I607J4151j8985j2018L098P561N231j3969k1557J0547K9933P757j0731j5055
874d430k0657l775K5774K1506p93j0443j8045j0602J8382J8985j2957j6003R650
887c408J9333R016j4080l5868j1333L9609L7692j0170l3382k1380L675K7867J5060
900B2631k0574j6915J5952J6231m672j6690k0763L79L3266K5252j4884k8246j5077
$$ plain form
809 16086 -6838 -14685 8818 18689 -11220 -33324 -18910 5100 24625 26607 -4473 -36597 -32050
822 -32050 -8306 12464 25556 11863 -19586 -20540 3931 9276 -4083 -11731 -6034 19733 39542
835 39542 10516 -37414 -37113 5935 38311 38775 7080 -28989 -24104 9345 17803 3340 -4244
848 -4244 -2243 8712 21031 3718 -31138 -28827 7176 33075 30077 997 -33744 -28850 9607
861 9607 23758 4773 -7245 -4147 3414 8645 -5324 -26881 -16334 13599 21356 10625 -4430
874 -4430 -25087 -28862 -3088 18418 17625 7182 -10863 -21465 -3083 15902 2945 -13058 -3408
887 -3408 15925 24941 10861 -25007 -36340 3269 40961 30791 -2591 -23971 -20296 7571 22631
900 22631 2057 -14858 1094 17325 12653 -4037 -24800 -24421 8845 34097 19213 -9033 -24110
913b4110J520K2277K1290j1128k1765K852J1733J660n782j4664o525K4955K6605
926B8918j0924k9047j6588K578K4423K7239n169k6516r263N860Q747R283n233
939D308j5551P443K6314K254k5841k4394j063L1670L7274j0207m5398j6450K2574
952g067K2659O9j7954j2801J9480K4608j7044l6272l810K4161K2389O897j7271
965H044k3480j903R498K418Q697J1946r020j7008M88P682J958l200q641L484K6955
980A7918R618l4109l2330J0612L4854K4950r487l6339j4657K5906J8783j4243
992A476j4369N916J6737J3945r980l1601j0406K4482K3327M587q311k0439j3877
1005a8513J1785J6668Q46m656l295l545P114N835j6898j6346J2274K2848J0492
$$ plain form
913 -24110 -22590 -313 20977 9849 -11916 -9064 2669 4329 -1453 -16117 -22642 2313 28918
926 28918 17994 -11053 -27641 -25063 -640 26599 21430 -5086 -14349 -8489 258 9541 4308
939 4308 -11243 -3800 22514 24768 -1073 -25467 -26530 5140 42414 32207 -13191 -29641 -7067
952 -7067 15592 15661 -2293 -15094 4386 28994 11950 -24322 -28132 -3971 18418 25315 8044
965 8044 -15436 -17339 -7841 -5423 3274 15220 6200 -10808 -10320 -2638 -680 -3880 -12521 -9037 17918
980 17918 27536 -6573 -38903 -28291 6563 31513 22026 -14313 -28970 -3064 15719 1476
992 1476 -12893 -6977 9760 23705 13725 -17876 -28282 -3800 19527 24114 15803 -4636 -18513
1005 -18513 -6728 9940 10786 6130 2835 -710 6404 12239 -4659 -21005 -8731 14117 24609
1018B4609p557k6977k1004J5194K8254N608j0857j0941q092N516J2251o232j3830
1031a4058M960J5085Q440k348k1516k4106J1124L5637J3901j7239k3668j0258
1043b4046J5640K3319o139k4235L387K5036J0043j4568k5896j1713K4476L3960
1055B9264j794k7215j3778K002R633J1615j470r992K194P366m606n523k112o771
1069a1187L826J9246Q443j1294j6307j3447L562K5934J6119j5650j8431R0Q138
1082i58O592k998j4423l53K3781J1406j8266k3158p007J2974K7023J0599k2264
1095B948k0461M135J1815N841j092r576j004J7592P429j7881j6804k6J2843J9954
1109A5713Q235j7662j9532l7P252P747R654k102j2470k79O629j716m751m016j240
$$ plain form
1018 24609 17052 -9925 -30929 -15735 12519 18127 7270 -3671 -11763 -6247 6004 -228 -14058
1031 -14058 -9098 5987 14427 12079 -9437 -33543 -22419 13218 27119 9880 -13788 -24046
1043 -24046 -8406 14913 8774 -15461 -12074 12962 23005 8437 -17459 -29172 -4696 29264
1055 29264 27470 255 -13523 -11521 -1888 9727 8257 -1735 459 7825 3219 -2304 -4416 -11187
1069 -11187 -7361 11885 20328 9034 -7273 -20720 -17158 8776 24895 9245 -9186 -9096 -958
1082 -958 5634 2636 -11787 -12140 11641 23047 4781 -18377 -25384 -12410 14613 25212 2948
1095 2948 -17513 -13378 -1563 4278 3186 -6390 -7394 10198 17627 -254 -17058 -17084 -4241 15713
1109 15713 23948 6286 -13246 -13283 -6031 1716 11370 9268 -3202 -3481 3148 1432 -3319 -7335 -8575
1124h575J5243J9959r726l0991j2304J5041K6453J3549j7743k8257L087K4274
1136A0010K368j9108j0223R747K4218R563k6876l1800N804L0310J5375n128j6412
1149b152j3336N608J1883k851m412O697L724j475J381n445j2597j226J1789J3197
1163A0785R092q393k7430j0508K0236J9610p30j0268r047K042J2390k302j8026
1176a2549o31K0156J3418k779j4765j9055j288K0584J5192k983q718j0434o500
1189a0352Q902Q665q249o483Q065R628J203j1162k0917m512K5346K2518o774k0065
1203d187j3164J166J5586R519r286o092Q640M397o322o810o508R51J5747J2139
1217A5776o089j1472r947o375J0624K0294K896j3587p799P18O707O271p813j1045
$$ plain form
1124 -8575 6668 26627 16901 -14090 -26394 -11353 15100 28649 10906 -17351 -14264 10010
1136 10010 12378 -6730 -16953 -7206 17012 26575 -301 -32101 -26297 4013 19388 14260 -2152
1149 -2152 -15488 -9880 2003 -848 -5260 1437 5161 3686 5067 -378 -12975 -14201 -2412 10785
1163 10785 19877 11484 -15946 -26454 -6218 13392 12662 2394 -6653 -4611 7779 5477 -12549
1176 -12549 -13180 6976 20394 17615 2850 -16205 -17493 3091 18283 15300 6582 -3852 -10352
1189 -10352 -1450 7215 -1034 -7517 548 10176 11379 217 -20700 -25212 134 22652 15878 -4187
1203 -4187 -17351 -16185 -599 8920 -366 -6458 2182 6579 257 -6553 -13061 -12110 3637 15776
1217 15776 9687 -1785 -11732 -18107 -7483 12811 15707 2120 -5679 -4961 1746 8017 204 -10841
1231a0841J2669K1435k966k2465j6965L025K3414K0235j1315k4531l867J0679
1243a493N615j469o741l484J0967J0953j0005j7103l383O597J3148J2339n290
1256A0651j7435o555M779N131Q062K297p549l374N312n67o518k186J3O365J5279
1271A3705Q24j9832j4613N244J5741J4885j246j9915q610J4977J0461q563j0935
1284g877M44J3564J6265o870k6860j0393J7795J7742K601r096j4739k905J1332
1297A003K869p122N7N098J486J601j911j0619m610P443Q646O998J263j4061j5030
1312a6889N538J5848N261n188q431m339R886P256j3273j3413R024J8030O932q941
1326G301j9389r240J5791J7442k012r160l093p45L199L825n353m258O717O985
$$ plain form
1231 -10841 1828 23263 20297 -2168 -19133 -16108 7306 27541 16226 -8305 -12172 -1493
1243 -1493 4122 2653 -4088 -7572 3395 14348 4343 -12760 -16143 -9546 3602 15941 10651
1256 10651 -6784 -13339 -8560 -3429 4633 6930 -619 -3993 1319 752 -5766 -7952 -7939 -1574 13705
1271 13705 14529 -5303 -19916 -14672 1069 15954 14708 -5207 -13817 1160 11621 3058 -7877
1284 -7877 -7433 6131 22396 15526 -11334 -21727 -3932 13810 16411 7315 -7424 -10329 1003
1297 1003 3872 -3250 -3193 1905 3391 4992 3081 -7538 -12148 -4705 3941 10939 12202 -1859 -16889
1312 -16889 -11351 4497 9758 4570 -3861 -8200 1686 8942 -4331 -17744 -8720 9310 16242 7301
1326 7301 -12088 -21328 -5537 11905 9893 733 -2360 -3105 94 3919 -1434 -5692 1025 8010
1340H010O18j832r978j2527N884J8632P683p974j3888r106P516J5957j363j3551
1354e919j93J1840N108n654j3555q012J2993J9910l73j4668r289j976N133J0180
1368E525J487o999j715J889j413K02j547p062J981J4858O254r372j3757q534P858
1383a0345K0872O681j5932j2106M584Q713K330n600q424N572J6824O72j6411j0958
1397a3528K634J0205J2671O50j2586o661K893J889K168M372k014l075M625K215
1411F458n912n304k028L446J2998P441j2782j6170p08R721J0243K776j0319q632
1425h772O405P498n234p582n49N731J0893L740j3342j3761L047J1173Q799K393
1439A0439q828j0714K933Q822o83m063r01K503O601L522r789j2378L165J1948
$$ plain form
1340 8010 8628 6796 -3182 -15709 -9825 8807 16490 8516 -5372 -14478 -6962 8995 7632 -5919
1354 -5919 -6112 5728 10836 5182 -8373 -16385 -3392 16518 16145 1477 -7812 -9788 -4655 5525
1368 5525 7012 13 -1702 187 -1226 -1024 -2571 -9633 -7652 7206 13460 4088 -9669 -18203 -10345
1383 -10345 10527 17208 1276 -10830 -6246 2467 4797 -803 -9227 -3655 13169 13841 -2570 -13528
1397 -13528 -10894 -689 11982 12632 46 -6615 -3722 -1833 335 4707 2693 -382 4243 6458
1411 6458 546 -4758 -6786 -3340 9658 17099 4317 -11853 -12561 -2840 7403 10179 -140 -8772
1425 -8772 -2367 5131 -103 -7685 -8234 -2503 8390 12130 -1212 -14973 -11926 -753 8046 10439
1439 10439 1611 -9103 -6170 2652 1969 -2094 -2995 -492 6109 9631 -158 -12536 -9371 2577
1453B577P532J234q654j1844Q09J0743L630k286k800k461L304O239n203j2131
1467i311K28J2045R320l22j2217j3434K819J5135M671o136n094j395K165M475
1481B949l692p498L124R084K643j852o455q963l22J2016P986k386n943p777j062
1496h148R481N145p976m326N549O951N05q209j2098J870J7682Q975q723j1224
1510d546l535L902Q429K239p204j230O356N70m114l283k326J341P782M429l753
1525E057n254n709l894P808J1348p98j0023m209J770N635J978p408n751R900J1572
1540A2022m823j3459p258N075J3856P215r259j1269K127N985N91j370j966N63
1554a970N564K810o273n946J12J836N833P356j991r847m815J638N911P294j331
$$ plain form
1453 2577 10109 11343 2689 -9155 -8346 2397 6027 3741 941 -1520 1784 8023 2820 -9311
1467 -9311 -9083 2962 12282 11960 -257 -13691 -10872 4263 8934 2798 -2296 -3691 -1526 2949
1481 2949 -743 -8241 -5117 3967 6610 4758 -1697 -10660 -10982 1034 9020 6634 691 -7086 -8148
1496 -8148 1333 6478 -1498 -5824 -275 6676 7181 -1028 -13126 -11256 6426 15401 6678 -4546
1510 -4546 -8081 -4179 4250 6489 -715 -1945 4411 4981 867 -2416 -4742 -3401 4381 8810 5057
1525 5057 -197 -5906 -9800 -1992 9356 8558 -1465 -5674 -3904 1731 3709 -3699 -9450 450 12022
1540 12022 7199 -6260 -13518 -8443 5413 12628 3369 -7900 -5773 212 803 -567 -2533 -1970
1554 -1970 3594 6404 131 -5815 -5703 -3867 1966 9322 7331 -2516 -7331 -5693 218 7512 6181
1569F181q687r34P004J282n744m889J037Q714R292n641j4406m194P668Q290L376
1584H349m319q123n67O507Rm359j111J897M294M293m028j0290k462O561O944L842
1600G437k896r508l491O305M571j567j895n04J789M219j916q487k591P416P148
1615F030J892l977r026l311O490O309m90j902j870j021K465R80m995j812M962
1630G24M963R53k988q033m235O556P790J153l932n137l551M312M463k695m552
1645d209K801M431J954k944p880m799Q452J0143o78p201n841n37N473M986l633
1660E18l855L170L818j689l382l368q13O237N231j228m467k817k557J491P136
1675C425K777l798l880q98K122L596k071n741J946Q966K624p848q133j836Q241
$$ plain form
1569 6181 -2506 -3440 3564 4846 -898 -5787 -4750 3964 13256 7615 -6791 -10985 -3317 4973 8349
1584 8349 4030 -4093 -4660 1847 1856 -2503 -3614 -1717 2577 6870 2842 -7448 -9910 -3349 3595 7437
1600 7437 4541 -4967 -8458 -2153 2418 851 -1044 -1548 241 4460 2544 -5943 -8534 -1118 6030
1615 6030 7922 3945 -5081 -8392 -1902 4407 3917 2015 145 -876 1589 2569 -2426 -4238 724
1630 724 5687 6640 3652 -4381 -8616 -2060 5730 6883 2951 -2186 -5737 -1425 3038 343 -4209
1645 -4209 -1408 3023 4977 2033 -5847 -10646 -2194 7949 7271 70 -5771 -6308 -835 4151 518
1660 518 -3337 -167 3651 1962 -1420 -4788 -5601 636 5867 4639 172 -2645 -5202 -3711 3425
1675 3425 6202 2404 -1476 -2374 -252 3344 1273 -4468 -2522 6444 9068 1220 -6913 -8749 -508
1690e08J0399k454j0818k944N976L641k621l710j051N581N406m067p932p69L775
1705b096L395L249o08m119k686k63j2L528L508k519m087J960K420j497l040k514
1721e381L112P865K410r217p428K680P107M768j186o635j931N435K279m563k548
1736c233J672L836L959j412p293l835L183N100K798q2m160m613J352L593M09j090
1752A84o21J29L268J339n685n315L206N797L606j519o200n082L663N189j1k239
1768b91o43p6J195J109l566l214K981N014J620n29n457n022K333O914K805k338
1784B835l249k363J789L908j536m445J016N034K138j740n826m478L577P975K036
1799F671m724l658j556K077L239l15k723P52L216m93j851k868j865J949N563J186
$$ plain form
1690 -508 9891 7437 -3381 -6325 -349 3292 671 -3039 -4090 1491 6897 2830 -5102 -5871 -2096
1705 -2096 1299 4548 3940 -179 -2865 -3128 -3140 388 3896 1377 -2710 -750 1670 173 -2867 -5381
1721 -5381 -2269 5596 8006 -1211 -8639 -5959 1148 5916 4730 -1905 -3836 1599 3878 -685 -3233
1736 -3233 -1561 2275 6234 4822 -2471 -6306 -3123 1977 4775 4693 533 -4080 -2728 865 1274 184
1752 184 -437 -308 2960 4299 -1386 -6701 -3495 2302 5908 4389 -1811 -6893 -3230 1959 1948 -291
1768 -291 -934 -1010 185 1294 -2272 -5486 -2505 2509 4129 3600 -1857 -6879 -4546 2368 5173 2835
1784 2835 -414 -2777 -988 2920 1384 -3061 -2045 2989 5127 3387 -2439 -6917 -3340 4635 6671
1799 6671 1947 -1711 -3267 -1190 2049 1734 -989 -237 2979 2486 635 -2233 -4098 -2149 3414 4600
1815D600l152l306k893L01M920L159k831k921K57J250J174r46l653k23O625L712
1831F073l722o074k955L447P597K385n822m678K025L297N18k475k685J630O259
1846D820J045o360m394J106L788L988M44l881k283P06P8M76K081L57j813J4J307
1863A479j056j203j779o17M734M800l165p734k305M046N927J747n004m853L354
1878a629M922j921n195j127M399N488O02o610n350K390N433J927o10j982k259
1893a522M38J157o55n1J120J75K02J742j614m317n45L112M229K486l210o628j066
1910d947N732L178k144k255p97K234K457k630n679J070N482L069p47m778m361
1925e116L59N589K485k392j156j322M3K206m9l128k15L580K374k68l400m655K86
$$ plain form
1815 4600 1448 -1858 -4751 -4450 470 3629 798 -2123 -1866 -616 558 -388 -4041 -4264 2361 6073
1831 6073 2351 -3723 -6678 -3231 4366 6751 929 -3749 -1724 1573 2091 -384 -3069 -1439 4820
1846 4820 5865 -495 -4889 -3783 5 3993 4437 556 -1727 -1021 -943 -467 1614 1971 158 172 1479
1863 1479 423 -780 -2559 -3176 1558 6358 3193 -4541 -6846 -2800 3127 4874 -130 -4983 -1629
1878 -1629 3293 1372 -3823 -4950 -551 4937 5539 -1071 -6421 -4031 1402 3329 2719 737 -1522
1893 -1522 -1084 73 -582 -633 487 662 864 2606 992 -3325 -3870 -758 3471 5957 2747 -3881 -4947
1910 -4947 785 3963 1819 -436 -1233 1001 3458 828 -4851 -3781 1701 4770 4023 -755 -5116
1925 -5116 -4757 832 3317 925 -231 -1553 -1510 696 647 -2481 -2696 884 3258 2990 -410 -5065 -4779
1942d779N940L713j912l697j922L57K688J219k722l9K456J142j162k090k855M59
1958c204N122K787j449l155k744p53L749L465j383l170K49Q95Q69n76l078j061
1974c437M689M286k194m908l889J425N557L764l352m870Q47K435P94j241k510
1989b604j19M558K723l589m656o92K142M014J797k426l309K19Q79L23J243L16
2005H19j322P92J655j312j672j352j74L423M658j554n734k808K568M007K404k481
2021A917m065L41M472k83l686k699K328M541K910m199o385J62M683K706n5k360
2037C28k261Q08J734j026j485J043J471K34N82n69l385j188J701K615K761l45
2053C018m811l145L189L943n78k081j741J757L487k89n831j919M512N018P75m005
$$ plain form
1942 -4779 1161 4874 2962 -735 -2657 -2300 388 1607 -1115 -1154 1302 2444 1282 -808 -3663 -3204
1958 -3204 1918 4705 3256 101 -2643 -3396 353 3818 2435 -735 -486 409 1278 702 -2376 -3437
1974 -3437 1252 5538 3344 -1564 -5453 -4028 1529 5293 1941 -2929 -2082 353 1147 -94 -2604
1989 -2604 -2723 1835 4558 969 -3687 -4379 -2237 1777 3574 1148 -2161 -1942 -1063 -740 503 819
2005 819 -503 289 1944 632 -1040 -2392 -2566 857 5515 3961 -1773 -4581 -2013 1994 4398 1917
2021 1917 -2148 -1807 2665 2382 -1304 -4003 -1675 2866 5776 1577 -4808 -4646 37 2743 2688 328
2037 328 -1933 -1125 609 -417 -1902 -859 612 846 1428 859 -2526 -3714 -2013 602 3363 3018
2053 3018 -1793 -4938 -1749 2194 1616 -465 -2206 -449 3038 2749 -3082 -5001 -489 4529 5304 1299
2069A299n246m62N207K595k089j843M52K74J324n75l309K83L218K199m21k084
2085H22l636j532L597M165j75k344k459j215K201K033k117j486K090K270R8k733
2101d21l551n51M651L805j082l115k532n23K293K976p79k264N99J373J61q78j958
2118a796j876L570N051q13m213l721k63M340M107j293m411m00K880M82j422j957
2134a735l38L847L401k735m743j382J360L241L193j574l531q82J155J2J061p1
2150B79r56P29J672n33k715j637N4L032M144j66n443l134J897L046K073n17l569
2167a744k92L724N93l660j810J203L438L570j961n915j848L706L175O45j340k399
2183i15m59K603o7k519K68J531J212J162r32l491j943K144K520K170O1l505l600
$$ plain form
2069 1299 -3947 -4409 798 3393 1304 -539 -87 187 1511 936 -2373 -2090 1128 3327 2906 822
2085 822 -2814 -4346 -749 3416 3241 897 -1562 -2777 -576 1457 -660 -2146 -56 2214 2312 -421
2101 -421 -3972 -4523 128 3933 2851 -264 -2796 -3319 -1026 1950 1171 -1093 -494 879 1040 162 -1796
2118 -1796 -3672 -102 4949 4136 -77 -3798 -4061 279 4386 3093 -1318 -1718 1162 1644 222 -1735
2134 -1735 -2073 1774 5175 2440 -2303 -3685 -2325 916 4109 2535 -996 -1878 -723 -711 350 279
2150 279 -677 52 1724 1191 -1524 -3161 -3107 -75 4069 3903 -1540 -4674 -2777 269 2342 1825 -1744
2167 -1744 -2036 1688 2281 -1379 -3189 -1986 1452 5022 3061 -2854 -4702 -996 2179 2824 1484 -915
2183 -915 -1374 1229 1162 -1357 -1089 442 1654 2816 1884 -1607 -3550 -1406 1114 3284 3345 -160 -3760
2200c760J634L575L33j672j349L36K993M22m714l106K984M899J901k520n275j887
2216e206M091L548j025k388j21J390J108n21l112j028L585K965m35j766k773j992
2232c680K630L230P13j432j780j586J017K165j110j572N58L294M48j231m019k315
2248d670L313N551J53l844k546o26K176K465j089k194J246J700l92j107k285j344
2264c493K372M408K33l393k544j299J857M080O28l068j547J467J145r33j709j502
2280c298K506M678j82m580l205P15L372L783m48l968j327J780J11j37j04l80R00
2297B16K332j43l073j799k3K020L706J517m168l596L17K447K485j15k257j196
2313a330K806J035l030k921O25L030L883n5n122l787K238L300J240j71k310r67
$$ plain form
2200 -3760 -2126 1449 1782 110 -1239 -903 2090 2512 -2202 -5308 -2324 2575 4476 1956 -3319 -5206
2216 -5206 -1115 2433 1408 -980 -1101 289 1397 876 -2236 -3264 321 3286 2851 1085 -1688 -3680
2232 -3680 -1050 2180 2893 1461 -319 -1905 -888 1277 167 -1405 -847 2447 2895 1664 -2355 -4670
2248 -4670 -1357 4194 4347 503 -2043 -2669 -493 1972 883 -1311 -65 1635 1243 136 -2149 -3493
2264 -3493 -1121 3287 3520 127 -2417 -3716 -1859 2221 2849 -219 -1766 -299 846 -87 -1796 -3298
2280 -3298 -792 3886 3704 -876 -4081 -3366 6 3789 3341 -627 -1954 -174 -63 -200 -304 -684 216
2297 216 2548 2405 -668 -2467 -2490 -470 3236 4753 585 -3011 -2694 -247 2238 2123 -134 -1330
2313 -1330 1476 2511 -519 -3440 -2815 215 4098 4043 -1079 -4866 -2628 672 1912 1741 -569 -1536
2329a536J516Q40k150j023J342J518K156m9l374l320J426L094K068L94k524l121
2345b743O60K418M69j134j1N09J428J033k736l754J484M180K464l91m421l499
2361d044J795M042O89j751j415NJ759R57l041k702J872M316J185j814l264k791
2377d202J572M167J080j471j486q56R8J620n00k088M54K668J330j085k502l167
2393d368J086M908K446k447k810j396R99K604K09k361K30K712N18j385k157j650
2409b862R64M282J912k189l019j799N58L229K108k208j848P11J104K3j168k274
2425b476J0M263K799k884m338j646K052M383J647l009k845O42J956m30q94j001
2441a771O25K794J491k966k906m41J695K678K228j791l207j093J724J129J513
$$ plain form
2329 -1536 -20 820 -1330 -2353 -1011 507 2663 2614 -760 -4080 -2654 440 2508 2902 378 -2743
2345 -2743 -2083 335 804 -330 -341 168 1596 2629 -107 -3861 -2377 1803 4267 3876 -545 -4044
2361 -4044 -2249 1793 2482 731 -684 -679 1080 2037 -1004 -3706 -1834 2482 3667 1853 -1411 -4202
2377 -4202 -2630 1537 2617 1146 -340 -1196 -1098 522 22 -2066 -1612 1056 2386 1301 -1201 -4368
2393 -4368 -3282 1626 4072 1625 -1185 -2581 -1582 1022 1231 -1130 -900 1812 2330 945 -1212 -2862
2409 -2862 -1898 2384 4296 2107 -912 -2711 -2153 1076 3184 976 -872 -161 943 966 -202 -2476
2425 -2476 -2466 1797 4596 1712 -2626 -4272 -2220 2163 3810 801 -2044 -1402 554 124 -770 -1771
2441 -1771 -1146 1648 3139 173 -2733 -3174 -1479 1199 3427 1636 -1571 -2664 -940 189 1702
2456A702j235j702J517K181q55l404j054J020M135L022k895n193p46K980K785
2471B258L30k082k218J456K504j333l127j97K458K681P68k667l908k25K878J962
2487A538J127j436k434r45J950K88o83j99J97R63J953j003m129j460L192L194
2503B113J510j860m266j426L496K314j155p35k67Q44J284l31l874r14L190L136
2519C059M72k098m041j501L895L162p89j920j033k26K193J21k809j434L209L105
2535C365p5k345l951r74L461L874m67k523j491n72J280J796j602j462J937J567
2551A818o3j983k241j464L143M289m57k688k746q32K149K969j19k764QJ803O05
2568A427m72k556j869K776M975j31m286l288l15L682L660p93l873o73K438P86
$$ plain form
2456 1702 467 -1235 282 2463 1608 -1796 -2850 -1830 2305 5327 2432 -2761 -3507 -527 2258
2471 2258 2588 506 -1712 -256 2248 915 -2212 -2409 49 2730 3498 831 -3077 -3302 -424 1538
2487 1538 2665 1229 -1205 -2150 -200 88 -595 -794 -597 366 2319 1316 -2813 -4273 -1081 2113
2503 2113 3623 1763 -2503 -3929 -433 1881 726 -9 -276 568 1852 1521 -2353 -3267 -77 3059
2519 3059 3531 1433 -2608 -4109 -214 2948 2159 239 -794 -1020 1173 1294 -1515 -2949 260 3365
2535 3365 3290 945 -3006 -3980 -519 3355 2888 365 -1126 -1698 -418 1378 -224 -1686 251 1818
2551 1818 1755 -228 -2469 -3933 -790 3499 3042 354 -2392 -3224 -1075 1894 1775 -989 -981 822 1427
2568 1427 955 -1601 -3470 -694 4281 4150 -136 -3424 -3739 -57 3603 2810 -1063 -1736 702 1488
2584A488r94k031n08L052L353j483m224j446Q23K053K828%k868j491K17L01J390
2601D60L68j549k68K324N29k059k528q41K441M322J139m635l888J050L221K463
2617B549j269k631o07L287Q35l326k379J358K940L052n27m993k371K095K946P32
2633A691N40j791j703R68J290j317n57O94Q47J890M96l234l311Q46L464K314N64
2650C691l214l576Q33L058M25j304q18P0K322J130l456l652J527L919K829q71
2666B913l837l836J759M233O94j671j117q1J186J317k274k988J599M171J607j366
2682B309l705l184K079M521J159j718j626q48Q30J456p63k327J174K828O26j160
2698A651k371k877J133M531J805j528k591k357K50K899J866k552j027J604J045
$$ plain form
2584 1488 494 -1537 -2045 1007 4360 2877 -1347 -2793 -1970 83 2911 2911 43 -1448 -1231 -930 460
2601 460 828 -721 -989 1335 1864 -195 -2723 -3564 -1123 3199 4338 -297 -4185 -3135 86 2549
2617 2549 1280 -1351 -1958 1329 2164 -1162 -3541 -2183 757 3809 3282 -1711 -4082 -1987 959 1691
2633 1691 2231 440 -1263 -295 995 -322 -879 -185 662 2552 3048 -186 -3497 -2651 813 3127 3691
2650 3691 477 -3099 -2266 792 1217 -87 -905 -835 1487 2617 -839 -4491 -2964 955 3784 2913
2666 2913 -924 -4760 -3001 1232 1926 255 -862 -943 243 1560 -714 -3702 -2103 2068 3675 2309
2682 2309 -1396 -4580 -2501 2020 3179 1461 -165 -1013 -183 1273 510 -1817 -643 2185 2811 1651
2698 1651 -720 -3597 -2464 2067 3872 2344 -247 -2604 -2354 545 2411 -141 -1168 436 1481
2713A481k96k098k995N98N313K856k805m470j616J226M496J002k911k110K246
2728h3J220j050j357j832J663M214Q50l317k752m92J145K981J947j486k210n9
2744f18k41O18J431q45j419J836K470j842k607j871P21M241L524k561n362q64
2760c389K463K498Q15k499k360K933K774k342l689j176K752M198J957m598m623
2775d286P39L001J712m7r98j465J120J232j835j557J151J265J224J507j525l592
2791b354j413K545K703K061q73m417j220K777J645j133q74o30K232K966k083n264
2807c332r84M164L705N75k713m526j00L727J286j245n94m00J244J035j219l537
2823b914k55L570K514O0k345l694r67L488K654p33j338j109l76J687N66k949k65
$$ plain form
2713 1481 1185 -913 -3908 -3310 2003 4859 2054 -2416 -4032 -2806 1690 2692 -219 -2329 -83
2728 -83 1137 87 -1270 -3102 -1439 2775 3625 308 -2444 -2936 -1791 1190 3137 1651 -559 -618
2744 -618 -859 -241 1190 345 -1074 762 3232 1390 -1217 -3088 -2367 1874 5398 2837 -2525 -3389
2760 -3389 -926 1572 2387 -112 -2472 461 3235 893 -2796 -3972 -1220 2978 4935 337 -4286
2775 -4286 -3547 -546 1166 1119 121 -1344 -224 1008 -827 -2384 -1233 32 1256 2763 1238 -2354
2791 -2354 -3767 -1222 1481 3542 2669 -1748 -2968 -191 1454 321 -553 -1183 1049 4015 1932 -3332
2807 -3332 -4316 -152 3553 4128 1415 -3111 -3211 516 1802 557 -37 -437 807 1842 623 -2914
2823 -2914 -3169 401 2915 2975 630 -3064 -4031 -543 2111 1378 40 -1069 -1445 242 808 -2141 -2406
2840b406K675K190l50j689l335j130L823L203j85k322j842j320J774K256q90j585
2856a133J217J565L48j133l304j424L977M578n84l990k985n02L331L319j894k917
2872a531J044J960J10j479k707k47M126L388k277l791j656M98J960K884l08k370
2888c96o30M12p1J10J89j150R14K521P0k852j985r61K622N061O9m451k829J347
2906b010K320J747j423k516R72M162j47m743k084J581L608L473j998m819j355
2921c232K399J910N25o35j341N04J469q00k160j25J171J355J456J05l605k482
2937c486J364J927K569O22k954k740J410K285o84j375k07O92L090J82m420k885
2953d610K143L758K049q47l960k255K417K850n89j533J92K52J953n5l127k084
$$ plain form
2840 -2406 269 2459 2109 420 -2915 -4045 -222 2981 2796 474 -1368 -2688 -914 1342 452 -1133
2856 -1133 84 1649 1997 864 -2440 -3864 113 4691 4107 117 -2868 -3370 -39 3280 1386 -1531
2872 -1531 -487 1473 1583 104 -2603 -2850 1276 4664 2387 -1404 -3060 -2562 -602 2282 1974 -396
2888 -396 -1026 -614 -685 -575 -386 -1536 -622 1899 1969 -883 -2868 -3829 -1207 3854 3923 -528 -3357 -2010
2906 -2010 310 2057 634 -1882 -910 3252 3105 -1638 -3722 -2141 1467 4940 2942 -1877 -3232
2921 -3232 -833 1077 1602 967 -374 130 1599 799 -1361 -1486 -315 1040 2496 2601 -1004 -3486
2937 -3486 -2122 -195 2374 2996 42 -2698 -1288 997 313 -1062 -1269 -577 2513 2695 -1725 -4610
2953 -4610 -2467 1291 3340 2493 -1467 -3722 -1305 1545 956 -577 -385 -133 1820 1765 -1362 -3446
2969c446K618L009J097o10l645k467J910L360L98j008o31j302Q19J572j529k376
2985b231J667K645R82r75k987l090J845M423P90k170j920j141R92J969m71k159
3001a831N06K420M70p64k534k263J597M618J246k134l154j121J496L092K35k518
3017f39j38J660N71o39k216j630J850M084O91k961k259r81J254K888O21j549j239
3034f32R11K53l78J73j433J22K757J227j837k805j137M74M120K142k718l205j53
3051b119J767J248Q9k421m17L220J363k426l293o79J971L973J507m029k880R28
3067b198K022Q07K34j305m76J446R60j966j346N75J121J859J258j953k974l96
3083b332J570J563K106j076k901j26K165n9q05r97J7K529J931k353m164l70L157
$$ plain form
2969 -3446 -828 2181 3278 2668 -977 -3444 -1534 1826 2224 1216 585 -717 102 1674 145 -2231
2985 -2231 -564 2081 3063 2088 -899 -3989 -2144 2279 3069 899 -1021 -2162 -1170 799 328 -1831
3001 -1831 -1325 1095 1565 801 -1733 -3996 -2399 2219 3465 1331 -1823 -2944 -1448 1644 1879 -639
3017 -639 -777 883 1454 815 -1401 -3031 -1181 2903 3594 633 -1626 -2607 -1353 1535 2156 607 -632
3034 -632 279 532 154 327 -1106 -984 1773 3000 1163 -1642 -2779 -2305 1815 3957 1239 -1966 -2119
3051 -2119 -352 896 985 -1436 -1853 1367 2730 304 -2989 -3668 -1697 2276 3783 -246 -3126 -2198
3067 -2198 -176 631 865 -440 -916 530 1490 -476 -1822 -1247 -126 1733 2991 1038 -1936 -2332
3083 -2332 -762 801 2907 1831 -1070 -1196 969 910 105 -892 -875 1654 3585 1232 -2932 -3302 -145
3100a45K695M08k329l089O01K625K90j880j80J067R03Q91k022k989M79K942J205
3117A472Q46j825k844l60K511J552l83o60r46K3J544q0k653m98K387K074M25j575
3135A010l600k61L092K329n71j855j120j55J790J36j733k57J585J955p3j849k800
3152b377l67L558K194q25j996j687j12J349J933j512j427J468J134k27j146k076
3168b116o85L185K640r62k691j675o08K411K175m79k245Q34M20k19l34j163l49
3185a861J880K394n99k402j507n56K319L005l02k539j015N87J034N67r05j603
3201a503J662K808m73l136k129L53L046L029q85l977r17J782J052K50p31j090
3217h59R68J895j001k748m8M59J774K109n75l140j469J061J207J349N74j790j313
$$ plain form
3100 -145 2550 2958 629 -2460 -1859 766 1056 -824 -1004 63 966 1857 -165 -3154 -2675 267 1472
3117 1472 2318 493 -2351 -2711 -200 1352 969 309 -637 -614 930 850 -1803 -2301 86 2160 2585 1010
3135 1010 -2590 -2851 241 2570 1999 144 -976 -1131 659 795 -938 -1195 390 2345 2272 423 -2377
3152 -2377 -2744 814 3008 2183 187 -1500 -1612 -263 1670 158 -1269 199 1333 1106 -40 -2116
3168 -2116 -2801 384 3024 2062 -629 -2304 -2912 -501 1674 1195 -1050 -216 204 -15 -349 -1512 -1861
3185 -1861 19 2413 1814 -588 -2095 -2651 -332 2673 2371 -168 -1183 -596 438 1005 100 -1503
3201 -1503 159 2967 2494 -642 -2771 -2418 628 3657 2772 -1205 -2122 -340 712 962 231 -859
3217 -859 109 2004 1003 -1745 -1793 -1334 440 2549 1974 -1166 -2635 -1574 -367 982 1556 -234 -1547
3234a547J512O55j038j052L28J125K644l35l799k112J653K737J436k78k653j338
3250b062J684J437r74r79Q90P65J782q61l086j284K122K188Q96m47k337k057J468
3267h55J752km32k40o86J031R88k412j839J502K343J286l61l072k491J730K934
3284A176Q2j019j050l18J354N80j437j772J203K317R01j059k614j503J383L410
3300A634N61j024j588j542O08K165k34j379K78J600O41n41k155j850J654L893
3316B721N42k397k152p74J194K632k33j876K30J111R6o95r99j293J196K870L89
3333B562j965j996r87O23K823J195j687j662N3N64P03l65j655M45K680J096k248
3350A79k250j052J732L363J105k956k078M62J471R10o0j714p6K570M61k386j546
$$ plain form
3234 -1547 -35 620 -418 -1470 -1142 -17 2627 2292 -1507 -3619 -1966 771 2207 1929 -724 -2062
3250 -2062 -378 1059 85 -894 -4 761 2543 1682 -1404 -2688 -566 1622 2518 2071 -266 -2323 -855
3267 -855 897 895 463 223 -463 568 1556 -856 -2695 -1193 1150 2436 2075 -997 -3488 -1758 1176
3284 1176 1258 239 -811 -1129 225 805 -632 -2404 -1201 1116 2017 958 -1656 -3159 -1776 1634
3300 1634 2195 1171 -417 -1959 -1351 814 580 -799 -521 1079 1720 1179 -976 -2826 -1172 2721
3316 2721 3263 866 -1286 -2060 -866 1766 1533 -343 -113 998 1094 399 -600 -1893 -697 2173 2562
3333 2562 597 -1399 -2386 -1763 1060 2255 568 -1094 -1041 -477 226 -139 -1794 -1349 1331 2427 179
3350 179 -2071 -3123 -1391 1972 3077 121 -1957 -1495 -24 886 826 -888 -964 1606 2067 -319 -1865
3367a865L52J214K583N99k332k279N06J058Q65J038r30j550J080Q66j387p84k33
3384a199N13K490J270k227l322j7K002J839Q03j717k412P15K002m60j067n79R30
3401d36J797Q64k559k675O78K378J554L48j518k372L92J774R8n43J70p0N32R37
3419A349r25k676N27K007J843N32j902l091K37K527J435q48j122p04P27J514r88
3436D42k274O10K279R45N6j841k686p0K940J760o91j231j638n6J643N00j647m29
3454a388J707J165l20j369k391j60L273K336j581j921j566N88K094J153j874o89
3470i43J319O89m87j442j069K08K845J628j382j809q90m66J966J694o17j374l1
3487a61N18J23o5p97j086K064J862p54j756k188j15K529K714j164l114k31J202
$$ plain form
3367 -1865 -1513 -299 2284 2883 551 -1728 -1222 -164 701 1739 809 -741 339 1205 -182 -966 -1199
3384 -1199 -686 1804 3074 847 -2475 -2492 -490 1349 2152 435 -1977 -1262 740 280 -787 -1366 -436
3401 -436 1361 2225 -334 -3009 -2331 47 1601 1949 431 -1941 -1549 225 323 -220 -50 -120 412 1349
3419 1349 424 -2252 -1725 282 2125 2657 755 -2336 -2099 428 1863 1015 -107 -811 -84 1430 442
3436 442 -1832 -1222 1057 2002 2058 217 -2469 -2539 401 2161 1470 239 -1399 -1455 188 688 -959 -1388
3454 -1388 319 1484 1164 -205 -2596 -2756 517 2853 1272 -649 -2215 -1627 467 1620 -254 -943
3470 -943 376 1065 578 -864 -1933 -1725 1120 2748 1366 -443 -1333 -1799 167 1861 1244 -130 -161
3487 -161 357 480 415 -382 -1468 596 2458 1704 -52 -2240 -2355 174 2888 1724 -1390 -1621 -419
3504d19R63j99j167p87K052J851j473k472q12J299K098J541j600k574J12N86O82
3521c19O21j32p81L38J223o82j108l43L9J667K003p51k749j433J212J693J629
3538B127m31k559n12J794M71j236o86K89J810J661j268l094j141K229J784Q75
3554B113j026k323k42J527N51p35o06M56N44J041o59k467o51J736J687R22o32
3571A236k496r49J510R75L62p64j91j80P50M71j853o05J397J669Q44j160k153
3588a137j352J733K394Jo86r97o76O27J003r08j416J539J087O79p24k383j459
3605b675K065K852l2j663j499n45J300J486r93j446Q07J368j6j068j558n28J586
3622e59K315m49j162j312o28Q16J764K96j392k11M99j67L63n80r40N73K250M02
$$ plain form
3504 -419 544 345 -822 -1609 443 2294 821 -1651 -2463 -1164 934 2475 875 -1699 -1587 -1001 -319
3521 -319 302 170 -611 -273 950 268 -840 -1183 -1144 523 2526 1775 -974 -2407 -1195 498 2127
3538 2127 1696 -863 -1375 419 890 -346 -1032 -743 1067 2728 1460 -1634 -2775 -546 1238 2113
3554 2113 1087 -1236 -1478 49 600 -135 -741 -285 259 1300 641 -1826 -2477 -741 946 1868 1236
3571 1236 -1260 -2209 -699 276 638 -126 -317 -497 253 724 -1129 -1734 -337 1332 2176 1016 -1137
3588 -1137 -2489 -756 1638 1639 953 -44 -720 -93 910 2 -1414 125 1212 1891 1167 -1216 -2675
3605 -2675 -610 2242 2210 547 -952 -1497 -197 1289 296 -1150 -343 1025 1009 -59 -1617 -2145 -559
3622 -559 1756 1307 145 -1167 -1795 -979 785 1081 -311 -522 -23 -190 173 -407 -1347 -774 1476 1878
3640A878j359j774j101J305K772M73k236r47M77R12M02p62j464J097K406j43k303
3657c67j453K67J600K266m03k317n21M47L13L86K46p18J76J173k23j374n85K2
3675a065P14J692N87k162j313r9J111J418M44j616q81Q71R72m40j235m54R96K102
3693A642N70k578j923P05J763J444j8j883j171J543O41p63m70K89M69J121P5j715
3711b59j594Q73J322J165l0r48j850L31J494L0j11n98j42O13P03q24j979R58J258
3730D12J034J04j802j731M35J945O87l33j031q26O91J054l02j464q3J302J174
3747A266L4j650j888N59K285J322j160j150q32N81J337j45j342j04J497N50m91
3764F69q79j468M33K144P91o73j133j000J01J433N14q71N9J08K31k44n18o46l58
$$ plain form
3640 1878 519 -1255 -2356 -1051 1721 2194 -42 -989 -512 400 802 40 -1424 -327 2079 1936 -367
3657 -367 -1820 -1553 47 2313 1910 -407 -928 -481 -168 218 464 -254 -78 1095 872 -502 -1087 -1065
3675 -1065 -351 1341 1928 -234 -1547 -1646 -535 883 1327 -289 -1170 -299 673 233 -1002 -1456 -460 1642
3693 1642 2212 -366 -2289 -1584 179 1623 1605 -278 -1449 94 735 -28 -498 -209 260 1381 1456 -259
3711 -259 -1853 -980 342 1507 1477 529 -1321 -990 504 534 423 -175 -317 296 999 175 -1804 -846 412
3730 412 1446 1550 -252 -1983 -1548 397 1084 751 -280 -1106 -415 639 337 -1127 -1210 92 1266
3747 1266 1300 -350 -2238 -1679 606 1928 768 -382 -1214 -633 704 559 -783 -887 610 1160 669
3764 669 -210 -1678 -1245 899 1690 1017 -116 -1116 -1015 418 932 61 120 228 459 215 -303 -949 -1307
3783a307J990R69m36j382j363l41J582K122j204j648R3R08M69k42j488l59J904
3800B67J747j260j751j167Q31K290R32j218j652K91Q98l55L71j87m77J153K40
3817I53q08r09k61K46J349J357n61j724q48L37R19J151l23j700K85J416q1j504
3835g06o36M20J366J763j107k559n33J399J328N59q93j492K62J324m48j081J57
3852h77N24Q51P32p65k060j36J037J032P87l40j515o96R36M83J79k96K27j04Q64
3871H63J17j992p39J143J577P62m83j879j088J271J796l44m56r17P7J006Q3j397
3889f00r36J180J545K27l40k409o88J509K071k89j231q47L5O94O46j064q09J212
3907i4R76J52n78j761p45J704J802j59j128q50n11O22J380o59r08P99J50k50L50
$$ plain form
3783 -1307 683 1652 1216 -166 -1529 -1870 -288 1834 630 -1018 -925 -17 452 210 -1278 -1637 267
3800 267 2014 754 -997 -2164 -1333 957 1889 671 -981 -690 208 -147 224 37 -440 713 953
3817 953 145 -764 -1025 -779 570 1927 1366 -358 -1206 -869 50 1201 878 -822 -537 879 798 -706
3835 -706 -1342 -922 444 2207 1100 -1459 -1992 -593 735 1294 401 -1091 -829 495 47 -1034 -877
3852 -877 -353 498 1230 465 -1595 -1731 -694 338 1125 785 -730 -1426 -490 -7 172 -124 103 -1 863
3871 863 980 -1012 -1751 -608 969 1731 1248 -631 -1719 -448 1348 1004 548 -369 -292 714 797 -600
3889 -600 -1536 -356 1189 1416 1076 -1333 -2021 -512 1559 1270 39 -808 -773 -79 567 -497 -1306 -94
3907 -94 882 1034 456 -1305 -2050 -346 1456 1297 169 -681 -1192 -570 810 151 -757 42 192 -58 292
3926B92r46j208J452K098j07j088j119j263J017K132K24j499m51N56M47K78j162
3943c47j132J254J969M8j644j596l18J678J842m52j904k08N97n4L43o65m1Q56
3961B26J013n92j054r87K84N97J674L56j662j015O9P46P97L84r78p44J107P24
3979I45q86j056j21N85K360L96k240k039Q79J330J087q8j406m43J134O12j485
3996d36m93P53O53J201l43j835j092O40J412P01J75j466q68L82Q90k74l4M4j28
4015a18P29N71j160j880P28J224J453K94k008j792O34J764K11o00n07K68N22L57
4033F90j142j103Q22J418Q63j19j712j855R18J791M92l17q84m06L76Q95l85j248
4051i06L46J509M05l59j374j965J205K461J12p66q59n87M8J083J91q19K47M06
$$ plain form
3926 292 -654 -1862 -410 1688 1581 493 -626 -1889 -872 1260 1484 -15 -466 90 537 815 -347
3943 -347 -1479 -225 1744 1792 148 -1448 -1766 -88 1754 1302 -602 -810 -213 -267 76 -589 -630 226
3961 226 1239 647 -407 -1394 -1110 -513 1161 1517 -145 -1160 -1091 -345 452 836 -142 -886 221 945
3979 945 59 -997 -1118 -533 1827 2223 -17 -2056 -1177 153 1240 1152 -254 -697 437 1049 -436
3996 -436 -929 -176 477 1678 1335 -500 -1592 -952 460 1161 1336 -130 -998 -616 274 0 -34 10 -118
4015 -118 611 1182 22 -1858 -1130 94 1547 1841 -167 -1959 -1325 439 650 50 -457 -189 333 690
4033 690 -452 -1555 -733 685 1548 1429 -283 -2138 -1220 571 1063 746 -138 -544 -168 727 342 -906
4051 -906 -560 949 1354 995 -379 -2344 -1139 1322 1434 668 -191 -778 -730 353 544 -275 -28 378
4069C78K29l95m79j405M49K016N98p08j138j124K07J276J409j292n92L22M00P
4087A58j44j477L18J968J086j540j520n75P24J766Q98j202j449N96M69K28l35
4104c1n06K55J323O34j242j439QN56J449O52r61j309K1k1P19Q37p70o86O04O56
4124G49n55j058n60N50J936J109j527k416L7J361J017L25j165n76O62J127p35
4141B81j394k02R69J637L67j523k013O28R25J092K63m41j125N0O68M5k37P3o5
4160bM73J022q16j886J14J034J170P68j160j613k33J443O99o40n12k67P36N39
4178H69n86j505J34J350J049q7j026j865LJ819M85k91p7p95k29J365k05j397j30
4197a119J159Q31J02q26j724j31K054J017k33j112o76Q2Q73K78o89p75J334N75
$$ plain form
4069 378 607 212 -267 -1672 -1223 793 1391 683 -455 -1579 -1372 -96 1313 21 -571 -249 151 158
4087 158 14 -1463 -1145 823 1909 369 -1151 -1726 -1002 764 1662 460 -989 -393 76 304 -31
4104 -31 -537 -282 1041 1675 433 -1006 -998 -442 1007 1659 698 -611 -590 -611 108 945 175 -511 93 749
4124 749 194 -864 -1424 -874 1062 2171 644 -1772 -1735 -374 643 968 -197 -773 -111 1016 281
4141 281 -1113 -1315 -346 1291 1658 135 -1878 -1250 -325 767 1030 589 -536 -486 182 227 -10 63 -2
4160 -2 471 1493 677 -1209 -1095 -61 1109 1877 717 -896 -1129 314 1013 373 -139 -406 330 869
4178 869 283 -1222 -1088 262 1311 1224 198 -1667 -1664 155 640 349 272 -523 -752 613 408 -989 -1119
4197 -1119 40 871 973 147 -1577 -1708 346 1363 1130 18 -658 -576 297 575 -114 -889 445 1020
4215A020k69p63j217J03J585J069o31q55o30o30J274R54n49n51k82P32r9o8r91
4234g98p51J821J426l29j507j459J84J717R95o86j291K53L98J29l40o17l26J665
4252D84Q01p67j099n87J37J383J021p16j118m47O70k4N64J4p07N90R79m96r68
4271b86n97p4J079J585k72j977o65M77J048O52j74j191J95J207l40j210m17M16
4289e44Q43J235n59j849m31Q56O21O86m69r90L0P79Lm98m7K3N13O37L9j665o08
4310a395Q26P82O87O1j189j272J067O87Q6m48j68J2Q44L30j598q16J224J058K67
4329A045n8j725o24J034J160m42j28m92J37L81J88r38n49N40J105M05l4j705o46
4348a346O07J713Op06m11q12O43P26o90m99N49R96K78p41j089q84J076J391R0
$$ plain form
4215 1020 751 -12 -1229 -1126 459 1528 897 42 -588 -1218 56 1010 461 -90 -372 360 261 193 -798
4234 -798 -1549 272 1698 1369 -138 -1597 -1413 304 1299 613 -678 -425 -27 102 -238 -855 -1181 484
4252 484 1285 518 -581 -1168 -1031 352 1373 657 -461 -908 -238 -262 302 316 -391 199 1178 682 -286
4271 -286 -883 -957 122 1707 1435 -542 -1207 -730 318 970 796 -395 -200 1007 667 -543 -960 -544
4289 -544 299 1534 975 -874 -1305 -449 172 858 389 -601 -571 208 211 -287 -334 -311 202 839 878 -787 -1395
4310 -1395 -569 213 900 961 -228 -1500 -433 254 340 -108 -276 -264 580 910 -688 -1504 -280 778 1045
4329 1045 987 -738 -1362 -328 832 390 262 -230 -93 288 476 -462 -1011 -471 634 1039 1005 -700 -1346
4348 -1346 -739 974 980 274 -137 -949 -306 420 -270 -769 -220 776 1054 313 -776 -1660 -584 807 897
4367H97p13n67n88O42M86J85p89J83M03L0M06r77q20Q38J377M45q11q84q77N13
4387f21J338L06j028r9N39j72L99q71p41P04J526O4j205j174N2M20J309N39j297
4406a2k38L1N9L5p5j28L9J224k85m76q39k56K61J313P42j083j526L03L83J227
4426F99J23r32n58R98M91r67n82m81O80J467P67j413j273K38P46O73J65o74m17
4445b50K78N13n60k97j39M19O27L62o95j286J83M91J287L92q59j208Q0J130l30
4464A38l09J8k40Q48M04r09j222n4J357M61M07p61j156J09R83L62l0n59k84O39
$$ plain form
4367 897 184 -383 -971 -329 157 342 -447 -264 139 169 575 -402 -1222 -384 993 1438 627 -257 -1134 -621
4387 -621 717 1023 -5 -104 435 263 662 -209 -950 -246 1280 1344 139 -1035 -983 -563 746 1285 -12
4406 -12 -250 -219 -160 -125 -200 -328 -289 935 650 174 -665 -921 -660 653 1395 312 -1214 -911 -528 699
4426 699 822 -110 -668 330 821 -146 -728 -1209 -529 938 1705 292 -981 -743 3 676 841 167 -250
4445 -250 28 541 -19 -316 -455 -36 591 953 258 -1028 -845 -354 933 1325 466 -742 -662 468 138
4464 138 -171 -153 -393 455 859 -50 -1272 -1326 31 492 899 138 -1018 -909 74 436 406 -153 -437 202
$$ [...]
8191i0
##END NTUPLES=NMR FID
##END=
