##TITLE=1H_EC-3084x
 DMSO, 8 sc, 
 23.10.2019
##JCAMPDX= 6.0         $$ Bruker NMR JCAMP-DX V2.0
##DATA TYPE= NMR FID
##DATA CLASS= NTUPLES
##ORIGIN= UXNMR, Bruker Analytische Messtechnik GmbH
##OWNER= root
$$ XWIN-NMR		Version 3.5
$$ Wed Oct 23 16:57:11 2019 Russian Standard Time (UT+4h)  she@DPX200
##.OBSERVE FREQUENCY= 200.1315
##.OBSERVE NUCLEUS= ^1H
##.DELAY= (6, 6)
##.ACQUISITION MODE= SIMULTANEOUS
##.ACQUISITION SCHEME= undefined
##.AVERAGES= 8
##.DIGITISER RES= 18
##SPECTROMETER/DATA SYSTEM= spect
##.PULSE SEQUENCE= zg30
##.SOLVENT NAME= DMSO
##.SHIFT REFERENCE= (INTERNAL, DMSO, 0, 15.7039)
##AUDIT TRAIL= $$ (NUMBER, WHEN, WHO, WHERE, WHAT)
$$ ##TITLE= Audit trail, XWIN-NMR		Version 3.5
$$ ##JCAMPDX= 5.01
$$ ##ORIGIN= Bruker BioSpin GmbH
$$ ##OWNER= she
$$ F:/spectra/data/she/nmr/H-F/1/audita.txt
$$ ##AUDIT TRAIL=  $$ (NUMBER, WHEN, WHO, WHERE, WHAT)
(   1,<2019-10-23 16:56:18.73 +0400>,<she>,<DPX200>,
      <created by zg, POWCHK disabled, PULCHK disabled
       configuration hash MD5:
       00 E9 B6 7A A2 85 ED C7 34 08 36 98 17 FE 4E 26
       data hash MD5: 16K
       BD 91 F4 C8 C5 E0 AA EC 94 E6 E2 93 5D 2C CF D1>)
$$ ##END=
$$ 
$$ hash MD5
$$ D7 B8 58 4B DC 0F 96 7D D3 64 9C C6 29 A5 24 7D
##$RELAX= 
##$RELAX= 
##$RELAX= 
##$RELAX= 
##$RELAX= 
##$RELAX= 
$$ Bruker specific parameters
$$ --------------------------
##$DU= <F:/spectra>
##$EXPNO= 1
##$NAME= <H-F>
##$PROCNO= 1
##$TYPE= <nmr>
##$USER= <she>
##$AMP= (0..31)
100 100 100 100 100 100 100 100 100 100 100 100 100 100 100 100 100 100 
100 100 100 100 100 100 100 100 100 100 100 100 100 100 
##$AQSEQ= 0
##$AQ_mod= 1
##$AUNM= <au_zg>
##$AUTOPOS= <>
##$BF1= 200.13
##$BF2= 200.13
##$BF3= 200.13
##$BF4= 200.13
##$BF5= 200.13
##$BF6= 200.13
##$BF7= 200.13
##$BF8= 200.13
##$BYTORDA= 1
##$CFDGTYP= 0
##$CFRGTYP= 5
##$CHEMSTR= <none>
##$CNST= (0..31)
1 1 145 1 1 1 1 1 1 1 1 1 1 1 1 1 1 1 1 1 1 1 1 1 1 1 1 1 1 1 1 1 
##$CPDPRG= <>
##$CPDPRG1= <>
##$CPDPRG2= <>
##$CPDPRG3= <>
##$CPDPRG4= <mlev>
##$CPDPRG5= <mlev>
##$CPDPRG6= <mlev>
##$CPDPRG7= <mlev>
##$CPDPRG8= <mlev>
##$CPDPRGB= <>
##$CPDPRGT= <>
##$D= (0..31)
0 1.2 0 0 0 0 0 0 0 0.06 0 0.03 0 0 0 0 0.0002 0 0 0 0 0 0 0 0 0 0 0 0 
0 0 0 
##$DATE= 1571835378
##$DBL= (0..7)
120 120 120 120 120 120 120 120 
##$DBP= (0..7)
150 150 150 150 150 150 150 150 
##$DBP07= 0
##$DBPNAM0= <>
##$DBPNAM1= <>
##$DBPNAM2= <>
##$DBPNAM3= <>
##$DBPNAM4= <>
##$DBPNAM5= <>
##$DBPNAM6= <>
##$DBPNAM7= <>
##$DBPOAL= (0..7)
0.5 0.5 0.5 0.5 0.5 0.5 0.5 0.5 
##$DBPOFFS= (0..7)
0 0 0 0 0 0 0 0 
##$DE= 6
##$DECBNUC= <off>
##$DECIM= 24
##$DECNUC= <off>
##$DECSTAT= 4
##$DIGMOD= 1
##$DIGTYP= 9
##$DL= (0..7)
0 120 120 120 120 120 120 120 
##$DP= (0..7)
150 150 150 150 150 150 150 150 
##$DP07= 0
##$DPNAME0= <>
##$DPNAME1= <>
##$DPNAME2= <>
##$DPNAME3= <>
##$DPNAME4= <>
##$DPNAME5= <>
##$DPNAME6= <>
##$DPNAME7= <>
##$DPOAL= (0..7)
0.5 0.5 0.5 0.5 0.5 0.5 0.5 0.5 
##$DPOFFS= (0..7)
0 0 0 0 0 0 0 0 
##$DQDMODE= 0
##$DR= 18
##$DS= 0
##$DSLIST= <SSSSSSSSSSSSSSS>
$$ [...]
##$SUBNAM2= <"">
##$SUBNAM3= <"">
##$SUBNAM4= <"">
##$SUBNAM5= <"">
##$SUBNAM6= <"">
##$SUBNAM7= <"">
##$SUBNAM8= <"">
##$SUBNAM9= <"">
##$SW= 24.0689530833862
##$SWIBOX= (0..15)
0 0 2 0 0 0 0 0 0 0 0 0 0 0 0 0 
##$SW_h= 4816.95568400771
##$TD= 16384
##$TD0= 1
##$TE= 0
##$TE2= 300
##$TE3= 300
##$TEG= 300
##$TL= (0..7)
0 120 120 120 120 120 120 120 
##$TP= (0..7)
150 150 150 150 150 150 150 150 
##$TP07= 0
##$TPNAME0= <>
##$TPNAME1= <>
##$TPNAME2= <>
##$TPNAME3= <>
##$TPNAME4= <>
##$TPNAME5= <>
##$TPNAME6= <>
##$TPNAME7= <>
##$TPOAL= (0..7)
0.5 0.5 0.5 0.5 0.5 0.5 0.5 0.5 
##$TPOFFS= (0..7)
0 0 0 0 0 0 0 0 
##$TUNHIN= 0
##$TUNHOUT= 0
##$TUNXOUT= 0
##$USERA1= <user>
##$USERA2= <user>
##$USERA3= <user>
##$USERA4= <user>
##$USERA5= <user>
##$V9= 5
##$VALIST= <valist>
##$VCLIST= <CCCCCCCCCCCCCCC>
##$VD= 0
##$VDLIST= <DDDDDDDDDDDDDDD>
##$VPLIST= <PPPPPPPPPPPPPPP>
##$VTLIST= <TTTTTTTTTTTTTTT>
##$WBST= 1024
##$WBSW= 4
##$XGAIN= (0..3)
0 0 0 0 
##$XL= 0
##$YL= 0
##$YMAX_a= 122915
##$YMIN_a= -232529
##$ZGOPTNS= <>
##$ZL1= 120
##$ZL2= 120
##$ZL3= 120
##$ZL4= 120
##$ABSF1= 10
##$ABSF2= 0
##$ABSG= 5
##$ABSL= 3
##$ALPHA= 0
##$AQORDER= 0
##$ASSFAC= 0
##$ASSFACI= 0
##$ASSFACX= 0
##$ASSWID= 0
##$AUNMP= <proc_1d>
##$AZFE= 0.1
##$AZFW= 0.1
##$BCFW= 1
##$BC_mod= 2
##$BYTORDP= 1
##$COROFFS= 0
##$CY= 11.3945322036743
##$DATMOD= 1
##$DC= 2
##$DFILT= <>
##$DTYPP= 0
##$F1P= 20.1720416913024
##$F2P= 0.152960286110954
##$FCOR= 0.5
##$FTSIZE= 0
##$FT_mod= 4
##$GAMMA= 1
##$GB= 0.15
##$INTBC= 1
##$INTSCL= 1
##$ISEN= 128
##$LB= 0.24
##$LEV0= 0
##$LPBIN= 0
##$MAXI= 10000
##$MC2= 0
##$MEAN= 0
##$ME_mod= 0
##$MI= 1.114404
##$NCOEF= 0
##$NC_proc= 0
##$NLEV= 6
##$NOISF1= 3.799351
##$NOISF2= 2.8
##$NSP= 1
##$NTH_PI= 0
##$NZP= 0
##$OFFSET= 15.70392
##$PC= 1
##$PHC0= -9577.127
##$PHC1= 19.6008
##$PH_mod= 1
##$PKNL= yes
##$PPARMOD= 0
##$PSCAL= 0
##$PSIGN= 0
##$REVERSE= no
##$SF= 200.130013532006
##$SI= 16384
##$SIGF1= 3
##$SIGF2= 2
##$SINO= 400
##$SIOLD= 16384
##$SREGLST= <1H.CDCl3>
##$SSB= 0
##$STSI= 0
##$STSR= 0
##$SW_p= 3612.71676300578
##$SYMM= 0
##$S_DEV= 0
##$TDeff= 0
##$TDoff= 0
##$TI= <>
##$TILT= no
##$TM1= 0
##$TM2= 0
##$TOPLEV= 0
##$USERP1= <user>
##$USERP2= <user>
##$USERP3= <user>
##$USERP4= <user>
##$USERP5= <user>
##$WDW= 1
##$XDIM= 8192
##$YMAX_p= 0
##$YMIN_p= 0
$$ End of Bruker specific parameters
$$ ---------------------------------
##NTUPLES= NMR FID
##VAR_NAME=  TIME,          FID/REAL,        FID/IMAG
##SYMBOL=    X,             R,               I
##VAR_TYPE=  INDEPENDENT,   DEPENDENT,       DEPENDENT
##VAR_FORM=  AFFN,          ASDF,            ASDF
##VAR_DIM=   8192,          8192,            8192
##UNITS=     SECONDS,       ARBITRARY UNITS, ARBITRARY UNITS
##FACTOR=    0.0002076,     1,               1
##FIRST=     0,             0,               0
##LAST=      1.7004516,     0,               0
##MIN=       0,             -232529,         0
##MAX=       1.7004516,     122915,          0
$$ Real data points
##PAGE= N=1
##DATA TABLE= (X++(R..R)), XYDATA
$$ [...]
1944c80L31N05o85J14L27o74M1Q47m75n89J025m2n78J69K62n00K51O12q08m5O35
$$ -380 -49 456 -229 -115 212 -462 -421 426 -49 -638 387 345 -233 -64 198 -302 -51 561 -247 -292 343
1965C43J3n04J52P5K47L64o19m55Q82O7p10J7N99o17Q4M98p78j89Q28k6p27M86
$$ 343 356 -148 4 79 326 690 71 -384 498 565 -145 -128 471 -146 -62 436 -342 -531 297 271 -456 30
1987C0l0l56N04J59q12J90P71l43l19M49l35N3M69l01n14M08M81m87k7J95j35
$$ 30 0 -356 148 307 -505 -315 456 113 -206 243 -92 -39 430 129 -385 23 504 17 -10 185 50
2008E0K08J89l40j81N26J02o33J06J63m02N76j22o54J71O48m66m04M89k54J40
$$ 50 258 447 107 -74 452 554 -79 27 190 -212 364 242 -412 -241 407 -59 -463 26 -228 -88
2028h8K06j91m42N56L60n97j80L85J6R7J15n35k26R22j34m66K67k08m7L26k06
$$ -88 118 -73 -515 41 401 -196 -376 9 25 122 237 -298 -524 398 264 -202 65 -143 -190 136 -70
2049g0k40L99L86l25k2N4m68J92N74l84j57K37K13p76R3L04k69M09O7l00k48N61
$$ -70 -310 89 475 150 128 182 -286 -94 480 96 -61 176 389 -387 -294 10 -259 150 217 -83 -331 230
2071B30k55j94K09j12r9K68O7o74L07M50l95K95o5j41n4L72k10j52K13N99n23
$$ 230 -25 -219 -10 -122 -221 47 114 -560 -253 197 -198 97 32 -109 -163 209 -1 -153 60 659 136
2092A36l1k25O4K83M54q40o9L90l66J30J13k46k57P45J55o99n99Q14K74k0j88
$$ 136 105 -120 -56 227 681 -159 -228 162 -204 -74 39 -207 -464 281 436 -263 -862 -48 226 206 18
2113A8j80l77J071m27o72L83M04K9j95Qp18P97M67q28l58J106j96k51Q3L9l45
$$ 18 -162 -539 532 105 -567 -184 220 249 54 62 -656 141 608 -220 -578 528 332 81 164 203 -142
2134a42O05j26o42J28M59k60l5k5m31M38O53n90l48J02K14n2J49o1j85N22M2o56
$$ -142 463 337 -305 -177 282 22 -13 -38 -469 -31 622 32 -316 -214 0 -52 97 36 -149 373 415 -241
2156b41j89N43lj52k04K8r2Q03o5p84Q9N71r5o6k5k68mP58o57k62J20K63jk71
$$ -241 -430 113 110 -42 -246 -218 -310 493 428 -356 -267 304 209 143 118 -150 -154 604 -53 -315 -195 68 67 -204
2180b04RR6K11K40m73l81Q77j90l96J80l38J17N94k45n97L30K38q8J52m64J98
$$ -204 -195 -99 112 352 -121 -502 375 185 -211 -31 -369 -252 342 97 -500 -170 68 -20 132 -332 -134
2201a34J44K59j86l62K05L95k73J55J0n71N38L89o13n10Q60k53n8J01j06m09Q05
$$ -134 10 269 83 -279 -74 321 48 203 213 -358 180 569 -44 -554 306 53 -5 96 -10 -419 386
2222C86no56N23q0k35J37J21o81K56P54m20m98K92P1J6J48l71k29N73M48n20n58
$$ 386 381 -275 248 168 -67 70 191 -490 -234 520 100 -398 -106 -35 -19 129 -242 -471 102 550 30 -528
2244e28N94L5Q2q5n75j7P92R5m37j34L74J10Ml56n05N05N12R9j047K72M98j02
$$ -528 66 101 183 98 -477 -494 298 393 -44 -178 196 306 310 -46 -551 -46 466 565 -482 -210 288 186
2266A86O8m58k49M65N65p20n10L71L51L42m57l72j06R56R8p21k56O64k22K20k65
$$ 186 254 -204 -453 12 577 -143 -653 -282 69 411 -46 -418 -524 432 530 -191 -447 217 -5 215 -50
2287e0m94L67N57j7r52J59M35M6J85l51k89N27M78n32p70K79O60r5k98J9m3M67
$$ -50 -544 -177 380 363 -589 -430 5 51 236 -115 -404 123 601 69 -701 -422 238 143 -155 -136 -179 288
2309B88J56o94n46P60K03P4o18J7J48O53l34l98k53M18L79j90l85n7N30L48m50
$$ 288 444 -250 -796 -36 167 241 -377 -360 -212 441 107 -291 -544 -126 253 63 -322 -379 151 499 49
2330D9l88J65L42j76K41m57l71R13J74n35l11L19L5L14l06l07j67P53J04q72k07
$$ 49 -339 -174 168 -8 233 -224 -595 318 492 -43 -354 -35 0 314 8 -299 -466 287 391 -481 -688
2351f88P29M0L18n55k18L70O43j94q08ON34Lq9o08k42J050L86q02o43N61R0M87
$$ -688 41 81 399 -156 -374 -4 639 445 -363 -357 177 180 91 -517 -759 291 677 -125 -768 -207 -117 370
2373C70p1o75o7R52l07p56M07j53P32L5l23o17K86Q01l05o03M66o9J44J30m78
$$ 370 299 -376 -443 509 202 -554 -147 -300 432 467 144 -473 -187 614 309 -294 172 103 247 377 -101
2394a01o22J008L19o43j44Q8J76J42L3p01o9R70J14o39o22N69K64M73n02p16O08
$$ -101 -723 285 604 -39 -183 -95 81 223 256 -445 -514 456 570 -69 -691 -122 142 615 113 -603 5
2415EO90o78k75O4j05O94J0n15n47R19K18l60o04K58K80M67l39q15K85J018m00
$$ 5 695 17 -258 -194 -299 395 405 -110 -657 262 480 120 -484 -226 54 521 182 -633 -348 670 270
2436B70m07k09K25M52J2n20l41K12Q06k85m85p0M4N64j80k68m75Q30L75k53r38
$$ 270 -137 -346 -121 331 343 -177 -518 -306 500 215 -270 -340 -296 268 88 -180 -655 175 550 297 -641
2457f41N03J61N45j81n66l77O66L98p34j72K46L35M71o95n41N56Q23o21m26L1
$$ -641 -138 23 568 387 -179 -556 110 508 -226 -398 -152 183 654 -41 -582 -26 797 176 -250 -219
2477b19ON48J1k70o14O24K84m13q5j01J61N40l48o14L9P55K04o46j68K29N9O13
$$ -219 -213 335 346 76 -538 86 370 -43 -128 -229 -68 472 124 -490 -451 304 508 -138 -306 -77 -18 595
2499E95m72l10Q7L82R4o54K9K42J14L36k67p93N27P17n72m06J26L77J16N6q16
$$ 595 123 -187 -100 282 376 -278 -249 -7 107 443 176 -617 -90 627 55 -351 -225 152 268 324 -492
2520d92P5L53O31n39k43j31L22N00l55o45K84O31K11o79l41K93L58Q7m17m89O56
$$ -492 -417 -64 567 28 -215 -346 -24 476 121 -524 -240 391 602 -77 -418 -125 233 320 -97 -586 70
2541G0P13o34m40L54j35M57J3p72r3N57L20l34j12n06M70O46m11q94N84N66O3
$$ 70 783 149 -291 63 -72 385 398 -374 -467 90 410 76 -36 -542 -72 574 163 -731 -147 419 482
2562D82m39l31J28K45L87n45q21P14M62j27l35j48n9P41R0j124J15R43j88k07
$$ 482 43 -288 -160 85 472 -73 -894 -180 282 155 -180 -328 -387 354 444 -680 -565 378 190 -17
2582a7l10J20j7R11l39j059N28L69N8r3p29j2P40L93q56m98Q18K41l63p2R1l32
$$ -17 -327 -207 -224 687 348 -711 -183 186 244 151 -578 -590 150 543 -313 -811 7 248 -115 -187 -96 -428
2604d28Q48j37q23L9N97L75n76o9j16K00M40l35n29J29R86p9n37k55J74P6L52
$$ -428 420 283 -540 -501 96 471 -105 -174 -290 -90 350 15 -514 -385 601 522 -15 -270 -96 -20 332
2625C32k02q34O84O06m17l68k8j01O83L27r14Q1L04K16k77m15m6J22O05J92r47
$$ 332 130 -704 -20 586 169 -199 -227 -328 355 682 -232 -151 153 369 92 -323 -369 -247 358 550 -397
2646c97J78M48J20n43q9R3L76J59m79n45M70L62J56j84k23N0J13L24n92m37O50
$$ -397 -219 229 349 -194 -283 -190 186 345 -134 -679 -209 153 309 125 -98 -48 65 389 -203 -640 10
2667A0%Q3k10j62K34N40k39q30M20L76j23l4j45k28M61M59n48n64N23K32J05l13
$$ 10 10 93 -117 -279 -45 495 256 -574 -154 222 99 65 -80 -308 153 612 64 -500 23 255 360 47
2689D7k32k00N90L43q20m76Q79K88k89j58l00P8N40j40q03M96L90K00l24k41l84
$$ 47 -185 -385 205 548 -272 -748 131 419 130 -28 -328 -250 290 150 -653 -157 233 433 109 -132 -516
2710e16N94L59l55k78J25L96l70k2l84J16P46J3m27o59P13K23j82k51j96J98M60
$$ -516 78 437 82 -196 -71 325 -45 -67 -451 -335 411 424 -3 -662 51 274 92 -159 -355 -157 303
2731C03j0q11Q8M51p4m8J07k43L77L26l97k62j5K54L63n12k55r5Q57K07p77j54
$$ 303 293 -518 -430 21 -53 -101 6 -237 140 466 69 -193 -208 46 409 -103 -358 -453 404 611 -166 -320
2753c20M55N4j40o9k73J21P71k10p77q4K16M35m1k4m10R0J085q44m27J96N60l04
$$ -320 135 189 49 -20 -293 -172 599 389 -388 -472 -256 179 138 114 -296 -206 879 35 -392 -196 364 60
2775F0p7j05k07O29J8l79m07O62o7l77J54j38j4O84n6m13l46O11L22m79j48J4
$$ 60 -17 -122 -329 300 318 -61 -468 194 127 -250 -96 -234 -248 436 380 -33 -379 232 554 75 -73 -59
2797e9j22O43j99p20N72m7k07L25l66j27N72L02q78OL28J73R0l26J1j93P18m25
$$ -59 -181 462 263 -457 115 68 -139 186 -180 -307 265 567 -311 -305 23 196 286 -40 -29 -222 496 71
2819G1n07J5N06r5L69n25k16L41P28n31q29O65lo5J00j44k83Q77l6m43m80M92
$$ 71 -436 -421 85 -10 359 -166 -382 -41 687 156 -673 -8 -11 -76 24 -120 -403 474 438 -5 -485 7
2841GK16mk92J24m50O76j69m38Q9J55J88R5n24P2L69L08m61j71Q0q7K70j22l06
$$ 7 223 219 -73 51 -399 277 108 -330 -241 -86 102 197 -327 -255 114 422 -39 -210 -130 -217 53 -69 -375
2864c75l8M56K87m13m14K89K43o1L10o04k8L63L75p47J16L1L25K45j35n16P7N64
$$ -375 -413 43 330 -83 -497 -208 35 -26 284 -320 -348 15 390 -357 -241 -210 115 360 225 -291 -214 350
2886C50l33k07K79j5j32M26o04p6J81L44j61j30k07K75n8O10n00j49K24J37k33
$$ 350 17 -190 89 74 -58 368 -236 -312 -131 213 52 -78 -285 -10 -68 542 42 -107 117 254 21
2907B1l49J99K39K00l93m6N0L51m30J25k66N15K0jl24p2K16N17o59n70O17K2l6
$$ 21 -328 -129 110 310 -83 -129 -79 272 -158 -33 -299 216 236 235 -89 -161 55 572 -87 -657 -40 -18 -54
2930e4K49k49j40N33j72j46k24Q7L31j74K08l56m16J089m02o43L87n7L58m9q1
$$ -54 195 -54 -194 339 167 21 -203 -116 215 41 249 -107 -523 566 164 -479 -92 -149 209 160 79
2951G9l38N0O38k96r8q7k34K65K25j55m00L58L35o65K77K1O9K57k76l33P6O79
$$ 79 -259 -209 429 133 35 -52 -286 -21 204 49 -351 7 342 -323 -46 -25 44 301 25 -308 -232 447
2973D47k45n65J64M10k10J12j49j5J86k7n07LK75N1j19M10l75l79O68N0k93L3
$$ 447 202 -363 -199 211 1 113 -36 -51 135 108 -399 -396 -121 -70 -189 221 -154 -533 135 185 -108 -75
2995g5J31k60M92j74k79j53P02k97k56r9K87m7L16j41m55J32J86q0j79M57k14
$$ -75 56 -204 288 114 -165 -318 384 87 -169 -268 19 -28 288 147 -308 -176 10 -70 -249 208 -6
3016fj30O45o51l48M01L69l58m2j43K12K8N6l38O0N69j62n68P7Q8M96k16Ok73
$$ -6 -136 509 -142 -490 -89 280 -78 -120 -263 -51 -23 33 -305 -245 324 162 -406 -329 -241 255 39 45 -228
3039b28J47J23l46J79J93j86J62L45o83K27L51K04o05J13k46N5M56o6l65N3L34
$$ -228 -81 42 -304 -125 68 -118 44 389 -294 -67 284 488 -117 -4 -250 -195 261 195 -170 -117 217
3060B17K16p30L93l65L41L7R9m81K04K44j17l15K30m9K72k78p3O9J01K21j57M6
$$ 217 433 -297 96 -269 72 109 208 -273 -69 175 58 -257 -27 -76 196 -82 -155 -86 15 236 79 125
3082A25J02j99J92k60jj36K36J64l64L63r0m07N84l29j76K71o4j24j75L84j91
$$ 125 227 28 220 -40 -41 -177 59 223 -141 222 132 -275 309 -20 -196 75 11 -113 -288 96 -95
3103i5K19M05k43n52K36K01k21MK51k68J1K9j74j43N57j46j52N8J83m20L91m38
$$ -95 124 529 286 -266 -30 171 -50 -46 205 -63 -52 -23 -197 -340 217 71 -81 -23 160 -260 131 -307
3125c07o6J47M55J4m86J73L7l1L83l10m10L43K96k44j77J69j57J17K28l33j18
$$ -307 -373 -226 229 243 -243 -70 -33 -64 319 9 -401 -58 238 -6 -183 -14 -171 -54 174 -159 -277
3146b77L74Pl52O17p10M05R1p3l04K45Rr1l57N04j75J8M73l15l45O1J38J97j20
$$ -277 97 104 -248 369 -341 64 155 82 -222 23 32 -59 -416 88 -87 -69 404 89 -256 -195 -57 140 20
3169B0q0k50L36K67n67J51M15r0j59J21j20j21K21J40j58j00J42k66l3L09m44
$$ 20 -60 -310 26 293 -274 -123 292 202 43 164 44 -77 144 284 126 26 168 -98 -131 178 -266
3190b66L69l1r5r8K46L8o4r3R3o2j61J88l5j08j39M39k60o1K08j42J27J38o0j90
$$ -266 103 72 -23 -121 125 163 99 6 99 37 -124 64 29 -79 -218 221 -39 -100 108 -34 93 231 171 -19
3214a9J91l38J45J42m41M59K74p02P1J26N3K5r9K28k77K22J50k88r1J39J10j16
$$ -19 172 -166 -21 121 -320 139 413 -289 -218 -92 -39 -14 -113 115 -162 60 210 -78 -169 -30 80 -36
3236c6L9j81K20J74m83J04J22K18m71J2jL24k6L81k01n49K95J80l92O37j33n31
$$ -36 3 -178 42 216 -267 -163 -41 177 -294 -282 -283 41 15 396 195 -354 -59 121 -271 366 233 -298
3258b98L67J97m48rL01k37j05N11k77k23J90J89j85q8J97j49l1K31O4l76K36j5
$$ -298 69 266 -182 -191 110 -127 -232 279 2 -221 -31 158 -27 -115 82 -67 -98 133 197 -179 57 42
3280D2j65N62r8m47K0L16m59oN44m94K18K21l48J31j63J72J68R5j21l12j45L37
$$ 42 -123 439 341 -106 -86 230 -229 -235 309 -185 33 254 -94 37 -126 46 214 309 188 -124 -269 68
3302F8K40j35L6l33J35RJ10k92M4N93p54J83J12j13L00j59l63l9O32l34m9K24
$$ 68 308 173 209 -124 11 20 130 -162 -118 475 -279 -96 16 -97 203 44 -319 -358 274 -60 -109 115
3324A15j10j31M23o56K17J05l6K25k0j53l99K66J42K91k65JL1k94K29L03k12J6
$$ 115 5 -126 297 -359 -142 -37 -73 152 132 -21 -420 -154 -12 279 14 15 46 -248 -19 284 72 88
3346H8J00k85p2N45l21k22K85Oj36J40j11J63j22J06k16j94L39O4j90L30k63n4
$$ 88 188 -97 -169 376 55 -167 118 124 -12 128 17 180 58 164 -52 -246 93 157 -33 297 34 -20
3368b0K2j13l66L87P0j47K0L28m45L08j54j15K31K1J96p1J7j26M9k24o2mL54p0
$$ -20 2 -111 -477 -90 -20 -167 -147 181 -264 44 -110 -225 6 27 223 152 169 43 92 -132 -194 -198 156 86
3392H6r5l68M64n4j03L09q0k68PL03m78J24M84l88j24M01k35l55N15k95r6j6N60
$$ 86 -9 -377 87 33 -70 239 159 -109 -102 201 -277 -153 331 -57 -181 220 -15 -370 145 -150 -246 -262 298
3415B98l30J88j64j30K20m9j30r5K73N6k27L3R8j43N4L39k34pK71j03k84K26n7
$$ 298 -32 156 -8 -138 82 33 -97 -192 81 137 -90 -57 41 -102 -48 291 57 50 321 218 -66 160 103
3438A03l34M14k70K5K51q1l91L23o3J01J6L09n17J31M9N7j14K2o3P9J09j21l11
$$ 103 -231 183 -87 -62 189 108 -283 40 -23 78 94 403 -114 17 66 123 9 31 -32 47 156 35 -276
3461b76M3N42o97Q25m26j69q7K26L74m57J41k21J7K15J38j34J0J04l21J63K58
$$ -276 -233 309 -388 437 11 -158 -245 -19 355 -102 39 -182 -165 50 188 54 64 168 -153 10 268
3482B68r5k08K25j11j07m8K22l69M01ql01j25L45j00nJ99k18j16L13l09qK88r
$$ 268 173 -35 190 79 -28 -76 146 -223 178 170 -131 -256 89 -11 -16 183 -35 -151 162 -147 -155 133 124
3505A24l56J15j95M00K62j18k67Q2m0k9O1J3L6r6k9K20m88J39Q53q65o0J42K35
$$ 124 -232 -117 -312 88 350 232 -35 47 7 -22 39 52 88 -8 -37 183 -305 -166 687 -178 -238 -96 139
3528A39k94J54J84l73J3L17j41L98m44L36k15q0L0N5J15m80L42mK08k33Q6j60
$$ 139 -155 -1 183 -190 -177 140 -1 397 -47 289 74 -6 24 79 194 -286 56 52 260 27 113 -47
3550d7n1J02m0o0N3J46l8l20M73k88j93L95j41k08O59j21n55J3J78J87j97J98
$$ -47 -98 4 -36 -96 -43 103 65 -255 218 -70 -263 132 -9 -217 442 321 -234 -221 -43 144 -53 145
3572A45k47N5k1J28k43K68M32p12Q8q7J69o7L32m64P5K30j21p4NK76l93L67ol29
$$ 145 -102 -47 -68 60 -183 85 517 -195 -107 -194 -25 -92 240 -224 -149 81 -40 -114 -109 167 -226 141 135 -194
3596a94N18m72O8K6J49r3Q2O3Q7l23qL36j31j45K19n9j70J92o1j14J85m0j78K64
$$ -194 324 -148 -80 -54 95 2 84 147 234 -89 -97 239 108 -37 182 123 -47 145 84 -30 155 115 -63 201
3620B01j10j06J37l2r7m4K27j60m0N9k86J49j53M54l25J3L03k21J21n2k31lL70
$$ 201 91 -15 122 90 -7 -51 176 16 -24 35 -251 -102 -255 199 -126 -113 190 -31 90 38 -193 -196 174
3643A74l74O1K64j88n5K6K88l94J80J51l25L59k04J7K3j56L37k98K95j44l22L01
$$ 174 -200 -139 125 -63 -118 -92 196 -198 -18 133 -192 167 -37 -20 3 -153 184 -114 181 37 -285 16
3665A6j99R8J23Q5j31p3J96o1j9j82L85l51J4K01l54K96M01n60j57L98k05J39
$$ 16 -183 -85 38 123 -8 -81 115 54 35 -147 238 -113 -99 102 -252 44 445 -115 -272 126 -79 60
3687F0j21R1k69K06K55m8j00M10m54k2P0j48J16l28J46J02k8K16l97J46N6L4M5
$$ 60 -61 30 -239 -33 222 174 74 484 30 8 78 -70 46 -282 -136 -34 -62 154 -243 -97 -41 -7 38
3710C8J9j13p4L35l10N0k5j25P5M72l71l2l0Kj76L77j14Mj11j81J46J37LJ06J06
$$ 38 57 -56 -130 205 -105 -55 -80 -205 -130 342 -29 -61 -91 -89 -265 112 -2 2 -109 -290 -144 -7 -4 102 208
3735B08l83K77j81O9j0O2J47j57J18k83K40j56P5J86k02o1K48j69j37Q8k26N5
$$ 208 -175 102 -79 -10 -20 42 189 32 150 -133 107 -49 26 212 10 -51 197 28 -109 -21 -247 -192
3757a92Q2K70l4m8l32K20J79J52m22J78O7J9l85M98k49j05l7J32o7O3R8J46J09
$$ -192 -110 160 126 78 -254 -34 145 297 -125 53 120 139 -246 252 3 -102 -139 -7 -74 -11 87 233 342
3780C42l19j51K45j80NN1j28K13K75o05J81J2j12J68K85m21L20J21l52P1K85k59
$$ 342 23 -128 117 -63 -58 -7 -135 78 353 -252 -71 -59 -171 -3 282 -139 181 302 -50 21 306 47
3802D7k51K96j93k72K95J15j21J03o9J03j37L30l94J86j33j34J59j09K70l22m2
$$ 47 -204 92 -101 -373 -78 37 -84 19 -50 53 -84 246 -148 38 -95 -229 -70 -179 91 -231 -273
3823b73L87j34lJ37l16J68M10m80K69l1r2j27J70l08J28K77r6m5K6j3l48J72L78
$$ -273 114 -20 -23 114 -202 -34 376 -104 165 134 42 -85 85 -223 -95 182 86 41 67 54 -294 -122 256
3846B56l08J73r3j77J65j28L43k89J96J77m86J06N6P8j89K41o7k00O02k48m6j28
$$ 256 -52 121 28 -149 16 -112 231 -58 138 315 -171 -65 -9 69 -120 121 54 -146 456 208 162 34
3868C4P8k61K14R2p7k16J62j22M2J12nk19L51r7l8l79J54J69J14j32km0J34k33
$$ 34 112 -149 65 157 80 -136 26 -96 -54 58 53 -166 185 88 50 -329 -175 -6 108 -24 -26 -66 68 -165
3892a65k9L00R7l59K2M19k35m0P3R2k53M5Q3j47j48Q2K10J43NJ3m80J90P9r3L8
$$ -165 -194 106 203 -156 -134 285 50 10 83 175 -78 -33 50 -97 -245 -163 47 190 195 208 -272 -82 -3 -96 -58
3917e8Rk48M20m37K33L55m7o4j18M3j69J25l9k42L47l82L09P5j4j36j33K00K38
$$ -58 -49 -297 123 -314 -81 274 227 163 45 88 -81 44 5 -237 110 -272 37 112 98 -38 -171 29 267
3940B67k99l7Q5j78K94J02j91j25L40j23m68L35L44j82N7R7n80N90O1n45R8M76
$$ 267 -32 -69 16 -162 132 234 43 -82 258 135 -333 2 346 164 221 318 -262 328 389 -156 -58 418
3962D18l77r2M0j59k0J40k68M00k31K15j65l8M16j79k11L52l25J63j3k99J07J22
$$ 418 41 -51 -11 -170 -190 -50 -318 82 -149 66 -99 -137 279 100 -111 241 -84 79 66 -233 -126 -4
3984dj25J57J3K34m77J16N8j38K37q3j51K52M04m90k97K00J08k70J79J75j47n6
$$ -4 -129 28 41 275 -202 -86 -28 -166 71 -12 -163 89 493 3 -294 -94 14 -256 -77 98 -49 -105
4006a05O4K98Om00j15J27J1j74O3L11qn1j64R8l0k7J57Q0r6K5L0K0j56J52n0l03
$$ -105 -41 257 263 -137 -252 -125 -114 -288 -225 86 78 27 -137 -39 -69 -96 61 141 45 70 100 120 -36 116 66 -237
4032b37N53l42M4r5o2Q2J83K3j92P9J4k56J78O3Q0J98r8m02K56k1j69r2L15j38
$$ -237 316 -26 18 -77 -139 -57 126 149 -43 36 50 -206 -28 35 115 313 215 -187 69 48 -121 -213 102 -36
4056c6J52j57N8Nk26K91O8j12K62j34k78K77J5J75k36k18n7L17j79L9J13K0q3
$$ -36 116 -41 17 22 -204 87 155 43 305 171 -107 170 185 360 124 -94 -151 166 -13 26 139 159 76
4079G6lJ5j41l33K24J33l46L52J71j04k38K32K02l65n1J62K0Q4r7k90L98k43K0
$$ 76 73 88 -53 -386 -162 -29 -375 -23 148 44 -194 38 240 -125 -176 -14 6 90 -7 -297 101 -142 -122
4102a22p9K20J36l94L28j51j32L34j32l41J85K35k46j11K12j12K60J71k08j32
$$ -122 -201 19 155 -239 89 -62 -194 140 8 -333 -148 87 -159 -270 -58 -170 90 261 53 -79
4122g9N4j36J66Q0l3k98M2L77j01j64lJ7m68R09m03r4K73j36N8J1j8K96l94J22
$$ -79 -25 -161 5 85 52 -246 -204 173 72 -92 -95 -78 -546 363 -40 -134 139 3 61 72 54 350 -44 78
4146G8l27L52k8J48k58O0L84m21J78l29J63K64j11j20o0J95n10M44J00j38K2O8
$$ 78 -249 103 75 223 -35 25 409 -12 166 -163 0 264 153 33 -27 168 -342 102 202 64 86 154
4168A54mk35R6j35k51M03L1k65K66j58R5n0m4K73k76K10k21R2m14L27j4Q5J48
$$ 154 150 -85 11 -124 -375 28 59 -206 60 -98 -3 -53 -97 176 -100 110 -111 -19 -433 -106 -120 -35 113
4191A13l50L83j07j33L45k94j11M3K76j62K43k81J19j78L5K54j66j33O6Q5j74
$$ 113 -237 146 39 -94 251 -43 -154 -111 165 3 246 -35 84 -94 -59 195 29 -104 -38 47 -127
4212a27K65m5l33K24K23j93J70n7j00N5O%k08N2K11o6n5J63k04l1K63r6J24k44
$$ -127 138 93 -240 -16 207 14 184 127 27 82 88 88 -120 -68 143 77 22 185 -19 -50 213 117 241 -3
4236cJ36p7j58L3k73L95j79J57j07J49j01l6K00k20k0Q8L2k2j43k2K64M2k5r0
$$ -3 133 56 -102 -69 -342 53 -126 31 -76 73 -28 -64 136 -84 -104 -16 16 -6 -149 -171 93 135 110 20
4260B0O1J11l1j40l4k20R2P1N3J93N6k24J65l24K03P8j20J72k90J21K94k19k41
$$ 20 81 192 161 21 -13 -233 -141 -70 -17 176 232 8 173 -151 52 130 10 182 -108 13 307 88 -153
4283a53J73k12J96J20j18L0J00p9k9j85J76K15n07L54M5j00J8j79M3M7m0J70j19
$$ -153 20 -192 4 124 6 36 136 57 28 -157 19 234 -273 81 126 26 44 -135 -92 -45 -85 85 -34
4306c4n2J32Ml6k40J74QJ50j7j52k9J4J33J97k69j02J94j63J28K1r4j20K15r0
$$ -34 -86 46 50 14 -226 -52 -44 106 89 -63 -92 -78 55 252 -17 -119 75 -88 40 61 -33 -153 62 -28
4330b8J95j47N6k4l04N33j90j01J63k82P9K51l38K3L17n62K01K87j5j12P2k10
$$ -28 167 20 76 52 -252 281 91 -10 153 -129 -50 201 -137 -114 203 -359 -158 129 114 2 74 -136
4352a36K15k04J71k37K96J6r9O4l1n6p8K81j56p9j89N26k87J84K1k21o5J32l03
$$ -136 79 -125 46 -191 105 121 22 86 55 -1 -79 202 46 -33 -222 304 17 201 222 1 -64 68 -235
4375b35k3M54k32r1K67OL4p4k14j24L3J14o1J33K4l33K12L46m34P3M49n86J60
$$ -235 -258 196 -36 -127 140 146 180 106 -108 -232 -199 -85 -146 -13 11 -322 -110 236 -198 -125 324 -262 -102
4398a02k29Q0L61l02K45K03j36lk8M6m6J2j87K9M5j12K53j72J28j14P9m0j17J65
$$ -102 -331 -251 110 -192 53 256 120 117 89 135 89 101 -86 -57 -12 -124 129 -43 85 -29 50 10 -107 58
4422E8J47n54K17R2K81lO3l52o2j13M65n24L21K17m60L37l3Qj78k67N66k74j56
$$ 58 205 -349 -132 -40 241 238 301 -51 -113 -226 239 -285 36 253 -207 130 97 105 -73 -340 226 -48 -204
4445b04P6J80N0K22m07J23J47l30J40N7m3j0J90l29q9K15L61m77K7K95k5j88J97
$$ -204 -128 52 102 324 -83 40 187 -143 -3 54 11 1 191 -138 -227 -12 349 -128 -101 194 169 -19 178
4468A78j36l9K35k39j38k1J53k21J76n7K35l05M43l15q7M72k15j83r5K68Qj84
$$ 178 42 3 238 -1 -139 -160 -7 -228 -52 -109 126 -179 264 -51 -138 334 119 -64 -159 109 117 -67
4490f7M17j80k54J80P7j85K38j16l87M09n9m20L46K08l63M70j63k40K04k6k21
$$ -67 350 170 -84 96 173 -12 226 110 -277 132 73 -347 -1 207 -156 314 151 -89 115 89 -132
4511a32J57J06k16J9o3o0J35J07J06j88l7J28j10Q6J57j45M5J25k50k68L60N5
$$ -132 25 131 -85 -66 -129 -189 -54 53 159 -29 -66 62 -48 38 195 50 95 220 -30 -298 62 117
4533A17J00K0j00J38k58k7J7j31L08k34Q0j00P6j18l8L70j69J50Ql89J0R6o9l6
$$ 117 217 237 137 275 17 -10 7 -124 184 -50 30 -70 6 -112 -150 220 51 201 209 -180 -170 -74 -143 -179
4557a79M22j61l0R2l64K61Pl4l21L87j62R1J91J76l35L3rk80K1K74k08K17r4p6
$$ -179 243 82 52 144 -220 41 48 14 -307 80 -82 9 200 376 41 74 65 -215 -194 80 -128 89 -5 -81
4581h1j11J16J41j81o0K84j22l70N91k71R4k78K31l9r9M02k99K79j77j03JJ3J48
$$ -81 -192 -76 65 -116 -176 108 -14 -384 207 -64 30 -248 -17 -56 -155 247 -52 227 50 -53 -52 -39 109
4604A09k03p2L88l40N2L9O0Q7k28K63j87J60k11l60N55N5k79K46N8j27p4K80k53
$$ 109 -94 -166 222 -118 -66 -27 33 120 -108 155 -32 128 -83 -443 112 167 -112 134 192 65 -9 271 18
4627A8K39k71p1O3J22j61K0R1j35k26M20j54J2j33O18m18p3K71o0J00p8l00K52
$$ 18 257 -14 -85 -22 100 -61 -41 50 -85 -311 109 -45 -33 -166 452 34 -39 232 172 272 194 -106 146
4650A46J19l15K44k41J86m74K07J89L7l04R0J94j05j20K45k04J87N9k41K09k04
$$ 146 265 -50 194 -47 139 -335 -128 61 98 -206 -116 78 -27 -147 98 -106 81 140 -101 108 -96
4671i6J92k14R3k85L66k58K89l32K98k15k07N53J7k79J87j48j60K2L53k15p9O2
$$ -96 96 -118 -25 -310 56 -202 87 -245 53 -162 -369 184 201 -78 109 -39 -199 -177 176 -39 -118 -56
4693e6O1n1L52l56q5L3M4J92j82l63M90l12N35k52m1M7n7o5K95k21p7K5QJ27P5
$$ -56 5 -46 306 -50 -135 -102 -58 134 -48 -411 79 -233 302 50 9 56 -1 -66 229 8 -69 -44 -36 91 166
4718A66k22J0Lk0L53m83L41P4m0l13L20J95n90K84k24L17lj32qN5O3j77K3K31
$$ 166 -56 -46 -43 -63 290 -193 148 222 182 -131 189 384 -206 78 -146 171 168 36 28 83 146 -31 -8 223
4742B23l7J80m37q1K89m32L72k27MK20j84J24lj14N9K62k13M7K80o48K02K6K98
$$ 223 186 366 -71 -152 137 -295 77 -150 -146 74 -110 14 11 -103 -44 218 5 52 332 -316 -114 -88 210
4765B10l79J89k01K82l2r3J11o2O5q4J4K45m27J17K74k99k2Q4p8q5L95k66J81
$$ 210 -169 20 -181 101 69 -24 87 25 90 6 20 265 -162 -45 229 -70 -92 -8 -86 -171 224 -42 139
4788A39k23K90J9k50K19k54J79K41m38O1L97n18L7p5L42q1j72L34l67q6M52k25
$$ 139 -84 206 225 -25 194 -60 119 360 -78 -17 380 -138 -101 -176 166 85 -87 247 -120 -206 246 21
4810B1j39L24k95M6L25l84K26r9m2k0o0l16M12J4k0O9l33M18j42l4L98N0n71M1
$$ 21 -118 206 -89 -43 282 -102 124 25 -17 -37 -97 -413 -1 13 -7 62 -271 147 5 -29 369 419 -152 -111
4834a11l5J1m4L62J28p38L24J8l3L82j23J4q9o2k5J01J74l35j82L19k38L0L04
$$ -111 -146 -135 -179 183 311 -427 -103 -85 -118 264 141 155 66 4 -21 80 254 -81 -263 56 -182 -152 152
4857A52R2l70K99p6j00n4j38L08K53l88J40k11L38l13L7O6J91n60O11j83j48o3
$$ 152 244 -126 173 97 -3 -57 -195 113 366 -22 118 -93 245 -68 -31 35 226 -334 277 94 -54 -117
4879a17k7J00q3J65K4Q6j80L22k92QN6k07K46M2p1j23k46M67j51k20L56j4o8Q7
$$ -117 -144 -44 -127 38 62 148 -32 290 -2 6 62 -145 101 143 72 -51 -297 170 19 -201 155 141 73 160
4903A60M8j14l51M06k76K90l40J70J96r4k60J6J17J20j30K72k01N3m80L62K7J97
$$ 160 208 94 -257 149 -127 163 -177 -7 189 95 -165 -149 -32 88 -42 230 29 82 -398 -36 -9 188
4925A88j64m3l78M24k8N2k46OM50J4k89K9O4r8J82j94K76m47J01K22j97k07J87
$$ 188 24 -19 -397 27 -1 51 -195 -189 261 275 -14 15 79 -19 163 -31 245 -202 -101 121 -76 -283 -96
4948i6l1k54O69j66l79L84l57K36j07L08l02j58mK22K60j44j17k9k0K08l38J23
$$ -96 -127 -381 288 122 -257 127 -230 6 -101 207 -95 -253 -257 -35 225 81 -36 -65 -85 123 -215 -92
4970i2m7J54j64K57n8K7r3J65k36K39j48j83L74j16l10K28J5n2j08M03l85rK53
$$ -92 -139 15 -149 108 50 77 -16 149 -87 152 4 -179 195 79 -231 -3 12 -40 -148 255 -130 -139 114
4993A14J1R1m6j27k98L46l11J57k49L96k77K55J8J0R6q6J28k90L50k92j49K22
$$ 114 125 216 170 43 -255 91 -220 -63 -312 84 -193 62 80 90 186 100 228 -62 288 -4 -153 69
5015F9l64M39k62J2J67j44j71nJ69M91m49N2O9l54J69K16n1m9j23L25m81L13j57
$$ 69 -295 144 -118 -106 61 -83 -254 -259 -90 401 -48 4 73 -281 -112 104 53 4 -119 206 -275 38 -119
5038a19Op9K89J68m13K91l21J60J09Rj53J40j19r4J87r6Kr5M7n5O9Mn3P6j30L97
$$ -119 -113 -192 97 265 -148 143 -178 -18 91 100 -53 87 -32 -126 61 -35 -33 -128 -81 -136 -67 -63 -116 -40 -170 227
5064B27l78L28q4K9j96R9M3J26j8k45m9K50K6l19J26L7J9j21j09J68N9K44l60
$$ 227 -151 177 93 122 -74 25 68 194 176 -69 -118 132 158 -161 -35 2 21 -100 -209 -41 18 262 -98
5087i8O3L21l78J12j00K95M4l60K29k7k97K78j63K7N1L7j3J57l4k12r9%j57J60
$$ -98 -35 286 -92 20 -80 215 259 -101 128 101 -196 82 -81 -54 -3 34 21 178 144 -68 -167 -167 -324 -164
5111a64m3J74r9K29L7n4m83M36k50L31m3mj97J85J25k26k7O0K15k41O2j13m2Q0
$$ -164 -207 -33 -132 97 134 80 -403 33 -217 114 71 67 -130 55 180 -46 -73 -13 202 -39 23 -90 -132 -52
5135e2K02m86L80p2o3J84j13K45Nk31N0O1k51K12l02L11k55j01O18l06j48J81
$$ -52 150 -336 44 -28 -91 93 -20 225 230 -1 49 110 -141 71 -231 80 -175 -276 342 36 -112 69
5157F9k31n0M16k61p9M26r6r6j36m6Q9L72j37m41K32k02J60p9J14k10J79J65k01
$$ 69 -162 -212 204 -57 -136 290 194 98 -38 -84 5 377 240 -201 31 -171 -11 -90 24 -186 -7 158 -43
5180d3L0J06k17J95k63L5P5K03m6Q8m9k89K50j73n2L7L23j16K04k68k74K78o1
$$ -43 -13 93 -124 71 -192 -157 -82 121 75 163 114 -175 75 -98 -150 -113 210 94 298 30 -244 34 -27
5203b7j47K44p7k26J39j2n8L26j68q1K68j73J82j46l11K75O5j74J32l20K44m0
$$ -27 -174 70 -7 -233 -94 -106 -164 162 -6 -87 181 8 190 44 -267 8 73 -101 31 -289 -45 -85
5225h5L21k74jJ53j00j34L53j83q5j07r3J52m4J67j11j94m2L6M69Jl96J17K23
$$ -85 236 -38 -39 114 14 -120 233 50 -35 -142 -235 -83 -127 40 -71 -265 -307 -271 198 199 -197 -80 143
5248A43k91J25l94M11m13O37k41k91M05k9j15K73q9M4l66J74N3r5J84l02R5J8
$$ 143 -148 -23 -417 -6 -419 218 -23 -314 91 62 -53 220 131 175 -191 -17 36 -59 125 -177 -82 -64
5270f4J10L4o4j41o3M51k48J79L6l40J60j34l9k5l8J57j45K32j24j6K19j63j84
$$ -64 46 80 16 -125 -188 263 15 194 230 -110 50 -84 -123 -148 -186 -29 -174 58 -66 -82 137 -26 -210
5293b10R2L2K00j23K57j02j5L1m92M28m9k63J62R5L0N1j27j22K84P1l48K12m4
$$ -210 -118 -86 114 -9 248 146 131 162 -330 98 49 -214 -52 43 73 124 -3 -125 159 230 -118 94 50
5316E0J15j91J67O3k78L04o0j85m3QJ52m4K43m09J02J01j85J41k17K24j57K49
$$ 50 165 -26 141 204 -74 230 170 -15 -58 -50 102 58 301 -108 -6 95 -90 51 -166 58 -99 150
5338A50k66M9K6K0j28N61n08L59k63J19l37L02Q9k87K95l14K83m22L30j64J06
$$ 150 -116 -67 -41 -21 -149 412 -96 263 0 119 -218 84 173 -114 181 -133 150 -272 58 -106 0
5359@J42j64J72l07k4L80N2j51J67j01N2l00J87J04l46L4K95m09J47P8J59l46
$$ 0 142 -22 150 -157 -181 199 251 100 267 166 218 -82 105 209 -137 -103 192 -217 -70 8 167 -179
5381a79O6O2P1q8p3K04nN2Q6l1j03o8o9J32L4Q6j31j4ok73J32J24p8L3j35K24
$$ -179 -113 -51 20 -68 -141 63 58 110 196 165 62 -6 -75 57 91 177 46 32 26 -247 -115 9 -69 -36 -171 53
5407E3J8j59k61M94M1l27J83J46j68k69K67K8J85o9j2j44kJ34j29q9M6OJ65j2
$$ 53 71 -88 -349 145 186 -141 42 188 20 -249 18 46 231 162 150 6 4 138 9 -80 -34 -28 137 125
5431A25l1ro6M0k48p5K64qk26J32J27J50k15n5p8J39PK05j06QJ31r3j07J70j05
$$ 125 94 85 19 59 -189 -264 0 -8 -234 -102 25 175 -40 -95 -173 -34 -27 178 72 80 211 118 11 181 76
5456G6k89J09p1Q4K01r4J30j38J98J36k82L1n1M9n1k64L35j19k5J30k67O2m3R8
$$ 76 -213 -104 -175 -91 110 16 146 8 206 342 60 91 40 89 38 -226 109 -10 -35 95 -172 -110 -153 -55
5480e5N4k9Q1k79n3J29L82n8k72J00J33M5j09p6Q9j22j36mP6J83j26J2J4R9L42
$$ -55 -1 -30 51 -228 -281 -152 230 172 -100 0 133 178 69 -7 82 -40 -176 -180 -104 79 -47 -35 -21 78 420
5505D20l68R4k69n0j5M9K35N0j7M2L5j10j60j11L14j02Jk22Q9J53j67L1O1Q2l20
$$ 420 52 146 -123 -173 -188 -139 96 146 129 171 206 96 -64 -175 139 37 38 -184 -95 58 -109 -78 -17 65 -255
5530b55K93kl9K59l32J5p5J26n2K05O9n8K1j97J07l06M25j91k66K47l62L83P1
$$ -255 38 36 -3 256 -76 -61 -136 -10 -62 143 212 154 175 -22 85 -221 204 13 -253 -6 -368 15 86
5553H6j69p5J39P1j34J25n7n6J82l28K12J26J23l92K37Kn83M63J70r3J65j68k55
$$ 86 -83 -158 -19 52 -82 43 -14 -70 112 -216 -4 122 245 -147 90 92 -491 -28 142 49 214 46 -209
5576b09J65K83k7k25j51N4O8j94M47n1l75L32p4j21K81j19m06L86k1m4L5j99J32
$$ -209 -44 239 212 -13 -164 -110 -42 -236 211 160 -215 117 43 -78 203 84 -322 64 43 -1 34 -165 -33
5599c3M7j82L75m24m1N78k87J11k36R0j06M20n02J60oN21n76Q6O6p5J70m02L22
$$ -33 14 -168 207 -217 -258 320 33 144 -92 -2 -108 312 -190 -30 -36 485 -91 -5 61 -14 156 -246 76
5622G6J68j99J52m51M11m95K38J28j85J66k88K61N6l1Q5j30j92K82k29J73k00
$$ 76 244 45 197 -254 157 -338 -100 28 -157 9 -279 -18 38 7 92 -38 -230 52 -177 -4 -204
5643b04K47j49j02L71m23K64K53n11J67j01N09l4j57j48Q2k9n2k79j4O08l23j5
$$ -204 43 -106 -208 163 -260 4 257 -254 -87 -188 321 287 130 -18 64 35 -17 -296 -310 298 -25 -40
5665d0J79M2j70K89m02L18Jj24L5j71J5J00n9K12P9p41M10P3R4k45K7Q8j87M32
$$ -40 139 181 11 300 -102 216 217 93 128 -43 -28 72 13 225 304 -437 -27 46 140 -105 -78 10 -177 255
5689B55r1k26J56m0k54M14p8k67L08k16j62K74o9OJ43j62L19m29J77k22m3J69
$$ 255 164 -62 94 54 -200 214 136 -131 177 -39 -201 73 4 10 153 -9 310 -119 58 -164 -207 -38
5711c8M9j17m4J18j37J57O2l11O8J56j98J25K56j99Q0J6r7j24J09l9J44k68o6
$$ -38 11 -106 -150 -32 -169 -12 50 -261 -193 -37 -235 -110 146 -53 27 43 -54 -178 -69 -108 36 -232 -298
5734b98L07L9j10M94l14n5l0K3l8J84J63m79j0R4L03l56L93l13j12K16k36K12
$$ -298 9 48 -62 432 118 63 33 56 18 202 365 -114 -124 -30 273 -83 310 -3 -115 101 -135 77
5756G7k44lK41p3l3k72M18n5l2J99j55j26k37N21l08L91k55k9j47L69l35j43j02
$$ 77 -167 -170 71 -2 -35 -307 111 56 24 223 68 -58 -295 226 -82 309 54 25 -122 247 -88 -231 -333
5779c33N56k95R4M9r7P3L23k01j5j64k66L63R8p9J38m2j16j47K09j38j15K72k10
$$ -333 223 -72 22 71 -26 47 370 169 154 -10 -276 87 185 106 244 202 86 -61 148 10 -105 167 -43
5802d3j40L06j17j52p3J52p4J24P8j2q3J21J93j93k6k18l2m6L16J28M3k55o7J6
$$ -43 -183 123 6 -146 -219 -67 -141 -17 61 49 -34 87 280 87 61 -157 -189 -235 81 209 252 -3 -70 -54
5826e4J85l4l96M99J13n3k65J39j56O8j9k18K30j74R7J6K6J01J1k33q9p6K82K0
$$ -54 131 97 -299 200 313 260 -5 134 -22 46 27 -191 39 -135 -38 -22 4 105 116 -117 -206 -282 0 20
5850B0k20J15J1J20j34j19L03j08j69R0j76K91j52K5Q8k29J10L06n0k11O7Q0Q4
$$ 20 -200 -85 -74 46 -88 -207 96 -12 -181 -91 -267 24 -128 -103 -15 -244 -134 172 122 -89 -22 58 142
5873A42j92k1l1K45P0k53J23j50j2L46m02K48j14Pr5J27K0l40J48k5J59J88l08
$$ 142 -50 -71 -102 143 213 -40 83 -67 -79 267 -135 113 -1 6 -89 38 58 -282 -134 -159 0 188 -120
5896a20K95Prj68J94l22J90K18k42j04j16L82l36j09L4K84J48p6l60J42l3K31
$$ -120 175 182 173 5 199 -123 67 285 43 -61 -177 205 -131 -240 -206 78 226 150 -210 -68 -101 130
5918A30l32K05J07k21K90j86j59L0K43q3j22K00J13j21J58l33o0L70j69j35q2
$$ 130 -202 3 110 -111 179 -7 -166 -136 107 24 -98 102 215 94 252 -81 -141 229 60 -75 -157
5939a57J17Q4n3m6K68j33j69j25K51j25k2J68O3N5k59J72L6M8k29K7J69J9J3k07
$$ -157 -40 44 -9 -55 213 80 -89 -214 37 -88 -110 58 121 176 -83 89 125 173 -56 -29 140 159 172 -35
5963c5LR3m4J44j89J58l44L13j86kR7j99R1K42Q5j99P2p9R5k49K34n6J22j93J55
$$ -35 -32 61 17 161 -28 130 -214 99 -87 -89 8 -191 -100 142 227 28 100 21 116 -133 101 45 167 -26 129
5988A29J52k94k5Q8k69M2K39m23M05K1J08m52L01L3j9j81NK65J10m77K00k5J53
$$ 129 281 -13 -38 50 -219 -177 62 -361 44 65 173 -279 22 55 36 -145 -140 125 235 -242 -42 -67 86
6011H6O7k53J07J14l5k39J71r1n2R3K43l52j77M13J29p8k5r2j88M64q7j03J14
$$ 86 153 -100 7 121 86 -153 18 -73 -125 -32 211 -141 -318 95 224 146 121 29 -159 305 218 115 229
6034B29j59o0j87K11M2j78K08M3j56R1J42k78K54J70k55j38k74Q0NJ46Kn7M26
$$ 229 70 10 -177 34 76 -102 106 149 -7 84 226 -52 202 372 117 -21 -295 -215 -210 -64 -62 -119 307
6057C07k92kJ2l1J56k47M8K8K53j91k18K51j96p6K64o9j81r0K63J77m82M18k71
$$ 307 15 13 25 -6 150 -97 -49 -21 232 41 -177 74 -122 -198 66 -3 -184 -274 -11 166 -316 102 -169
6080a69L50j91L0P4j6l61K34k13K06k01K36j06K9J09J8m26K57O1o4k15L36J32
$$ -169 181 -10 20 94 78 -283 -49 -262 -56 -257 -21 -127 -98 11 29 -397 -140 -79 -143 -358 -22 110
6102A10J23k67r5K5j34J14K45K4k80j50K82j44k4L49l09J28j17k0K55j78J1j56
$$ 110 233 -34 -129 -104 -238 -124 121 145 -135 -285 -3 -147 -171 178 -131 -3 -120 -140 115 -63 -52 -208
6124b08L13m4q4P9J90m99L59jk53J52J10j72jK37j82k60R6L56Ll47k02M60k61
$$ -208 105 61 -23 56 246 -253 106 105 -148 4 114 -58 -59 178 -4 -264 -168 188 191 -156 -358 102 -159
6147a59J12R3J27k34j13J36j6K44k60J18q0m7J26%j51p4OK11j02oJ03K43k58j08
$$ -159 -47 46 173 -61 -174 -38 -54 190 -70 48 -32 -79 47 47 -104 -178 -172 39 -63 -69 34 277 19 -89
6171h9J39K00K7j43j18J09Q4r2N4j50L0m3j24k9l09K42K43n3j67K06o9l2M47k11
$$ -89 50 250 277 134 16 125 209 117 171 21 51 8 -116 -145 -454 -212 31 -22 -189 17 -52 -84 363 152
6195A52n2n64L78P4j82L60k05LK01j5K97n54O2l2J58p3MP1j65L2P7J41j44k8k9
$$ 152 100 -464 -86 -12 -194 166 -39 -36 165 150 447 -107 -45 -77 81 8 12 83 -82 -50 27 168 24 -4 -33
6220c3J45J22m4J23k93J42j08lP6l0J11p2P6q5j84N30j88j45k54j37L18p6K13
$$ -33 112 234 190 313 20 162 54 51 127 97 208 136 212 127 -57 473 285 140 -114 -251 67 -9 204
6243B04k05j7o6l6L9k32L85l59M47l31K89k4L5q3j76L06k40P7K4j71n2P0J4N1
$$ 204 -1 -18 -84 -120 -81 -313 72 -287 160 -171 118 94 129 46 -130 176 -64 13 37 -134 -186 -116 -102 -51
6267e1l07R4N02l38Q7K8K3j91J65J07J9Q5k20P2n6Q7j53j14N78j84l97L28k3j61
$$ -51 -358 -264 238 -100 -13 15 38 -153 12 119 138 223 3 75 19 106 -47 -161 417 233 -164 164 141 -20
6291b0j66L31l90L72p7j49M9p8K03j85J98K39k48k58N2J99n3j36K09k87M26k99
$$ -20 -186 145 -245 127 50 -99 -50 -128 75 -110 88 327 79 -179 -127 72 19 -117 92 -195 231 -68
6313f8J89j88k9M2J48O3lK42o00K19j22Q3J68M3j42J37l79K4N5J16k75K26P3m8
$$ -68 121 -67 -96 -54 94 157 154 396 -204 15 -107 -24 144 187 45 182 -197 -173 -118 -2 -277 -51 22 -26
6337b6J82KM6J18m99K15j27J69k52K90r3p2P9j7J20m3m11L33J32k47R8j36j73
$$ -26 156 158 204 322 -177 38 -89 80 -172 118 25 -47 32 15 135 92 -319 14 146 -101 -3 -139 -312
6360c12Q1L07J6p8j50r0J47J73K60k90J37k96J36k15m3K73k27J33K14J03j79j19
$$ -312 -231 76 92 14 -136 -226 -79 94 354 64 201 -95 41 -174 -217 56 -171 -38 176 279 100 -19
6382a9J2r9J12o0J07M1N5k26J23j51N4m1J05n3Q4R7j42j51J24K9J8J80n22L19
$$ -19 -7 -106 6 -54 53 94 149 -77 46 -105 -51 -92 13 -40 44 141 -1 -152 -28 1 19 199 -323 -4
6406dp0M4JK05q5l78L43qk9j89L03p1k8K82l14j40R5p5M41j98j81j39L37m9k96
$$ -4 -74 -30 -29 176 91 -287 56 48 19 -170 133 62 34 316 2 -138 -43 -118 323 125 -56 -195 142 93 -203
6431b03J94Q1j77J88k7l33J96j32L12j26J12J2J04j37m9l3q7K59J9j41K06j29
$$ -203 -9 72 -105 83 56 -277 -81 -213 99 -27 85 97 201 64 15 -18 -105 154 173 32 238 109
6453A09o8J28L5l15kO5j42J32j26J58m0L77k00J07k87J88j52L8L8k55M21R3j20
$$ 109 41 169 204 -111 -113 -48 -190 -58 -184 -26 -66 311 111 218 -69 119 -33 5 43 -212 209 302 182
6476A82r1r7J73Pk23j00K02j16j65K87J29j56r1J3J2q1LJ5k9r6L86J45l45K06
$$ 182 91 -6 167 174 -49 -149 53 -63 -228 59 188 32 -59 -46 -34 -115 -112 -97 -126 -222 164 309 -36 170
6500A70L5k51K04p3l7j32Q8lJ17j20K1k88L75l13K47k3N7l37K15p5J45p1l3L11
$$ 170 205 -46 158 85 48 -84 4 1 118 -2 19 -269 106 -207 40 17 74 -263 -48 -123 22 -49 -82 229
6524B29l43L14k30j51k6Q3K96N6j84o0l3J03j17L30k78O4J40p4K1j55K02j20J19
$$ 229 -114 200 -30 -181 -207 -124 172 228 44 -16 -49 54 -63 267 -11 53 193 119 140 -15 187 67 186
6547A86k33k9J02RP5K23j77k77K57m7rl43J54J12j35K28J07l74L00k10J19j45
$$ 186 -47 -76 26 35 110 333 156 -121 136 89 80 -263 -109 3 -132 96 203 -171 129 -81 38 -107
6569a07K39j94k0L37k05L02j14k54j3j36K75qj15K21J56n94K1n7L68J06k81L81
$$ -107 132 -62 -82 255 50 352 238 -16 -29 -165 110 102 -13 208 364 -230 -209 -266 102 208 -73 308
6591C08n80%L10j30k9J04q1l4L60m08J69m5M53l92p6M5j15K65q4K8L3j08j62p0
$$ 308 -272 -272 38 -92 -121 -17 -98 -132 228 -180 -11 -56 397 5 -71 -26 -141 124 40 68 101 -7 -169 -239
6615b39K02LK2J25j87j82R5L35k02kJ02q0j92K20QK2J71L2o8k71J03k6K89l78
$$ -239 -37 -34 -12 113 -74 -256 -161 174 -28 -30 72 -8 -200 20 28 50 221 253 185 -86 17 -9 280 -98
6639i8L2J86jl8K52j52k2k10J71K10j26l06l83O53l5k62L3J34k97L77n6K7k42
$$ -98 -66 120 119 81 333 181 159 -51 120 330 204 -102 -485 168 133 -129 -96 38 -259 118 62 89 -153
6662a53M02m7j62k27J6J29J6P3j02j16J75lN7K6J66m06k5K31m53L76r1J76j74
$$ -153 249 202 40 -187 -171 -42 -26 47 -55 -171 4 1 58 84 250 -156 -181 50 -403 -27 -118 58 -116
6685a16K25l67QJ69K20j47k07N04m21K60k63L00j07m1l1K70n00K45p0Nk08K56
$$ -116 109 -258 -250 -81 139 -8 -215 289 -132 128 -135 165 58 17 -14 256 -244 1 -69 -64 -272 -16
6707a6J8PJ8J33k39r6K30o2P2j95j21J07K92l03K11q4k78L52q5j28p4M06p9r5
$$ -16 2 9 27 160 -79 -175 55 -7 65 -130 -251 -144 148 -155 56 -28 -306 46 -39 -167 -241 165 86 -9
6731iR8N3j56k06L13j38J10j61k7J27o5K64o5j36K51k94m2m7m3M71m31K23o8m8
$$ -9 89 142 -14 -220 93 -45 65 -96 -123 4 -61 203 138 2 253 -41 -83 -130 -173 298 -133 90 22 -26
6755b6QO5m7o1p9K73o0J32j50L7j50k55M79K2Q2k76K35J31j29m22L67K18l86K09
$$ -26 -18 47 0 -61 -140 133 73 205 55 92 -58 -313 166 188 270 -6 229 360 231 -191 176 394 8 217
6779B17K2k78p6J57J47q7mr4m6o7L31r2j58j69R5Q5nJ02O0L42l20j05j36J73m3
$$ 217 239 -39 -115 42 189 102 98 4 -42 -109 222 130 -28 -197 -102 -17 -22 80 140 482 162 57 -79 94 51
6804E1j31O9o3Nq3L96n16K87K00l00o3K54l05K42j2Q5J38j35k55L05l55K90Rl14
$$ 51 -80 -11 -74 -69 -152 244 -272 15 215 -85 -148 106 -199 43 31 116 254 119 -136 169 -186 104 113 -201
6828b01J32N2K1J31m20J54o0J83K27j18k4l89K48Q3M8J32n32J90J2K52J7k49L38
$$ -201 -69 -17 4 135 -285 -131 -191 -8 219 101 77 -312 -64 19 67 199 -333 -143 -131 121 138 -111 227
6851B27l13j35K17L1j22L52n89N31m3kn77M32m7K05l39M54k68j63K43o7j31P5
$$ 227 -86 -221 -4 27 -95 257 -332 199 156 154 -423 9 -38 167 -172 282 14 -149 94 27 -104 -29
6873b9j46J45o1J43r8J92l34L30j38l25O25j00j98J76l2j19l3N2k45K14R1k80
$$ -29 -175 -30 -91 52 -46 146 -188 142 4 -321 304 204 6 182 150 31 -2 50 -195 19 110 -170
6895a70K0K14j53J07j34r8K86O8o5j17P9L5J64m51K08r8o5K50j20K12J5j67J14
$$ -170 -150 64 -89 18 -116 -214 72 140 75 -42 37 72 236 -215 -7 -105 -170 80 -40 172 187 20 134
6918A34k48N49m11J29j24q8R3k70M20K11k43j7l23K72N4l41P2M87o59J60M7J18
$$ 134 -114 435 24 153 29 -59 34 -236 184 395 152 135 -188 84 138 -203 -131 356 -303 -143 -96 22
6940B2J10j99j7m9LMK95j39L6j10K0R5j56N3J58j1k32K42J73m07p4K45j69P2l1
$$ 22 132 -67 -84 -133 -130 -126 169 30 66 -44 -24 71 -85 -32 126 115 -117 125 298 -109 -183 62 -107 -35 -66
6965f6K80j91j95M11j78q8l0j72J89J16J25j30n7m1lJ37j93J86o7L7Qk78M74j55
$$ -66 214 23 -172 239 61 -27 -57 -229 -40 76 201 71 14 -27 -30 107 -86 100 33 70 78 -200 274 119
6989A19j09jj91J34NL35l93K30Q6k47Q3M9k23mK02jJ3O2J6m12J83j19K73R6j08
$$ 119 10 9 -182 -48 -43 292 -101 129 215 -32 51 100 -123 -127 75 74 87 149 165 -247 -64 -183 90 186 78
7014G8l41M46k94pMJ17k71L86l22J58L52m36K92j68L99l02J6n4r1j12R7J33k7
$$ 78 -263 183 -111 -118 -114 3 -268 118 -204 -46 306 -130 162 -6 393 91 107 53 -38 -150 -53 80 53
7037E3M6j13j64P5J76j63K68j77Rk18J72M21l39m1o1j07J15j60j45R4K84L0l14
$$ 53 99 -14 -178 -103 73 -90 178 1 10 -208 -36 385 46 5 -56 -163 -48 -208 -353 -259 25 55 -259
7060b59K49j33q6J64J7j62o3M51k29K6l5K83j97n1j03K17j12j11L83k20K74k89
$$ -259 -10 -143 -229 -65 -48 -210 -273 178 -51 -25 -60 223 26 -25 -128 89 -23 -134 249 29 303 14
7082A4m45N71M2j02L9j2j01J83j42J58k73J27j61q6N06l11P8p0J64j71j01P9j66
$$ 14 -431 140 182 80 119 107 6 189 47 205 -68 59 -102 -188 318 7 85 15 179 8 -93 -14 -180
7105a80r5K40N6o2mk53K37j33L18j61K39k61L2o7J59q2jn9J45k53P5K89K3l82
$$ -180 -275 -35 21 -41 -45 -298 -61 -194 124 -37 202 -59 -27 -94 65 -17 -18 -77 68 -185 -110 179 202 -180
7129a80L9J55P9j48j51P3l8kQ5J16K06m20K64p6K4P7rr3K13k2l7l62K3N9j8J49
$$ -180 -141 14 93 -55 -206 -133 -171 -173 -88 28 234 -186 78 2 26 103 94 1 214 192 155 -207 -184 -125 -143 6
7155Fm5J57P1k4n1j18k28K79j36J80k01P1J35j33m9j31K07m4J03k1j13k06K82
$$ 6 -39 118 189 165 114 -4 -232 47 -89 91 -110 -39 96 -37 -86 -217 -10 -54 49 28 -85 -291 -9
7178ik81R5K10k4j73NM88l01J32l36K54o0m5O1j88l6M92k40k55l9J26K34%k47
$$ -9 -290 -195 15 -9 -182 -177 311 10 142 -194 60 0 -45 16 -172 -208 284 44 -211 -250 -124 110 110 -137
7202a37J52j2o4L12K6j21r2k09k7K79r4N7l05L51j13j86K4J64K32l50K03r3j31
$$ -137 15 3 -61 251 277 156 64 -145 -172 107 13 70 -235 116 3 -183 -159 5 237 -113 90 -3 -134
7225a34J66n3o0K7K45R0m51K39l36J22M4J7L15k51K6J09k13R8q5j65K83M5j3j19
$$ -134 32 -21 -81 -54 191 281 -170 69 -267 -145 -101 -84 231 -20 6 115 -98 0 -85 -250 33 78 65 -54
7249e4J29jj63K04j0j65L12j23q2o9N3k2N5K6N2j28Q4l3r8p6K30L8j59J16k29
$$ -54 75 74 -89 115 105 -60 252 129 47 -22 31 9 64 90 142 14 98 65 -33 -109 121 159 0 116 -113
7274a13R3j74O2p3K57P3j51k4J91j46J07l7p6l6o1R7n4J76l24M98n32L3L53l38
$$ -113 -20 -194 -132 -205 52 125 -26 -50 141 -5 102 65 -11 -47 -108 -11 -65 111 -213 285 -247 -214 139 -199
7298a99J31J80r0m7K13k05r8RK26m13K13RO1M9P9j98N7K2Q4j32K37m27J80J75
$$ -199 -68 112 22 -25 188 -17 -115 -106 120 -293 -80 -71 -10 39 118 -80 -23 -1 83 -49 188 -239 -59 116
7322A16k37M29l53J40j99LJ92j93J79r9K90k87m2J07k96K82K10j92p5J5R0J38
$$ 116 -121 308 -45 95 -104 -101 91 -102 77 -22 268 -19 -61 46 -250 32 242 50 -25 -10 80 218
7344B18k11n0j43P0j00L86l29J7J4N06m29Oj13j12L55j09k01J43K32R2m23L0p9
$$ 218 7 -43 -186 -116 -216 170 -159 -142 -128 378 -51 -45 -158 -270 85 -24 -225 -82 150 242 -181 -151 -230
7367b30J90k99K25K58O5j41K36l62J41j08k4n9J26lJ70r5l06P6J29J54k43K01
$$ -230 -40 -339 -114 144 209 68 304 -58 83 -25 -49 -108 18 15 185 90 -216 -140 -11 143 -100 101
7389A01l6J61k22n4p2j04K39L8j52K13l9k61J18J57m2j76K97j29k73L91j41j39
$$ 101 65 226 4 -50 -122 -226 13 51 -101 112 73 -188 -70 87 45 -131 166 37 -236 155 14 -125
7411a25J12L80l06j43J39j83K71k97K29k48J99L90l23kj29J03n0j26J57J41j81
$$ -125 -13 367 61 -82 57 -126 145 -152 77 -171 28 418 95 93 -36 67 17 -109 48 189 8
7432HO0l7K17l20N2l0J1J54j31k30J97J39j97j18K48j27K29j33K05j76j21l33
$$ 8 68 31 248 -72 -20 -50 -39 115 -16 -246 -49 90 -107 -225 23 -104 125 -8 197 21 -100 -433
7454d33K34L5K22k59K09n8j0K5J44O1k9j04m1N1k5J7K5J3l85K15K13j77J91n2
$$ -433 -199 -164 58 -201 8 -50 -60 -35 109 170 141 37 -4 47 22 39 64 77 -308 -93 120 -57 134 82
7478H2k22k8J63P5j73P7J22j1j70K61m19M39Ok48k04K98k39L87j74K50r8k37L35
$$ 82 -140 -168 -5 70 -103 -26 96 85 -85 176 -243 196 202 -46 -250 48 -191 196 22 272 174 -63 272
7501B72k30P1j16J58l44K52rj89J04j14K62k12J38O8R0k05Ro6K18l43J61j38J72
$$ 272 42 113 -3 155 -189 63 54 -135 -31 -145 117 -95 43 111 201 -4 5 -61 157 -186 -25 -163 9
7524Ij57K33j77J47J06l68O9J26K13m4m3k24L2L9J08j93K10Q1m1j52r3n7J40J55
$$ 9 -148 85 -92 55 161 -207 -138 -12 201 157 114 -110 -78 -39 69 -124 86 167 126 -26 -119 -176 -36 119
7548A19k87m6K7j3K13J42l68K08Q5K1j54K4p2O0oK2l18L77n3n2R1j47j03J89R5
$$ 119 -168 -214 -187 -200 13 155 -213 -5 80 101 -53 -29 -101 -41 -47 -25 -343 34 -19 -71 20 -127 -230 -41 54
7573E4P8M4q0n0J9K60l18J26k1k45J35P4j09J59j33Jj7K6K58k72j9k30K57J26
$$ 54 132 176 96 46 65 325 7 133 112 -133 2 76 -33 126 -7 -6 -23 3 261 -11 -30 -260 -3 123
7597A23l62LJ45J05oJ18k91J12O3J17J0j65j83P0M36m61K9J85L89l80k86J69J06
$$ 123 -239 -236 -91 14 8 126 -165 -53 10 127 137 -28 -211 -141 295 -166 -137 48 437 57 -229 -60 46
7620D6J57l0q8j26o2J31L01j91k8k12J00j08J42R3l31J36Q2j03K2L5N8J89k63
$$ 46 203 173 85 -41 -103 28 329 138 110 -102 -2 -110 32 125 -206 -70 12 -91 -69 -34 24 213 -50
7643e0K85j28k75J72o2J7O3J62m58M40J11R0m23P1K44j49p26O77j44jL43k91M2
$$ -50 235 107 -168 4 -58 -41 22 184 -274 166 277 367 -56 15 259 110 -616 61 -83 -84 259 -32 10
7666A0K67l52O3l9K04k04l59L92J23j74J00q2L7J04j61k15K53K10l14k10O93m40
$$ 10 277 -75 -12 -51 153 -51 -410 -18 105 -69 31 -51 -14 90 -71 -286 -33 177 -137 -347 346 -94
7688i4l8J36J75l0k14k7j29N3L44k63J45M6j15l0J84k8m50K01M12k07n8k14K30
$$ -94 -132 4 179 149 -65 -92 -221 -168 176 -87 58 104 -11 -41 143 115 -335 -134 278 71 13 -201 29
7711B9j34J09j21M86o24K97k21M05l35k0P4N7N4l5k55M58j98j32L89l39o2M0J24
$$ 29 -105 4 -117 369 -255 42 -179 226 -109 -129 -55 2 56 21 -234 224 26 -106 283 -56 -118 -78 46
7734D6J37J14l66J37j2J45l63j59L19N2M2k24k68M06J56k38jj5J30Q7k83J36K27
$$ 46 183 297 -69 68 56 201 -162 -321 -2 50 92 -132 -400 6 162 -76 -77 -92 38 125 -158 -22 205
7757B05J41m86M3k22M19k88p3M16j82K06m07M68m49J85l2J18k47kQ4K89m35J43
$$ 205 346 -140 -97 -319 100 -188 -261 155 -27 179 -228 240 -209 -24 -56 62 -185 -187 -103 186 -249 -106
7779a06J53J84j12l76K72j11M13m00J86K0n5l00M24j23m57M77q0p9K53nk95L05
$$ -106 47 231 119 -257 15 -96 317 -83 103 123 68 -232 192 69 -388 89 9 -70 183 178 -117 188
7801A88k69j19K73k82M07o0j24o7R6J87n73M63r9J63k02L18l33J68j30oj89J66
$$ 188 -81 -200 73 -209 198 138 14 -53 43 230 -343 120 21 184 -18 300 -33 135 5 -1 -190 -24
7823b4Q1n4q7j04N29m51N1k84K48J14N9j08K8M9Q8j60K90l78j44N66l20m5N2L2
$$ -24 57 3 -84 -188 341 -110 -59 -343 -95 19 78 -30 -2 47 135 -25 265 -113 -257 309 -11 -56 -4 28
7847B8N0J9j23k6J30K18l15L2L7j01k19L73p7j36R4J22j13J43q7l4k52L50K86
$$ 28 78 97 -26 -52 78 296 -19 13 50 -51 -270 103 26 -110 -16 106 -7 136 49 15 -237 113 399
7870C99o75K79Q6J18j04k9j51K4k19M33j31j72J80J14j01k0J29J31j45j21r2J39
$$ 399 -276 3 89 207 103 74 -77 -53 -272 161 30 -142 38 152 51 31 160 291 146 25 -67 72
7892G2j52J52k28J51j19m6oJ57pL71k20k56K93j1l16K68j30j87N42m00N7M1K0
$$ 72 -80 72 -156 -5 -124 -170 -176 -19 -26 345 125 -131 162 151 -165 103 -27 -214 328 -72 -15 26 46
7915D6k8r8j33L88j06k24J38k23jJ96P3j74m3J29J32j3k51L5l2J11K77j31J65
$$ 46 18 -80 -213 175 69 -155 -17 -240 -241 -45 28 -146 -189 -60 72 59 -192 -157 -189 -78 199 68 233
7938B33j96J62%k25l1O4r1O7%J38m00J96r3O7K25K2j57K1q9k15o2J30L16k82M57
$$ 233 37 199 199 -26 -57 7 -84 -17 -17 121 -279 -83 -176 -109 116 138 -19 2 -87 -302 -364 -234 82 -200 257
7963B57m15n8O2L38k79J42N7l62K38L79l47J22k30K2o5J48j84K70K7m59M80m52
$$ 257 -158 -216 -154 184 -95 47 104 -258 -20 359 12 134 -96 -74 -139 9 -175 95 122 -337 143 -309
7985c09K25m7j31K64j23J01M3q2j54L92k53j39K75N5m4J33k80jj2m7J25j17M11
$$ -309 -84 -131 -262 2 -121 -20 23 -59 -213 179 -74 -213 62 117 73 206 -74 -75 -87 -134 -9 -126 285
8008B85l70K06J17k79J00O0J65l46K03j35k22L38k22O9n2n2j82J64J29l22L25
$$ 285 -85 121 238 -41 59 119 284 -62 141 6 -216 122 -100 -31 -83 -135 -317 -153 -24 -346 -21
8029b1J09j44J6L0p0R1m0J21Kj67P0J53k66n4L62m66K41j24K55L9j98J37k41K65
$$ -21 88 -56 -40 -10 -80 11 -29 92 94 -73 -3 150 -116 -170 192 -274 -33 -157 98 137 -61 76 -165 100
8053A00k79L3j55L18K12k60K05j11L6j69K5J46l17M31k44J85k0m7K71k14j11J69
$$ 100 -179 -146 -301 17 229 -31 174 63 99 -70 -45 101 -216 215 -29 156 136 89 360 146 35 204
8075B04r9o7m1l2M7k67J15K85m8j29K50k7m67K57R6J26j24j80J85j33m3R0j83
$$ 204 105 38 -3 -35 12 -255 -140 145 97 -32 218 191 -276 -19 77 203 79 -101 84 -49 -92 -2 -185
8098a85l3K02j05J80P9O5%k39k12M52kk55k49M77j05K3j06l0j56J8J18K14l01
$$ -185 -218 -16 -121 59 138 203 203 -36 -248 204 202 -53 -302 175 70 93 -13 -43 -199 -181 -63 151 -150
8121a50R3J42Q6l17M74l06L09l81J20j84m8O5K90k33n2J44j88j23J29J61K93l49
$$ -150 -57 85 171 -146 328 22 331 -50 70 -114 -162 -97 193 -40 -92 52 -136 -259 -130 31 324 -25
8143b5k8l8L5r7J96j66j5M22k31j94J90j45R8L7J3J4j20J75j50J31j1k26K55k2
$$ -25 -53 -91 -56 -153 43 -123 -138 284 53 -141 49 -96 2 39 52 66 -54 121 -29 102 91 -135 120 98
8167I8l11L18j30q0J03j07K3L11k14M2j14j66L90J56k88j94j2L14j50J14JK6j36
$$ 98 -213 105 -25 -105 -2 -109 -86 225 11 53 -61 -227 163 319 31 -163 -175 139 -11 103 104 130 -6
8190fM4
8191C8
$$ Imaginary data points
##PAGE= N=2
##DATA TABLE= (X++(I..I)), XYDATA
0@%%%%%%%%%Mj2J6j6J6j6K4l2L2m0M8n6O6p4Q8j03J17j32J49j68J90k15K41k69
$$ 0 0 0 0 0 0 0 0 0 0 4 -8 8 -8 8 -8 16 -16 16 -24 24 -32 34 -40 48 -55 62 -70 79 -89 101 -114 127 -142
33a42L02l37L75m18M64n14N70o33O99p73Q56r47J052j170J302j455J634j845K100
$$ -142 160 -177 198 -220 244 -270 300 -333 366 -407 449 -498 554 -616 686 -769 865 -980 1120
52A120k412K805l324M037n082O771r948J7956p2189j72263J26111J85793M3540
$$ 1120 -1292 1513 -1811 2226 -2856 3915 -6033 11923 -60266 -232529 -106418 79375 122915
65A22915r9469q0299r189M2316L7804J8222j3694k6544k4817o564P284L2925M2198
$$ 122915 23446 -56853 -66042 -23726 14078 32300 18606 -7938 -32755 -39319 -32035 890 43088
78D3088n935p4305l9706O3846Q4859q263q4453o7452J4107P8925O2032j8637n9285
$$ 43088 37153 -37152 -76858 -13012 71847 63584 -20869 -88321 -74214 4711 66743 48106 -11179
91a1179k5282J3397J1217P556K7965K4819l8152q2166j1673R6037Q1143l1574
$$ -11179 -36461 -23064 -11847 -4291 23674 48493 10341 -71825 -83498 12539 93682 62108
103F2108q1993l6045K0375M6293L6781j5737n5713k2540L8397M1798q015k9675
$$ 62108 -19885 -55930 -35555 10738 47519 31782 -23931 -46471 -8074 33724 25709 -3966
115c966K090K2088j1471l3971M394L7952P479k8940k1839J1099L6570K9200k2774
$$ -3966 -1876 20212 8741 -25230 -20836 17116 24595 -4345 -26184 -15085 21485 50685 27911
128B7911o1916k6071L9373N3506J3159l0306m2875j5162K5582M2292K0373k1921
$$ 27911 -34005 -60076 -20703 32803 45962 15656 -27219 -42381 -16799 25493 45866 23945
140B3945m2883j6713J7879J6580P787J5706j69l4878j9376L3381L7230j4845m5180
$$ 23945 -18938 -35651 -17772 -1192 6595 22301 22132 -12746 -32122 1259 38489 23644 -21536
153b1536k1130K1809L7060J4117j9665k9322j1092J8638K9818J246k6192j2306
$$ -21536 -42666 -20857 16203 30320 10655 -18667 -29759 -11121 18697 19943 -6249 -18555
165a8555O637p430j2266K2268L9215M482m1741m4858M629N8396M2601l1502o8428
$$ -18555 -11918 -19348 -31614 -9346 29869 34351 -7390 -52248 -47619 10777 53378 21876 -46552
178d6552j6601N3381N5280q018m9759j7640L0884J9416j8165j4363J0441J3825
$$ -46552 -63153 -9772 45508 37490 -12269 -29909 975 20391 2226 -12137 -1696 12129
190A2129m52j3674r349J7479K9970n071m3438k1749L1147M0001o023m5553j9259
$$ 12129 11677 -1997 -11346 6133 36103 31032 -12406 -34155 -3008 36993 30970 -14583 -33842
203c3842L2464L0792j0670k1873J653P624r107j7323j390K5961K8686j3970m8281
$$ -33842 -1378 29414 18744 -3129 -1476 6148 -2959 -20282 -21672 4289 32975 19005 -29276
216b9276j4697M4200M2509j4001n2010k3673L2611M1270n710l4211q963K2449
$$ -29276 -43973 227 42736 28735 -23275 -46948 -14337 26933 21223 -12988 -21951 498
228D98K0555n862k4925q231K3577J3399k4832k2233K3478L5726k758l6776k3298
$$ 498 21053 15191 -9734 -17965 5612 19011 -5821 -28054 -4576 31150 28392 -8384 -31682
241c1682K0496L6317K969l3191k4781O801K4113J6216o062j7939m001Q584k267
$$ -31682 -11186 25131 28100 -5091 -29872 -23071 1042 17258 11196 -6743 -10744 -2160 -4427
254d427p467O900R543q157j4666j965J6656J9255k327k3625j4212J2982K0398
$$ -4427 -11894 -4994 4549 -3608 -18274 -20239 -3583 15672 13345 -10280 -24492 -11510 8888
267H888M329j5251j6738N687K2690Q132j3809o082P361K831n847o028o04R256
$$ 8888 13217 -2034 -18772 -13085 9605 17737 3928 -2154 5207 8038 2191 -3837 -4441 4815
281D815J1125n415j5326k514J5408J5594n672k5437j5986J6902K4558q94j9544
$$ 4815 15940 10525 -4801 -7315 8093 23687 18015 -7422 -23408 -6506 18052 17158 -2386
294b386j0831N231J5353Q487j1106j5479K650J0420k275q300O25J0447Q737o728
$$ -2386 -13217 -7986 7367 15854 4748 -10731 -8081 2339 64 -8236 -7611 2836 11573 4845
308D845j5102J203J6091M431j3416j2464K198J5474J2710p433j7295O81J5331
$$ 4845 -10257 -9054 7037 11468 -1948 -14412 -12214 3260 15970 8537 -8758 -8077 7254
321G254K377j2149n282O989O643p059j3211L474K2969R191k0155k2234L022K2443
$$ 7254 9631 -2518 -7800 -811 5832 -1227 -14438 -10964 12005 21196 1041 -21193 -18171 4272
335D272J3743j6376k8156K329L1456J5145j9448k0509M032J8457O175j6890j3917
$$ 4272 18015 1639 -26517 -24188 7268 22413 2965 -17544 -13512 4945 11120 -5770 -19687
348a9687J3047K0309m178k0103m560J8145J8272p006k6438r080K3356J8488j1468
$$ -19687 -6640 13669 9491 -10612 -15172 2973 21245 14239 -12199 -21279 2077 20565 9097
361I097j9778O8J6642J1364o896j4965L3J1402j334j3055j687J3063J0576n672
$$ 9097 -10681 -10613 6029 17393 10497 -4468 -4435 6967 5633 -7422 -9109 3954 14530 8858
375H858j7437n303J8458J4474j2844k0444q1J5895R664o921j5001Q71J6926P217
$$ 8858 -8579 -13882 4576 19050 6206 -14238 -14319 1576 11240 4319 -10682 -9811 7115 14332
389A4332j3345j1415N342J0870R48j1088q640J1520J8309k805j8414p823R725
$$ 14332 987 -10428 -5086 5784 6732 -4356 -12996 -1476 16833 14028 -4386 -12209 -2484
402b484J1909J232j2101j0314O526J2744p83p864k790K658L621q97o437k573N259
$$ -2484 9425 10657 -1444 -11758 -5232 7512 6729 -1135 -3925 -1267 2354 1457 -4980 -7553 -2294
417b294K261n496j196M697L652P30l959p480j5P370K716m890j861J634L192L839
$$ -2294 -33 -5529 -6725 -2028 1624 2354 -1605 -9085 -9100 -1730 986 -3904 -5765 -4131 -939 2900
433B900j693m314J025M276j850l168P44K405L343J602n090l712O952P496m209
$$ 2900 1207 -3107 -2082 2194 344 -2824 -2080 325 3668 5270 180 -3532 3420 10916 6707
448F707r279m688M433J0195K688r717o763P018Q572j617q971o169L852R211o79
$$ 6707 -2572 -7260 -2827 7368 10056 339 -6424 594 9166 7549 -1422 -7591 -3739 5472 4793
463D793j0751j443R778M791n652p689j55Q783O150q439j2010L442J2459M028o008
$$ 4793 -5958 -7401 2377 7168 1516 -6173 -6328 2455 8605 166 -11844 -8402 4057 8085 2077
478B077o969R57Q838K200r932n011P897O380l729o872o4P320P199o361j2824J355
$$ 2077 -4892 -3935 4903 7103 -2829 -7840 57 6437 2708 -4164 -4228 3092 10291 3930 -8894 -7539
494g539J2601L070r508r257K800J1865N593r944j0475N573J0701k664j0270l555
$$ -7539 5062 8132 -1376 -10633 -7833 4032 9625 -319 -10794 -5221 5480 2816 -7454 -11009
508a1009O834R228j358j2179k541J2204P846p389j1008r45R000Q103m970r616
$$ -11009 -4175 5053 3695 -8484 -11025 1179 9025 1636 -9372 -10317 -1317 6786 1816 -7800
522g800K153J0381J758p035m159K605N760R46p072m312P527P054m731o148P53
$$ -7800 -5647 4734 6492 -543 -4702 -2097 3663 4609 -2463 -6775 752 7806 3075 -3073 -2320
537b320N584L385m208q552R7Q775L079n482k885J945L065J642m380m110L266N664
$$ -2320 3264 6649 2441 -6111 -6014 2761 5840 358 -2527 -582 2483 4125 -255 -4365 -1099 4565
553D565l048n818L34M285M242L37n427l575L894L641l085k994pJ644K689J360
$$ 4565 1517 -4301 -3967 318 4560 4897 -530 -4105 -211 3430 345 -2649 -2656 -1012 1677 3037
569C037l740j754K670O25j600j56p14j449J711J092j851N68K409o45j379p35k115
$$ 3037 -703 -2457 213 838 -762 -918 -1632 -3081 -1370 -278 -2129 -1561 848 203 -1176 -1911 -4026
586d026N96L061J97k580K55J608L43R90Ok722J77K218j777j970J685K399Q84J68
$$ -4026 -3430 -369 -172 -2752 -2497 -889 -546 444 450 -2272 -2095 123 -1654 -3624 -1939 460 1344 1512
604A512k850j123L831J733m859k814K387L754R54k710m197J589O514K99o333k858
$$ 1512 -1338 -2461 1370 3103 -1756 -4570 -2183 1571 2525 -185 -4382 -2793 3721 4020 -2313 -5171
620e171L067K855Kk805k286M622M796m009n993J508M913J802k822m731l52P007
$$ -5171 -2104 751 753 -2052 -4338 284 5080 1071 -4922 -3414 1499 3301 479 -4252 -4604 2403
636B403L133n417k763L907K924j426l791k826L828M982k343n198J157M961N76
$$ 2403 5536 119 -2644 1263 4187 2761 -1030 -3856 -28 4954 2611 -2587 -1430 3531 4107
651D107l519l637J16M761K454o107m948M240N127l21l170l292J004M211r78n772
$$ 4107 588 -3049 -2933 1828 4282 -1825 -6773 -2533 2594 2273 -897 -4189 -3185 1026 48 -5724
667e724m90N354K684k671l381p39L637M326l357m968J854L812m26k112j64J124
$$ -5724 -6214 -860 1824 -847 -4228 -4967 -1330 2996 -361 -5329 -3475 337 -89 -2201 -2365 -1241
683a241L188Q37l708j881L248J516k328j241Q21K043J693k156l385J965M000j084
$$ -1241 1947 2784 -924 -2805 443 1959 -369 -1610 -789 1254 2947 791 -2594 -629 3371 2287
699B287l602r99N62J299J301j511j697L060J147k895k219J179Q87J175m08k110
$$ 2287 -1315 -2314 -1752 -453 848 -663 -2360 700 1847 -1048 -3267 -2088 -1201 -26 -434 -2544
715b544J33K737j21j463J019Q47j088J08M19j177O43J567p77O62J979j486k319
$$ -2544 -2411 326 205 -1258 -239 608 -480 -372 47 -1130 -487 1080 303 965 2944 1458 -861
732h61N80J067P55J58j137k143J616K301j635j736J735l6j010o89j337k56K966
$$ -861 -281 786 1541 1699 562 -1581 35 2336 701 -1035 700 664 -346 -1035 -2372 -2628 338
749C38L9k798L69J526m38o52j20p14J212N97k161p85K675J149j494k02N18Q2J156
$$ 338 377 -2421 -2052 -526 -964 -1616 -1736 -2450 -1238 -641 -2802 -3587 -912 237 -1257 -1459 -941 -859 297
768B97p43k874J302M080L03k973j119N53J983K113k225l247J900K713j490k040
$$ 297 -446 -3320 -2018 2062 2365 -608 -1727 -1174 809 2922 697 -2550 -650 2063 573 -1467
784a467K31J391K264m7m044j363L247J425k666j012J091R88P27r42k317J327K964
$$ -1467 -1236 155 2419 2372 -1672 -3035 212 1637 -1029 -2041 -950 38 765 -177 -2494 -1167 1797
801A797j504k576J316R37k5J05q67J62L213Ml806j425K864K044r84j266j537J396
$$ 1797 293 -2283 -967 -30 -55 50 -817 -655 2558 2562 -1244 -2669 195 2239 1255 -11 -1548 -152
819a52L303j482l727J313K682p56j362j515n57K596J449k136j495J948L55j223
$$ -152 3151 1669 -2058 -745 1937 1181 -181 -1696 -2253 343 1792 -344 -1839 109 464 -759
835g59m64m22k95J816Q1k300O87K139q42j069J295k70O9o3j332n80L018Q62k132
$$ -759 -1223 -1645 -1940 -124 -43 -2343 -1656 483 -359 -1428 -133 -403 -334 -397 -1729 -2309 709 1571 -561
854e61r02J506M48j33o72j697J468K370p02l219P81J725K59J86o76j831P06J659
$$ -561 -1463 43 491 358 -314 -2011 -543 1827 1125 -2094 -1313 412 671 857 181 -1650 -944 715
872G15j328q84J395M47k2jj093l09J496J59j440J27J518o99r16N26Q47Q84L90
$$ 715 -613 -1497 -102 345 323 322 -771 -1080 416 575 -865 -738 780 81 -835 -309 538 1422 1812
891A812k286q42K511P48k010q38J284P80P20n73k731O36K821j61k705l09O55J058
$$ 1812 -474 -1316 1195 1943 -67 -905 379 1159 1879 1306 -1425 -789 2032 1871 -834 -1143 -488 570
909E70M84j128j244J541J575k103j083O40R0J32N45j012n27K230l87k366J032
$$ 570 1054 -74 -1318 223 1798 -305 -1388 -748 -658 -526 19 -993 -1520 710 323 -2043 -1011
926a011J605n80r62r6K17J360J133k275j117K622R07j540q98R3M41J746l13k612
$$ -1011 594 14 -948 -1044 -827 533 1666 -609 -1726 896 1803 263 -635 -542 -101 1645 1332 -1280
944a280R5K590J6j544j09l16M93J073j017j746J542J434j101o04J20l7J34N81
$$ -1280 -1185 1405 1421 -123 -232 -548 -55 1018 1 -1745 -203 1231 130 -474 -354 -391 -257 324
962C24j230J07J637j41k036Q44J414j88k56n41o78J148J529k184j132J721J773
$$ 324 -906 -799 838 697 -1339 -495 919 731 475 -66 -744 404 1933 -251 -1383 338 2111
979B111o45o14j150K96J904qk466m88J970O74o78m71r53N85J898j150k230R19
$$ 2111 1466 852 -298 -2 1902 1894 -572 -1060 910 1584 906 435 -518 67 1965 815 -1415 -496
997d96J134o29k84J45l97N69O16j493k09J955l06j988N87J207l98L00o16j230
$$ -496 638 9 -275 -130 -527 42 658 -835 -1044 911 605 -1383 -796 411 13 313 -303 -1533
1015a533K128J271k035j682J538J201J43p84r33l67K298J107l000m05J484K25
$$ -1533 595 1866 -169 -1851 -313 888 1031 247 -686 -1053 1245 2352 -648 -1053 431 656
1031F56J95p12j309N59J838m49j400M69O63l17k33k12m19J063P30j585k79K004
$$ 656 851 139 -1170 -611 1227 778 -622 -153 510 193 -40 -252 -671 392 1122 -463 -742 1262
1049A262m16j256K47O78Q3N43p46j724J753J929j193j555L03M39R57J93j892o54
$$ 1262 846 -410 -163 515 598 1141 395 -1329 424 2353 1160 -395 -92 347 1304 1497 -395 -1049
1067a049J926J060j644r30N63N61L54m6j811K79J992p12j197M33Q30o00L89j81
$$ -1049 877 1937 293 -637 -74 487 841 795 -1016 -737 1255 543 -654 -221 609 9 398 217
1085B17p49R19N87j545o42J927N01j057j96j64P00J467j368j876J171J618m87
$$ 217 -532 387 974 -571 -1213 714 1215 158 -38 -202 498 1965 597 -1279 -108 1510 1023
1102A023j211j79L67J236O96k109j312J800R56j031l32j27m9J069J98j961K62
$$ 1023 -188 -367 0 1236 1932 -177 -1489 311 1267 236 -96 -223 -272 797 995 -966 -704
1119g04J622n95j236Q49j31M9J017p90r04J218P71j641o4J194j94m47Q0k74K52
$$ -704 918 323 -913 -64 -195 -146 871 81 -823 395 1166 -475 -539 655 461 14 94 -180 72
1138G2J745o28j748R16J127j86n32j35j055J302J169j186j289R09P91m53q6j018
$$ 72 1817 1189 -559 357 1484 1298 766 631 -424 878 2047 861 -428 481 1272 819 733 -285
1156b85j68R63O06j712J58P99r5m23M60m68j58R94p44p52J225N18j197j49Q63
$$ -285 -453 510 1116 -596 -438 361 266 -157 303 -165 -323 671 -73 -825 400 918 -279 -428 435
1175D35j74J36K42j263K43K005o94j616R40Q60p3l3o09j162J199J191j573j157
$$ 435 261 397 639 -624 -381 1624 930 -686 254 1114 1041 1008 399 -763 436 1627 54 -1103
1193a103J617L39l74J17n43m05J010j33j230J81J290q59k38O05n31J52P61q53
$$ -1103 514 853 479 596 53 -352 658 525 -705 -524 766 -93 -331 274 -257 -105 656 -197
1211a97o92J740k36r85k73P54K03N22k19j364N98J268j23j280J86M47O81M35j191
$$ -197 -889 851 615 -370 -643 111 314 836 617 -747 -149 1119 996 -284 -98 349 1030 1465 274
1230B74r62J440R98j174p34M07L82K35M6j094J15J021O27j592q6M80l40l1k6m62
$$ 274 -688 752 1750 576 -158 249 631 866 912 -182 -67 954 1581 -11 -97 383 43 12 -14 -476
1250d76O26J044j056j099R15J114r86m5m36j72J142M17j686j32J652J20q19o8
$$ -476 150 1194 138 -961 -46 1068 82 37 -399 -571 571 988 -698 -830 822 942 123 55
1268E5n90R28J054o71j661O25J226n88j76L9l64N52Q86j614q81J428N80q91P5
$$ 55 -535 393 1447 776 -885 -260 966 378 202 241 -123 429 1315 -299 -1180 248 828 -63 12
1287A2J85l26N39r1j077N79J081q24q40O51K70k24K79k20m71J418n3j522P0J068
$$ 12 197 -129 410 319 -758 -179 902 78 -762 -111 159 -65 214 -6 -477 941 888 -634 -564 504
1307E04j35k1L0m72K60R69o09r28K68Q36q06P24j83r44O08Q41q07k05K77k66k48
$$ 504 369 348 378 -94 166 1135 526 -402 -134 702 -104 620 437 -507 101 942 135 -70 207 -59 -307
1328c07L92J66n19M96N9q09M04R26r53l54P21k11lN85n20o82Q81P02j307R7R91
$$ -307 85 251 -268 228 287 -522 -118 808 -145 -499 222 11 8 593 73 -609 272 974 -333 -236 755
1349G55n47J22m1m79O8J429q34j037L53J027n72K8j86n10P07N84j471P4R41j02
$$ 755 208 330 289 -190 -122 1307 473 -564 -211 816 244 272 86 -424 283 867 -604 -530 411 309
1369C09n34P0J43J99N61q91r93Q32J178o37j043N69J34O24K22r78p45J934M4j238
$$ 309 -225 -155 -12 187 748 -143 -1136 -304 874 237 -806 -237 -103 521 743 -235 -980 954 998 -240
1389b40m62P89N12K93o60q46L48J549n72j487P07K92m5N62p55q02J249M31q97
$$ -240 -702 87 599 892 232 -614 -266 1283 711 -776 -69 223 178 740 -15 -817 432 863 -34
1408c4n66P57Q7k89K81o45LP02L16j293K46P66k09n1J22r21N96J270r06r60P83
$$ -34 -600 157 244 -45 236 -409 -406 296 612 -681 -435 331 122 71 193 -728 -132 1138 232 -728 55
1429E5P74o63m30L66m26P70O49j645j85J338l79k65J62k13r5J067m75r53N87O22
$$ 55 829 166 -264 102 -324 446 1095 -550 -735 603 224 -41 121 -92 -187 880 405 -548 39 661
1449F61o53k19L44n41R7N45l68q13J301j82p88J08P43l40J75J34q46O43J027r94
$$ 661 8 -211 133 -408 -311 234 -134 -947 354 172 -616 -508 235 -105 70 204 -642 1 1028 34
1469C4n80R62j13k52K06k69j25O42K24r58K11Q19q80k51O45j8j19N00o73k57N70
$$ 34 -546 416 303 51 257 -12 -137 505 729 -229 -18 801 -79 -330 315 297 178 678 5 -252 318
1490C18J0p03K43L00k17K01K47q37K18P30m34q11P00K75l79K47j10j72M7Q78p28
$$ 318 328 -375 -132 168 -49 152 399 -438 -220 510 76 -735 -35 240 -139 108 -2 -174 -127 751 23
1511B3o15J211l30o4R9n24k33J192p3j151N67K07J26n39K59n14K81P57r57m53
$$ 23 -592 619 289 225 324 -200 -433 759 686 -465 102 309 435 -104 155 -359 -78 679 -278 -731
1531g31P68N26p08k33K82l68R59J57j313j16J381k58o43m3M08j63O08m30r53Q43
$$ -731 37 563 -145 -378 -96 -464 495 652 -661 -777 604 346 -297 -340 68 -95 513 83 -870 -27
1551b7O09o07m06M83k55P80R5j280l64J705j52j032J43O92k02L80k02r04J34J127
$$ -27 582 -25 -431 52 -203 577 672 -608 -972 733 581 -451 -308 384 182 562 360 -544 -410 717
1571G17n91n32M70N8k01L0j85k58P04J67j001jJ065l45j81l4qk1N68o40n10P38
$$ 717 126 -406 64 122 -79 -49 -234 -492 212 379 -622 -623 442 97 -84 -118 -126 -147 421 -219 -729 9
1593IL42m94J05J49m94M31J45k32l85R69k00n43P3J66m42N32O7p25J85J033q46
$$ 9 351 -143 -38 111 -383 48 193 -39 -424 545 345 -198 -125 41 -401 131 198 -527 -342 691 -155
1614a55l86O07K1n35P67l43n27J017l78n89J45L32p5j28K55k90j91Q54J1q38J45
$$ -155 -541 66 87 -448 319 -24 -551 466 88 -501 -356 -24 -99 -227 28 -262 -453 401 412 -426 -281
1635b81O66q60L21L07n58K40Q92o61k00M01n4m60M93k84k35R55k26j097M07P25
$$ -281 385 -475 -154 153 -405 -165 727 66 -134 267 213 -247 246 -38 -273 682 456 -641 -234 491
1655D91m47n03O65l98J72M33l18j064J149M84j287K46K72k87K78J89m21k6J240
$$ 491 44 -459 206 -192 -20 413 95 -969 180 664 -623 -377 -105 -392 -114 75 -346 -372 868
1674H68q46n81O48J21j66J43k80J7K68M09r71o8N44K46k90q2j85J40M42k09q35
$$ 868 22 -559 89 210 44 187 -93 -76 192 601 -370 -438 106 352 62 -20 -205 -65 377 168 -667
1695f67N50N60l70l20J26k13M34K10m66n37O71K80m69J9rl32Q22p8m88l84Q56
$$ -667 -117 443 73 -247 -121 -334 100 310 -156 -693 -22 258 -211 -192 -201 -533 289 211 -277 -661 195
1716A95Q8o54O55n62O6L41n8n99O40N04l43n15L25o2q2J60l15n2M44K15n87J49
$$ 195 283 -371 284 -278 -212 129 71 -528 112 616 273 -242 83 21 -61 99 -216 -268 176 391 -196 -47
1738d7R7l50J54n0j07K51L62m05k99K97L05n63N11k21l71N53N4o05M0O79k67j01
$$ -47 50 -300 -146 -196 -303 -52 310 -95 -394 -97 208 -355 156 -65 -436 117 171 -434 -394 285 18 -83
1760h3J98l17l5P02l08o43M28M28j036P35l0k98K91L07n06p0O90l9n61M40j03
$$ -83 115 -202 -237 465 157 -486 -58 370 -666 69 39 -259 32 339 -167 -237 453 414 -147 293 190
1781A90m00M71l10n47N09K12m03J01N23m79l60P62k76j67J47J18n22M23K76m04
$$ 190 -210 261 -49 -596 -87 125 -278 -177 346 -133 -493 269 -7 -174 -27 91 -431 -8 268 -136
1801a36J69J87k3m65L14ml91N87k53j31R0J02n99O67K36p81O6L25j93O0L39m07
$$ -136 33 220 197 -268 46 42 -349 238 -15 -146 -56 46 -553 114 350 -431 -365 -40 -233 -173 166 -241
1823b41L5O20n39n60O24L38n53l52O21J2j39L64m36o41J092q6n82J47Q6%J6N45
$$ -241 -206 414 -125 -685 -61 277 -276 -628 -7 5 -134 230 -206 -847 245 159 -423 -276 -190 -190 -174 371
1845C71n83J82P57r27r2L82K05m92N41l53k72M46J24q78L13N86k64k43J74j02
$$ 371 -212 -30 727 -200 -292 90 295 -197 344 -9 -281 165 289 -589 -276 310 46 -197 -23 -125
1865a25LL84k01m99L08N01p27J95J29k85M5N12n25l55P00L1m28L78K90o41L92
$$ -125 -122 262 61 -438 -130 371 -356 -161 -32 -317 -272 240 -285 -640 60 91 -337 41 331 -310 82
1886H2P9j69P2L95m41m48R94n39m89R22l83l01O06k29m24K31J84m71J82L99q50
$$ 82 161 -8 64 459 18 -430 564 25 -464 458 75 -226 380 151 -273 -42 142 -329 -147 252 -598
1907e98K84M70J28p63L31K98m76M10K87p66K6N85k66r9K67J9l74L89k09l28K74
$$ -598 -314 156 284 -479 -148 150 -326 84 371 -395 -369 216 -50 -149 118 137 -237 152 -57 -385 -111
1928a11L56l67J92j49J01q4N56l85j48L31l7l68M84M3o24R7O52n37o6K19k34J58
$$ -111 245 -122 70 -79 22 -62 494 109 -39 292 255 -113 371 414 -210 -113 539 2 -64 155 -79 79
1950G9M92o75m25L57J05j32L91k93l36O21Op38M3Q84k97m89M64j52R5J20mn27
$$ 79 571 -104 -529 -172 -67 -199 192 -101 -437 184 190 -548 -505 379 82 -407 57 -95 0 120 116 -411
1972d11M83K67o27J78L35m92N0M66n28j60O45J96q02L07O1k37L27M10p75J37M00
$$ -411 72 339 -288 -110 225 -267 -217 249 -279 -439 206 402 -400 -93 -32 -269 58 468 -307 -170 230
1993B30J81p08r3L71l77M27L05q43M54L77m86j16L14L8k66N25m28k49Q36j59q54
$$ 230 411 -297 -390 -19 -396 31 336 -507 -53 324 -162 -278 36 74 -192 333 -95 -344 492 333 -521
2014e21L91J83J52J98m27k78O29K51m14m48L25L09m58M02k74k32L08K90o59o6
$$ -521 -130 53 205 403 -24 -302 327 578 164 -284 41 350 -108 294 20 -212 96 386 -273 -339
2034c39M76l55L22O9j91k12N68J5n21K41Kk39J52M57p05K1O03k75M5k20J02l24
$$ -339 137 -218 104 173 -18 -230 338 353 -168 73 75 -164 -12 445 -260 -239 364 89 134 -86 16 -308
2056c08O45l50n9N70k12m34M6L84l79n5M16m34J81J86n8j80N7K0k26L17r8l52
$$ -308 337 -13 -72 498 286 -148 -102 282 -97 -152 264 -170 11 197 139 -41 16 36 -190 127 29 -323
2078c23J52L57R7p52L69M0j0L74o9l82L1M48o15J02K43n20N15L56n37o62P91M75
$$ -323 -171 186 283 -469 -100 -60 -70 304 235 -147 -116 332 -283 -181 62 -458 57 413 -124 -786 5 480
2100D80n84K74k05k81N46K68o55m16O60K91n79K34q8k63N66l08m50L02M12j08
$$ 480 -104 170 -35 -316 230 498 -157 -573 87 378 -201 33 -55 -318 248 -60 -510 -208 204 96
2120I6p7n4k8j61O59m69o42R40J75m60l63K07R8J96J37p77L36M35j34k75J32k95
$$ 96 19 -35 -63 -224 435 -34 -676 264 439 -21 -384 -177 -79 117 254 -523 -187 248 114 -161 -29 -324
2142c24M96J87l60o43N15O20n61k0J1L02j49K16n09k69P06K63n37KJ04m56N68
$$ -324 172 359 -1 -644 -129 491 -70 -90 -79 223 74 290 -219 -488 218 481 -56 -54 50 -406 162
2163A62J58p10N8P30k66j14r9k4J5L09M3o17OJ009n48j90j34o7L20M96r22l5N88
$$ 162 320 -390 -332 398 132 18 -81 -105 -90 219 262 -355 -349 660 112 -78 -212 -279 41 537 -385 -420 168
2186A68j54J49k25J93J14J64K5q26j6Q46Jo81K70k3l11Q30m86l65L39M12N3l02
$$ 168 14 163 -62 131 245 409 434 -392 -408 438 439 -242 28 5 -306 524 38 -327 12 424 477 175
2208A75O4k34J53K02o53K1M82K85l89L0j99r7K88O29o34l86M28K00j55J00l65
$$ 175 239 5 158 360 -293 -272 210 495 106 136 -63 -160 128 757 123 -263 165 365 210 310 -55
2229e5j70N34k35n92O18P3p6K31n50l21O34N21r03j69K00M49j35k01L7l69N85
$$ -55 -225 309 74 -518 100 173 97 328 -222 -543 91 612 -291 -460 -260 189 54 -147 -110 -479 106
2250A06M35r54k20R34l1k69q7k77L24N17k3p24R3N92K4k07n94O6N11M5l38o06
$$ 106 541 -413 -633 301 270 1 -86 -363 -39 478 455 -269 -176 416 440 233 -361 -295 216 261 -77 -683
2272f83O21L60k62l86lK18M66j31m70k65M43L65j06Qo45M17O11l19q24N4M19K15
$$ -683 -62 298 36 -350 -353 -135 331 200 -270 -535 -92 273 167 175 -470 -53 558 239 -585 -531 -112 103
2294A03L27o36j02K87M92n22o80O55N19k79k77l62K91P04J13r41k03O46J15j04
$$ 103 430 -206 -308 -21 471 -51 -731 -76 443 164 -113 -475 -184 520 633 -308 -511 135 250 146
2314A46j25n65L96Q63m47j002K95P27k24k89j56N9J84L73l41o65Q76K44j49j88
$$ 146 21 -544 -148 715 268 -734 -439 288 64 -225 -381 -322 -138 235 -106 -771 105 349 200 12
2334A2l82j75Q62Q5o04l28N62J92l0l23j77P1N36L26j021L89J63J73j60j72m90
$$ 12 -370 -545 317 402 -202 -530 32 224 194 -129 -306 -235 301 627 -394 -5 158 331 171 -1 -491
2355d91M68O05k65r10L85N75n0k16k43j65M30K96p84j11P62K%l99k08m2Q18N3
$$ -491 -23 582 317 -593 -208 367 317 101 -142 -307 123 419 -365 -476 286 288 288 -111 -319 -361 457 510
2377E10r27j43L94M16k55M7l92R9Q61l03j100P35J18J95L55o29m16N65N21n59
$$ 510 -417 -560 -166 250 -5 42 -350 -251 610 307 -793 -58 60 255 610 -19 -435 130 651 92
2397I2n39K82J97M54m25l80o2Q90N0r41K72k06M36J64l92k20J26P39k43j052O24
$$ 92 -447 -165 32 486 61 -319 -381 509 559 -382 -110 -316 120 284 -108 -328 -202 537 294 -758 -134
2418a34J20p2j4r8n70J199K67o30o71J50O18R5k47l93Q1P63J68r87L38K01J05
$$ -134 -14 -86 -100 -198 -768 431 698 68 -603 -453 165 260 13 -380 -299 464 632 -355 -17 184 289
2439B89J60n08q04Q49Q52l24r84p2P39m9J41o52k38Q11K54p70k64M88M04J45j76
$$ 289 449 -59 -863 -14 838 514 -470 -542 197 148 289 -363 -601 210 464 -306 -570 -82 322 467 291
2460B91o69j03J042q9p83r6K92M10P5n69l31N40N55j90q70K65L46j62L51n40l30
$$ 291 -378 -481 561 472 -311 -407 -115 295 370 -199 -530 10 565 375 -495 -230 116 -46 305 -235 -565
2481e65R78K26k88j033K98L23M82m78m62K42O24j95l78k93M85J53K1o2o34L16
$$ -565 413 639 351 -682 -384 -61 421 -57 -519 -277 347 152 -226 -519 -34 119 140 78 -556 -240
2501b40R28l62p67K45M35k45N08l53m25P33J9k39o13K95K46qN8o13M9N30O25p39
$$ -240 688 326 -441 -196 239 -6 502 149 -276 457 476 237 -376 -81 165 157 215 -398 -349 181 806 67
2523F7k81L21K24L03o14n02J35P86m82k42j22N59K9L4n22l01M78M65k55n17K53
$$ 67 -214 107 331 634 20 -482 -347 439 -43 -285 -407 152 181 215 -307 -608 -130 335 80 -437 -184
2544a84L08K84p6r14K22P26M99p80p69M96J39M41j36j014N63P17k71n04P6K23
$$ -184 124 408 332 -582 -360 366 865 85 -684 -188 -49 392 256 -758 -195 522 251 -253 -177 46
2564D6K66J90n67m58M72N46k38o78N55l22N85l9p39k67P75O95r06m32J89K09N15
$$ 46 312 502 -65 -523 -51 495 257 -421 134 -188 397 358 -381 -648 127 822 -84 -516 -327 -118 397
2585C97k92o66j19J332k18p18j73M50K82Q2o37n12O70P86o16m40P8M11J81J42
$$ 397 105 -561 -680 652 434 -284 -457 -7 275 357 -280 -792 -122 664 48 -392 -314 97 278 420
2605D20j007M0P97K42q96r0K93J0O95k64r25L91Q92j45q78P3K75J35J66l46l61
$$ 420 -587 -547 250 492 -404 -494 -201 -191 504 240 -685 -294 598 453 -425 -352 -77 58 224 -122 -483
2626d83M77N22j28p00O9k59P58j1n50j48Q45K69p86r6L17j7L01m14m46M87O32
$$ -483 -6 516 388 -312 -243 -502 256 245 -305 -453 392 661 -125 -221 96 79 380 -34 -480 7 639
2647F39l02m81j68n4O32K21m56m67K09P44l91k79l72L73L17N0n08l55O41N47r22
$$ 639 337 -144 -312 -366 266 487 31 -436 -227 517 126 -153 -525 -152 165 215 -293 -648 -7 540 -382
2668c82K5R1L6N45J29r44J01O38J99m90j93J30Q3Q33p04p74O63M96j44n43Q7j21
$$ -382 -357 -266 -230 315 444 -500 -399 239 438 -52 -245 -115 -32 801 97 -677 -14 482 338 -205 -118 -239
2690b39O55k6n26k96P4J009n03r6m74L22L85N3q63J68N29K98l04n58K78O3N06
$$ -239 416 390 -136 -432 -358 651 148 52 -422 -100 285 338 -525 -357 172 470 166 -392 -114 -51 455
2711D55l58n08N36J36m68J84k71J34M48on17k05N52J29l17j52j43L96M94k83n20
$$ 455 97 -411 125 261 -207 -23 -294 -160 288 282 -235 -440 112 241 -76 -228 -371 25 519 236 -284
2732b84p2Q17O2m12m0k60MO62j87q24K42N29P7m00j01L18J92J25p54J5J18O42
$$ -284 -356 461 523 111 71 -189 -185 477 290 -534 -292 237 314 -86 -187 131 323 448 -306 -291 -173 469
2754D69o63N6R6K24K38j80o87R1L40P36o35j10j43R7M87l85o90N27M17J37r4l49
$$ 469 -194 -138 -42 182 420 240 -447 -356 -16 720 85 -25 -168 -71 416 31 -659 -132 285 422 328 -21
2776b1n94O41M26n61o53P05M98j98k12k45R7K80j98k31l37P98L36q04j32K17j3
$$ -21 -615 26 452 -109 -762 -57 441 243 31 -214 -117 163 -35 -266 -603 195 531 -273 -405 -188 -201
2797b01O15m4j066Q10m1PK9o7k1l8N25k86p83M14O73l09j92l57N4M64K50q03j8
$$ -201 414 370 -696 114 73 80 109 42 21 -17 508 222 -561 -147 526 217 25 -332 -278 186 436 -367 -385
2820c85L75O36n94n3m29J49N95m65l57M74L74k4m84j8m5K20M55k99n71O37M5J86
$$ -385 -10 626 32 -21 -450 -301 294 -171 -528 -54 320 296 -188 -206 -251 -31 424 125 -446 191 236 422
2842D22n06j91K24K97J40p64J22L22J18j77J93m40J26Q14o06l29K05K13K8k87
$$ 422 -84 -275 -51 246 386 -378 -256 66 184 7 200 -240 -114 700 94 -235 -30 183 211 -76
2862g6M9o30O66N24o06m14K90M42j90K36m44l93R04j54j79m85L60M03l97J97m49
$$ -76 -27 -657 9 533 -73 -487 -197 245 55 291 -153 -546 358 204 25 -460 -100 303 -94 103 -346
2883c46L58M29O2n30k02L36K62q9l18r3R7M26o27n63Q76k1Q6J50k10m44P38K59
$$ -346 12 441 503 -27 -229 107 369 280 -38 -131 -34 392 -235 -798 78 57 143 293 83 -361 377 636
2905F36j101J45N99j83K44m74Q8K5L48l91j57L0M36l2m42J88j94J70N15n10m87
$$ 636 -465 -320 279 96 340 -134 -46 -21 327 -64 -221 -191 245 213 -229 -41 -235 -65 450 -60 -547
2926e47R03k73J30j89k20k3L02J12j57k36L02N6jM9r0L1P1l95p4K68J16J25j23
$$ -547 356 83 213 24 -196 -219 83 195 38 -198 104 160 159 208 118 149 220 -175 -249 19 135 260 137
2949A37l7j50j52P90j55o43N5R6k41K32Qm9J1K39k73k88O28j86j50k1m9j34N77
$$ 137 100 -50 -202 588 433 -210 -155 -59 -300 -68 -60 -109 -98 141 -132 -420 208 22 -128 -149 -198 -332 245
2972B45p8k30k0M50n71L31P7m22J85L21l74M3q8L29k74K67k47k17M12J95k46m67
$$ 245 167 -63 -83 367 -204 127 204 -218 -33 288 -86 -43 -131 198 -76 191 -56 -273 139 334 88 -379
2994c79M14o9j32K97N9o98P62j43m66J89L02l81M28k20j06J10J20j73N6o3Q9J4
$$ -379 35 -34 -166 131 190 -508 254 111 -355 -166 136 -245 183 -37 -143 -33 87 -86 -30 -93 -4 10
3016A0j8j80j60N35k31j68L0J97L51l63Q1k44k64P47l37KK88k58L8r3q8M3q9N01
$$ 10 -8 -188 -348 187 -44 -212 -182 15 366 3 84 -160 -424 323 -14 -12 276 18 56 -37 -125 -82 -171 330
3040C30o44j42M06r1J9K42Kn80L81J43j44m4K39j23J60R2Ln36M46j21K3j48J48
$$ 330 -314 -456 -50 -141 -122 120 122 -458 -77 66 -78 -122 117 -6 154 246 249 -287 159 38 61 -87 61
3063F1k97L73l13J61J5J28J1m23M03j44j96K70l12L2L41K70m95r8L26k19J78k12
$$ 61 -236 137 -176 -15 0 128 139 -284 119 -25 -221 49 -263 -231 110 380 -115 -213 113 -106 72 -140
3085a40J08N6L55k34k02M2J94k20J57o1j42j26K29l9j81M39k16k33L76k81J36
$$ -140 -32 24 379 145 -57 -15 179 -41 116 55 -87 -213 16 -23 -204 235 19 -214 162 -119 17
3106A7j55J71qJ20j21K67l46K21m62M78K40l57l51K14L28l08J25j21l4l0M06j63
$$ 17 -138 33 25 145 24 291 -55 166 -296 182 422 65 -286 -72 256 -52 73 -48 -82 -112 294 131
3128A31n70O26k32J29J67l83M6O9N5k39J22j77K35j14QK7M5J24J02j58j93K58
$$ 131 -439 187 -45 84 251 -132 -86 -17 38 -201 -79 -256 -21 -135 -127 -100 -55 69 171 13 -180 78
3150G8j78J53K60n80J80K68j37l20n2K91P7J87j7k46L9K85k59p7K7n6N3K95l53
$$ 78 -100 53 313 -267 -87 181 44 -276 -328 -37 40 227 210 -36 3 288 29 -48 -21 -77 -24 271 -82
3173h2Q7J43l0j95J51k3o8K19k23q0J43J01o22P5N33l02L64k61P3k01K85J55m91
$$ -82 5 148 118 -77 74 51 -17 202 -21 -101 42 143 -479 -404 129 -173 191 -70 3 -198 87 242 -249
3196b49j5M00k78J33Q6k99k22N17l6j82K8K43j06r9J02l56N32k34r7j52K36K10
$$ -249 -264 136 -142 -9 77 -222 -444 73 37 -145 -117 126 20 -79 23 -333 199 -35 -132 -284 -48 162
3218A62k20K56n6l08j30L12qj46M45l08j01J87K8j85M88j01k14j93J07j39L30
$$ 162 -58 198 142 -166 -296 16 8 -138 307 -1 -102 85 113 -72 416 315 101 -92 15 -124 206
3239B06k27m3o5M60m99k2N03l82j68J09L48m26r7N20l57R7j27m2N07j74j60mR1
$$ 206 -21 -64 -129 331 -168 -190 313 -69 -237 -128 220 -206 -303 217 -140 -43 -170 -212 295 121 -39 -43 48
3262D8kl7O8K48n98J33J05j97J32K0K01k18K16j82l4O9Ml92N28N0k77OJJ78j10
$$ 48 46 9 77 325 -273 -140 -35 -232 -100 -80 121 -97 119 -63 -97 -28 -24 -416 112 162 -115 -109 -108 70 -40
3287d0O1K2K3j48l2J92J07j53j09J59M17m50r1K21l75K88O6o3l96L64Q4m19J99
$$ -40 21 43 66 -82 -114 78 185 32 -77 82 499 49 -42 179 -196 92 158 95 -301 63 147 -272 -73
3310g3K63o14P18q5l31J84q7O9j83K31l18n0O10l22l7k51N97m37mK61l40m1Q24
$$ -73 190 -424 294 209 -122 62 -25 44 -139 92 -226 -276 334 12 -25 -276 321 -116 -120 141 -199 -240 584
3333E84o08J74j26j62n2L47J7j99K73J39l41k66L42n5j93J47J73j34m6R5j02j4
$$ 584 -24 150 24 -138 -190 157 174 -25 248 387 46 -220 122 67 -126 21 194 60 14 109 7 -7
3355gK00j36j78J61J09l92J57O6O3Rk74K89Pj55m7J49J55k88jK37n0m56O94m22
$$ -7 193 57 -121 40 149 -243 -86 -20 43 52 -222 67 74 -81 -128 21 176 -112 -113 124 74 -382 312 -110
3379a10J64K47k24l2J13K15l50j54L8M0j73lM09j43K58j82l1j98J46P8k84K38
$$ -110 54 301 77 45 158 373 23 -131 -93 -53 -226 -229 180 37 295 113 82 -116 30 108 -176 62
3401F2j82LR5j02K7K89k20j47N09l03k33K54J35m03K36j28J02k33L50r6K68k81
$$ 62 -120 -117 -22 -124 -97 192 -28 -175 334 31 -202 52 187 -216 20 -108 -6 -239 111 15 283 2
3423Bn7o4J73P3l48J87j20J35O5l14J08J9J84jj03M86l08k89K00M20n71J0K28
$$ 2 -55 -119 54 127 -221 -34 -154 -19 46 -268 -160 -141 43 42 -61 425 117 -172 28 448 -123 -113 115
3446A15k64L2J60l28L60j4k88j06O97j59nl79J97o4l2J11j44K72l8Nj13M97n69
$$ 115 -149 -117 43 -285 75 61 -227 -333 364 205 200 -179 18 -46 -78 33 -111 161 123 128 15 512 -57
3469e7rj34J94j14K46J59l44j64M8J84M5J15j6j66J4L50o04K38J6Qr7K73j24Q2
$$ -57 -66 -200 -6 -120 126 285 -59 -223 -175 9 54 169 153 -13 1 351 -253 -15 1 9 -88 185 61 143
3493A43o4j65RP7J5j35J53J33k20K4J66m59J73J74j09k09L45j1q0qK31l35l5r2
$$ 143 79 -86 -77 0 15 -120 33 166 -54 -30 136 -323 -150 24 -85 -294 51 40 -40 -48 183 -152 -187 -279
3517b79m4J68R2n5L9k9N7r9K88j23J05m79M11j03J22K45j08k60P0J23l03K17K09
$$ -279 -323 -155 -63 -118 -79 -108 -51 -150 138 15 120 -359 52 -51 71 316 208 -52 18 141 -162 55 264
3540B64k72n6K2J59j04l2n4k92L27jK9K39l78q7K31p5Q1J5j57K22j4j72l9M7K24
$$ 264 -8 -64 -42 117 13 -19 -73 -365 -38 -39 -10 229 -149 -236 -5 -80 1 16 -141 81 67 -105 -144 -97 127
3565A27k99q2L97j37o6J86k94N3m3L5K84k53N8O2k33N96l71p5Mn1L1J08Q8n11
$$ 127 -172 -254 143 6 -60 126 -168 -115 -158 -123 161 -92 -34 28 -205 391 20 -55 -51 -102 -71 37 125 -386
3589c86N97j19l66j1M50k17r8M24o99L55J63q6P0j44K05K8j70j63L59l8o6K1J50
$$ -386 211 92 -274 -285 165 -52 -150 274 -425 -70 93 7 77 -67 138 166 -4 -167 192 154 88 109 259
3612B59Jj21k35L7J27j7JOj06K05j1j43k35L97k24j18K37k02j75L63k38J33J62
$$ 259 260 139 -96 -59 68 51 52 58 -48 157 146 3 -232 165 -59 -177 60 -142 -317 46 -192 -59 103
3635A03J7q7j98K87l2J73l56K70n05K59K65o84N94k40j15K79j92j37J89J21K16
$$ 103 120 33 -165 122 90 263 -93 177 -328 -69 196 -488 106 -134 -249 30 -162 -299 -110 11 227
3656B27l51M03m04J07j75K83j57m4k74N75l39L91m17j75L77k32K47o3K18l78L15
$$ 227 -124 279 -125 -18 -193 90 -67 -111 -385 190 -149 242 -175 -350 27 -205 42 -21 197 -181 134
3677A34m69L56n6K26k43J09k0P4J9j31k5M06m1m23k4O1k07K58j04M0K83j51J00
$$ 134 -335 21 -35 191 -52 57 37 111 130 -1 -26 380 339 -84 -108 -47 -254 4 -100 -60 223 72 172
3700A72o0j16mK53m13J57K48j27r7J59j98Q6J75l78M7J92L0j69M08k38q9j73L10
$$ 172 112 -4 -8 245 -168 -11 237 110 13 172 -26 60 235 -143 -96 96 126 -43 365 127 38 -135 175
3723A75J62n79L13o9k6o0K4q7L11k6N2j76L2j05p3K27j80J4M8M2k82L90Q2k99
$$ 175 337 -242 71 2 -24 -84 -60 -147 164 138 190 14 46 -59 -132 95 -85 -71 -23 19 -263 127 209 -90
3747i0L46m6p5K99k76o5N5q7L3j01J56j05j72j33P7L71l0l41K17J82J23N9j50
$$ -90 256 210 135 434 158 93 148 61 94 -7 149 44 -128 -261 -184 187 157 -184 33 215 338 397 247
3770B47j61j83J26l8J11j07L9J88l83k5N41n00J28M22n17k7L03q6l4Q6K9j30j76
$$ 247 86 -97 29 -9 102 -5 34 222 -161 -186 355 -145 -17 405 -112 -139 164 78 44 130 159 29 -147
3793a47J94j27J93J2o8qO0j43O6oL4O9j5j82k44K07L06rj9j30k97J69L30j22j38
$$ -147 47 -80 113 125 57 49 109 -34 32 26 60 129 114 -68 -312 -105 201 192 173 43 -254 -85 245 123 -15
3818a5N0k90K04L6j2j17K36l78K23J56K30n66J51J83M5k14Q7L33l3k12k0j72j41
$$ -15 35 -255 -51 -15 -27 -144 92 -286 -63 93 323 -243 -92 91 136 -78 9 342 309 97 77 -95 -236
3841b36L34k30J46M2J12J00Q6m36j75N17k29k19K16r5j52J84p3J38q6K83j88o2
$$ -236 98 -132 14 56 168 268 354 -82 -257 260 31 -188 28 -67 -219 -35 -108 30 -56 227 39 -23
3863b3J62k10r9J74J21k33R0k1k27M74j43L5j06l99L67P5j11O7J63l50M22k22
$$ -23 139 -71 -170 4 125 -108 -18 -39 -266 208 65 100 -6 -405 -38 37 -74 -7 156 -194 228 6
3885Fk41m4K40K85k93O8j08J6K88l42K92K3l37J87M6j37N2j33K15J6K08k97K61
$$ 6 -235 -279 -39 246 -47 21 -87 -71 217 -125 167 190 -147 40 86 -51 1 -132 83 99 307 10 271
3908B71m15K03k30O7l41J73J85n3r9K04K8J47j15j58k0J3N0O7Q0k9J2J12N8o42
$$ 271 -144 59 -171 -104 -445 -272 -87 -140 -239 -35 -7 140 25 -133 -153 -140 -90 -23 57 28 40 152 210 -432
3932d32M48p7M2J03k72J72o8j5j77Q38n85j34L4J23k82K90j76M43q2K22n18K35
$$ -432 16 -61 -19 84 -188 -16 -84 -99 -276 562 -23 -157 -123 0 -282 8 -168 275 193 415 -103 132
3954A32k2j6%q0J47k90R1j33r8K73J06l99L29o4K12l64M40l74J0N25l39J22k79
$$ 132 110 94 94 14 161 -129 -38 -171 -269 4 110 -289 40 -24 188 -176 264 -110 -100 425 86 208 -71
3977g1m0L2r8j13L6M33j34j52K1J36p1J94l25K9l9J04J34J57k81K48j68k3K09
$$ -71 -111 -79 -177 -290 -254 179 45 -107 -86 50 -21 173 -152 -123 -162 -58 76 233 -48 200 32 9 218
4000B18k38n5J58k35q3L33j2R6k91L86j84k23O8j48J53L69j64r4j0k92J70m4k13
$$ 218 -20 -75 83 -152 -235 98 86 182 -109 277 93 -130 -62 -210 -57 312 148 54 44 -248 -78 -122 -335
4023c35L80j60L10k94J45k8K29l99J98M3j73%j5j16K16L04k59l02J82P4k40K85
$$ -335 45 -115 195 -99 46 18 247 -152 46 89 -84 -84 -99 -215 1 305 46 -256 -74 0 -240 45
4045D5j61L51l40jr5K72j05k03K23R5l42L13J06K3l22O5L08l33K12k00M5j8k24
$$ 45 -116 235 -105 -106 -201 71 -34 -237 -14 81 -261 52 158 181 -141 -76 232 -101 111 -89 -44 -62 -286
4068b86K31J7R6j25N4n2k20L11m5k44M05L3Q5l42J48J83m23M57k54N9J12J24l73
$$ -286 -55 -38 58 -67 -13 -65 -285 26 -19 -263 142 175 260 -82 66 249 -174 283 29 88 200 324 -49
4091d9R9Ql44O69m70L47l52lK23l78L79k12J89l89K70K46k52N6K09l32J68K5k04
$$ -49 50 58 -286 383 -87 260 -92 -95 128 -250 129 -83 106 -283 -13 233 -19 37 246 -86 82 107 -97
4114i7L3K47k0r9J09m5k31L84l1n41P4L02k41J80L08l55L3K36n84L73J78m75L69
$$ -97 -64 183 163 64 173 128 -103 281 250 -291 -217 85 -156 24 332 -23 10 246 -338 35 213 -262 107
4137A07n1n3j76k8K50n4k03K11K42l83O8L2J39j13K2L7K20l06n8N1j19j21Q5M36
$$ 107 56 3 -173 -201 49 -5 -208 3 245 -138 -70 -38 101 -12 10 47 267 -39 -97 -46 -165 -286 -201 235
4161B35m14J40K44j71q5J80J77m00L02k14q9q5K23Q3j1j45J42k13j95K18R8j00
$$ 235 -179 -39 205 34 -51 129 306 -94 208 -6 -95 -180 43 126 115 -30 112 -101 -296 -78 20 -80
4183h0n4L16j79l38M40rpo7l9L47m27r8J28J21j52O6K16m08K54l46J1J36L15k9
$$ -80 -134 182 3 -335 105 96 89 22 -17 330 -97 -195 -67 54 -98 -32 184 -224 30 -316 -305 -169 146 117
4207A17j11j00n9M08j08j31j58K53j69p4J50O0m1j56K28r7o6L2N8l08L98j68M2
$$ 117 6 -94 -153 255 147 16 -142 111 -58 -132 18 78 37 -119 109 12 -54 -22 36 -272 126 -42 0
4230@n0R8j88J23L84o93k86N11L07k53k77K30P9o0M1n9J85j21lJ17o4K57n33M39
$$ 0 -50 48 -140 -17 367 -326 -612 -101 206 -47 -324 -94 -15 -75 -34 -93 92 -29 -32 85 21 278 -255 184
4254A84k27j58L95O3p3l90K53k01L32j99M3N0j46q4Q9K23l93K06J49K7m08J94
$$ 184 -43 -201 194 257 184 -206 47 -154 178 -21 22 72 -74 -158 -69 154 -239 -33 116 143 -265 -71
4276g1K32m07K31J38l04Q5K1j49P1K66K39n15J83K11l44n3K16j27j40N22l51J45
$$ -71 161 -246 -15 123 -181 -96 -75 -224 -153 113 352 -163 20 231 -113 -166 50 -77 -217 305 -46 99
4298I9j53K38l70L47l04k8L39l2k03J0N4NK49k88J15l31M85l1l99M4J06kj15J65
$$ 99 -54 184 -186 161 -143 -171 168 136 -67 -57 -3 2 251 -37 78 -253 232 201 -198 -154 -48 -50 -165 0
4322@J43j39K67l83J4PK91j36r6N0P4m0jj35q5K23R9j96J35j18K8J01j56N5jK19
$$ 0 143 4 271 -112 -98 -91 200 64 -32 18 92 52 51 -84 -169 54 153 -43 92 -26 2 103 -53 2 1 220
4348B20l14J32J81k98M9P3J05O0k16K31k65J70l10K54L2j20k47J77K52R4l93L16
$$ 220 -94 38 219 -79 -30 43 148 208 -8 223 -42 128 -182 72 104 -16 -263 -86 166 260 -133 183
4370A83j93r2K4K01o6r4L1O7j92j69M6J33K90j37l66O59j43l97K03k69L68j83
$$ 183 -10 -102 -78 123 57 -37 -6 61 -131 -300 -254 -121 169 32 -334 325 182 -215 -12 -281 87 -96
4392i6q8J02K87p4J47m14M36k24j83L06Qr4m54M50J25k34N2j50J61k3M6p0J9L8
$$ -96 -184 -82 205 131 278 -136 300 76 -107 199 207 113 -341 109 234 0 52 -98 63 40 86 16 35 73
4416G3k09K45Mk62P5N1p2j46R8J85q4J57j63L9J32p8j23q4K92j21j28L46k13L9
$$ 73 -136 109 113 -149 -74 -23 -95 -241 -143 42 -42 115 -48 -9 123 45 -78 -162 130 9 -119 227 14 53
4440E3J58j50J48Qk58J19j79J10m23O65j70k14M63m68L96k56M8l6k60K96l5j39
$$ 53 211 61 209 217 -41 78 -101 9 -414 251 81 -133 330 -138 258 2 50 14 -246 50 15 -124
4462a24K95p6k11L4N1K34l52L16l76K35Q7J03k63p0J94P0l39K31o4l09N06l46
$$ -124 171 95 -116 -82 -31 203 -149 167 -209 26 113 216 -47 -117 77 147 -192 39 -25 -334 172 -174
4484a74K33j12j1o0Q6N8q3j01L35k40R2j36K06k02O6k3m9K9q4L29l71N26n92K1
$$ -174 59 -53 -64 -124 -38 20 -63 -164 171 -69 23 -113 93 -109 -43 -66 -115 -86 -170 159 -212 314 -278 -257
4508b57L74j79n9K97j05J23Pl72j30N74l18L4j44K91l16j2L56j86j74K93J66j63
$$ -257 117 -62 -121 176 71 194 201 -171 -301 273 -45 -11 -155 136 -180 -192 164 -22 -196 97 263 100
4530A00j93jK07q3J37l3k16RK85m50J55J35k8l7m2O1K11p9k34k60M13r8J22o4
$$ 100 -93 -94 113 30 167 134 -82 -73 212 -238 -83 52 24 -13 -55 6 217 138 -96 -356 57 -41 81 17
4554A7K54l73J52Q1k77K06j74l4K81k68L20r4K22l28q7K47Qm19J08K74j16J87
$$ 17 271 -102 50 131 -146 60 -114 -148 133 -135 185 91 313 -15 -102 145 153 -266 -158 116 0 187
4576A87j7j58j82K61K4k15kj58q6N70k18o0J67J20j2n38K38J4J16m8j36J04o3
$$ 187 170 12 -170 91 115 -100 -102 -260 -346 224 6 -54 113 233 221 -317 -79 -65 51 3 -133 -29 -92
4599i2J67p1l3l9q0L63j29k94J23J08J99j05J6k34K35Q3l19L10k02n7k59L89m8
$$ -92 75 4 -29 -68 -148 215 86 -208 -85 23 222 117 133 -101 134 217 -102 208 6 -51 -310 79 31
4622C1o1n8L88l88L68l09k33L20J01j91L6J33k29k9K8L40l58K23j75j12L89k27
$$ 31 -30 -88 300 -88 280 -29 -262 58 159 -32 4 137 -92 -121 -93 247 -111 112 -63 -175 214 -13
4644a3k42J73L9k37K52kJ44o4L1J60k52J02o7O4m9r5K0K87J46m19R2q7K01j79
$$ -13 -255 -82 -43 -280 -28 -30 114 50 81 241 -11 91 24 88 39 -56 -36 251 397 -22 70 -17 184 5
4668EK01J62l89N0J80r2r5R1K6m99J34L06j50J21j24J9L13j60k53J17K92l96n4
$$ 5 206 368 -21 29 209 117 22 113 139 -360 -226 80 -70 51 -73 -54 259 99 -154 -37 255 -141 -195
4691a95J53J29k01J88L30n17KJ32J85p0q5j50l10M45R4k39K20k12r0K60k4K21
$$ -195 -42 87 -114 74 404 -113 -111 21 206 136 51 -99 -409 36 130 -109 111 -101 -191 69 45 266
4713B66m12J52j07l5L59n73K91M5L55l67Mk1L48n71J58k65M71Q4k33k21M52k38
$$ 266 -146 6 -101 -136 223 -350 -59 -14 341 -26 -22 -43 305 -266 -108 -373 98 182 -51 -272 180 -58
4735e8%K50j87L8j49o3K01k11L17J95j46k5n3l4K7j49P2O7j05j55M7M7K74m7l12
$$ -58 -58 192 5 43 -106 -169 32 -179 138 333 187 162 109 75 102 -47 25 92 -13 -168 -121 -74 200 153 -159
4760a59O9Q8J59l14R9pR7j48J17j18J57k16L52l23K47J30l74j62M03KO0j86L6
$$ -159 -90 -2 157 -157 -58 -65 32 -116 1 -117 40 -176 176 -147 100 230 -144 -306 97 99 159 -27 9
4783INk9j70J35j07J03j69K12j53K53n0K59Q7m89K46j11Q8j10M0K62k59J22l10
$$ 9 14 -15 -185 -50 -157 -54 -223 -11 -164 89 39 298 385 -104 142 31 119 9 49 311 52 174 -136
4806a36L4L44l29L6j35M90p8m84L35OJ5j30j89K93j20K2M4M03m87K17j86Q6J77
$$ -136 -102 242 -87 -51 -186 304 226 -258 77 83 98 -32 -221 72 -48 -26 18 421 -66 151 -35 51 228
4829B28n00K21K10k46Qj46P3K41k27O5j76J38R0k28K63m6l38L79j32K74j45K15
$$ 228 -272 -51 159 -87 -79 -225 -152 89 -138 -73 -249 -111 -21 -249 14 -32 -370 9 -123 151 6 221
4851B21l54L4K76N2k90M9j77J68n1j7P4J35r8L06l45L4j51N44l63N7M1J85k50
$$ 221 -133 -99 177 229 -61 -12 -189 -21 -72 -89 -15 120 22 328 -17 17 -134 410 47 104 145 330 80
4874H0P3k03L26k70R0J33l38K03j27p6K27j23P5j26j91K56q7p5J73p7K06j94k17
$$ 80 153 -50 276 6 96 229 -109 94 -33 -109 118 -5 70 -56 -247 9 -78 -153 20 -57 149 -45 -262
4897b62J12K81l64M73Q1k24o9k17K26P5j81J73R3k96P2q4L27N4O0k70j51J23o0
$$ -262 -150 131 -233 240 321 97 28 -189 37 112 -69 104 197 -99 -27 -111 216 270 330 60 -91 32 -28
4920b8L14l26K62k55n6M9O8l39K25K87j16M7p2j23k27L93j91j3m4J49J59n5l69
$$ -28 286 -40 222 -33 -89 -40 28 -311 -86 201 85 132 60 -63 -290 103 -88 -101 -145 4 163 108 -261
4943b61j3L18n4l43L26R4j35J07j48MK90j61k07Q7O3M85m80%J05J72k17k8q8K21
$$ -261 -274 44 -10 -353 -27 67 -68 39 -109 -105 185 24 -183 -96 -33 452 -28 -28 77 249 32 4 -84 137
4967A37p1m1L6L0N5Q5k68J86J60m55L07k31M6p1J28K9J15l55K54k5j97R0j03j23
$$ 137 66 25 61 91 146 231 -37 149 309 -146 161 -70 -24 -95 33 62 177 -178 76 51 -146 -56 -159 -282
4991b82M05k69J32K27l33K28k78N8J66Q7q8j99M31jn23K77P8l84J91J15j45K58
$$ -282 123 -146 -14 213 -120 108 -170 -112 54 141 53 -146 285 284 -239 38 116 -268 -77 38 -107 151
5013A51J13K1p19L99J44l17M53k68L30l10m7J13J1l4K20l72R6j17K61j16K5j82
$$ 151 264 285 -434 -35 109 -208 245 -23 307 -3 -50 63 74 40 260 -112 -16 -133 128 12 37 -145
5035a45J9J36J48k30N4l2L35l19J95r5l54K41j25M63m14j5J06o0L91J28o94L16
$$ -145 -126 10 158 -72 -18 -50 285 -34 161 66 -288 -47 -172 291 -123 -138 -32 -92 299 427 -267 49
5057D9j50M46l01j3j01o1K7J61N7p1k03J20J22m29K79M1O2j75L35j71k15K54R8
$$ 49 -101 345 44 31 -70 -131 -104 57 114 43 -160 -40 82 -347 -68 -27 35 -140 195 24 -191 63 161
5080A61k7o1M6J48k64j25R7j85L33K74m31J80r6j50J70Jj31J50j95P2K15K17l69
$$ 161 134 73 119 267 3 -122 -25 -210 123 397 -34 146 50 -100 70 71 -60 90 -105 -33 182 399 30
5103C0P5J25l39j70K49Ko6l5m9K15Q1L44n9n42J92J60k65m1J04r5K28j43K5J28
$$ 30 105 230 -109 -279 -30 -28 -94 -129 -178 37 118 462 403 -139 53 213 -52 -93 11 -84 144 1 26 154
5127A54j46J52j03J85k60J34j21p3J42k02L23m5M2p4l65L83J29l85K11O3n1k44
$$ 154 8 160 57 242 -18 116 -5 -78 64 -138 185 140 182 108 -257 126 255 -130 81 144 93 -151
5149a51l3J61k4M6O3M2k93LK13P1Nj04J33j35J08k49K84O2k11j30q2K27l83N40
$$ -151 -184 -23 -47 -1 62 104 -189 -186 27 98 103 -1 132 -3 105 -144 140 202 -9 -139 -221 6 -377 163
5173A63n68J53N87m30K5Q2N3N1J2l5k02M62l90j14J21N8K0j02J2J64o2R3Mj53
$$ 163 -405 -252 335 -95 -70 12 65 116 128 93 -109 353 -37 -151 -30 28 48 -54 -42 122 60 153 157 4
5197DL43j18l28L33j27m76K14J31K53k96K8j56K07r9K21j46j50L5J81K6J55l92
$$ 4 347 229 -99 234 107 -369 -155 -24 229 -67 -39 -195 12 -87 134 -12 -162 -127 54 80 235 -157
5219a57J59l2k80L96j93m2R9j09N22m40J66J20k52k28K15J6o5m9J87j73LK90L8
$$ -157 2 -30 -310 86 -107 -149 -50 -159 363 -77 89 209 -43 -271 -56 -40 -105 -154 33 -140 -137 153 191
5242A91l2k43P7K22j46j68J21j61J15K6m1J75Roj4j46M8j28l5o9K6J14O2J20o4
$$ 191 159 -84 -7 215 69 -99 22 -139 -24 2 -39 136 145 139 125 -21 27 -101 -136 -205 -179 -65 -3 117 53
5267E3j58jJ16k7K4o8K59j22R3j95J80Ml26K26j62Q1J42J19q4k75J80k76N16m66
$$ 53 -105 -106 10 -17 7 -61 198 76 169 -26 154 158 -168 58 -104 -23 119 238 154 -121 59 -217 299 -167
5291a67K20j72O2Q9K7j61J90k8j07J43kn8j85L78l46J20p6nJ73J02j12l17N53
$$ -167 53 -119 -57 32 59 -102 88 60 -47 96 94 36 -149 229 -117 3 -73 -78 95 197 85 -232 321
5314C21o06J13K58k20K27l71K22k8j8J55j91J69N0k56M02j14O0j40k54K60j68
$$ 321 -285 -172 86 -134 93 -278 -56 -84 -102 53 -138 31 81 -175 227 113 173 33 -221 39 -129
5335a29J80j53K12l21J73J27o4K00M2l24RJ33k45K3j0P6l3Q1L34l80J34K58k95
$$ -129 51 -102 110 -211 -38 89 25 225 267 -57 -48 85 -160 -137 -147 -71 -104 -23 311 -69 65 323 28
5358B8j26J17K17j9k44N6k8o5J57k02L70Ok26M5J32l80M50m64J85L5j47K29r8
$$ 28 -98 19 236 217 -27 29 1 -64 93 -109 261 267 41 86 218 -162 288 -176 9 44 -103 126 28
5381B8k47K66o6K42l09RJ9J91L7oj52P8j50Q6k10M44m14nK21j27nj69L23k0p8
$$ 28 -219 47 -19 223 -86 -77 -58 133 170 164 12 90 -60 26 -184 260 -154 -159 62 -65 -70 -239 84 64 -14
5406a4j02M5K00m7k32O9K4j7M0K1J34k02M09k84J16M7%k23j49K38l8Q5k06J85
$$ -14 -116 -71 129 82 -150 -81 -57 -74 -34 -13 121 -81 328 44 160 207 207 -16 -165 73 35 120 -86 99
5430I9J11j83K4l0j01lk15O3K32K76m23J72J19k52r6K89N8l67J54j43K56k06L04
$$ 99 210 27 51 21 -80 -83 -298 -235 -3 273 -150 22 141 -111 -207 82 140 -227 -73 -216 40 -166 138
5453A38j00k02J04l1J94k41J54P5k68O4L30j48j49Q9rj60J70K02j34Q9j7k0m78
$$ 138 38 -164 -60 -91 103 -138 16 91 -177 -113 217 69 -80 9 0 -160 10 212 78 167 150 130 -348
5476c48K21L22pn9Q0k40J54k67L70k10m7n7M0k03K65j36J88J16Kj28j48j51J56
$$ -348 -127 195 188 129 209 -31 123 -144 226 16 -31 -88 -48 -251 14 -122 66 182 184 56 -92 -243 -87
5499h7j40N05k63j13K53l85o2P1K43j46l7J47n7K50k21k4P6r3pk01K96J85j25
$$ -87 -227 278 15 -98 155 -230 -292 -221 22 -124 -161 -14 -71 179 -42 -66 10 -83 -90 -291 5 190 65
5522F5Q7k95L69l17L9K53m39K47k10OL34k15q0N1L09l9n24M54J64n09J6%J74J09
$$ 65 152 -143 226 -91 -52 201 -238 9 -201 -195 139 -76 -156 -105 204 165 -359 95 259 -250 -234 -234 -60 49
5546D9L96o99N20l37k77L65L2j85L50j00k00J37j84KJ66K69l31N3p4N8R3j47L35
$$ 49 445 -254 266 -71 -348 17 49 -136 214 114 -86 51 -133 -131 35 304 -27 26 -48 10 103 -44 291
5569B91m58M99l38k60J50M7L02j07l65K43J80l07L36l82J60J51k73J19j09M46
$$ 291 -167 332 -6 -266 -116 -69 233 126 -239 4 184 -123 213 -169 -9 142 -131 -12 -121 325
5589C25n10K01K50m17K16j21j0L38j91l16M14j4l08J22R5P0r6K63k11J15j93k61
$$ 325 -185 16 266 -151 65 -56 -66 272 81 -235 179 165 -143 -21 74 144 48 311 100 215 22 -239
5611b39J88K09J98o40K10J99J35n92K98p8k40L92q6J55j38o6K64l16L99k31K26
$$ -239 -51 158 356 -284 -74 125 260 -332 -34 -112 -352 40 -46 109 -29 -95 169 -147 252 21 247
5632B47j47j67L7J79k2j74K11j86L8P0m7k53k55P32j14n3j18K20j60J32j95j01
$$ 247 100 -67 -30 149 127 -47 164 -22 16 86 39 -214 -469 263 149 96 -22 198 38 170 -25 -126
5654a26J46J72l22L62l25J3J20j31L82l85K10J02k93K17M1j37k10J69k61K02J15
$$ -126 20 192 -130 232 -93 -80 40 -91 291 -94 116 218 -75 142 183 46 -164 5 -256 -54 61
5675F1kk66L19L2l14K9J41l9J19J79n29J14k12M15k45J84j27J51J44k37P5J14
$$ 61 59 -207 112 144 -170 -141 0 -39 80 259 -270 -156 -368 47 -198 -14 -141 10 154 -83 -8 106
5697A06k2j74K04l49M17k18j67K71R6k49nM6M8J46q8k00L64K61k78j93r4k01L93
$$ 106 84 -90 114 -235 182 -36 -203 68 164 -85 -90 -44 4 150 62 -138 226 487 209 16 -78 -279 114
5720A14Q2k09L2j29k0R6J69j38R3k68K42j61mJ72j39k57L20J35J32J0l90K45l44
$$ 114 196 -13 19 -110 -130 -34 135 -3 90 -178 64 -97 -101 71 -68 -325 -5 130 262 272 -118 127 -217
5743b17N3R6j31J82j60l6J93l41L54Jp7K64o01N6J89L73l50R4J00j24L40N2m0
$$ -217 -164 -68 -199 -17 -177 -213 -20 -361 -7 -6 -83 181 -420 -364 -175 198 -152 -58 42 -82 258 310 270
5766B70k81K39m18L76r5o4j6q9o5J19k31M97J19l97M24m38p7Q2J91k41J49j20
$$ 270 -11 228 -190 186 91 27 11 -78 -143 -24 -255 242 361 -36 388 -50 -127 -45 146 -95 54 -66
5788f6K88l38j46L07j19L59n30K11J30Jk68J66J49j82N6j89L46l24n6M19k76J98
$$ -66 222 -116 -262 45 -74 285 -245 -34 96 97 -171 -5 144 -38 18 -171 175 -149 -205 214 -62 136
5810A36j6o5j56J23j20J58k51Q9K55l53J04L8K44n23J95J82j06n1j03J97l3k43
$$ 136 120 55 -101 22 -98 60 -191 -102 153 -200 -96 -58 186 -337 -142 40 -66 -117 -220 -23 -56 -299
5832b99O29j68l56K12m8l28L61M4N8j14j49N1J54J6j04J58N6j47m1P1k0k40lL42
$$ -299 330 162 -194 18 -30 -358 3 47 105 -9 -158 -107 47 63 -41 117 173 26 -15 56 36 -204 -207 135
5856A35j21J00o0k24J24L22k54p7L21p9Ol30N4N7R8o2J1K07k8j54j10j0q5k3K19
$$ 135 14 114 54 -170 -46 276 22 -55 266 187 193 -137 -83 -26 72 10 21 228 200 46 -64 -74 -159 -182 37
$$ [...]
8191c1
##END NTUPLES=NMR FID
##END=
