##TITLE=1H_EC-3081-x
 DMSO, 8 sc, 
 23.10.2019
##JCAMPDX= 6.0         $$ Bruker NMR JCAMP-DX V2.0
##DATA TYPE= NMR FID
##DATA CLASS= NTUPLES
##ORIGIN= UXNMR, Bruker Analytische Messtechnik GmbH
##OWNER= root
$$ XWIN-NMR		Version 3.5
$$ Wed Oct 23 14:55:44 2019 Russian Standard Time (UT+4h)  she@DPX200
##.OBSERVE FREQUENCY= 200.1315
##.OBSERVE NUCLEUS= ^1H
##.DELAY= (6, 6)
##.ACQUISITION MODE= SIMULTANEOUS
##.ACQUISITION SCHEME= undefined
##.AVERAGES= 8
##.DIGITISER RES= 18
##SPECTROMETER/DATA SYSTEM= spect
##.PULSE SEQUENCE= zg30
##.SOLVENT NAME= CDCl3
##.SHIFT REFERENCE= (INTERNAL, CDCl3, 0, 15.7039)
##AUDIT TRAIL= $$ (NUMBER, WHEN, WHO, WHERE, WHAT)
$$ ##TITLE= Audit trail, XWIN-NMR		Version 3.5
$$ ##JCAMPDX= 5.01
$$ ##ORIGIN= Bruker BioSpin GmbH
$$ ##OWNER= she
$$ F:/spectra/data/she/nmr/H-F/1/audita.txt
$$ ##AUDIT TRAIL=  $$ (NUMBER, WHEN, WHO, WHERE, WHAT)
(   1,<2019-10-23 14:54:36.78 +0400>,<she>,<DPX200>,
      <created by zg, POWCHK disabled, PULCHK disabled
       configuration hash MD5:
       00 E9 B6 7A A2 85 ED C7 34 08 36 98 17 FE 4E 26
       data hash MD5: 16K
       61 65 F5 75 B0 03 3E F7 33 83 67 E4 DD 56 88 6C>)
$$ ##END=
$$ 
$$ hash MD5
$$ 43 55 B6 B8 EE 96 54 A7 E2 9B 9B DC A3 2B C4 C9
##$RELAX= 
##$RELAX= 
##$RELAX= 
##$RELAX= 
##$RELAX= 
##$RELAX= 
$$ Bruker specific parameters
$$ --------------------------
##$DU= <F:/spectra>
##$EXPNO= 1
##$NAME= <H-F>
##$PROCNO= 1
##$TYPE= <nmr>
##$USER= <she>
##$AMP= (0..31)
100 100 100 100 100 100 100 100 100 100 100 100 100 100 100 100 100 100 
100 100 100 100 100 100 100 100 100 100 100 100 100 100 
##$AQSEQ= 0
##$AQ_mod= 1
##$AUNM= <au_zg>
##$AUTOPOS= <>
##$BF1= 200.13
##$BF2= 200.13
##$BF3= 200.13
##$BF4= 200.13
##$BF5= 200.13
##$BF6= 200.13
##$BF7= 200.13
##$BF8= 200.13
##$BYTORDA= 1
##$CFDGTYP= 0
##$CFRGTYP= 5
##$CHEMSTR= <none>
##$CNST= (0..31)
1 1 145 1 1 1 1 1 1 1 1 1 1 1 1 1 1 1 1 1 1 1 1 1 1 1 1 1 1 1 1 1 
##$CPDPRG= <>
##$CPDPRG1= <>
##$CPDPRG2= <>
##$CPDPRG3= <>
##$CPDPRG4= <mlev>
##$CPDPRG5= <mlev>
##$CPDPRG6= <mlev>
##$CPDPRG7= <mlev>
##$CPDPRG8= <mlev>
##$CPDPRGB= <>
##$CPDPRGT= <>
##$D= (0..31)
0 1.2 0 0 0 0 0 0 0 0.06 0 0.03 0 0 0 0 0.0002 0 0 0 0 0 0 0 0 0 0 0 0 
0 0 0 
##$DATE= 1571828075
##$DBL= (0..7)
120 120 120 120 120 120 120 120 
##$DBP= (0..7)
150 150 150 150 150 150 150 150 
##$DBP07= 0
##$DBPNAM0= <>
##$DBPNAM1= <>
##$DBPNAM2= <>
##$DBPNAM3= <>
##$DBPNAM4= <>
##$DBPNAM5= <>
##$DBPNAM6= <>
##$DBPNAM7= <>
##$DBPOAL= (0..7)
0.5 0.5 0.5 0.5 0.5 0.5 0.5 0.5 
##$DBPOFFS= (0..7)
0 0 0 0 0 0 0 0 
##$DE= 6
##$DECBNUC= <off>
##$DECIM= 24
##$DECNUC= <off>
##$DECSTAT= 4
##$DIGMOD= 1
##$DIGTYP= 9
##$DL= (0..7)
0 120 120 120 120 120 120 120 
##$DP= (0..7)
150 150 150 150 150 150 150 150 
##$DP07= 0
##$DPNAME0= <>
##$DPNAME1= <>
##$DPNAME2= <>
##$DPNAME3= <>
##$DPNAME4= <>
##$DPNAME5= <>
##$DPNAME6= <>
##$DPNAME7= <>
##$DPOAL= (0..7)
0.5 0.5 0.5 0.5 0.5 0.5 0.5 0.5 
##$DPOFFS= (0..7)
0 0 0 0 0 0 0 0 
##$DQDMODE= 0
##$DR= 18
##$DS= 0
##$DSLIST= <SSSSSSSSSSSSSSS>
$$ [...]
##$SUBNAM2= <"">
##$SUBNAM3= <"">
##$SUBNAM4= <"">
##$SUBNAM5= <"">
##$SUBNAM6= <"">
##$SUBNAM7= <"">
##$SUBNAM8= <"">
##$SUBNAM9= <"">
##$SW= 24.0689530833862
##$SWIBOX= (0..15)
0 0 2 0 0 0 0 0 0 0 0 0 0 0 0 0 
##$SW_h= 4816.95568400771
##$TD= 16384
##$TD0= 1
##$TE= 0
##$TE2= 300
##$TE3= 300
##$TEG= 300
##$TL= (0..7)
0 120 120 120 120 120 120 120 
##$TP= (0..7)
150 150 150 150 150 150 150 150 
##$TP07= 0
##$TPNAME0= <>
##$TPNAME1= <>
##$TPNAME2= <>
##$TPNAME3= <>
##$TPNAME4= <>
##$TPNAME5= <>
##$TPNAME6= <>
##$TPNAME7= <>
##$TPOAL= (0..7)
0.5 0.5 0.5 0.5 0.5 0.5 0.5 0.5 
##$TPOFFS= (0..7)
0 0 0 0 0 0 0 0 
##$TUNHIN= 0
##$TUNHOUT= 0
##$TUNXOUT= 0
##$USERA1= <user>
##$USERA2= <user>
##$USERA3= <user>
##$USERA4= <user>
##$USERA5= <user>
##$V9= 5
##$VALIST= <valist>
##$VCLIST= <CCCCCCCCCCCCCCC>
##$VD= 0
##$VDLIST= <DDDDDDDDDDDDDDD>
##$VPLIST= <PPPPPPPPPPPPPPP>
##$VTLIST= <TTTTTTTTTTTTTTT>
##$WBST= 1024
##$WBSW= 4
##$XGAIN= (0..3)
0 0 0 0 
##$XL= 0
##$YL= 0
##$YMAX_a= 129248
##$YMIN_a= -265504
##$ZGOPTNS= <>
##$ZL1= 120
##$ZL2= 120
##$ZL3= 120
##$ZL4= 120
##$ABSF1= 10
##$ABSF2= 0
##$ABSG= 5
##$ABSL= 3
##$ALPHA= 0
##$AQORDER= 0
##$ASSFAC= 0
##$ASSFACI= 0
##$ASSFACX= 0
##$ASSWID= 0
##$AUNMP= <proc_1d>
##$AZFE= 0.1
##$AZFW= 0.1
##$BCFW= 1
##$BC_mod= 2
##$BYTORDP= 1
##$COROFFS= 0
##$CY= 11.3945322036743
##$DATMOD= 1
##$DC= 2
##$DFILT= <>
##$DTYPP= 0
##$F1P= 20.1720416913024
##$F2P= 0.152960286110954
##$FCOR= 0.5
##$FTSIZE= 0
##$FT_mod= 4
##$GAMMA= 1
##$GB= 0.15
##$INTBC= 1
##$INTSCL= 1
##$ISEN= 128
##$LB= 0.24
##$LEV0= 0
##$LPBIN= 0
##$MAXI= 10000
##$MC2= 0
##$MEAN= 0
##$ME_mod= 0
##$MI= 1.114404
##$NCOEF= 0
##$NC_proc= 0
##$NLEV= 6
##$NOISF1= 3.799351
##$NOISF2= 2.8
##$NSP= 1
##$NTH_PI= 0
##$NZP= 0
##$OFFSET= 15.70392
##$PC= 1
##$PHC0= -9564.193
##$PHC1= -3.199186
##$PH_mod= 1
##$PKNL= yes
##$PPARMOD= 0
##$PSCAL= 0
##$PSIGN= 0
##$REVERSE= no
##$SF= 200.130013532006
##$SI= 16384
##$SIGF1= 3
##$SIGF2= 2
##$SINO= 400
##$SIOLD= 16384
##$SREGLST= <1H.CDCl3>
##$SSB= 0
##$STSI= 0
##$STSR= 0
##$SW_p= 3612.71676300578
##$SYMM= 0
##$S_DEV= 0
##$TDeff= 0
##$TDoff= 0
##$TI= <>
##$TILT= no
##$TM1= 0
##$TM2= 0
##$TOPLEV= 0
##$USERP1= <user>
##$USERP2= <user>
##$USERP3= <user>
##$USERP4= <user>
##$USERP5= <user>
##$WDW= 1
##$XDIM= 8192
##$YMAX_p= 0
##$YMIN_p= 0
$$ End of Bruker specific parameters
$$ ---------------------------------
##NTUPLES= NMR FID
##VAR_NAME=  TIME,          FID/REAL,        FID/IMAG
##SYMBOL=    X,             R,               I
##VAR_TYPE=  INDEPENDENT,   DEPENDENT,       DEPENDENT
##VAR_FORM=  AFFN,          ASDF,            ASDF
##VAR_DIM=   8192,          8192,            8192
##UNITS=     SECONDS,       ARBITRARY UNITS, ARBITRARY UNITS
##FACTOR=    0.0002076,     1,               1
##FIRST=     0,             0,               0
##LAST=      1.7004516,     0,               0
##MIN=       0,             -265504,         0
##MAX=       1.7004516,     129248,          0
$$ Real data points
##PAGE= N=1
##DATA TABLE= (X++(R..R)), XYDATA
0@%%%%%%Qj6J6j6K4l2M0m8N6p2Q8j04J20j36J60j92K24k56K96l41L89m42N00n65
$$ 0 0 0 0 0 0 0 8 -8 8 -8 16 -16 24 -24 32 -40 48 -56 64 -72 88 -104 120 -136 160 -181 208 -234 266 -299
30b99O37p17Q05r03J009j126J255j394J547j717J902k105K332k581K859l171L519
$$ -299 338 -379 426 -477 532 -594 661 -733 814 -903 999 -1106 1226 -1355 1504 -1667 1852
47A852l914M366m889N500o227P114q212R620j1511J4188j8310K5564m2076J47772
$$ 1852 -2062 2304 -2585 2915 -3312 3802 -4410 5210 -6301 7887 -10423 15141 -26935 120837
61A20837Q411k68376l655J07794J19448j6185l1432L902M5438m1396r3330m8944
$$ 120837 129248 -139128 -142783 -34989 84459 68274 36842 40744 86182 44786 -48544 -97488
73i7488P0399R3905L0692n6249n3301q818Q205k6890j0064M5653O2546M74n4850
$$ -97488 -27089 66816 97508 41259 -12042 -20860 -12655 -39545 -49609 -3956 58590 59064 4214
86D214n1820N431L4960Q639j9847J4190M7147O831o6220p2158M725Q6017P3068
$$ 4214 -47606 -42175 -7215 1424 -18423 -4233 42914 49745 -16475 -88633 -83908 2109 75177
99G5177j9183p0281k6074K2488R634k3372j1164L9840N8628N6p6794p1000J2930
$$ 75177 55994 -14287 -40361 -17873 -8239 -31611 -42775 -2935 55693 55749 -21045 -92045 -79115
112g9115O9105N0102l558l2180k1067n288j9806k7159J5238N9915M3844j4316
$$ -79115 -10010 40092 36534 4354 -16713 -22001 -41807 -68966 -53728 6187 50031 35715
124C5715n4342m6882j831L3336K6355P383P429O647r212k5019k7294q610K3020
$$ 35715 -18627 -65509 -67340 -34004 -7649 -266 7163 13810 4598 -20421 -47715 -56325 -33305
137c3305L6706K1228K881j0973k6575k7218l936K0031K9543K4693J772k0580j9802
$$ -33305 3401 24629 27510 16537 -10038 -37256 -41192 -21161 8382 33075 34847 14267 -5535
150e535j0191m644N910K0619K4408J5851p309l8538l8146M750M3350L9138J664
$$ -5535 -15726 -20370 -14460 6159 30567 46418 39109 571 -37575 -32825 10525 49663 51327
163E1327l6657l5676N358L1278Q963j7501q719J6178K2025q526m3060k5833L2651
$$ 51327 14670 -21006 -15648 15630 24593 7092 -1627 14551 36576 28050 -15010 -40843 -8192
176h192N3830Q216m0329l8481L646L4719J6576k3279j9756K0193K9691l910l4009
$$ -8192 45638 53854 13525 -24956 -21310 13409 29985 6706 -13050 7143 36834 32924 -1085
189a085k5621R203L0058J4884o543j065N681j5946k9824r306K5117L7415J2005
$$ -1085 -26706 -17503 12555 27439 20896 19831 25512 9566 -20258 -29564 -4447 32968 44973
202D4973k4650k5935L087O946j8137j5454K2935M6989J7791m2258o2633q759N1427
$$ 44973 20323 -5612 -2525 4421 -13716 -29170 -6235 40754 58545 16287 -46346 -55105 -3678
215c678L6916j9536l3808L445L1341P651l9711l7228K1752N4739J1992m1022l4218
$$ -3678 33238 13702 -20106 -16661 14680 22331 -17380 -54608 -32856 21883 33875 -7147 -41365
228d1365J4621L6767M040l7125k1767L1177L7991r163l8636j3945K2631K6259
$$ -41365 -26744 10023 14063 -23062 -44829 -13652 24339 15176 -23460 -37405 -14774 11485
240A1485n827k5689q56K5908P211k5547j8192J7210L1893O030k8952k5757J2546
$$ 11485 5658 -20031 -20887 5021 12232 -13315 -31507 -14297 17596 23626 -5326 -31083 -18537
253a8537K6055j484j7065N409K2636L748k9915l3048J0055M9693K5251k8574l7347
$$ -18537 7518 6034 -11031 -5622 17014 20762 -9153 -42201 -32146 17547 42798 14224 -23123
266b3123J273K7236R538k3769k0217K3505M1731n35m4362k8946J8086L5447R445
$$ -23123 -21850 5386 14924 -8845 -29062 -5557 36174 35639 -8723 -37669 -19583 15864 25309
279B5309k4458j8985J8047K7505o758l1484j4607J5292K5756Q646j3221j0972
$$ 25309 851 -18134 -87 27418 20660 -10824 -25431 -10139 15617 24263 11042 70
291G0M319J759j1358m380J2788J4481K034j1032j2163Q52P934k190n227P861J1972
$$ 70 4389 6148 -5210 -9590 3198 17679 19713 8681 -3482 -2630 5304 3114 -2113 5748 17720
306A7720k222j6274j3851O591K3261R297j9582k1068M651J8050R579p675j5196
$$ 17720 15498 -776 -14627 -8036 15225 24522 4940 -16128 -11477 6573 16152 8477 -6719
319f719j901J3412O162j3209j1549M856J5823R657q603j9776n888J4614J1341
$$ -6719 -8620 4792 10954 -2255 -13804 -8948 6875 16532 7929 -11847 -17735 -3121 8220
332H220m188r896l860Q456J2367j821j7809j0490P961J3600O736l050p821j979
$$ 8220 4032 -5864 -9724 -1268 11099 9278 -8531 -19021 -11060 2540 9276 6226 -1595 -3574
346c574L326m503q410K749J2707R861J58j1594j3689l39R351M167J090N045J117
$$ -3574 -248 -4751 -13161 -10412 2295 12156 12314 720 -12969 -13308 -3957 210 1300 6345 7462
361G462o907q063k272O642R815j638j0672l1J1544M285r106j0800o09J3934J0006
$$ 7462 555 -7508 -9780 -3138 6677 5039 -5633 -5664 5880 10165 1059 -9741 -10350 3584 13590
376A3590j1146j5499P022J9899K149j8922j7277P525K5897R874k1522k1114Q600
$$ 13590 2444 -13055 -6033 13866 16015 -2907 -20184 -12659 13238 23112 1590 -19524 -10924
389a0924K2343N417j6764j6540O090K1136L238j8492r352J4348J3938o167j8610
$$ -10924 11419 16836 72 -16468 -10378 10758 13996 -4496 -13848 500 14438 8271 -10339
402a0339p709J4415J7903k045j4462k612O414r18p624k088J0709J4609k979j9972
$$ -10339 -18048 -3633 14270 12225 -2237 -4849 1565 647 -6977 -9065 1644 16253 13274 -6698
416f698q455J3880J2680q098j3232J186J7278J0403j5184k2122L658K2730P352
$$ -6698 -15153 -1273 11407 3309 -9923 -8737 8541 18944 3760 -18362 -14704 8026 15378
429A5378j6985j4864Q006K2774N748k4228k2328J0512K6286O733j5359j4631M460
$$ 15378 -1607 -16471 -8465 14309 20057 -4171 -26499 -15987 10299 17032 1673 -12958 -8498
442h498J4786P86j6325o518J4868J3369n189j3997n243Q502J1345l305j1217M85
$$ -8498 6288 7074 -9251 -15769 -901 12468 7279 -6718 -11961 -3459 7886 4581 -6636 -6151
456f151Q975J513n404q64N068M191m906j1136l31J5002R286q766j1683M92R103
$$ -6151 2824 4337 -1067 -1931 3137 7328 2422 -8714 -9045 5957 15243 6477 -5206 -4714 4389
471D389M686q020r638N862J5516J220j4666r748O042J2396K677j1674j0228P825
$$ 4389 9075 1055 -8583 -2721 12795 14015 -651 -10399 -4357 8039 10716 -958 -11186 -3361
485c361J4309M83j1746q699N80Q181O067l777m086L034K861m241m687j657L044
$$ -3361 10948 11431 -315 -9014 -8434 -253 5814 2037 -2049 985 3846 -395 -5082 -6739 -3695
500c695O573M406l339n153k082j303J911N999J080m129k093J373K431K479j936
$$ -3695 2878 7284 3945 -1208 -3290 -4593 -2682 3317 4397 268 -1825 -452 1979 4458 2522
515B522o268j99N136K435j155j312j218L47J587k921l466J881M327J712m54k500
$$ 2522 -3746 -3945 1191 3626 2471 1159 -59 288 1875 -1046 -4512 -2631 1696 3408 2954 454
531D54n915j663M921M465k82l574n030J44P929L508p239o693Q52O655N730k569
$$ 454 -5461 -7124 -2203 2262 1980 -1594 -6624 -6480 1449 4957 -2282 -8975 -8123 -1468 4262 1693
547A693p861L72R004J809r021p073M467J1814O901p240j1948r82R467M127l602
$$ 1693 -6168 -5796 3208 5017 -4004 -11077 -6610 5204 12105 4865 -7083 -8065 1402 5529 1927
562A927l116R40N317K287o997m710M866M949k458m023J635L576J705l311n794
$$ 1927 -1189 -249 5068 7355 358 -4352 514 5463 3005 -1018 617 4193 5898 2587 -3207
577c207J640N245j251n370J516P150K018o500r777j700J2711Q872p497j1380J341
$$ -3207 -1567 3678 2427 -2943 -1427 5723 7741 1241 -8536 -10236 2475 11347 3850 -7530 -6189
592f189R429L712p049r272K829J2696L472j1044p778N742J0081J488r279q932
$$ -6189 3240 6952 -97 -9369 -6540 6156 9628 -1416 -9194 -3452 6629 8117 -1162 -10094
606a0094N115J2647J360q563m809L454L392o52m220p70O814L760o066n948K041
$$ -10094 -4979 7668 9028 465 -4344 -890 2502 1850 -2370 -3140 3674 7434 1368 -4580 -2539
621b539L999k28k659j716K818M615l774p184J564P582M09p384m532L957R371L120
$$ -2539 1460 1232 -1427 -3143 -325 4290 516 -6668 -5104 2478 2887 -4497 -9029 -5072 4299 7419
637G419j0752r534M405R553K252n976m132L139P415n72j0090l647P803Q163r05
$$ 7419 -3333 -12867 -8462 1091 3343 -2633 -6765 -3626 3789 3217 -6873 -10520 -2717 5446 4541
652D541o003m102K647N965j41m817k47K696R39K70O75k99o4j313k254L24N589
$$ 4541 -1462 -5564 -2917 3048 2907 -1910 -2157 539 1478 1748 2423 2124 2060 747 -1507 -1183 4406
669D406J089m038j370K195J222j852l559j078N859N293l997p237m03M512L808
$$ 4406 5495 1457 87 2282 3504 1652 -1907 -2985 2874 8167 4170 -3067 -3470 1042 4850
684D850j350n298k476N127N119k343m359n51R81J293Q7j125M36L353j55k414j349
$$ 4850 3500 -1798 -4274 853 5972 3629 -730 -1281 -300 993 1080 -45 391 3744 3589 1175 -174
701a74m94j33J780L224K05j464k157k757J137M823J79m483j199K510K876J99l937
$$ -174 -668 -801 979 4203 4408 2944 787 -1970 -833 3990 4169 -314 -1513 997 3873 4072 135
718A35m149K492M825j255l968l45L030K137j209o059l117M919N089q90l792j183
$$ 135 -4014 -1522 3303 2048 -1920 -2265 765 2902 1693 -4366 -7483 -2564 2525 1635 -2157 -3340
734c340l0R62L82j548L76K633j031j911R27J387j018j085o05R31K472L72l233
$$ -3340 -3370 -2408 -2026 -3574 -3198 -565 -1596 -3507 -2580 -1193 -2211 -3296 -3901 -2970 -498 -126 -3359
751c359k99M440J073m364l352J089N553N088l410p368j53N810K067k657l172N53
$$ -3359 -3658 782 1855 -2509 -5861 -4772 781 5869 2459 -4909 -5062 748 2815 158 -3014 -2461
767b461M419K654l903n263K197M533J95k262j944L65L350J281k997k193J569m1
$$ -2461 1958 4612 709 -4554 -2357 2176 2371 109 -1835 -1470 1880 3161 164 -2029 -460 -501
783e01m66J848J593M46j596l199j356M217L291k480l015J883K511M89k986l534
$$ -501 -967 881 2474 2920 1324 -1875 -3231 986 4277 1797 -1218 665 3176 3665 679 -2855
799b855J615O493R12n574k980L217M139P51m382m740K768N523O43l799j967J001
$$ -2855 -1240 5253 6165 591 -2389 828 4967 5718 1336 -3404 -636 4887 5530 1731 -236 765
815G65J398J8k370j272L820K228l043k641J186K67l21K30o1N48Q48j829k495K163
$$ 765 2163 2181 -189 -1461 2359 4587 1544 -1097 89 356 35 265 204 752 1600 -229 -2724 -561
833e61K657j759l353o95K252M035K12n079k625L295K768k137k140K46L334K966
$$ -561 2096 337 -3016 -3711 -1459 2576 2788 -2291 -4916 -1621 1147 -990 -3130 -2884 450 3416
849C416k795n842k08N244K599k012k782o45J826K865j543l335Q58K624n27n83
$$ 3416 621 -5221 -5429 -185 2414 402 -2380 -3025 -1199 1666 123 -3212 -2354 270 -257 -840
865h40M38M4M75j27k607J53K932K38j605M57J400J50k099k102M51M204K700l783
$$ -840 -402 -358 117 -10 -2617 -2464 468 706 -899 -442 958 1108 -991 -3093 -2642 1562 4262 479
883D79m115J515L725R74k128l573O68M780J679l781k631J792K406M04k042k885
$$ 479 -3636 -2121 1604 2578 450 -3123 -2455 2325 4004 223 -2408 -616 1790 2194 152 -2733
899b733K216M004J22l798j018Q70M14N89N87q15R22j55j700l28K329k27j856J71
$$ -2733 -517 3487 3609 -189 -1207 -337 77 666 1253 438 1360 1205 -495 -823 1506 1279 -577 -406
917d06R01J278O79k620k222J758L267j276k905m7K034K328l60m183k650L603L352
$$ -406 495 1773 2452 -168 -2390 -632 2635 1359 -1546 -1593 441 2769 2409 -1774 -4424 -821 2531
934B531n98k254j231J68K342J17l151l63K986Q62j790p12j89j2R14o3r66L89R21
$$ 2531 1933 -321 -1552 -1384 958 1075 -2076 -2439 547 1409 -381 -1093 -1282 -1294 -380 -443 -1409 -1020 -99
953i9r30j51K034j048j276r88J41J959K611j306l450L54K562l1j209p34J34K777
$$ -99 -1029 -1180 854 -194 -1470 -2458 -2317 -358 2253 947 -2503 -2149 413 382 -827 -1561 -1427 1350
971A350J446l012k680J954K323J72j218k054L32L389R02k360j507R79L03k71Q42
$$ 1350 2796 -216 -2896 -942 1381 1553 335 -1719 -1387 2002 2904 544 -963 16 319 48 890
988H90K69m15N81r70j215J403Q38r89n39J914L62r11j340j277J231L374j197l311
$$ 890 1159 744 1325 355 -860 543 1381 392 -147 1767 2129 1218 -122 -1399 -168 3206 2009 -1302
1006a302l4K366J898m00k967j975K248L686j414k659L35J384P81q20j951n50K705
$$ -1302 -1336 1030 2928 2528 -439 -2414 -166 3520 2106 -553 -218 1166 1947 1127 -824 -1374 1331
1023A331J657j835j552q0L73Q01m7p27O0J139j126j265J182Q92r17j355l96J088
$$ 1331 2988 1153 -399 -479 -106 695 648 -79 -19 1120 -6 -1271 -89 803 -114 -1469 -1865 -777
1041g77J970o40k430p96K446P22k221j140N78K519J928k721l750M30M046N56k032
$$ -777 1193 553 -1877 -2673 -227 495 -1726 -2866 -2288 231 2159 -562 -4312 -3882 164 720 -1312
1058a312j499j08K369J458k272k118J656J819l74r69j40L32J558o9j874k02J358
$$ -1312 -2811 -2919 -550 908 -1364 -3482 -1826 -7 -381 -1350 -1490 -1158 400 331 -1543 -1745 -387
1075c87J72p19J082L62k46p71q58l27K633J280k303j317J280J235J03r27k043
$$ -387 -215 -934 148 510 264 -507 -1365 -1692 941 2221 -82 -1399 -119 1116 1219 292 -1751
1092a751Q95K993mk751p07J947J129kj974j719J936K980o75k402l76R08M97K25
$$ -1751 -856 2137 2133 -618 -1325 622 1751 1749 -225 -1944 -8 2972 2297 -105 -481 427 924 1149
1110A149m67n68J502M90j306n77J295Q5o49M69j10K57P26j173r16J379J298j787
$$ 1149 682 114 1616 2106 800 223 1518 1603 954 1423 1313 1570 2296 1123 207 1586 2884 1097
1128A097j012K85J421J252p67l154o67K591J447j499j711Q81N94J089j494k353
$$ 1097 85 370 1791 3043 2276 -878 -1545 1046 2493 994 -717 164 758 1847 353 -2000
1144b000P07K366Q7j488q12m4R79M71o28j485P69J010q49j00J102m91r35N9m85
$$ -2000 -1293 1073 1160 -328 -1140 -1184 -205 266 -362 -1847 -1078 -68 -917 -1017 85 -406 -1341 -1282 -1767
1163a767J195J317j118j483P08J170m21r86m48K17J987P40k487j414J728J458
$$ -1767 -572 745 -373 -1856 -1148 22 -399 -1385 -1833 -1616 371 1111 -1376 -2790 -1062 396
1179C96j51j416j103N21K668j46k330l11J135L83k84p2r84R92J482j006j389K28
$$ 396 245 -1171 -2274 -1753 915 769 -1561 -1872 -737 -354 -638 -710 -1694 -702 780 -226 -1615 -1387
1197a387J168k59N7K50k03M1K73j000O96J683q28j261K34J349K00N30j601r73
$$ -1387 -219 -478 -421 -171 -374 -333 -60 -1060 -364 1319 491 -770 -536 813 1013 1543 -58 -1031
1215a031J416J832j107j359P13J047M57p08j932m1K129J191j210j485M89J58O94
$$ -1031 385 2217 1110 -249 464 1511 1968 1260 -672 -713 1416 2607 1397 -88 401 559 1253
1232A253l89o06j45J539o57q29N51O7l22k12J9n31J123J11j240L23J055m82j082
$$ 1253 864 258 113 1652 995 166 717 784 462 250 269 -262 861 972 -268 55 1110 628 -454
1251d54k42O38J003N15j384j759R70J857m88r37k00O0J017O32j486r75J349N33
$$ -454 -696 -58 945 1460 76 -1683 -713 1144 656 -281 -481 -421 596 1228 -258 -1233 116 649
1269F49l36q06J1K21Q16K26j388k74P33j01k68O74j69l76J1l12m05J412L0j268
$$ 649 313 -493 -482 -261 555 781 -607 -881 -148 -249 -517 157 -12 -388 -377 -689 -1094 318 348 -920
1289i20k28J167L35o09n86n06Q16J470o97j842M23J298L94m38j230l95J572J293
$$ -920 -1148 19 354 -255 -841 -1347 -531 939 242 -1600 -1177 121 515 77 -1153 -1548 24 1317
1307A317j243j340P62O64p9k49n20J25J425Qj212l74O75L58m98N21j82L29P2m57
$$ 1317 74 -1266 -504 160 81 -168 -688 -563 862 870 -342 -716 -41 317 -181 340 158 487 559 102
1327A02o86J221N96j520m08N50J230M42r25j622K17J924j35j374k08P19P23K40
$$ 102 -584 637 1233 -287 -695 -145 1085 1527 602 -1020 -803 1121 986 -388 -596 123 846 1086
1345A086j294j531J323J634m78j159l1K97O63M57j263o15Q30Q36q97r0K41p3L45
$$ 1086 -208 -1739 -416 1218 740 -419 -450 -153 510 967 -296 -911 -81 755 -142 -232 9 -64 281
1364B81J2q72K65R80n40n51M91M98m93l62k87k3J284l2j622M7P36P68l84r18k75
$$ 281 293 -579 -314 666 126 -425 66 564 71 -291 -578 -601 683 651 -971 -924 -188 580 196 -722 -997
1385i97N58J358k47j543K8J235J1o54m64k18J038P50m66j216J92N89J25L38m48
$$ -997 -439 919 672 -871 -843 392 403 -251 -715 -933 105 855 389 -827 -635 -46 79 417 -31
1404c1k55N77m9n43K16O24j66o99O65J8K1K07q25qP54M76j015m87Q66N02m90K1
$$ -31 -286 291 242 -301 -85 539 373 -326 339 357 378 585 -240 -248 506 982 -33 -520 346 848 358 379
1426C79j085M89J188L69j036n35N06J7K54j57p51M74Q42o23m51K88Q7k00L95l24
$$ 379 -706 -217 971 1340 304 -231 275 292 546 389 -362 112 954 331 -120 168 255 55 450 126
1446A26m22P22k15o29N43M05o61m92P1P19L70J67r67n94Q98M34l16o02k96K88
$$ 126 -296 426 211 -418 125 530 -131 -623 -552 167 537 704 -263 -857 41 475 159 -443 -739 -451
1466d51P43L19j695j13J490K13p49l17j47O34N39l37j063K74Q52l29k90L72j17
$$ -451 292 611 -1084 -1197 293 506 -243 -560 -707 -73 466 129 -934 -660 192 -137 -427 -55 -172
1485a72R8M1m92j63P89K08j077M98L11L5m99L5k93O42Q84j044n24M82O62N0l25
$$ -172 -74 -33 -525 -688 101 309 -768 -270 41 76 -423 -388 -681 -39 845 -199 -723 -241 421 471 146
1506A46q17k05J342L93r93n09N84P18k14l07q30M77Q94L81j061k11L54j8m4N24
$$ 146 -671 -876 466 859 -134 -643 -59 659 445 138 -692 -215 679 1060 -1 -212 142 124 80 604
1526F04n48j09J183q55k00K12J02k02j86M75j28J74o8p25L40O64j85m61J0K25
$$ 604 56 -53 1130 275 75 287 389 187 1 476 348 522 454 -271 69 733 548 87 97 322
1546C22J87L46j078p92Q61P30k49l11N0j07K54J49n84m52P96M02r81M03K04j63
$$ 322 509 855 -223 -1015 -154 576 327 16 66 -41 213 362 -222 -674 122 524 -457 -54 150 -13
1566a3J42k5p00L41J27K40k13L01p7o23J58K21k77R03l04p45J49L23K85p35j73
$$ -13 129 104 -596 -255 -128 112 -101 200 123 -500 -342 -121 -398 505 201 -544 -395 -72 213 -522 -695
1587f95N67l7N12n49n52N68N88l36o55o1r8J127L8q12j24M13m1m9L69k19RJ34
$$ -695 -128 -165 347 -202 -754 -186 402 66 -589 -650 -748 379 417 -395 -519 -106 -147 -196 173 -46 -37 97
1609I7l00l10P75p5m77O9M35l21O63j67n56j18N24L33j204K53P59j42M00m65p04
$$ 97 -203 -513 262 187 -290 -221 214 -107 556 389 -167 -285 239 572 -632 -379 380 238 638 173 -531
1630e31O59O77k66o62Q6N86n1j5o82j73O22M61o43n13L51L39K13j8m03l22O43
$$ -531 128 805 539 -123 -37 549 498 483 -199 -372 250 711 68 -445 -94 245 458 440 37 -285 358
1651C58L7o38N1O97m98k21K4j55O03J97o66j07M84L47n14k59P7K02L64j24j171
$$ 358 395 -243 -192 505 7 -214 -190 -345 258 455 -211 -318 166 513 -1 -260 -183 19 383 259 -912
1672i12P9P75J78j40k97j92M7R78m22q06J60R36qo96M4j02N59J50q68k21N66L72
$$ -912 -833 -58 120 -20 -317 -509 -462 516 94 -712 -552 384 376 -320 -276 -378 181 331 -537 -758 -192 180
1694A80m62K57n2m63L71K92n28K33L76r2n24K93Q6l0k7n3j85M82O35r09l5J75
$$ 180 -282 -25 -77 -540 -169 123 -405 -172 204 112 -412 -119 -33 -63 -90 -143 -328 154 789 -120 -155 20
1716B0J28O0P6n64J36Q72M5p35Q8J59j89J53Kn39O19L58l41k12J65k10k86M80
$$ 20 148 208 284 -280 -144 728 773 38 126 285 96 249 251 -288 331 689 348 136 301 91 -195 285
1738B85J19p55N94J45l56k03Q48r44K99L03j77l8J48j2j51j64P69o20J54M0j07
$$ 285 404 -351 243 388 32 -171 677 -267 32 335 158 120 268 256 105 -59 710 90 244 284 177
1759A77n3k8l56k06P03k94k67M90l04j0M76l85l27L66l26K38k52N48k24n44L93
$$ 177 124 96 -260 -466 237 -57 -324 166 -138 -148 328 -57 -384 -18 -344 -106 -358 190 -34 -578 -185
1780a85j2jL59o49j86L76M74k77k63p1J48R0J31m94j78P58K89l11m91K62k40M56
$$ -185 -197 -198 161 -488 -674 -298 176 -101 -364 -435 -287 -197 -66 -560 -738 20 309 -2 -493 -231 -471 -15
1802a5L67o64m48N94Nj92K3J37K00K21j65k97J97L45o79j50L24M79l73L28l82
$$ -15 352 -312 -760 -166 -161 -353 -330 -193 7 228 63 -234 -37 308 -371 -521 -197 282 -91 237 -145
1823a45j33M70J41l60rJ12R0k27J13l03K81M97m25m6p8L97M0k51r4n71N28J026
$$ -145 -278 192 333 -27 -36 76 166 -61 52 -251 30 527 102 56 -22 375 415 164 70 -501 27 1053
1845A053r65k53M67N11k11k23m39J83M23n1k07j3J48M4j78j79p7K18L62m21j84
$$ 1053 88 -165 302 813 602 379 -60 123 546 495 288 275 423 467 289 110 33 251 613 192 8
1866HL60K0l08K99l75n9L56K1m12l46P09L6k02p09L59K63M00n25m99N52K08j73
$$ 8 368 388 80 379 4 -55 301 322 -90 -436 273 309 107 -602 -243 20 420 -105 -604 -52 156 -17
1888a7k77pN4K70K92n80n01O86K91m09J84k67K9M98O0o29LK55j60K6J57K9j41
$$ -17 -294 -301 -247 23 315 -265 -766 -80 211 -198 -14 -281 -252 246 306 -323 -320 -65 -225 -199 -42 -13 -154
1911a54L00p19J61O52On50R8L13k21J18Q3n85L34J3L02k47J29m03M05J4k93k40
$$ -154 146 -573 -412 240 246 -304 -206 107 -114 4 87 -498 -164 -151 151 -96 33 -370 35 49 -244 -484
1933d84M12J84j67j46k3K64k91P00l40k42K50K55m69K57M5k29P5N80n55j02K19
$$ -484 -72 112 -55 -201 -224 40 -251 449 109 -133 117 372 -97 160 205 -24 51 631 76 -26 193
1954A93l4k58j6K94j84K34n7J6j47J50l59J56j6k0M6J20q1J61N4q6q6mj57k8L19
$$ 193 159 -99 -115 179 -5 229 172 188 41 191 -168 -12 -28 -48 -2 118 37 198 252 166 80 76 -81 -109 210
1979B10J51l11p5J78l75J79L43j00l49R1K96k89L3M0k40L69N9m27p6O77n83K44
$$ 210 361 50 -25 153 -222 -43 300 200 -149 -58 238 -51 -18 22 -218 151 210 -217 -293 384 -199 45
2001D5k11L81m92J93J86n92J06P28m24l32J70L40j11J40k01k91M21j12J17m2j51
$$ 45 -166 215 -277 -84 102 -490 -384 344 -80 -412 -242 98 -13 127 -74 -365 56 -56 61 19 -132
2022a32L25k63L61o45K46J92m53j04J36N79m19K80j70j91N88J27q85J23O13p3
$$ -132 193 -70 291 -354 -108 84 -369 -473 -337 242 -177 103 -67 -258 330 457 -428 -305 308 235
2042B35j06P2r0m47P65k03k44p4J90J08j23k66K5J03M56J09o11J53K1R6J12m55
$$ 235 129 201 111 -336 429 226 -18 -92 98 206 83 -183 -158 -55 401 510 -101 52 73 169 281 -174
2064a74K3L88L6l05RK41j07R2j61o6l89M05N8k81Q5K60j74n9r3j45M16J68m02
$$ -174 -151 237 273 -32 -23 218 111 203 42 -24 -413 -8 50 -231 -146 114 -60 -119 -212 -357 59 227 -175
2087a75JL77K30k81j88J2K1O1R7k36o2R7L34l53p3j67K12L63l85l49L20K02j32
$$ -175 -174 203 433 152 -36 -24 -3 58 155 -81 -143 -46 288 -65 -138 -305 -93 270 -115 -464 -144 58 -74
2110g4K27k72J15RJ86k30l78L58k3q7p0R3L1J30K18m27OL2J00R8M4o08M00J58
$$ -74 153 -119 -4 5 191 -39 -417 -59 -82 -169 -239 -146 -115 15 233 -194 -188 -156 -56 42 86 -522 -122 36
2134C6J0j94K02q8j67K56m20N20n30P90p29L0M27R6j78L21j69q14O58M65m24j29
$$ 36 46 -148 54 -34 -201 55 -365 155 -375 415 -314 -284 143 239 61 382 213 -601 57 522 98 -31
2156c1k49L88o6j1M2k26L72%m03n4K24k03K86m8r4j7K51j65o9J35m6R7j60K15
$$ -31 -280 108 42 31 73 -153 219 219 -184 -238 -14 -217 69 21 -73 -90 161 -4 -73 62 16 113 -47 168
2180A68j71q2N19l17l18k0N03j34k7N3p1J72m09P2j26P45n54Q2n0n07K23N30k46
$$ 168 -3 -85 434 117 -201 -221 282 148 121 174 103 275 -134 -62 -188 557 3 85 35 -472 -249 281 35
2203C5l27J15K32K42l10J4k06M74K5k22m12M31J41j45l48j6p4N19j4j86l60L98
$$ 35 -292 -177 55 297 -13 1 -205 269 294 72 -340 91 232 87 -261 -277 -351 168 154 -32 -392 6
2225Fq4J97j71k55K82J00j38k28O8R3r2J87ol56M74L34r06K72m4K94K66m10n56
$$ 6 -78 119 -52 -307 -25 75 -63 -291 -223 -130 -222 -35 -41 -397 77 411 -495 -223 -267 27 293 -117 -673
2248f73N60L90J10n30j71K12M08K10n89k68J46M42p3l07l3J61L70l54j68p5M23
$$ -673 -113 277 387 -143 -314 -102 306 516 -73 -341 -195 247 174 -133 -166 -5 365 11 -157 -232 191
2269A91j6P9m19q1J24L08o5k95K75rM48n46l16K55J34J34n98K93j0O19j81n77
$$ 191 175 254 -165 -246 -122 186 121 -174 101 92 540 -6 -322 -67 67 201 -397 -104 -114 505 324 -253
2291b53J83K70K03j94k91j28L65j8k04l53K75K31M41o01j86N4M68Jm88J4j02N71
$$ -253 -70 200 403 209 -82 -210 155 137 -67 -420 -145 86 527 -74 -260 -206 262 263 -225 -211 -313 258
2313B58j16m72J4K93N90n69k59Q9J21L98j37p6n57N39J3j38j96p5K24K46k86o7
$$ 258 142 -330 -316 -23 567 -2 -261 -172 -51 347 210 134 -423 116 129 -9 -205 -280 -56 190 -96 -163
2335a63j48N28j75l09R8N4k90O21k23k37J0L74k32m8Q0O3M1K45n90m17Q98J21
$$ -163 -311 217 42 -267 -169 -115 -405 216 -7 -244 -234 140 -92 -140 -60 3 44 289 -301 -718 180 301
2357C01m40O1K25n6L26j70k81j70J81K94J16p02L96J46Q0K1l73j39M55l74J33
$$ 301 -139 -78 147 91 417 247 -34 -204 -23 271 387 -315 81 227 307 328 -45 -184 271 -103 30
2378C0l41J20J46L81m50k30K84K46l92M18j56j5o1K10O2k86L60k41p2k29J59N9
$$ 30 -311 -191 -45 336 -114 -344 -60 186 -206 212 56 41 -20 190 252 -34 326 85 13 -216 -57 2
2400BK18k38l72M41M06m85J03m38L34K34Pn65k64M66M13k32r5j16L2M05j43l68
$$ 2 220 -18 -390 51 457 -28 75 -363 -29 205 212 -353 -617 -151 262 30 -65 -181 -149 256 113 -255
2422b55k56P22N9l71k42J66K18P4k69m7m7K44K08l44q8J79J98J99k41k07m9L34
$$ -255 -511 211 270 -101 -343 -177 41 115 -154 -201 -248 -4 204 -140 -228 -49 149 348 107 -100 -149 185
2444A85r4l40k07M51J69L42p19k1K39L56n41J58J94j05K61j51l76j40M61L7l14
$$ 185 91 -249 -456 -5 164 506 -213 -234 5 361 -180 -22 172 67 328 177 -199 -339 122 159 -155
2465a55kK71J05K69o53j68K86L10mm26M7J60L46j19m20q2K39M41l42k90j6K04
$$ -155 -157 114 219 488 -165 -333 -47 263 259 -167 -120 40 386 267 -153 -235 4 445 103 -187 -203 1
2487AK37k22k30j36L86O6j38r7K43k05J19ml61L68J07om33N14j69K41Rp33L40
$$ 1 238 16 -214 -350 36 102 -36 -133 110 -95 24 20 -341 27 134 128 -305 209 40 281 290 -443 -103
2510a03K67O4j37P3l88L09J76k79j28J3M06j49l34K41l47L97L76p48J0K22K10
$$ -103 164 228 91 164 -224 85 261 -18 -146 -133 273 124 -210 31 -316 81 457 -291 -281 -59 151
2531A51Q4l37j39J7J49M5P4n28L89J69M3p1j88J37K30j56k11M4L08k07P9k80P5
$$ 151 235 -102 -241 -224 -75 -30 44 -484 -95 74 117 46 -142 -5 225 69 -142 -98 210 3 82 -198 -123
2554a23J51L32l31n02L39L37J26l26Q8k24M54k52j17M0j60M12j41k73j00K43J67
$$ -123 28 360 29 -473 -134 203 329 3 91 -133 321 69 -48 -8 -168 244 103 -170 -270 -27 140
2575A40P0j72j71K96l52M07o00J84j06P23j09m51j80M84Kq5m45L95K27Q2n27N5
$$ 140 210 38 -133 163 -189 218 -382 -198 -304 419 310 -141 -321 163 165 80 -365 30 257 339 -188 -133
2597a33J54N5l4j79K64l00N46m70j22J04P8K16K7J6j24k68P01l69l44n0K28Q4
$$ -133 21 76 42 -137 127 -173 373 -97 -219 -115 -37 179 206 222 98 -170 531 162 -182 -232 -4 80
2619H0J7j9m48N45kj9l44k01Q22k12n68P6K44J07J9k98k06M22J59q7j00l53K87
$$ 80 97 78 -370 175 173 154 -190 -391 431 219 -349 -273 -29 78 97 -201 -407 15 174 87 -13 -366 -79
2642g9L41l00k11P6L16j74J61l77O9j20M08k49k51M63l0L15n87K75L1J67k24j20
$$ -79 262 -38 -249 -173 143 -31 130 -247 -178 -298 110 -139 -390 73 43 358 -229 46 77 244 20 -100
2664a00j58Q5K49m9m70K27M8L00j9l13Q3J76k3Mj02r6J53k6J53j63m40P17j38
$$ -100 -258 -173 76 27 -443 -216 -168 132 113 -200 -117 59 36 40 -62 -158 -5 -31 122 -41 -481 236 98
2687I8n81N14j25J14j81L26l68M62k44r5J74l37K33J89j83j6n4L19L3k01N5l82
$$ 98 -483 31 -94 20 -161 165 -203 259 15 -80 94 -243 -10 179 -4 -20 -74 245 278 77 132 -250
2709b50N20j6j92l44P6L19k22pJ53m96M14P8J17n11K79J85O0j09k97q5L92j36
$$ -250 270 254 62 -282 -206 113 -109 -116 37 -459 -45 33 150 -361 -82 103 163 54 -243 -328 64 -72
2731g2r4nL33k76K17l01p2N13k95lk21L08k38J74%p9n9J17J97j53k06K69J05r6
$$ -72 -166 -171 162 -114 103 -198 -270 243 -52 -55 -276 32 -206 -32 -32 -111 -170 -53 144 -9 -215 54 159 63
2755F3j03M20l82J15j71q7r1L73j13k72K87j48NK67j6k02L8K64K4j65k28m10P01
$$ 63 -40 380 -2 113 -58 -145 -236 137 24 -248 39 -109 -104 163 147 -55 -17 247 271 106 -122 -532 169
2778A69k38M08o70L46J86j29j21j58L8J89K28k87k98M46l35J48Q2k46K26qKj10
$$ 169 -69 339 -331 15 201 72 -49 -207 -169 20 248 -39 -337 109 -226 -78 4 -242 -16 -24 -22 -132
2800a32P2J78k16j34L79l58M56j89j47l90M12m0J0J54j23K78j56K5p3l1j31L28
$$ -132 -60 118 -98 -232 147 -211 245 56 -91 -481 -69 -109 -99 55 -68 210 54 79 6 -25 -156 172
2822A72j57k11Q5J86l1l5j03O2J78jj57j31j39K1K15R4k9R9NK9J00n02K09K69
$$ 172 15 -196 -111 75 44 9 -94 -32 146 145 -12 -143 -282 -261 -46 48 19 118 123 152 252 -250 -41 228
2846B28Jj25l98N33j43p1j9jl7M63l98j61QK02L1r2l42K30p6M70l39j78L96j23
$$ 228 229 104 -294 239 96 25 6 5 -32 431 33 -128 -120 82 113 21 -321 -91 -167 303 -36 -214 182 59
2870E9L9K63m25k16R9M71l91n3L38j83K28l82j20K40k36J73K86p43P15l65L46
$$ 59 98 361 -64 -280 -181 290 -101 -154 184 1 229 -153 -273 -33 -269 -96 190 -553 162 -203 143
2891A43p3n20N76N8O8j25j02j17J48l2j48j18M90k82K43l76Q3j03O6r8R2L91j98
$$ 143 70 -450 126 184 252 127 25 -92 56 24 -124 -242 248 -34 209 -167 -84 -187 -121 -219 -127 264 66
2914F6j41o9J04j59K69R2l54p1Q7P1J40P5q3m4MJ36l2l58J50J70N9m48K29L0j57
$$ 66 -75 -144 -40 -199 70 162 -192 -263 -176 -105 35 110 27 -17 -13 123 91 -267 -117 53 112 -336 -107 -77 -234
2939b34L71m07J31K55j01J71j82rJ55k56K51j27o9N6j93J29J55ol7j17J0j5J70
$$ -234 137 -270 -139 116 15 186 4 -5 150 -106 145 18 -51 5 -188 -59 96 90 53 -64 -54 -69 101
2962A01J63l13RK85l08J04j72K37j27J78j75j38P0J41k43M61k49q0k49K87P6q9
$$ 101 264 -49 -40 245 -63 41 -131 106 -21 157 -18 -156 -86 55 -188 273 24 -56 -305 -18 58 -31
2984c1j4M0J44j73J87m55J70L58l46R6L0j56J46k98L88r9K98m02R8j72J08K11
$$ -31 -45 -5 139 -34 153 -302 -132 226 -120 -24 6 -150 -4 -302 86 -13 285 -117 -19 -191 -83 128
3006A28j04J30p0k7J29o7j07n2Q7J81p2k30N1J41Pk69J08J10m7J68o2K2j46p9
$$ 128 24 154 84 57 186 119 12 -40 47 228 156 -74 -23 118 125 -144 -36 74 27 195 133 155 9 -70
3030g0j79L40k7q1K58l18j68K58K1Q9q6j35JJ01J64j3j75k33L18L6k05j00K48
$$ -70 -249 91 64 -17 241 -77 -245 13 34 123 37 -98 -97 4 168 155 -20 -253 65 101 -104 -204 44
3053D4j59K62J92l44k42M30j73j40J45k79K46J40jl10Q2LJ82r0Q2q4K78O0j78
$$ 44 -115 147 339 -5 -247 183 10 -130 15 -264 -18 122 121 -189 -107 -104 78 -12 70 -14 264 324 146
3076A46l78K90J19k06J54j65j33M6K07k30J54J91J36k69r2N9R1j1k79K87k30K14
$$ 146 -232 58 177 -29 125 -40 -173 -127 80 -150 4 195 331 62 -30 29 120 109 -170 117 -113 101
3098A01r9p0K1n3J77n0j81K46J0j41J33j16J93l46L26k28l7J3J05J54k71K2M6
$$ 101 2 -68 -47 -100 77 27 -154 92 102 -39 94 -22 171 -175 151 -77 -114 -101 4 158 -113 -91 -45
3121d5L9Pk31M76k56R9j27J07oj98K38L69l20k63p2L25Rj49r1o0K82l8k76J76
$$ -45 -6 1 -230 246 -10 89 -38 69 63 -135 103 472 152 -111 -183 142 151 2 -89 -149 133 95 -181 -5
3145eN2J01J06m66Q1M1k32M48l30J06L36k68J02m23J82K13j03J98p6k26N7K07
$$ -5 47 148 254 -212 -131 -90 -322 126 -204 -98 238 -30 72 -351 -169 44 -59 139 63 -163 -106 101
3167A01l5r2O6l60M01l76J0M46j53J45j31l71N48j59J49k80KL14k74M5J04j94
$$ 101 66 -26 40 -320 81 -295 -285 161 8 153 22 -349 199 40 189 -91 -89 225 -49 -4 100 -94
3189i4N5j78J34NL37l21O6K39k42m07M84L14o86L06Q2j39J08l46M85j94J56j92
$$ -94 -39 -217 -83 -78 259 -62 4 243 1 -406 78 392 -294 12 94 -45 63 -283 202 8 164 -28
3211b8k44J71r2J22j3J34mq9N2n3k44L07R3j18J45p4q0J40k79J61O0k28K76j85
$$ -28 -272 -101 -193 -71 -84 50 46 -43 9 -44 -288 19 112 -6 139 65 -15 125 -154 7 67 -161 115 -70
3235g0q4N68l74k36M42m28J29J24L0l0J03k69q3K41k92K9L59l24O3K12j94p8M97
$$ -70 -154 414 40 -196 246 -182 -53 71 101 71 174 -95 -178 63 -229 -200 159 -165 -102 110 -84 -162 335
3258C35k51l6j87j00M22k02o5j02q2N51l7l50NJ84k11K6K63j74j21L58j15j87
$$ 335 84 48 -139 -239 183 -19 -84 -186 -268 283 246 -104 -99 85 -126 -100 163 -11 -132 226 111 -76
3280g6J31R7j36j34K05k99K48L07j87k63K75q6j87j05K01J95M1n07r8M91n6l05
$$ -76 55 152 16 -118 87 -212 36 343 156 -107 168 82 -105 -210 -9 186 227 -280 -378 113 57 -248
3302b48J02M47l86K24j48L17m44j36J34O4J88j12k70K10L07m25K53J85r3k07J75
$$ -248 -146 301 -85 139 -9 308 -136 -272 -138 -74 114 2 -268 -58 249 -176 77 262 169 -38 137
3323A37k08LN5mk0J4pk88K32J03J55o5k22l6O3P3Q5Nk19L42l30J05N0l31J68M42
$$ 137 -71 -68 -13 -17 -37 -23 -30 -318 -86 17 172 107 -115 -151 -88 -15 70 75 -144 198 -132 -27 23 -308 -140 302
3349C02l26O5r0N5j78M64n17K09J32j15K7j08K77k08Q9j66M1j4l3J53l13K23J34
$$ 302 -24 41 -49 6 -172 292 -225 -16 116 1 28 -80 197 -11 78 -88 -47 -61 -94 59 -254 -31 103
3372A03l31N7K49j93K63j79j95M47J04j97J14n87M56p7p4J97k30J07N3K43n70
$$ 103 -228 -171 78 -115 148 -31 -226 221 325 128 242 -345 111 34 -40 157 -73 34 87 330 -240
3393b40M22o9q5j27R1K17k97qL22k43K55l08L0jK36j51p8j4n9K8j18M41j66R6
$$ -240 182 113 28 -99 -8 209 -88 -96 226 -17 238 -70 -40 -41 195 44 -34 -48 -107 -79 -197 244 78 174
3417A74j87j56J60o5Q4j88J66k81K27L78n97M74J01l83R1j30K68j94J81J34l26
$$ 174 -13 -169 -9 -74 10 -178 -12 -293 -66 312 -285 189 290 -93 -2 -132 136 -58 123 257 -69
3438f9J43K37l18J88J1j15k97L83n67M95j35J6J24j36j94M70k16J14m21L44L3
$$ -69 74 311 -7 181 192 77 -220 163 -404 91 -44 -28 96 -40 -234 236 20 134 -287 57 90
3459I0k62K92l15m7L39k31J17M9rJ14L8J11o91K52R8K23n6k44j1J92k2k6k00l2
$$ 90 -172 120 -195 -242 97 -134 -17 32 23 137 175 286 -405 -153 -55 168 112 -132 -143 49 27 1 -199 -231
3483b31J78j15MJ87q0q1K20r1J01l1j47L84l79K07j10J75pK83m38N0j91K5K11
$$ -231 -53 -168 -164 23 -57 -138 82 -9 92 61 -86 298 -81 126 16 191 184 467 29 79 -112 -87 124
3506A24J06j31j18j42K8l9K51l32J99Q1J8J36j11j22j88L27k4r0N8k04K53n5j51
$$ 124 230 99 -19 -161 -133 -172 79 -253 -54 27 45 181 70 -52 -240 87 63 -27 31 -173 80 25 -126
3529a26N3J12m4K16l60K2J38k5j2J21j48o8J42K69k25J28l6k98M04M8l88J74K0
$$ -126 -73 39 -5 211 -149 -127 11 -14 -26 95 -53 -121 21 290 65 193 157 -141 263 311 -77 97 117
3552A17j46j34J04J35j19o0K71J33l11J1P6m5j19K49l04J91j15O7J40l48k1K46
$$ 117 -29 -163 -59 76 -43 -103 168 301 -10 1 77 32 -87 162 -142 49 -66 1 141 -207 -228 18
3574A8J9n4j4J41j46J14m7p0k23K9Q9P0J33R6j41q7J54K47k89K55l67M7K95k73
$$ 18 37 -17 -31 110 -36 78 31 -39 -262 -233 -144 -74 59 155 14 -73 81 328 39 294 -73 -26 269 -4
3598dj0j39K09k01J10kj01J51J00k27J23J06k24J45J1j85J57J97l65K06l56R7
$$ -4 -14 -153 56 -145 -35 -37 -138 13 113 -114 9 115 -109 36 47 -138 19 216 -149 57 -299 -202
3620b02LL05r6j96K18r8R7J02kk77J81K13J9k94NjK72k65J10l14J56J58L91m50
$$ -202 -199 106 10 -186 32 -66 31 133 131 -146 35 248 267 -27 -22 -23 249 -16 94 -220 -64 94 485 35
3644C5l78L22O9j48P3j00N6J53n0N8K9l34J07J25J02j25J71r7qJ67j56%j96p3
$$ 35 -343 -21 48 -100 -27 -127 -71 82 32 90 119 -215 -108 17 119 -6 165 68 60 227 71 71 -125 -198
3668a98K64o9J99n86J88K05j97L4J57J51j07K11j50q8R2J83m59m3L43K65p60K42
$$ -198 66 -3 196 -390 -202 3 -194 -160 -3 148 41 252 102 14 106 289 -170 -213 130 395 -365 -123
3690a23L91k50J46k91O2q3K71k91J66j64j09J42L06oj91J75j13k57K28J3J2J42
$$ -123 268 18 164 -127 -65 -148 123 -168 -2 -166 -275 -133 173 167 -24 151 38 -219 9 22 34 176
3712A76k55P9j10J0qJK3K34M8p6M5l13K39QJ28m06M4J20m62N77o9M3j66K60q1
$$ 176 -79 0 -110 -100 -108 -107 -84 150 198 122 167 -146 93 101 229 -177 -133 -13 -475 102 33 76 -90 170 89
3737H9j75L8J2Q1l90J28K09L1j04K17k24q4L2M6L9J2K40o8n4P1n7O7n88N13M9
$$ 89 -86 -48 -36 45 -345 -217 -8 23 -81 136 -88 -172 -140 -94 -55 -43 197 129 75 146 89 156 -432 81 130
3762A30j6k04J57k69J84N1j06J21L3qJj4O7k26j32L36K1j30j73K87p3K56l49J14
$$ 130 114 -90 67 -202 -18 33 -73 48 81 73 74 60 127 -99 -231 105 126 -4 -177 110 37 293 -56 58
3786E8J92k98k67K21R0p7m1P4K41n56N31k23L28m20K77j60k0J17k62L45pM6j94
$$ 58 250 -48 -315 -94 -4 -81 -122 -48 193 -363 168 -55 273 -147 130 -30 -50 67 -195 150 143 189 -5
3809epO5j07J47j90J69o3n2R3j21M05o65K15K41j57Mmj11L94m05K62l6J08j97
$$ -5 -12 53 -54 93 -97 72 9 -43 50 -71 334 -331 -116 125 -32 -28 -32 -143 251 -154 108 72 180 -17
3833a7j15K81l95J80O82o10l37J4M55k14L08M7l61K59O2l67K24j10j71J17j96
$$ -17 -132 149 -246 -66 616 6 -331 -317 138 -76 232 279 -82 177 239 -128 96 -14 -185 -68 -264
3854b64K31M3Qn7n0J25J15J73l84L2j00rK23k53P1l7J01l20K90K50l70%M10k13
$$ -264 -33 10 18 -39 -89 36 151 324 -60 -28 -128 -137 86 -167 -96 -133 -32 -352 -62 188 -182 -182 228 15
3878A5k0M6K34j20l07J14k01J61J42k26K36n9R3m00L20m17K75K82J8N2j70k38
$$ 15 -5 41 275 155 -152 -38 -239 -78 64 -162 74 15 108 -292 28 -389 -114 168 186 238 68 -170
3900a70L30K19l56k23L62l58K2L16J24m89M43p2p1l98k26P85l07k64L34j26j7
$$ -170 160 379 23 -200 162 -196 -174 142 266 -223 220 148 77 -321 -547 238 -69 -333 1 -125 -142
3921a42pr6K65k95K29j41J12j9L24o48P10m79M33j88J67m41R6j60K27k39M68k12
$$ -142 -149 -245 20 -275 -46 -187 -75 -94 230 -418 292 -187 246 58 225 -216 -120 -280 -53 -292 176 -36
3943c6l13O66k71j37J76J05l64N8K19j1p9J13J7l93L00j16j36M5J59J74j72k3
$$ -36 -349 317 46 -91 85 190 -174 -116 103 92 13 126 143 -250 50 -66 -202 -157 2 176 4 -19
3965a9n7p8K72j7k53M00j69M1k62n2N51j86j05o0j39P0j97J84O9n8n0p5K29j0
$$ -19 -76 -154 118 101 -152 248 79 120 -142 -194 357 171 66 6 -133 -63 -260 -76 -7 -65 -115 -190 39 29
3989B9J68j00r3N5pj27J70j37J10k0k09J75r8P6P9l37M81m17J38N6j7K30k33K39
$$ 29 197 97 4 59 52 -75 95 -42 68 48 -161 14 -84 -8 71 -266 215 -202 -64 -8 -25 205 -28 211
4013B11l04J98rl10J22K10l40L89j37j96Q2L58l84J46L6J85k38k25K55J64j61
$$ 211 -93 105 96 -214 -92 118 -222 167 30 -166 -84 274 -110 36 72 257 19 -206 49 213 52
4034E2M9J26j23j89j2J62j64J56j21J07l6l05J66J54J17j40K89m19Q9O6j08j11
$$ 52 101 227 104 -85 -97 65 -99 57 -64 43 7 -298 -132 22 139 -1 288 -131 -42 24 -84 -195
4056a95j02L29m39M48p2k36L68k25R0n6L17j52l2k51K29l9K83j32j23j75N14j55
$$ -195 -297 32 -407 41 -31 -267 101 -124 -34 -90 227 75 43 -208 21 -18 265 133 10 -165 349 194
4078A94j78O5j62Q7j33L12k90J55qK08k13m5o0qK59n5j10J13l47j29M05p4j76
$$ 194 16 81 -81 6 -127 185 -105 50 42 250 37 -8 -68 -76 183 128 18 131 -216 -345 60 -14 -190
4101a90k3K40jo5J32k89J70J17m2J99j51P4k32J17N6j52K55j59j38J22J52j75
$$ -190 -213 27 26 -39 93 -196 -26 91 49 248 97 171 -61 56 112 -40 215 56 -82 40 192 17
4123A7O7%J3j6J70j62l20M42k48q8J4K44j27J11QL0ol17J69r1J68n1J7K3j57Q3
$$ 17 84 84 97 81 251 89 -231 211 -37 -125 -111 133 6 117 125 155 149 -168 1 -90 78 27 44 67 -90 -7
4149gL4K58k22j86J34k60k8M52J49l60L4L57r5k04j03J20j29K88k59pL72l79l33
$$ -7 27 285 63 -123 11 -249 -277 175 324 -36 -2 355 260 56 -47 73 -56 232 -27 -34 338 -41 -374
4172c74K47Q7Q0O3j56NJ42j15J49l14M48k95q0QJ06j48N8k1R8j27K37Oj21J37
$$ -374 -127 -40 40 103 -53 -48 94 -21 128 -186 262 -33 -113 -105 1 -147 -89 -110 -12 -139 98 104 -17 120
4196A20p7J85l15M45n07J23J57k49j16M83m2j50M2o1j68J09j81M4M12k78L7k22
$$ 120 43 228 -87 358 -149 -26 131 -118 -234 249 207 57 99 38 -130 -21 -202 -158 254 -24 13 -209
4218b09K78M4k59K17j51p7L9oK07k6R3j84j76K64j08N6K61j36Jj02m1j7J53L0
$$ -209 69 113 -146 71 -80 -157 -118 -124 83 57 150 -34 -210 54 -54 2 263 127 128 26 -15 -32 121 151
4242A51p5j18j01p0L63n5p0R2mj77QQ7j33J30m3j01K11m7O7j34r6q2L42m75L49
$$ 151 76 -42 -143 -213 150 95 25 117 113 -64 -56 31 -102 28 -15 -116 95 48 115 -19 -115 -197 145 -330 19
4267A9L7q9K18j09K05KJ09m90K74j02k44R8Q6r4k27J37l0J80j83J48J74q1J04
$$ 19 56 -33 185 76 281 283 392 -98 176 74 -170 -72 14 -80 -307 -170 -200 -20 -203 -55 119 38 142
4290A42j57J9m2M6j80k38L31k9o4L60j93P2P2l70mL48o0K33m05J14K25j57O3k06
$$ 142 -15 4 -38 8 -172 -410 -79 -108 -172 188 -5 67 139 -231 -235 113 53 286 -119 -5 220 63 126 -80
4314h0J39k22J42m1n1j54MM49l68K65k5j53J61K84n18K07k5mj39L0L19l88j2M09
$$ -80 59 -163 -21 -62 -113 -267 -263 186 -182 83 58 -95 66 350 -168 39 14 10 -129 -99 220 -168 -180 229
4338B29j2k08klj75L75R1k84Q3k87k06K96M22m07J8J82j77J62l95J48Q6J43k62
$$ 229 217 9 7 4 -171 204 295 11 94 -193 -399 -103 319 -88 -70 112 -65 97 -298 -150 -64 79 -183
4361a83N4r6P9o7N25j91l62K41ln1J62K24j94n18M26M0j46K98l76N1m7K73l46
$$ -183 -129 -225 -146 -213 312 121 -241 0 -3 -54 108 332 138 -380 46 86 -60 238 -138 -87 -134 139 -207
4384b07Q0L86j14k03k59L16K44k58J04J42j45J4j95L86J14n07r0K91r6j05J90
$$ -207 -127 259 145 -58 -317 -1 243 -15 89 231 86 100 -95 291 405 -102 -192 99 3 -102 88
4405H8M9J42m0j89m7M4k7k0r8K16%l18J80r7j11K0J08R7j31r6K25K0k67J8L50
$$ 88 137 279 239 50 3 47 20 0 -98 118 118 -200 -20 -117 -228 -208 -100 -3 -134 -230 -5 15 -252 -234 116
4430A16j51K39j71J82L2m5J4l85K83%j48l12K81K42j74J92L3n02K73q1k22K2Q9
$$ 116 -35 204 33 215 247 202 216 -169 114 114 -34 -346 -65 177 3 195 228 -274 -1 -82 -304 -282 -193
4453a93L27l59O3J2K41pO5o5Rq2K06j92k6L1j28j91q8M00k15J01J58j16K37m36
$$ -193 134 -225 -162 -150 91 84 149 84 93 11 217 25 -1 30 -98 -289 -377 23 -192 -91 67 -49 188 -248
4477b48K58j35L09k41j5K03J15k65J53m01J93K01j47J13K13k91k1J22j48N7j4
$$ -248 10 -125 184 -57 -72 131 246 -19 134 -267 -74 127 -20 93 306 15 -6 116 -32 25 11
4498A1J82n13L68j78K8N11n00J52j1k40L70l21o3M54l50M94l27pj63K86j47j25
$$ 11 193 -320 48 -130 -102 409 -91 61 50 -190 180 -141 -204 250 -100 394 67 60 -103 183 36 -89
4520h9J06j13J57N6k48K94Mj34J51l12K57p0K47k29m54L23N0N4o8K15r5k00k2
$$ -89 17 -96 61 117 -131 163 167 33 184 -128 129 59 306 77 -377 -54 -4 50 -18 197 102 -98 -120
4543a20J7N0R8j1j34rK02J05j6N4l53J87J19k31J2J59p8nl2L58m77J60n0Kj01
$$ -120 -103 -53 45 34 -100 -109 93 198 182 236 -117 70 189 -42 -30 129 51 46 14 372 -105 55 5 7 -94
4568i4J51n4O3N9j43m9J19K07m01Q8L83k85j43J97m8J18l09K75l04J93o4J25J5
$$ -94 57 3 66 125 -18 -67 52 259 -142 -54 329 44 -99 98 50 168 -141 134 -170 23 -41 84 99
4591I9o0m9j9j10j21L81J18m4j30K56m23l0q3M06k98N9K14l4n0m5j9R3O1o8n7
$$ 99 39 -10 -29 -139 -260 121 239 195 65 321 -102 -132 -215 191 -107 -48 166 132 82 37 18 111 172 104 47
4616D7k92N9j57L47j5j02O4n2r3L52j77P8k09J5J74J69l67J97J4l3j67N2P2j1
$$ 47 -245 -186 -343 4 -11 -113 -49 -101 -194 158 -19 59 -150 -135 39 208 -159 38 52 19 -148 -96 -24 -35
4640c5L29l52J34j70P2J76m9k19N7J43j24M3K2R3j11J44k43m19M57o4J01J34j08
$$ -35 294 -58 76 -94 -22 154 105 -114 -57 86 -38 5 27 120 9 153 -90 -509 -52 -116 -15 119 11
4663A1k6J88p0m8LP7l82J26Q4J95k60J30o2J51R5m7l1Nl5P8lk55J26l22L10o4
$$ 11 -15 173 103 55 58 135 -247 -121 -37 158 -102 28 -34 117 212 165 134 139 104 182 179 -76 50 -272 38 -26
4689b6K9P2K03k91M5J1j42K0l8k1M9N00m79r9J69j98n4L26R3Ml62K85k64Q6J30
$$ -26 3 75 278 -13 32 43 -99 -79 -117 -138 -89 411 -68 -167 2 -196 -250 76 169 173 -189 96 -168 -82 48
4714D8p7k41M46m7k31P6l35L80j78j3K32k41O9k43K37J5K95j99L6j55K27k83L22
$$ 48 -29 -270 176 129 -102 -26 -361 19 -159 -172 60 -181 -112 -355 -118 -103 192 -7 29 -126 101 -182 140
4737A40pk31J36l10N5J40J6K13k29j29j73M30j0j2P0j45R6k97R7N4K0L5J33k00
$$ 140 133 -98 38 -272 -217 -77 -61 152 -77 -206 -379 51 41 29 99 -46 50 -247 -150 -96 -76 -41 92 -108
4761a08J89k33pJ76K03j47r5k70L55N0j72K37p7j6q9P8l5r7J44k44J45K94n26
$$ -108 81 -152 -159 17 220 73 -22 -292 63 113 -59 178 101 85 -4 74 39 -58 86 -158 -13 281 -245
4784b45J57K66j44j81Q1M08m13K77p7k94J80j70J19k18J79J38r2p8J49n0K0n9
$$ -245 -88 178 34 -147 -66 342 -71 206 129 -165 15 -155 -36 -254 -75 63 -29 -107 42 -8 12 -47
4806d7K26m0k31K00K0l30K53r7l2P4J20o8P5k2K4j94J93l50q4K46J11K34k37J77
$$ -47 179 139 -92 108 128 -202 51 -46 -78 -4 116 48 123 101 125 -69 124 -226 -310 -64 47 281 44 221
4830B21m18L98p7j17j39M31j53N0n40M43k19N3J42n8j94k9L84k90L45j36p8J06
$$ 221 -197 201 124 7 -132 299 146 196 -344 99 -120 -67 75 17 -177 -206 178 -112 233 97 19 125
4852A25k68J6k65L35j79K08o2P7Q3L2K05k17j88K21j91n5J67m5n0O5mJ03J40l75
$$ 125 -143 -127 -392 -57 -236 -28 -90 -13 70 102 307 90 -98 123 -68 -123 44 -1 -51 14 10 113 253 -122
4876a22K49j00l3J31j40J9j0p2J89k91O31l98j08O2l0j00k19L14J06L0M3p8m7
$$ -122 127 27 -6 125 -15 4 -6 -78 111 -180 451 53 -55 7 -23 -123 -342 -28 78 108 151 73 26
4899B6O1K31r8n6k72J99o3p5K41m61L67j09o2J10J31l16J38r4m4r1M88j54j28
$$ 26 87 318 220 164 -108 91 28 -47 194 -267 100 -9 -71 39 170 -146 -8 -102 -146 -237 251 97 -31
4922c1k04O3K02K9j99K20P3J53k10o1j41J93j85j29M54j92j14P3L1k56L38L0K5
$$ -31 -235 -172 30 59 -140 80 153 306 96 35 -106 87 -98 -227 227 35 -79 -6 25 -231 107 137 162
4945A62j77k45M29K7j37p4O6K4m4K30l85L07l76K85j31N9j60L43j37l25L2K0M45
$$ 162 -15 -260 169 196 59 -15 51 75 31 261 -124 183 -193 92 -39 20 -140 203 66 -259 -227 -207 238
4968B38j94q0J08j92m8J93K37l15p6k33K86L02k08L25j37k99p4n7L10n8j47M2
$$ 238 44 -36 72 -120 -168 25 262 -53 -129 -362 -76 226 18 343 206 -93 -167 -224 86 28 -119 -77
4990g7N5p9j67L41j61q2L44L9l48J13o2L17l4j01k46K50M3l4P7p7k79j0K55J16
$$ -77 -22 -101 -268 73 -88 -170 174 213 -135 -22 -84 233 199 98 -148 102 145 111 188 111 -168 -178 77 193
5014A93m3L1k77J13m4N6o1K71k46J13q3q9J57l72J60J53j32K34j21m1j5P4j18
$$ 193 150 181 -96 17 -27 29 -32 239 -7 106 23 -66 91 -281 -121 32 -100 134 13 -28 -43 31 -87
5037h7J36R3q0j54J27O9j43J02J90k66P6P6k22O9J79r9j64n8J24P0j12K01J5K55
$$ -87 49 142 62 -92 35 104 -39 63 253 -13 63 139 -83 -14 165 66 -98 -156 -32 38 -74 127 142 397
5061C97n06j15P5K64j13l9L5J36j21J28j54n2J50J8M2q4J14k6J58l57R6j75P5
$$ 397 -109 -224 -149 115 2 -37 -2 134 13 141 -13 -65 85 103 145 61 175 149 307 -50 46 -129 -54
5084e4J18j1J10l11Q5l8M45j42l44K52j77k33J46M2O6J26OK4o8J81k78J49K6Q6
$$ -54 64 53 163 -148 -63 -101 344 202 -142 110 -67 -300 -154 -112 -46 80 86 110 42 223 -55 94 120 206
5108B06k11J7p2O5L54m40J9OnK2J06O0J60l55K00k62L06k34N5L6K29k42J52J84
$$ 206 -5 12 -60 5 359 -81 -62 -56 -61 -39 67 127 287 -68 132 -130 176 -58 -3 33 262 20 172 356
5132C56n37L25k41J26Q1J88m23oP3Q7Pk15J98N6K0J03k49l93L09J32Rj0K59m76
$$ 356 -181 144 -97 29 110 298 -125 -131 -58 29 36 -179 19 75 95 198 -51 -444 -135 -3 6 -4 255 -221
5156b21P3K01L00j17l55K30mK8k81J26j1k13K24M2R8N1j05j32kJ89q9j15J69o4
$$ -221 -148 53 353 236 -119 111 107 135 -146 -20 -31 -244 -20 22 120 171 66 -66 -68 121 32 -83 86 22
5180B2j35L97m44J10o5J27J20k12q4J3L88k81N1R7r7k66K05q5K57j37Q1p9j97
$$ 22 -113 284 -160 -50 -115 12 132 -80 -164 -151 237 -44 7 104 7 -259 -54 -139 118 -19 62 -17 -214
5203b14J36p8K97k65J8K22J48j21k40J05q4L51l41k3p5J83k68nK05R7N3j42M47
$$ -214 -78 -156 141 -124 -106 116 264 143 -97 8 -76 275 -66 -89 -164 19 -249 -254 -49 48 101 -41 406
5226D06m77l42K22L28k44R1J44k16K34J98k44j67l7j09J14Q5J52N9M2L34p33J90
$$ 406 -71 -413 -191 137 -107 -16 128 -88 146 344 100 -67 -104 -213 -99 -14 138 197 239 573 -160 30
5248C0o3R6k50J96l66K69L04m26K79L04o13L22J44l59k0k8J20J80l51L76k6k2
$$ 30 -33 63 -187 9 -357 -88 216 -210 69 373 -240 82 226 -133 -153 -181 -61 119 -232 144 118 96
5270I6m9p0J77l20J16k2J8L8K47k46J18j06o8Q2j02j45K54j46j07J13K28j6k9
$$ 96 47 -23 154 -166 -50 -72 -54 -16 231 -15 103 -3 -71 11 -91 -236 18 -128 -235 -122 106 90 61
5293F1j24J18J89j42l9J16K9k72J59j1j52r9j38J64n4P3L43j87O7k20L4Q9m0J93
$$ 61 -63 55 244 102 63 179 208 -64 95 84 -68 -167 -305 -141 -195 -122 221 34 101 -119 -85 4 -36 157
5317A57k02n7J58r4K13j73k18K92j40m0j33J80m1J79K14k31j24m6M77l34K21k12
$$ 157 -45 -102 56 -38 175 2 -216 76 -64 -104 -237 -57 -98 81 295 64 -60 -106 371 37 258 46
5339D6l24K64J98j89m4m9R0j88O8J42O1Mj88Q3K24j45o5P7j41K03j07K9j34m4
$$ 46 -278 -14 184 -5 -49 -98 -8 -196 -128 14 75 79 -109 -26 198 53 -12 65 -76 127 20 49 -85 -129
5363a29j14N72j85j91m7J97j69Q4k05J10J15J16m7M9l02K58l97N00k31n1J69j58
$$ -129 -243 329 144 -47 -94 103 -66 18 -187 -77 38 154 107 156 -146 112 -285 215 -16 -67 102 -56
5385e6kk39M19l68K66K42n70o3M07j45lM6QmK71k31j84J77L3j33J01n3l14L88
$$ -56 -58 -297 122 -246 20 262 -308 -371 36 -109 -112 -66 -58 -62 209 -22 -206 -29 4 -129 -28 -81 -395 -7
5409gM4P3J28j72j24J51j2k5l3J24j15j02M41r8k17L1o5r2M97k64lj65J1J82k65
$$ -7 37 110 238 66 -58 93 81 56 23 147 32 -70 371 273 56 87 22 -70 427 163 160 -5 6 188 -77
5434g7J07l14M93l69K69k2o5O2l1l92K85lJ4K38j96k38J30K35k62N06j45l41J22
$$ -77 30 -284 209 -160 109 87 22 84 53 -339 -54 -57 -43 195 -1 -239 -109 126 -136 370 225 -116 6
5457Fl3m8J84j34j4j23j6L68j05j42K56m72K02L34k92J86j32JP3n1Ol54L37o3
$$ 6 -27 -75 109 -25 -39 -162 -178 190 85 -57 199 -273 -71 263 -29 157 25 26 99 48 54 -300 37 -26
5481b6M2R8k28J4L2J71J99k11l05R0J6J2J53j28K21j64JR5J99m05K87J88l85J29
$$ -26 16 114 -114 -100 -68 103 302 91 -214 -124 -108 -96 57 -71 150 -14 -13 82 281 -124 163 351 -34 95
5505I5J36k72J36k15J76l30K42J21j86o5K19l8J30O2m57M89l81K20O6k0L07l53
$$ 95 231 -41 95 -120 56 -274 -32 89 -97 -162 57 19 149 211 -246 243 -138 82 148 128 435 82
5527H2k0J73k28J46k93J38O4Qk29QK39j7l2m7QJ66n2j32r8L77K1l39r8J35J72
$$ 82 62 235 7 153 -140 -2 62 70 -159 -151 88 71 39 -8 0 166 114 -18 -116 261 282 -57 -155 -20 152
5552A52l48M46j21k32q8M1L28j68J31j29P6j73qK05p9K10m65L60J84l41j3J47
$$ 152 -196 250 129 -103 -191 -150 178 10 141 12 88 -85 -93 112 33 243 -222 138 322 -19 -32 115
5574A15q6j47q0k8K38L9J26l18J16n5J0J34J74m99K88l80K65O0O1J53k60M63l42
$$ 115 29 -118 -198 -226 12 51 177 -141 -25 -80 -70 64 238 -261 27 -353 -88 -28 33 186 -74 389 47
5597D7j53K81J58l67P7l33P4P0K3k8M10Pk73%K70l58P2j03MJ57k46l2K65r2J41
$$ 47 -106 175 333 -34 43 -290 -216 -146 -123 -151 259 266 -7 -7 263 -95 -23 -126 -122 35 -211 -243 22 -70 71
5622G1k39K07k46J53J47j5r1j53J04M1J53o9J34j97J9J01K5m08M32j29n1L86n29
$$ 71 -168 39 -207 -54 93 78 -13 -166 -62 -21 132 63 197 0 19 120 145 -263 169 40 -11 375 -154
5645a54K7J0L8N6L5J6k04J9J21QN9k48K86r5M4j47j8N7R3J62l85O5j1K60Jl07
$$ -154 -127 -117 -79 -23 12 28 -176 -157 -36 -28 31 -217 69 -26 18 -129 -147 -90 3 165 -220 -155 -166 94 95 -212
5671b12J30J59j3O5p2j88j55J13L17n3L47m93M5j75J43K06k57L90m09K36K1k10
$$ -212 -82 77 64 129 57 -131 -286 -173 144 91 438 -55 -10 -185 -42 164 -93 297 -112 124 145 -65
5693f5k4R6k52L74l30L44o7r4N7J59j46O0J34j39j93O6Q2j06k39J75Q7j27R3M6
$$ -65 -89 7 -245 129 -201 143 76 -18 39 198 52 112 246 107 -86 -20 62 -44 -283 -108 -21 -148 -55 -9
5717ij3j32J38K12Ol81J61k5j63J10L16l79R1k4Q9J94j9n11N96l18q3ko4J37m
$$ -9 -22 -154 -16 196 202 -179 -18 -43 -206 -96 220 -159 -68 -92 -3 191 172 -339 257 -61 -144 -146 -210 -73 -77
5742g7Q7J58k18n7Q2K66m20J88J7n2no5p1K4K55j30j71J63J74l07L51k9m96O16
$$ -77 10 168 -50 -107 -25 241 -179 9 26 -26 -31 -96 -167 -143 112 -18 -189 -26 148 -159 192 163 -333 283
5766B83j35K35k72mo6OP7j59Mn7M26l40j05L74j68l05j8K65j53PK74j26l0L20
$$ 283 148 383 111 107 41 47 124 -35 -31 -88 338 -2 -107 267 99 -206 -224 41 -112 -105 169 43 13 333
5790C33n27L27p1j97m5L83l25J92l2j20J69k4L7l73M77j74j32K98k96J05j35K0
$$ 333 -194 133 62 -135 -180 203 -122 70 38 -82 87 63 100 -273 204 30 -102 196 -100 5 -130 -110
5812a10K43n05M47l64J61K09l7L17m43K31k16R5J74l19K43o4Jj21N2J4J45%k63
$$ -110 133 -372 75 -289 -128 81 44 361 -82 149 -67 28 202 -117 126 62 63 -58 -6 8 153 153 -110
5835a10L9j69J56Q5k4j04j02L65j44K02k44M09m67L16j46pk08J77P3j89k21O50
$$ -110 -71 -240 -84 1 -23 -127 -229 136 -8 194 -50 359 -108 208 62 55 -153 24 97 -92 -313 337
5857C37m83J9l0J9K72j94J15j77J7o8J86l3N9j47j8L06l24K61m80L25q2L44k60
$$ 337 -146 -127 -157 -138 134 -60 55 -122 -105 -173 13 -20 39 -108 -126 180 -144 117 -363 -38 -120 224 -36
5880c6J19j33M6k08N2J83J47k18M6Pj59j18J91J8j73L24l1j89l3M41l70J21O7
$$ -36 83 -50 -4 -212 -160 23 170 -48 -2 5 -154 -272 -81 -63 -236 88 57 -132 -165 276 -94 27 94
5903I4L0j86R0j7R8m1j36%Q0P8k02k16M00M1k64J86j15J70j78K07j58J28k83J49
$$ 94 124 -62 28 11 109 68 -68 -68 12 90 -112 -328 72 113 -151 35 -80 90 -88 119 -39 89 -194 -45
5927d5J99l82L31o3m1J16j30J44j47k40L18k06N71n65K67J27l44R2j66M98m94
$$ -45 154 -228 103 40 -1 115 -15 129 -18 -258 60 -146 425 -140 127 254 -90 2 -164 334 -160
5948a60P9K4J3N1P9r5J89j42OJ07K9j67J17k58J16J60k11J62ko8q4ML9N7l3N6
$$ -160 -81 -57 -44 7 86 -9 180 38 44 151 180 13 130 -128 -12 148 -63 99 97 29 -55 -51 -12 45 12 68
5974F8J11K4k99M9j97L0j1K82NJ06r6m0j08K83l44L67j82k64K16o2L0N1J15k03
$$ 68 179 203 -96 -47 -244 -214 -225 57 62 168 72 32 -76 207 -137 230 48 -216 0 -62 -32 19 134 -69
5998f9J41J14q2j5K77m16n9M20k17M5k9%k74r6R7j0K04j06O8L1l16J06L01m80
$$ -69 72 186 104 89 366 -50 -109 311 94 139 110 110 -164 -260 -163 -173 31 -75 -7 24 -292 -186 115 -365
6022c65P08n09J11K36r2J06l36P4mJ11j40K2L66l97K33j52K79n29M03o6j87L5
$$ -365 343 -166 -55 181 89 195 -141 -67 -71 40 -100 -78 288 -109 124 -28 251 -278 125 59 -128 -93
6044i3j96J55J24n8J62p7n8J10j27j51M33k02j00J26J1O5j78k85L94K15m90L59
$$ -93 -289 -134 -10 -68 94 17 -41 69 -58 -209 224 22 -78 48 59 124 -54 -339 55 270 -220 139
6066A39j3O3j64K35P6j40m0l26K52j79j03J80J50k55J2L6K91j99Q4J0k0l17Q7
$$ 139 126 189 25 260 336 196 156 -170 82 -97 -200 -20 130 -125 -113 -77 214 15 99 109 89 -228 -141
6089a41L11k8j30l7K58l66Q5o4K71o7j83M51j01k44J90l67J45K13j28J40N8k89
$$ -141 170 142 12 -25 233 -133 -48 -112 159 92 -91 360 259 15 205 -162 -17 196 68 208 266 -23
6111b3P9K6n7l43L76K21j88QL2l77J21P2%J72o5J63j0l16o1J85K02l74K96m48
$$ -23 56 82 25 -318 58 279 91 99 131 -246 -125 -53 -53 119 54 217 207 -109 -170 15 217 -157 139 -309
6135c09K45J88k64L64J3k35P0k13J06M18m27O4J35j97K29l98P9K45q2O0o0O8m15
$$ -309 -64 124 -140 224 237 2 72 -141 -35 383 -44 20 155 -42 187 -211 -132 113 31 91 31 99 -316
6158c16L14K8p8J21O5J0j55j12M4K21M9oj80j79J95o4K32k47m1m7k8M9J03L37
$$ -316 -2 26 -52 69 134 144 -11 -123 -79 142 191 185 5 -174 21 -43 189 -58 -99 -146 -174 -125 -22 315
6182C15m98J33K97j58j68K38k41o7n4M08j39k38K85j64K58j47kr7NJ14m3j0Q7
$$ 315 -183 -50 247 89 -79 159 -82 -149 -203 205 66 -172 113 -51 207 60 58 -39 -34 80 37 27 114
6205A14k92K46K88k66j66J16j87K09j20L48l53O5M7l4J19j22l2J84p6k34J96L7
$$ 114 -178 68 356 90 -76 40 -147 62 -58 290 -63 2 49 15 134 12 -20 164 88 -146 50 87
6227H7k30O5L96m01J91J79k85n2j12J95l51M13j77J6k60L78Q4j74Q3L87o36K01
$$ 87 -143 -78 318 -83 108 287 2 -50 -162 33 -318 95 -82 -66 -326 52 136 -38 45 432 -204 -3
6249cM4jj14k81L63J95r0P6n4Q9j34p6P4Lq7L6K0j23J95J01Q8m25o8m2M78J04
$$ -3 41 40 -74 -355 8 203 113 189 135 224 90 14 88 91 4 40 60 -63 132 233 321 -104 -172 -214 264 368
6275C68q2k89j67M83m79J27K20k81K55m13K9M80k45j68L5M52j76j25j06L03j40
$$ 368 286 -3 -170 313 -166 -39 181 -100 155 -258 -229 251 6 -162 -127 325 149 24 -82 221 81
6296H1j57k4o9M26j87RJ25N9o4k84J10j27J26p5J25j20r4O7R7j03J02J04j79k0
$$ 81 -76 -100 -169 257 70 79 204 263 199 -85 25 -102 24 -51 74 -46 -140 -73 24 -79 23 127 -52 -72
6320g2O6Q0J06P8l53o9K59j33k36J78J26J30o8J69m79J33K83k78J45j44j52M13
$$ -72 -6 74 180 258 -95 -164 95 -38 -274 -96 30 160 92 261 -218 -85 198 -80 65 -79 -231 182
6342A82n2QN3j43P4l37K17k93M06j42M8j25J83J80j73k73M03j47q5J51n0J37k89
$$ 182 130 138 191 48 122 -215 2 -291 115 -27 21 -104 79 259 86 -187 216 69 -16 135 85 222 -67
6365f7M8M8K2k17J37o2N3j33K05j06k5L70j65p8k58K60L7p6J19L0p6k29J24J42
$$ -67 -19 29 51 -166 -29 -91 -38 -171 34 -72 -97 273 108 30 -228 32 69 -7 112 142 66 -163 -39 103
6389A03L7l89K30J47k02K08j49j32Q0M7m7K52k31J28j98K66j35P3J68l42K1m7
$$ 103 140 -249 -19 128 -74 134 -15 -147 -67 -20 -67 185 -46 82 -116 150 15 88 256 -86 -65 -112
6411a12L30k05K32k71J74nj76L51l00J86l68K66k44L85m87K28L9J52k26k9n4K03
$$ -112 218 13 245 -26 148 143 -33 318 18 204 -164 102 -142 243 -244 -16 23 175 -51 -80 -134 69
6433F9J53j74m1J1o3j41O7j62K08J24M7J2m61K90o4M9n3K34J6M8l27O5J3J83k22
$$ 69 222 48 7 18 -45 -186 -119 -281 -73 51 98 110 -351 -61 -125 -76 -129 105 121 169 -158 -93 -80 103 -119
6458a19O7mJ51J6k68P1L36m33K89k33R5k87K89K64j89N6o8j03J07L6N0j03j31
$$ -119 -52 -56 95 111 -157 -86 250 -183 106 -127 -32 -319 -30 234 45 101 33 -70 37 73 123 20 -111
6481a11L23k99j46K90K51m71J44k2M4k78L01j77K13J67m64q1N66k78M0j31J2n3
$$ -111 212 -87 -233 57 308 -163 -19 -41 3 -275 26 -151 62 229 -235 -316 250 -28 12 -119 -107 -160
6503a60K10q7P0m0j70j4K23M4j76L4LJ03k46K24j58J51j93L24J8k6j20j41J87
$$ -160 50 -37 33 -7 -177 -191 32 76 -100 -66 -63 40 -206 18 -140 11 -182 142 160 134 14 -127 60
6526F0J44m20Q7j3R1k05J92K94l86n0J87N5j6J10L4J05l07O7j88O9Qj2K03OL22
$$ 60 204 -216 -129 -142 -51 -256 -64 230 -156 -206 -19 36 20 130 164 269 -38 29 -159 -90 -82 -94 109 115 437
6551D37l81k09J53kK13j58j48N7J60J81k39o4j45J81P7l48o8L83N0j40LO4m40
$$ 437 56 -153 0 -2 211 53 -95 -38 122 303 64 0 -145 36 113 -235 -303 80 130 -10 -7 57 -383
6574c83M36r5j88K93J16j44j20J41j17R3M6l14L56j84k21L14L7j68K56P6k59j43
$$ -383 53 -42 -230 63 179 35 -85 56 -61 32 78 -236 120 -64 -285 29 66 -102 154 230 -29 -172
6596a72L4M01o35N96j88m7k87J74m7J88J06L9k37r1J61n10N90r2J8O9K61n35j6
$$ -172 -138 263 -372 224 36 -11 -298 -124 -171 17 123 162 -75 -166 -5 -515 75 -17 1 70 331 -204 -220
6619b20M64k98o1K7JK07k31J1P0J19m0j26O7O2l4j63L24k48J18J97l27K52k13
$$ -220 244 -54 -115 -88 -87 120 -111 -100 -30 89 49 -77 -10 52 18 -145 179 -69 49 246 -81 171 -42
6642d2j34L44k66K82k85L9J94q4n2K9p6J9J58o0m3j10J20M8k06K71j69n7K75j75
$$ -42 -176 168 -98 184 -101 -62 132 48 -4 25 -51 -32 126 66 23 -87 33 81 -125 146 -23 -80 195 20
6666B0L17l05j54J77R4j20k01K93R3l39j38L00p8j40J36J28n3K16m43K09j00J92
$$ 20 337 32 -122 55 149 29 -172 121 214 -125 -263 37 -41 -181 -45 83 30 246 -197 12 -88 104
6688A04j22l09J34K67q6J17k08q5j27K46K6L68m25L2N6LK52l84J40K03j27k37
$$ 104 -18 -327 -193 74 -12 105 -103 -188 -315 -69 -43 325 -100 -68 -12 -9 243 -141 -1 202 75 -162
6710a62M4J9M40l26n8n7J97m86N41o6j08J81j93J29mMk19J14J20j95j4N4j37L16
$$ -162 -118 -99 341 15 -43 -100 97 -389 152 86 -22 159 -34 95 91 95 -124 -10 110 -85 -99 -45 -182 134
6734A34k6k22Q0J24O1Pj73LK31m37P7K81j05L9J71l14j93L75j51p7R6Q5o8J68
$$ 134 108 -114 -34 90 151 158 -15 -12 219 -218 -141 140 35 74 245 -69 -262 113 -38 -115 -19 66 -2 166
6758A66no1J49k46J89k52R0P1p4L1J75k03K14j49l07L14j53K3k48K98j18J38j05
$$ 166 161 100 249 3 192 -60 30 101 27 58 233 30 244 95 -212 102 -51 -28 -276 22 -96 42 -63
6781f3n9N1jNK17j71J19r7mR6k44K74k9l30J27M8l6L53r9n56O14k72k28K4J21
$$ -63 -122 -71 -72 -67 150 -21 98 1 -3 93 -151 123 94 -236 -109 -61 -97 256 157 -399 215 -57 -285 -261 -140
6806a40M51k01k53J06o5qM7o4L85l84L39j78K06j95Q2k69K73Q2m0j56j84L88o0
$$ -140 311 110 -143 -37 -102 -110 -63 -127 258 -126 213 35 241 46 128 -141 132 214 174 18 -166 222 162
6829A62k89L30r2j57n6O2R1l88M57k90K74k55K06k00K36J73j11q4J9O9j67R5n0
$$ 162 -127 203 111 -46 -102 -40 51 -337 120 -170 104 -151 55 -145 91 264 153 69 88 157 -10 85 35
6852C5r5J46Q2n8l37L48N0j53J31l17l12N51J00j97j74K41M5l34J10R0Q3J03j68
$$ 35 -60 86 168 110 -227 121 171 18 149 -168 -480 71 171 -26 -200 41 86 -248 -138 -48 35 138 -30
6875c0j41K02j3Q5j44q6J95k89K68M3k71K52JJ8j56k35L12R4j71j0Q1J79m07J14
$$ -30 -171 31 18 103 -41 -127 68 -221 47 90 -181 71 72 90 -66 -301 11 105 -66 -76 5 184 -223 -109
6899a09o9L9L28k23l0J72j0l9J78l85K77j28J69rk88K07j27K56l81%J13J03K67
$$ -109 -178 -139 189 -34 -64 108 98 59 237 -148 129 1 170 161 -127 80 -47 209 -172 -172 -59 44 311
6922C11l22K48k37K16l63M40k23l16K19K84m14K16j50M12l36l4J11k77L85k54
$$ 311 -11 237 0 216 -147 293 70 -246 -27 257 -157 59 -91 321 -15 -49 62 -215 170 -84
6942h4N4L14k01kj02k74L88K51j27k07RK89k27O0J28ok57j33J61j03K38j22j90
$$ -84 -30 284 83 81 -21 -295 93 344 217 10 19 308 81 141 269 263 6 -127 34 -69 169 47 -143
6965a43K4J23m8K11l12J66J7k57NQ9R5J46k9o7K15k60o9L06l38n3J17j0P2r8N5
$$ -143 -119 4 -44 167 -145 21 38 -219 -214 -125 -30 116 87 20 235 -25 -94 212 -126 -179 -62 -72 0 -98 -43
6990d3k48M76l00J95Nl30M43j56R5k01j45P1R5K9j36J18kQ0K23l87K20O5J38l87
$$ -43 -291 185 -115 80 85 -245 198 42 137 -64 -209 -138 -43 -14 -150 -32 -34 46 269 -118 102 167 305 -82
7014h2K8K32q4p0j04K23r3l09M83k87K05L5l12n0LK13j16J93J15k07l2k38N53
$$ -82 -54 178 94 24 -80 143 50 -259 224 -63 142 177 -135 -185 -182 31 -85 108 223 16 -16 -254 299
7037B99o67K76J80j1k40K08j0P1j24J39N0j81J45k61J46L20o12M95j7l76k6j93
$$ 299 -368 -92 88 77 -163 45 35 106 -18 121 171 -10 135 -126 20 340 -272 223 206 -170 -196 -389
7059c89J74M52j15j22k9J0j86K56N8L09k84k83OM1K24j66k76N80j28J9m00J14
$$ -389 -215 237 122 0 -29 -19 -205 51 109 418 134 -149 -143 -102 122 -44 -320 260 132 151 -249 -135
7081a35K89k18n6J95k33J67J82k91L31j81j95R7K9r9R6J93j09j41Q0J48j06L5
$$ -135 154 -64 -120 75 -158 9 191 -100 231 50 -145 -48 -19 -118 -22 171 62 -79 1 149 43 78
7103G8L13n55L00l01K30j7p5K2p4K11J71k49k16J56R3o3q9p1k6K73p1N2P9k37
$$ 78 391 -164 136 -165 65 48 -27 -5 -79 132 303 54 -162 -6 87 24 -65 -136 -162 111 40 92 171 -66
7127f6K3J63k16q8J74M6M9q4o7O2NK43l85J51j34L64k27o0R5j06L8M3n0J34J14
$$ -66 -43 120 -96 -184 -10 36 85 1 -66 -4 1 244 -141 10 -124 240 13 -47 48 -58 -20 23 -27 107 221
7152B21k29J71j11j77J21J12J71r8%j43p3J68j56P1J21J61m57o0J83J18k31K59
$$ 221 -8 163 52 -125 -4 108 279 181 181 38 -35 133 -23 48 169 330 -127 -187 -4 114 -117 142
7174A42p4M14m80k89Q7N9J37j79L64l14L3j99r1L96J30q2j46J71k76K37q6l3L71
$$ 142 68 482 2 -287 -200 -141 -4 -183 181 -133 -100 -299 -390 6 136 54 -92 79 -197 40 -46 -79 292
7197B92k70Q9K03m8k70N9j25L16kk05l10J43L00L21l68k71J57j11J78j16j29J32
$$ 292 22 111 314 266 -4 55 -70 246 244 39 -271 -128 172 493 125 -146 11 -100 78 -38 -167 -35
7219c5K6J17j49k2J55N7j26l87J79J90j38k0j9J28J93K8j89l69O35l91K18j59
$$ -35 -9 108 -41 -63 92 149 23 -364 -185 5 -133 -153 -172 -44 149 177 -12 -381 254 -137 81 -78
7241g8p1J80k34J27J74J07l23J85J83O5l26J79l44J12p9J89J84j82rJ8j55J45
$$ -78 -149 31 -203 -76 98 205 -118 67 250 315 -11 168 -176 -64 -143 46 230 48 39 57 -98 47
7263D7p7J26J27k96J40r7J7R4j58o2R1j6K44j71J47k38M6L0J06L4m5j50M3k40
$$ 47 -30 96 223 -73 67 -30 -13 81 -77 -139 -48 -64 180 9 156 -82 -36 -6 100 134 89 -61 -18 -258
7287b58L80l1j05O0l26L94j40J98q9j81L73m42J02j93L38J45n88N24M6m3p1m25
$$ -258 122 91 -14 46 -280 114 -26 172 83 -98 275 -167 -65 -258 80 225 -363 161 207 164 93 -332
7309c32P14m21k62J17J77O4j65K71j67j03J97r6R3R8j3j47j2M7p1K7R7l70J96
$$ -332 382 -39 -301 -184 -7 57 -108 163 -4 -107 90 -6 87 185 172 25 13 60 -11 16 113 -257 -61
7332f1K2M4k58K90j95J16j17J36j93oO6K24j19K06l15L40k55l3n4P1K25k82Q2
$$ -61 -39 5 -253 37 -158 -42 -159 -23 -216 -222 -156 68 -51 155 -160 180 -75 -108 -162 -91 134 -148 -66
7355f6j75L59j91J40l65L86k9k52lM32m09J77J40l24M5R2R9r4r7J87J03j19L6
$$ -66 -241 118 -73 67 -298 88 59 -193 -196 236 -173 4 144 -180 -135 -43 56 -38 -135 52 155 36 72
7378G2j29O1o8M2j32K1K28J44j42q2j4l0l2J9k16j30L93K68l31j1J75k04L23k60
$$ 72 -57 4 -64 -22 -154 -133 95 239 97 15 1 -29 -61 -42 -258 -388 5 273 -58 -69 106 -98 225 -35
7402c5k24K75l4Q9M9K77m88L44k43l78K65K06j38Q6j40K46l66M52j40j22Q7J13
$$ -35 -259 16 -18 71 120 397 -91 253 10 -368 -103 103 -35 51 -89 157 -209 243 103 -19 68 181
7424A81k54k00L24J36j35k89K26p6J32k48K79kP5l50J51J58KJ8J4r2k0ON9J87
$$ 181 -73 -273 51 187 52 -237 -11 -87 45 -203 76 74 149 -201 -50 108 110 128 142 50 30 36 95 282
7448B82j39k48L13l29k10L27K6j89J71Q9k37J97k68K60l05L27O0p7O8l36O4j12
$$ 282 143 -105 208 -121 -331 -4 22 -167 4 93 -144 53 -215 45 -260 67 127 50 118 -218 -154 -266
7470b66M58l38K2K73m27J92J07j03j84LK43K5l6j6r0p8L98k64J72j90N7j03j15
$$ -266 192 -146 -124 149 -278 -86 21 -82 -266 -263 -20 5 -31 -47 -137 -215 183 -81 91 -99 -42 -145 -260
7493b60M59l7j29J63m46L2J89k1P0J1n4J73k00J74j40J22l69M56oJ46l71j16M69
$$ -260 199 162 33 196 -250 -218 -29 -50 20 31 -23 150 -50 124 -16 106 -263 193 187 333 -38 -154 315
7516C15j54M2o07N02k24q5J86o9J19k26j38K94K35q1k38J05j21L58m40K76l5j03
$$ 315 161 203 -404 98 -126 -211 -25 -94 25 -201 -339 -45 190 109 -129 -24 -145 213 -227 49 14 -89
7538h9J8K95k97J92k8P9j76R8j26J22K5j48K93n03J77r9N01j74k2q2J55j77j75
$$ -89 -71 224 -73 119 91 170 -6 92 -34 88 113 -35 258 -245 -68 -167 334 160 138 56 211 34 -141
7561a41r4K88Q9P3j85n4r4J59N3l34M81k04k14L14N0q2k5p1q2p2K39o8j09k3K27
$$ -141 -235 53 142 215 30 -24 -118 41 94 -240 241 37 -177 137 187 105 80 9 -73 -145 94 26 -83 -106 121
7586A21r6k85M80j52R4j62k00k2J29mJ26m66Q26k82J6j55J57J6j35j08mr9M8L4
$$ 121 25 -260 220 68 162 0 -200 -222 -93 -97 29 -437 389 107 123 -32 125 141 6 -102 -106 -205 -157 -123
7610a23m3J31o2K85p4k7P6m01L04l30PK37M1J10l87K31o0J24O6l11k9K70r2j64
$$ -123 -166 -35 -97 188 114 87 163 -238 66 -264 -257 -20 21 131 -256 -25 -85 39 105 -206 -235 35 -57 -221
7634b21L60l64M07k33m1N8m4kJ01j96p6K64j09L79k57k30K11J41j93Q1n7k4j10
$$ -221 139 -225 182 -51 -92 -34 -78 -80 21 -175 -251 13 -96 283 26 -204 7 148 -45 36 -21 -45 -155
7657a55j71J31K23K9k9kk37J76L90l64k4k10N01l63J93q9O8l4j36J37J46p8n5
$$ -155 -326 -195 28 57 28 26 -211 -35 355 -9 -33 -243 258 -105 88 -1 67 33 -103 34 180 102 47
7680D7O3l67L24Pj70L31l16Q7J21J53q2j51j3J94L8k25j91Q9K19j57Nj3J75p0
$$ 47 110 -257 67 74 -96 235 -81 6 127 280 198 47 34 228 266 41 -150 -61 158 1 6 -7 168 98
7704I8KQ5Nk21p0K96Lm76L69QJ13j52j69j5L76l60K57k33Q5Q3j08O3l5R2l87K89
$$ 98 100 185 190 -31 -101 195 198 -278 91 99 212 60 -109 -124 252 -108 149 -84 1 84 -24 39 4 96 -291 -2
7730bJ46k59K55p2k53J39K89k50j31N6L29l09k02L92k63K56j07q4j82M36J8m26
$$ -2 144 -115 140 68 -185 -46 243 -7 -138 -82 247 -62 -264 128 -135 121 14 -70 -252 184 202 -224
7752b24K2K44m1Qj10j10J99J39o3j34O1K09J47o8m11r4j14L63Q0j28Q6l3r5P9
$$ -224 -202 42 1 9 -101 -211 -12 127 64 -70 -9 200 347 279 -132 -226 -340 23 103 -25 61 28 -67 12
7776A2j56K20k79J56R3q4j5J18j45J81L0k37j29M81k11J14r0l30J97J76rk06J45
$$ 12 -144 76 -203 -47 46 -38 -53 65 -80 101 131 -106 -235 246 35 149 59 -271 -74 102 93 -113 32
7799C2o4K3R9O3j61j7N4l15K73J84j06J09l95K9K41j15R8L6j52L13l91P7J34j76
$$ 32 -32 -9 90 153 -8 -25 29 -286 -13 171 65 174 -221 -192 49 -66 32 68 -84 229 -162 -85 49 -127
7823a27L44km25M21k81j3J58pJ9k85J26mp7J38l1mJ21k85J84o9j8R1J98r8p7k08
$$ -127 217 215 -210 211 -70 -83 75 68 87 -198 -72 -76 -153 -15 -46 -50 71 -214 -30 -99 -117 -26 172 74 -3 -211
7849b11M07k11O2k73K46j1p5P8j63K11J43O3k76K3j68J22k60K01K24m7j21k73
$$ -211 196 -15 47 -226 20 9 -66 12 -151 60 203 266 -10 13 -155 -33 -293 -92 132 85 -36 -309
7871c09N55l15M1K40l14p0K92j31PN5n5J5k25K23r8M11k70l66N62l46J17j23M33
$$ -309 246 -69 -28 212 -102 -172 120 -11 -4 51 -4 11 -214 9 -89 322 52 -314 248 -98 19 -104 329
7894C29m14J71j1N6q4M4j28K46l51N3K30J19k25k04J77k67M87l77L53k03K68m21
$$ 329 -85 86 75 131 47 91 -37 209 -142 -89 141 260 35 -169 8 -259 228 -149 204 1 269 -152
7916a52O3K12k66J03O3M1k30J23j51L36k06P8J09j95J97m17K94K04k46l3K29m1
$$ -152 -89 123 -143 -40 23 64 -166 -43 -194 142 -64 14 123 -72 125 -292 2 206 -40 -73 156 115
7938A15l06J65J34Q3j1k15J21j72N1K17n3j46J73r4J74l55K33N4l85P6J01J01
$$ 115 -191 -26 108 191 180 -35 86 -86 -35 182 129 -17 156 62 236 -119 114 168 -217 -141 -40 61
7960F1j1j72j32K56k3Q1k50M86Q3m10K71j06m02O4JR0n0L23l86J28R9J92k28J90
$$ 61 50 -122 -254 2 -21 60 -190 296 379 -31 240 134 -268 -204 -203 -113 -163 160 -226 -98 1 193 -35 155
7984A55k5k42K30l45J92m9J21J09J6j25k94L64l52K01R3K55k98J56j27l23L75
$$ 155 130 -112 118 -227 -35 -84 37 146 162 37 -257 107 -245 -44 49 304 6 162 35 -288 87
8005H7j11J79j7J19k35q1j26rK79k58L10l67J81L83m01K49n8P1k88L28n00L64
$$ 87 -24 155 138 257 22 -59 -185 -194 85 -173 137 -230 -49 334 -67 182 124 195 -93 235 -265 99
8027I9J85m71j04O4K85k9j62J01Q2m14L37p1N3j13J32j32j00J16K84k80o4N8J27
$$ 99 284 -187 -291 -227 58 29 -133 -32 50 -364 -27 -98 -45 -158 -26 -158 -258 -142 142 -138 -202 -144 -17
8050a7K49l84L59k98N7M6Q0j36r4K29m3l01J94O1K8R8N3k05Rl8Lj75O2O4J26L9
$$ -17 232 -152 207 -91 -34 12 92 -44 -138 91 48 -253 -59 2 30 128 181 -24 -15 -53 -50 -225 -163 -99 27 66
8076F6n7J30j97J81k21m4%K61j01P1o9J69j06k72lJ88K91k35k02k18M17k01J10
$$ 66 9 139 -58 123 -98 -142 -142 119 18 89 20 189 83 -189 -192 -4 287 52 -150 -368 49 -152 -42
8099d2K3J01qoN9m6l00L09k91M11l77J10j33K71j56J07OM1K62n2l74o6K86j22
$$ -42 -19 82 74 68 127 81 -219 90 -201 210 -167 -57 -190 81 -75 32 38 79 341 289 -85 -151 135 13
8123A3j71K31k09n0K48J06L0j4k9k4p5p0R2j54J09j51O8J2Jqoj8j76L74r3j0j25
$$ 13 -158 73 -136 -186 62 168 198 184 155 131 56 -14 78 -76 33 -118 -50 -38 -37 -45 -51 -69 -245 129 36 26 -99
8150i9J52Q5p2L5l9l45M01N1m07N01j49k61P8J12k58J81J10j22k49K40K0j16K13
$$ -99 53 138 66 101 62 -283 118 169 -238 263 114 -147 -69 43 -215 -34 76 -46 -295 -55 -35 -151 62
8173F2M0q2J28k84K55J12k76K4n4mP7J59j75J52j66k21M04J4
$$ 62 102 20 148 -136 119 231 -45 -21 -75 -79 -2 157 -18 134 -32 -253 151 165
8191A65
$$ Imaginary data points
##PAGE= N=2
##DATA TABLE= (X++(I..I)), XYDATA
0@%%%%%%%%%Qj6J6j6J6k4L2l4M2m8N6p0Q1r2J05j23J43j62J84k08K34k63K96l34
$$ 0 0 0 0 0 0 0 0 0 0 8 -8 8 -8 8 -16 16 -18 24 -24 32 -38 43 -49 56 -67 76 -86 98 -110 124 -139 157 -177
33a77L74m17M65n17N72o36P07p81Q66r58J060j176J303j448J615j805K026k287
$$ -177 197 -220 245 -272 300 -336 371 -410 456 -502 558 -618 685 -763 852 -953 1073 -1214
51a214K598k982L465m098M965o227Q255j2039K1499q8472j91254J01957J79149
$$ -1214 1384 -1598 1867 -2231 2734 -3493 4762 -7277 14222 -74250 -265504 -163547 15602
64A5602R3375n1193o1557p564J8572m4040o5945Q003R9033P5596j9189q1110m7917
$$ 15602 108977 57784 -3773 -11337 7235 -36805 -102750 -94747 4286 79882 60693 -20417 -68334
77f8334J3028K7235l375Q413N0084L8569l4755o9854k9847L4583M9026P095k3245
$$ -68334 -55306 -28071 -31446 -23033 27051 65620 30865 -38989 -68836 -34253 14773 21868 -1377
90a377O647L0816j3398o6862l8465M7921R3242L8668n9563q3226j1152M5989K0540
$$ -1377 5270 36086 22688 -44174 -82639 -34718 58524 97192 37629 -45597 -56749 -10760 9780
103I780j9039l931L5646L2763k9313p8885l8666N3364Q2846K6075l9260n0194
$$ 9780 -9259 -13190 22456 55219 25906 -52979 -91645 -38281 44565 70640 31380 -18814
115a8814j9144Q177J741m242K8340N1910J4122m6218o0501k1925L0673N0442K3619
$$ -18814 -37958 -29781 -28040 -32282 -3942 47968 62090 15872 -44629 -66554 -35881 14561 38180
128C8180q566j0781o069j5919k1120q614J4355L4849L0685K17k2407k4589k1325
$$ 38180 29614 18833 12764 -3155 -24275 -32889 -18534 16315 47000 47217 24810 221 -21104
141b1104j0528J6640L2081K3202M167j8433l0402j7498L986J0829J4322J8496
$$ -21104 -31632 -14992 17089 40291 44458 26025 -4377 -21875 -17889 -7060 7262 25758
153B5758J0511o696k3428l4235j6806K6928M8971K0908k4395m4678k3696K1672
$$ 25758 36269 29573 6145 -28090 -44896 -17968 31003 51911 27516 -17162 -40858 -19186
165a9186L7250N111k3267r023J6157J3029j5380l3754o348M3436M3773j3711n1851
$$ -19186 18064 23175 -92 -9115 7042 20071 4691 -29063 -35411 8025 51798 38087 -13764
178a3764k6884K2408M0138R296k7558j8271K2011K3927j5285l4921j1810K4761
$$ -13764 -40648 -18240 21898 31194 3636 -14635 7376 31303 16018 -18903 -30713 -5952
190e952L3003O305j9113j2155O2j1724j7807P231L3633K6949p986l7409k5325
$$ -5952 27051 33356 14243 2088 2150 -9574 -27381 -20150 13483 40432 32446 -4963 -30288
203c0288R966J6446p774n632K5176L1330q134n2724m5251J8172O3042K7970l5064
$$ -30288 -20322 -3876 -11650 -17282 7894 39224 31090 -21634 -66885 -48713 14329 42299 7235
216G235l7637Q786L0248K42l6369k1576L4390N0233m804n1139k5633K7679L6237
$$ 7235 -30402 -21616 8632 8874 -27495 -49071 -14681 35552 30748 -20391 -46024 -18345 17892
229A7892l840l6809j2123L6280L1327k1712m0936l322L2070K2537j2926k6318
$$ 17892 14052 -22757 -34880 1400 32727 11015 -29921 -33243 -1173 21364 8438 -17880
241a7880J505K5471L698k6041j1395K3180K5889o652l3041j7905K1899K8577m863
$$ -17880 -16375 9096 12794 -13247 -24642 -1462 24427 17775 -15266 -33171 -11272 17305 12442
254A2442k0973L012J7739l469k8242j7239K4605M5424R010m3122l5278J3729L4064
$$ 12442 -8531 -5519 12220 8751 -19491 -36730 -12125 33299 42309 -813 -36091 -22362 11702
267A1702N975k3733j2554K5449L1591j4065m7269j5597L4101L6751k177l0081
$$ 11702 17677 -6056 -18610 6839 38430 24365 -22904 -38501 -4400 32351 30174 93
279I3j5103K1014K2754j3676l0984l654K6751K3674k383k1434j2679O693N874
$$ 93 -15010 6004 28758 15082 -15902 -19556 7195 30869 28486 7052 -5627 1066 6940
292F940p149j068J4689J0303o767j5007r769N295J1273p7n670N182P670p330j6098
$$ 6940 -209 -1277 13412 23715 16948 1941 -7828 -2533 8740 8663 2993 8175 15845 8515 -7583
307g583n306J2770J9316J174k3472j7069J2659K1292K698j3548j3554J360J4509
$$ -7583 -12889 -119 19197 20371 -3101 -20170 -7511 13781 16479 2931 -10623 -9263 5246
320E246M016j3728q935R874J4326J949j4538j6688J337J8461R707r344j1332j59
$$ 5246 9262 -4466 -13401 -3527 10799 12748 -1790 -18478 -17141 1320 11027 1683 -9649 -9808
334i808Q930Q002o075j6966m729J4573J3968N50r280r657j252N015j284m427N737
$$ -9808 -878 7124 1049 -15917 -20646 -6073 7895 8445 -835 -10492 -11744 -6729 -8013 -12440 -6703
349f703J2663L081q227j3566q085N923J3907M643k850j28j951p694m710K931Q639
$$ -6703 5960 9041 814 -12752 -20837 -14914 -1007 3636 786 658 -1293 -8987 -13697 -10766 -2127
364b127P122l907j0056O50J1544J493j0746q120N553J3614N761j2365j3233R905
$$ -2127 4995 1088 -8968 -8318 3226 4719 -6027 -14147 -8594 5020 10781 -1584 -14817 -4912
378d912J8007l080k0213r343J5142K3336J702k4769j6882J5680K3415j558j9630
$$ -4912 13095 10015 -10198 -19541 -4399 18937 20639 -4130 -21012 -5332 18083 16525 -3105
391c105j1513J1743K0111m94k0009o817J7153J1242j1013j6633l49J8420J4630
$$ -3105 -14618 -2875 17236 16742 -3267 -10084 7069 18311 7298 -9335 -9684 8736 23366
404B3366q410j8135j675R550J453o122J049J0087P867q600j9329l005J7650J1426
$$ 23366 14956 -3179 -4854 4696 6149 27 1076 11163 19030 10430 -8899 -11904 5746 17172
418A7172j1335j3041N013J5414L295j7625j7807R773K3793J988k0176j1500J2242
$$ 17172 5837 -7204 -2191 13223 16518 -1107 -18914 -9141 14652 16640 -3536 -15036 -2794
431b794J9207k610k5335j4681J9030K5786j177k2209j1981R149J4364j430j5500
$$ -2794 16413 13803 -11532 -26213 -7183 18603 17426 -4783 -16764 -7615 6749 5319 -10181
444a0181l092J6283J0488j0566j5137k01J1554R079n897j1679J499J0236P94o843
$$ -10181 -13273 3010 13498 2932 -12205 -12406 -852 8227 2330 -9349 -7850 2386 3180 -3663
458c663j390M553K483n567p441K289J4770M713j2813j1512M426J0116K573q295
$$ -3663 -5053 -500 1983 -3584 -11025 -8736 6034 10747 -2066 -13578 -9152 964 3537 -4758
472d758o646P020J3200k997j6306n604J0884J1600j006j2248o392J0479J3157
$$ -4758 -11404 -4384 8816 5819 -10487 -16091 -5207 6393 5387 -6861 -13253 -2774 10383
485A0383l898j4511m548O819R895M165n299n805L356L095m113l599K445N211N393
$$ 10383 6485 -8026 -12574 -5755 4140 8305 3006 -2799 557 3652 -461 -4060 -1615 3596 8989
500H989O44n589n978R4K694L292M399l35n657k283L058K133O37k779m416P44O190
$$ 8989 9633 4044 -1934 -1840 854 4146 8545 8210 2553 270 3328 5461 6098 3319 -1097 -353 5837
517E837J545l516k118q84J21J177j634k737K697M585l10l599k972l367P49O333
$$ 5837 7382 3866 1748 864 985 2162 528 -2209 488 5073 4763 1164 -1808 -5175 -4426 1907
533A907L569l262m430k722K030O870J548q339n588M923P276K542m486p325J126
$$ 1907 5476 2214 -2216 -4938 -2908 3962 5510 -2829 -8417 -3494 3782 6324 1838 -5487 -4361
548d361Q620J87r508l814P816J0266O76j0737j0970K786J1891L188o343m051K285
$$ -4361 4259 4446 -5062 -8876 -1060 9206 9882 -855 -11825 -9039 2852 6040 -303 -4354 -2069
563b069L771m74n991l877N755N479l870m792K301L643j21m609l626K106O331j028
$$ -2069 1702 1228 -4763 -8640 -2885 2594 -1276 -6068 -3767 -124 -245 -4854 -8480 -6374 -43 -1071
579a071n098K256O056n38p500o163L946J2184N893j0064j0778M470J0923J351
$$ -1071 -6169 -3913 2143 1605 -5895 -12058 -8112 4072 9965 -99 -10877 -6407 4516 5867
593E867p742o135N437J1618N39j1850n628Q912Q885j996j0076n268Q171J1643
$$ 5867 -1875 -8010 -2573 9045 9584 -2266 -7894 1018 9903 7907 -2169 -7437 734 12377
607A2377j875j1539l564N581M223j581l863O73N130J896o858n227L945M756p97
$$ 12377 10502 -1037 -4601 980 5203 3622 -241 432 5562 7458 600 -4627 -682 4074 3277
622C277l021q46K597K997l845n955K333P852q94p425k045O185P255j126j0749
$$ 3277 256 -590 2007 5004 1159 -4796 -2463 5389 4495 -2930 -4975 1210 8465 7339 -3410
637c410o626P871J0614r14p845l143M139N786k413r188j192R383P073m816p690
$$ -3410 -10036 -2165 8449 7535 -310 -3453 686 6472 4059 -5129 -6321 3062 10135 5319 -2371
652b371k126M089N300j310n660n93M213N05j126o49o70j157o74j177J145M033
$$ -2371 -4497 -408 4892 3582 -2078 -2671 1542 2047 921 272 -398 -1555 -2229 -3406 -2261 1772
668A772M42n233j661K780M80k183j201M16M765L469n447o671J288O498K844k860
$$ 1772 2214 -3019 -4680 -1900 -1420 -3603 -4804 -4388 377 3846 -1601 -8272 -6984 -486 2358 -502
684e02m621j004N980M206l652n245Q00L131R15O23j158J01K646Nl536r29J252
$$ -502 -5123 -6127 -147 4059 407 -4838 -4038 -907 8 631 -527 -426 2220 2225 -1311 -2240 -988
701i88R43K171K037j224k662j469j126K054M365q39m706l76L031K133j300l669
$$ -988 -45 2126 4163 2939 277 -1192 -2318 -264 4101 3262 -1444 -1820 1211 3344 2044 -1625
717a625k579L629M569j518m686L87L488J257k481m424o03O061M450l214m482n96
$$ -1625 -4204 -575 3994 2476 -2210 -1823 1665 2922 441 -3983 -4586 1475 5925 2711 -1771 -2367
733b367J545J528O33j191K44K337r11k735J130J883j202j122O02J278J120k85
$$ -2367 -822 706 1339 148 392 2729 1818 -917 213 2096 894 -228 374 1652 2772 2487
749B487k803o8L411K42m744k028L042M726K103n394o865J481O743J174m072k848
$$ 2487 -316 -384 3027 3269 -1475 -3503 -461 4265 6368 974 -5891 -4410 2333 3507 -565 -3413
765c413J455L730O47m294m095L144N020o95l545j321J452K993K46l801j964K526
$$ -3413 -1958 1772 2419 -1875 -5970 -2826 2194 1499 -2046 -3367 -1915 1078 1324 -2477 -4441 -1915
781a915J584m67J087Q62j340j718j481O81L645K899l492l071K490K599r10k804
$$ -1915 -331 -798 289 1151 -189 -1907 -3388 -2707 938 3837 345 -2726 -236 2363 1453 -1351
797a351j756K698N572o81o058k089M508M006j573n099k448L877O085j199n321
$$ -1351 -3107 -409 5163 4482 -1576 -3665 843 4849 3276 -1823 -4271 -394 5691 4492 -829
812h29j115K088J486n20j457n75L333J502l556k631J655J627l96J64P4J34P87
$$ -829 -1944 144 1630 1110 -347 -922 2411 3913 357 -2274 -619 1008 612 776 850 984 1771
829A771j707j777K092K653k033l012R22K614K631j307m992j465M860K373k533
$$ 1771 64 -1713 379 3032 999 -2013 -1091 1523 4154 2847 -2145 -3610 1250 3623 1090
844A090k610J058K735J345l572m389J197O044J140l314k956k45K703J837k286
$$ 1090 -1520 -462 2273 3618 46 -4343 -3146 2898 4038 724 -2232 -2477 226 2063 -223
859b23l244J705K905q41j674J36N19O1o63j332J91K819J29k307J33J286o59j562
$$ -223 -3467 -1762 1143 302 -1372 -1236 -717 -656 -1319 -2651 -2460 359 488 -1819 -1686 -400 -1059 -2621
877b621q37J322L393J682m772l668K770M237j48l144k003J346M539N44m421k484
$$ -2621 -3458 -2136 1257 2939 -1833 -5501 -2731 1506 1358 -1786 -3789 -2443 2096 2640 -1781 -4265
893d265L166K352l35k427j492K245M033j225m010j004K431J130L66J43l38p7k61
$$ -4265 -1099 1253 918 -1509 -3001 -756 3277 2052 -1958 -2962 -531 599 965 1108 770 693 432
910D32j558N81K376L4k058J81J297Q35K9k131j506K090K953j580k807O91K678
$$ 432 -1126 -545 1831 1865 -193 -12 1285 2120 2149 18 -1488 602 3555 1975 -832 -141 2537
927B537R86j378l770r13M477K967j770l442l37J167J661k25k507K77K701M81k212
$$ 2537 3523 2145 -1625 -2538 1939 4906 3136 -306 -643 524 2185 1960 -547 -270 2431 2912 700
944G00r39Q90L52K83n80j135P71J312j198K4J136q07j859M6R65J656J106j946
$$ 700 -239 651 1003 1286 706 -429 342 1654 456 480 1616 809 -1050 -1004 -39 1617 2723 777
962G77k939O12K766j00j844n19R66J594M81l159j844K346K388j292j907n29R93
$$ 777 -2162 -1550 1216 1116 -728 -1247 -281 1313 1794 -1365 -3209 -863 1525 233 -1674 -2203 -1210
979a210K046N64l223j514J860P25o1M00j85m35J16r75o98J558J006j591k4J402
$$ -1210 836 1400 -1823 -3337 -1477 -752 -813 -413 -598 -1033 -917 -1892 -2590 -1032 -26 -1617 -1641 -239
997b39J09j157j086k42J886K695j266l651M90L127R60j544k243n56K580K935j677
$$ -239 -130 -1287 -2373 -2615 -729 1966 700 -2951 -2461 666 1626 82 -2161 -2717 -137 2798 1121
1014A121l193Q99J699P75j359j443J15K909J335k459k145R11J189K54K60r13k1
$$ 1121 -2072 -1173 526 1301 -58 -1501 -1386 1523 2858 399 -1746 -835 354 608 868 -45 -66
1031f6J067m00j338R99J269j201j619J025R85J186n55k628l53L006M41k254q62
$$ -66 1001 601 -737 262 1531 330 -1289 -264 721 1907 1352 -1276 -1629 1377 1818 -436 -1298
1048a298J478J993O69k643l237J612M327L1k731j403J105J883O13k343j708K099
$$ -1298 180 2173 2842 199 -3038 -1426 2901 2932 201 -1202 -97 1786 2399 56 -1652 447
1064D47J960j060j586K59L98N91l26j098n17J803N23j267K92N50r33o54o21O33
$$ 447 2407 1347 -239 20 418 1009 683 -415 -932 871 1394 127 419 969 36 -618 -1239 -606
1082f06K036J95k427j706J946J484n47j430j114J314K328l9l232o60K934Q40j390
$$ -606 1430 1625 -802 -2508 -562 922 375 -1055 -2169 -855 1473 1434 -1798 -2458 476 1316 -74
1099g4j413n35K085K401j326k942L94J229Q17k11N0q07Q46O57j817j43J037N19
$$ -74 -1487 -2022 63 2464 1138 -1804 -1410 -181 636 425 475 -332 514 1171 -646 -789 248 767
1117G67j081M19N03l99M55p13p53J455J304k110r70J107J239N49j537k350J77
$$ 767 -314 105 608 209 664 -49 -802 653 1957 -153 -1123 -16 1223 1772 235 -2115 -1938
1134a938K964J316k664q40P38J071K51j232j859J033K948l26k268n05O85J215
$$ -1938 1026 2342 -322 -1162 -424 647 898 -334 -2193 -1160 1788 1462 -806 -1311 -626 589
1150E89L06r67j115J104J169j048l72J009k56j124Q0L7J034P54p93k005J379Q24
$$ 589 895 -72 -1187 -83 1086 38 -334 675 419 -705 -625 -588 446 1200 407 -1598 -219 605
1168F05n19r60k20R25J138O0k651j053K197J603q86j980J41Q40J473M4k699n25
$$ 605 86 -874 -1094 -169 969 1029 -1622 -2675 -478 1125 239 -1741 -1600 -760 713 757 -1942 -2467
1186b467J495J112n50m99O3L56J274p76j811R73J034j90j91L39l91l24M90k91
$$ -2467 -972 140 -410 -909 -846 -490 784 8 -1803 -830 204 14 -177 162 -229 -553 -63 -354
1204c54L99J470j073j129N25J258M50j160n87r81J795J749j754j356P29J566l48
$$ -354 45 1515 442 -687 -162 1096 1546 386 -201 -1182 613 2362 608 -748 -19 1547 1199
1221A199m99j281k6K256R56k167j229M84J004L65k83n18l49J269k97q54K29P12
$$ 1199 700 -581 -607 1649 2605 438 -791 -307 697 1062 779 261 -88 1181 884 30 259 971
1239I71o61J43J12p1K99Q4n27k18J364o33j339N34R35L93K23j862r15J231J741
$$ 971 310 453 565 494 793 877 350 132 1496 863 -476 58 993 1386 1609 -253 -1168 63 1804
1258A804r53j023o7N71N77j60j341o71J421J165j427n87M8N70M69j30j266n03
$$ 1804 851 -172 -239 332 909 749 -592 -1263 158 1323 -104 -691 -643 -73 396 266 -1000 -1503
1276a503J121n2k21M20j14p06m46K61N7J079P6j449r6J085N78j319m64L86Q73
$$ -1503 -382 -434 -655 -235 -349 -1055 -1501 -1240 -1183 -104 -28 -1477 -1573 -488 90 -1229 -1693 -1307 -434
1295d34R11j042j697Q91J812l27p20r85j03J926J118j733j388J017J085l49o50
$$ -434 477 -565 -2262 -1371 441 114 -606 -1591 -1694 232 1350 -383 -1771 -754 331 -18 -668
1312f68L18j25R15K10j477N7R37K76n37p6L31j70K40m16l42Q69O14j314j61R06
$$ -668 -350 -475 440 650 -827 -770 167 443 -94 -170 161 -9 231 -185 -527 342 956 -358 -519 387
1332C87O08l8k21j735O74J750p5j603P3Q44P42M4j353r44J375J603o99j760K7
$$ 387 995 957 736 -999 -325 1425 1350 -253 -180 664 1406 1450 97 -847 528 2131 1432 -328 -301
1351c01J010O74j42j095m90J492O40j328%J71m9j19j49j79K10J042o55q61O17
$$ -301 709 1383 1241 146 -344 1148 1788 460 460 631 582 463 314 135 345 1387 732 -129 488
1370D88K66m16o23J07M14P33l82j439j16J058R51j053p92j70O86J141l21j712
$$ 488 754 338 -285 -178 236 969 587 -852 -968 90 1041 -12 -804 -974 -288 853 532 -1180
1388a180l2J410J82o53l39q2M44N45o80j477J175M20p1J6K01o15J35L30p11L95
$$ -1180 -1212 198 380 -273 -612 -694 -250 295 -385 -1862 -687 -267 -338 -322 -121 -736 -601 -271 -982 -587
1408e87N61r0q54O84L82l65j9n40n6R84N17j389n63J184M54k70o80o02N26J619
$$ -587 -26 -116 -970 -286 96 -269 -288 -828 -884 100 617 -772 -1335 -151 303 33 -647 -1249 -723 896
1428H96l28j253R2O17N8r2p0j99J00Q94k19j142Q60R3j34K13J0l59L67N1m83J97
$$ 896 568 -685 -593 24 82 -10 -80 -279 -179 715 496 -646 214 307 173 386 396 37 404 455 -28 169
1450A69N80m97p41O89M88j67K31n65q04J070P65p03n20J42P80K1l89r66K81J177
$$ 169 749 252 -489 200 688 521 752 187 -617 453 1218 515 -5 137 917 938 549 -417 -136 1041
1470A041J58j076o25O64L70L25m27j151N78O91k45l81M31K49o22L21k68n65Q04
$$ 1041 1199 123 -502 162 532 857 430 -721 -143 548 303 -78 353 602 -20 301 33 -532 272
1489B72K6p07r5P38J32o97j18J23N02L17p70p11P43O08l07m44p17J94J130M47
$$ 272 298 -409 -504 234 366 -331 -449 -326 176 493 -277 -988 -245 363 56 -388 -1105 -911 219 666
1509F66j152p61J129K33o2m50jJ3P17J0j118M5P19p1j0Q4k84k02Q18n15m15O47
$$ 666 -486 -1247 -118 115 53 -397 -398 -385 332 342 -776 -731 -12 -83 -93 -9 -293 -495 323 -192 -607 40
1531D0L31m18l62K37N75k32j20n01J80Q71n61l35O7N94K02k75n29k09M63J012
$$ 40 371 -47 -409 -172 403 171 51 -450 -270 601 40 -295 -228 366 568 293 -236 -445 18 1030
1551A030p32o04L93J81J25N0k25l71N48K49k23l06M16j95L0J25k70q3M74k45l33
$$ 1030 298 -306 87 268 393 443 218 -153 395 644 421 115 531 336 366 491 221 138 612 367 34
1572C4O54j88m90N5J73J56P4J07r43L78P86k50p99K16j08L71N59q34m86O55M72
$$ 34 688 500 10 65 238 394 468 575 -368 10 796 546 -253 -37 -145 226 785 -49 -535 120 592
1593E92o67l67J40J83M62P2r02m15P18M38p91J66L90k64r1L09m86J24P71p90k59
$$ 592 -75 -442 -302 -119 343 415 -487 -902 -184 254 -537 -371 19 -245 -336 -27 -513 -389 382 -408 -667
1614f67L51L48m23J52l65j42P02M67j154o7R11K7o53j14k72N69R35n19r38J61
$$ -667 -316 32 -391 -239 -604 -746 -44 423 -731 -798 113 140 -513 -627 -899 -330 605 86 -852 -691
1634f91O32J05p9m38p6O94O13q27n24K61Q04m60P4l91k45P41j76k03K30L44N4
$$ -691 -59 46 -33 -471 -547 147 760 -67 -591 -330 474 14 88 -303 -548 193 17 -186 44 388 442
1655D42n25J79J0M79J35n82n80P21J52k06l43J04K85K10K5p51L0P30K43o33k33
$$ 442 -83 96 106 585 720 138 -442 279 431 225 -118 -14 271 481 506 -245 -215 515 758 125 -108
1676a08j26N91P97n61r85J99P60ql88m54J29N30M58o81n98O85M25m99j60N2j03
$$ -108 -234 357 1154 593 -392 -193 567 559 171 -283 -154 376 834 153 -445 240 665 166 6 58 -45
1697d5P7L33m65m7N83j90o65M32M42o49J07k14K7L52L84p28K0K75M0j47k19l65
$$ -45 32 365 -100 -147 436 246 -419 13 455 -194 -87 -301 -274 78 462 -266 -246 29 69 -78 -297 -662
1719f62J95O57K91j257J46N00R7N6j50j85K04L61n30k35L89j88n2R3M14m12r9
$$ -662 -467 190 481 -776 -630 -130 -33 23 -127 -312 -108 253 -277 -512 -123 -311 -363 -270 144 -268 -367
1740c67L61l24M2J84k32M5L05k2q5j43n0k50O19K06o41J13K76j10j23N23n56j93
$$ -367 -6 -330 -288 -104 -336 -291 14 -8 -93 -236 -286 -536 83 289 -352 -239 37 -73 -196 327 -229 -422
1762d22N91L45r11L21M23l09l6K91l76j59N54l86N3J83O6m60K19K91k94M60m17
$$ -422 169 514 -397 -76 347 38 2 293 -83 -242 312 -74 -21 162 228 -232 -13 278 -16 444 27
1783B7k74K43O12o36m40N47L03k12J61m68k79P99M40r55J61K9k25M01p4l69j15
$$ 27 -247 -4 608 -28 -468 79 382 170 331 -137 -416 383 823 -132 29 58 -167 234 160 -209 -324
1804c24O46j91k02K40k27J36R9k27l37Q5O12o30K71M14l52j12J55k80L31K27j1
$$ -324 322 131 -71 169 -58 78 177 -50 -387 -302 310 -320 -49 365 13 -99 56 -224 107 334 323
1825C23p14L91J93J78n27m7p2K57M80k09p44L01K97K44n27l77L08N34L50q79m32
$$ 323 -391 0 193 371 -156 -203 -275 -18 462 253 -491 -190 107 351 -176 -553 -245 289 639 -240 -672
1846f72P98J47k87k34Q8j79M25K46o31K71L52l72J03K84p30N28J32k44m27M98
$$ -672 126 273 -14 -248 -160 -339 86 332 -299 -28 324 -48 55 339 -391 137 269 25 -402 96
1866I6J78j79j11n3K19L40n35m45M1Q78j8m03l75L84J27M98m66n93J73O23j67
$$ 96 274 95 -16 -69 150 490 -45 -490 -449 429 411 8 -367 17 144 642 176 -417 -244 379 212
1887B12l81j56M16Q4K48n71m22O84J36j11j55j42N5O7L29k07n13O05l7j94J99
$$ 212 -169 -325 91 175 423 -148 -570 114 250 139 -16 -158 -103 -36 293 86 -427 178 141 -53 146
1908A46l87J25L42l17j78M81l0n06K4M41q7l19M19n81K98J00M04q73K49N65m83
$$ 146 -241 -116 226 -91 -269 212 182 -324 -300 141 54 -265 154 -427 -129 -29 375 -498 -249 316 -167
1929a67n5J85j4j59M06Rl99J65R5j54L65m43k47N05O8m20J09N5L2J19J02L6l70
$$ -167 -222 -37 -51 -210 196 205 -194 -29 66 -88 277 -166 -413 92 160 -260 -151 -96 -64 55 157 193 -177
1952a77Q3J57o1J97k36k47J5L07K82l71J67l40K7L52N4l47j69L55J62Kl8j16j71
$$ -177 -94 63 2 199 -37 -284 -269 38 320 -51 116 -224 -197 155 209 -138 -307 48 210 212 174 58 -113
1975a13N1j33M68j56q1K6K09j08k67K91L9j29j44J68m57L33K31j05J30l7k46k26
$$ -113 -62 -195 273 117 36 62 271 163 -104 187 226 97 -47 121 -336 -3 228 123 253 216 -30 -256
1997b56O54k23l72j55M73K6k31J70j92P0M04k71m40K11K46Jr7j6k46L49K4m89
$$ -256 398 175 -197 -352 121 147 -84 86 -106 -36 368 97 -343 -132 114 115 18 2 -244 105 129 -360
2019c60LJ45L48j34K2R7n65J72M17p76M85K33k72M6j93K05L52J6n2o18J86N82
$$ -360 -357 -212 136 2 24 121 -444 -272 145 -631 -146 87 -185 -139 -332 -127 225 241 189 -429 -243 339
2041C39l94j61k15J06M90j24m13P4L64M17m85K66p21L14M72o9j08k49K67L80m72
$$ 339 -55 -216 -431 -325 165 41 -372 -298 66 483 -2 264 -457 -143 329 260 152 -97 170 550 78
2062G8O9k69L56J85k36k95K78J0m2J04m6k30K76J11l24j90O53o7m20k01J52L56
$$ 78 147 -122 234 419 183 -112 166 176 134 238 192 -38 238 349 25 -165 488 421 1 -200 -48 308
2084C08J69m77k56L81N07l68j67n8q3P02m71k95m6M66n9j33m07L82K6o4J93m49
$$ 308 477 0 -256 125 632 264 97 39 -44 658 187 -108 -154 312 253 120 -287 95 121 57 250 -199
2106a99K37L81j21m59R8N0j56K62J24o51M37K51Pm02O0nK15j64l7k24K85r2K37
$$ -199 38 419 298 -161 -63 -13 -169 93 217 -434 3 254 261 -141 -81 -86 129 -35 -72 -296 -11 -103 134
2129A34l86K7L65Q4l21l14J59M28j1n02l0N00m8m8j65p8L73Q0m08L70j96j22O4
$$ 134 -252 -225 140 224 -97 -411 -252 176 165 -337 -367 133 85 37 -128 -206 167 247 -161 209 13 -109 -45
2152d5p0J9l17M56q8k52L32n5rJ83J03n62N5K21k07L39j76Q8j01P9J61l42M44
$$ -45 -115 -96 -413 43 -45 -297 35 -20 -29 154 257 -305 -250 -29 -236 103 -73 15 -86 -7 154 -188 256
2175B56l0k06K39n16P6K60M5j94k03L18J79j35r4k1O9J04R7n51J52L45R4k61r5
$$ 256 226 20 259 -257 -181 79 124 -70 -273 45 224 89 -5 -26 43 147 244 -307 -155 190 284 23 -72
2198g2q8J23L62mo87qM04L29l52k49n0L30K45k38j72J38l5K79l91K74j64R4q7
$$ -72 -160 -37 325 321 -366 -374 30 359 7 -242 -292 38 283 45 -127 11 -24 255 -136 138 -26 68 -19
2221a9k23KN0K69j16p7j22K01K03J4n48J35J41L40l78J5j58M36k81j73k50M08
$$ -19 -242 -240 -190 79 -37 -114 -236 -35 168 182 -366 -231 -90 250 -128 -113 -271 165 -116 -289 -539 -131
2243a31J28N44o72j91N5K54r7j62J78K19M59n82L3m76L80J35P0l19j17M00J39
$$ -131 -3 541 -131 -322 -267 -13 -110 -272 -94 125 584 2 35 -441 -61 74 144 -175 -292 108 247
2264B47k93l6m0J90J40j06l84L54J5q8J00k91R2N02k3l36k39L39L64m47k70N9
$$ 247 -46 -82 -122 68 208 102 -282 72 87 -1 99 -192 -100 402 379 43 -196 143 507 60 -210 -151
2286a51K02L54j49m85M0O32j91j67n35K15J55N17l37o34O27J83L9l87K96m51N35
$$ -151 51 405 256 -229 -189 443 252 85 -450 -235 -80 437 100 -534 93 276 315 -72 224 -227 308
2307C08J86r68K14L44J77J8mm38M41L9j79m44R8L91J52k10J12l91J53J33k35j73
$$ 308 494 -474 -260 84 261 279 275 -163 278 317 138 -306 -208 183 335 125 237 -154 -1 132 -103 -276
2329b76L9L73k44l2k47M38J00j01m0m05K03M80m97P6r2L92J24J1n03J40J05r5
$$ -276 -237 136 -108 -140 -387 51 151 50 10 -395 -192 288 -209 -133 -225 167 291 302 -201 -61 44 -51
2351e1J70l72k13N30J10J35m71L1M24Km55l08K85K69n4l91R3L55j31L7L6k21M1
$$ -51 119 -253 -466 64 174 309 -162 -131 293 295 -160 -468 -183 86 32 -359 -266 89 -42 -5 31 -190 -149
2374a49K06K89m25L1J27M1n9l1p4K35L79o00j39L81j23L14n71j56J12N43Q6k63
$$ -149 57 346 -79 -48 79 120 61 30 -44 191 570 -30 -169 212 89 403 -168 -324 -212 331 417 154
2396A54m67M69q7K96j15n08k7O53J8k88o22O88k92K65k13O7Q5L09k59j34k98M16
$$ 154 -313 156 69 365 250 -258 -285 368 386 98 -524 164 -128 137 -76 -9 76 385 126 -8 -306 110
2418A10M44l50k38l13N34q4k31k35o2L50K29r2k88J86M93l07k71J59rM9J70m63
$$ 110 554 204 -34 -347 187 103 -128 -363 -425 -75 154 62 -226 -40 453 146 -125 34 25 74 244 -219
2440b19ML17J33l67j40K33M12m07L32n04k05L63N76o32j01K99K31k54j59r7n8
$$ -219 -215 102 235 -132 -272 -39 373 -34 298 -206 -411 -48 528 -104 -205 94 325 71 -88 -185 -243
2461b43L65J90o05L6M34j72j8j82m2L08M92j92p44L12L47p0q1l85P1M05J15l42
$$ -243 122 312 -293 -257 177 5 -13 -195 -237 71 563 371 -373 -61 286 216 135 -250 -179 226 341 -1
2483al36j28N97Q8j17k47J54j2K44m80L51K42j78o9rk15L43kj8o93L01J97K59
$$ -1 -337 -465 132 220 103 -144 10 -2 242 -238 113 355 177 108 99 -116 227 225 207 -486 -185 12 271
2506B71j7k96j02N48k5o34J83q5J93J73m01j43J98M01j02m72j5K25j01M05p6k50
$$ 271 254 -42 -144 404 379 -255 -72 -157 36 209 -192 -335 -137 264 162 -310 -325 -100 -201 204 128 -122
2528a22P7K97r1n85L58JK89j08l49J39k8J23Nn0lK99J14k55n84J32O50k52j04
$$ -122 -45 252 161 -424 -66 -65 224 116 -233 -94 -122 1 6 -44 -47 252 366 111 -473 -341 309 57 -47
2551d7J6J05p5L93n60Q3J80j03L14R2m23l12K65J43j56k05qN68j48k56j75K55
$$ -47 -31 74 -1 392 -168 -85 95 -8 306 398 -25 -337 -72 71 -85 -290 -298 270 122 -134 -309 -54
2573e4K00k7j11j7P5K71l62l05L19K91J10n08k5J8N6k3J07r7M52j36q6k52j36
$$ -54 146 119 8 -9 66 337 -25 -330 -11 280 390 -118 -143 -125 -69 -92 15 -82 370 234 148 -104 -240
2596b40L38KMk9l13L83qp7k03N2Q9K90k02k96P4N0J98j00j85J64J09K24n04J59
$$ -240 98 100 104 75 -238 145 137 60 -143 -91 -2 288 86 -210 -136 -86 112 12 -173 -9 100 324 -180 -21
2620b1J48Q2K53n06l86O8P53n27L1J13j06J19M7j32k00M00n3N3J20k77j51M35
$$ -21 127 209 462 -44 -430 -362 391 -136 -105 8 -98 21 68 -64 -264 136 83 136 256 -21 -172 263
2642B63k27k22kK85J66l33k81J51J66L22j10n88K73L74N9l37j37J53K92k07l7
$$ 263 36 -186 -188 97 263 -70 -351 -200 -34 288 178 -410 -137 237 296 -41 -178 -25 267 60 23
2663B3l20M25m2o2m98K87M58O6k84l78J20K06K42j10j78l18K13K50k64j51K38
$$ 23 -297 128 86 24 -474 -187 271 337 53 -325 -205 1 243 133 -45 -363 -150 100 -164 -315 -77
2684g7q9K78L8m44K48R4O8p3j77Q3K30K44m38j4K0p8K70l05j96K03L70k81j90
$$ -77 -166 112 150 -294 -46 48 116 43 -134 -51 179 423 -15 -29 -9 -87 183 -122 -318 -115 255 -26 -216
2707b16L02J75k99J01j81K4q8N36l25k19J15M18l9l87q3K35J84j65Q2l07J12K03
$$ -216 86 261 -38 63 -118 -94 -182 354 29 -190 -75 343 304 -83 -166 69 253 88 170 -137 -25 178
2729A78j09l1j52K01m6J16l30L9m6J96Jj43K56L3P5k70P5k15Q9N45l72j8o0L5
$$ 178 69 38 -114 87 41 157 -173 -134 -180 16 17 -126 130 163 238 -32 43 -172 -83 462 90 72 12 47
2753D7L65n30K22l35K42J36q0nL7j08J0K28k60J21K15n10J93K28j13K1M9l85O4
$$ 47 412 -118 104 -231 11 147 67 62 99 -9 1 229 -31 90 305 -205 -12 216 103 124 173 -212 -148
2776a48L82j08N7j83M8k12J31k07lJ59K75k8j47m8P5k0o8m4n8M30k95J19k19L6
$$ -148 234 126 183 0 48 -164 -33 -240 -243 -84 191 163 16 -32 43 23 -45 -89 -147 283 -12 107 -112 -76
2800g6N5M2O9J42k64j68oM47j25R2K2jL5m14j90L08R8l02L44j38K30j14j60k40
$$ -76 -21 21 90 232 -32 -200 -206 241 116 208 230 229 264 -150 -340 -32 66 -236 108 -30 200 86 -74 -314
2824c14M15j43J61l38J89n1L1j6J25k66K59J20j99M1l19K77r5p4J12R7L81q5j92
$$ -314 101 -42 119 -219 -30 -81 -50 -66 59 -207 52 172 -27 14 -305 -28 -123 -197 -85 12 393 308 116
2847A16J04m40J81J00j09n7k01M95J2m53RL82j97K05l59J55l47N02l8q0P7J25
$$ 116 220 -220 -39 61 -48 -105 -306 189 201 -252 -243 139 -58 147 -212 -57 -404 98 60 -20 57 182
2869A82l08J18Q4j95L70j59k24R1K11J24j03m31K54l15M10j85r0J51J76r3R1j73
$$ 182 -126 -8 76 -119 251 92 -132 -41 170 294 191 -240 14 -301 109 -76 -166 -15 161 68 159 -14
2891a4j20Q1J43p4r8J36j2j10r4K99k98K36J67k36q7K28j6KL19k55j94J08K58
$$ -14 -134 -53 90 16 -82 54 42 -68 -162 137 -161 75 242 6 -81 147 131 133 452 197 3 111 369
2914C69m32K35o0j86R0q4J02n6L43l28p3k74K38Q1L98l92rq8K08O9j8n4L9N8k95
$$ 369 -63 172 112 -74 16 -68 34 -22 321 -7 -80 -354 -116 -35 363 -29 -38 -126 82 151 133 79 118 176 -119
2939a19J06n1J28j18k4j79j0M22k2l14K12j23M58k88r4n7k17N84l46p3J42k15
$$ -119 -13 -64 64 -54 -78 -257 -267 155 133 -181 31 -92 366 78 -16 -73 -290 294 -52 -125 17 -198
2961a98L66j86l81M36p3J99j87O4J66r9k49K33n8K44k88J57q2j56l42L80J78l30
$$ -198 168 -18 -399 37 -36 163 -24 40 206 107 -142 91 33 277 -11 146 64 -92 -434 -54 124 -206
2983b06J62k31K91L6k55KN9N8J91k52J64K74k4j53j78j94L81M6j82l7o1l2J57
$$ -206 -44 -275 16 52 -203 -201 -142 -84 107 -145 19 293 269 116 -62 -256 125 171 -11 -48 -109 -141 16
3006A6R9q4n6J7K57j99n1M2J81k68j16L74m7m34N34o23N08j18m52N37m1j2j7K02
$$ 16 115 31 -25 -8 249 50 -1 41 222 -46 -162 212 165 -269 265 -358 150 32 -420 117 76 64 47 249
3030B49l37J97j18nq9j72M49l03K22O9k05M6J78l6m71L12J5Q5o3l00K83J14j57
$$ 249 -88 109 -9 -14 -103 -275 174 -129 93 162 -43 3 181 145 -326 -14 1 86 23 -277 6 120 -37
3053c7m1K79l76J73J51k21M7k21J23n9J6Q5QK1N6Q6L5k11l17L16K52k22K7L01
$$ -37 -78 201 -175 -2 149 -72 -25 -246 -123 -182 -166 -81 -73 -52 4 90 125 -86 -403 -87 165 -57 -30 271
3077B71m15K75k32J28j57J52O9j37k74N01p1j05M3k94N9N22k92K08j55l2K50j28
$$ 271 -144 131 -101 27 -130 22 91 -46 -320 181 110 5 48 -246 -187 335 43 251 96 64 314 186
3099A86j85J49mJ02K8l22L16l60L30j25n6l16K29K4O1o4K23k2j17k50K14L22l26
$$ 186 1 150 146 248 276 -46 270 -90 240 115 59 -257 -28 -4 57 -7 216 194 77 -173 41 363 37
3122C7K05l20O4n0M15m23J17j53L28j16l67R8k9K48l3j45L39j99p5L1J12P3o9
$$ 37 242 -78 -14 -64 351 -72 45 -108 220 104 -263 -165 -194 54 21 -124 215 16 -59 -28 84 157 88
3145H8q5J72%j11j28M00j07k80J73J6J01k09k5m2K88o5l4j32R5j24J14o5j68L52
$$ 88 3 175 175 64 -64 336 229 -51 122 138 239 30 5 -37 251 186 152 20 115 -9 105 40 -128 224
3169B24n0l18j76J21R9L23J52m71K72k68pL02m17J23J29pl71N50N8o7j61K56l13
$$ 224 174 -144 -320 -199 -100 223 375 -96 176 -92 -99 203 -214 -91 38 31 -340 210 268 201 40 296 -17
3192a7K91N1m84L32j92K7J86l08N4N9j05K82l33N05o25N40q2k93Q8p2j0P9j3l51
$$ -17 274 325 -159 173 -19 8 194 -114 -60 -1 -106 176 -157 348 -277 263 181 -112 -24 -96 -106 -27 -40 -391
3216c91L85j45K65l15R5M12r5n9j5j42j1l47N24j88j4J52J56j66J02m52L9L06
$$ -391 -6 -151 114 -201 -106 306 211 152 137 -5 -16 -363 161 -27 -41 111 267 101 203 -249 -210 96
3238I6k46J23J34J34j81J3M5R8n21M59k49R2o5p5K28j54j64L51J04k57K8O2j00
$$ 96 -150 -27 107 241 60 73 118 216 -305 154 -95 -3 -68 -143 85 -69 -233 118 222 -35 -7 55 -45
3261d5j66Q3J01j13q2L03K1N4l77K88q8p5K6o2Q3J07j68L00k71J17kk43K37j07
$$ -45 -211 -128 -27 -140 -222 81 102 156 -221 67 -21 -96 -70 -132 -49 58 -110 190 -81 36 34 -209 28 -79
3285g9p0M9J68j05Q4p1J96m05Q0J57O3j48k89P88n61J12L38k99l2j23K85l05R2
$$ -79 -149 -100 68 -37 47 -24 172 -233 -153 4 67 -81 -370 418 -143 -31 307 8 -24 -147 138 -167 -75
3308g5k17O8J44r8L58J55n31n1L30q3q0O6M1R4m0l77J37o1J42N8K38l98K99l23
$$ -75 -292 -224 -80 -178 180 335 -196 -247 83 0 -80 -14 27 121 81 -296 -159 -220 -78 -20 218 -180 119 -204
3332b04M53m19L72q0j46k7M25j91k02J24m8j29L28l30NJ39k6j38Q2j21j32L35
$$ -204 249 -170 202 122 -24 -51 374 183 -19 105 57 -72 256 -74 -69 70 44 -94 -12 -133 -265 70
3354G0m7k51J71mQ3k95K40J58j09J78l06J96J5j25J07l9Rj51J28J57l37N8j58
$$ 70 23 -228 -57 -61 22 -273 -33 125 16 194 -112 84 99 -26 81 42 51 -100 28 185 -152 -94 -252
3377b52Q6J72J02l15J93k07L29l86N93k6l00J61j56q4j14K82k78m7K64j75o9j2
$$ -252 -166 6 108 -207 -14 -221 108 -278 315 289 -11 150 -6 -90 -204 78 -200 -247 17 -158 -227 -239
$$ [...]
8191c5
##END NTUPLES=NMR FID
##END=
