##TITLE=1H_EC-3080x
 DMSO, 8 sc, 
 24.10.2019
##JCAMPDX= 6.0         $$ Bruker NMR JCAMP-DX V2.0
##DATA TYPE= NMR FID
##DATA CLASS= NTUPLES
##ORIGIN= UXNMR, Bruker Analytische Messtechnik GmbH
##OWNER= root
$$ XWIN-NMR		Version 3.5
$$ Thu Oct 24 15:01:12 2019 Russian Standard Time (UT+4h)  she@DPX200
##.OBSERVE FREQUENCY= 200.1315
##.OBSERVE NUCLEUS= ^1H
##.DELAY= (6, 6)
##.ACQUISITION MODE= SIMULTANEOUS
##.ACQUISITION SCHEME= undefined
##.AVERAGES= 8
##.DIGITISER RES= 18
##SPECTROMETER/DATA SYSTEM= spect
##.PULSE SEQUENCE= zg30
##.SOLVENT NAME= DMSO
##.SHIFT REFERENCE= (INTERNAL, DMSO, 0, 15.7039)
##AUDIT TRAIL= $$ (NUMBER, WHEN, WHO, WHERE, WHAT)
$$ ##TITLE= Audit trail, XWIN-NMR		Version 3.5
$$ ##JCAMPDX= 5.01
$$ ##ORIGIN= Bruker BioSpin GmbH
$$ ##OWNER= she
$$ F:/spectra/data/she/nmr/H-F/1/audita.txt
$$ ##AUDIT TRAIL=  $$ (NUMBER, WHEN, WHO, WHERE, WHAT)
(   1,<2019-10-24 15:00:15.35 +0400>,<she>,<DPX200>,
      <created by zg, POWCHK disabled, PULCHK disabled
       configuration hash MD5:
       00 E9 B6 7A A2 85 ED C7 34 08 36 98 17 FE 4E 26
       data hash MD5: 16K
       3A A3 1E 46 9D 96 CE F9 87 99 74 1B 00 22 32 FB>)
$$ ##END=
$$ 
$$ hash MD5
$$ 77 3F 2B C0 B3 AF 5F 86 BD 94 D5 81 AD 7D 98 68
##$RELAX= 
##$RELAX= 
##$RELAX= 
##$RELAX= 
##$RELAX= 
##$RELAX= 
$$ Bruker specific parameters
$$ --------------------------
##$DU= <F:/spectra>
##$EXPNO= 1
##$NAME= <H-F>
##$PROCNO= 1
##$TYPE= <nmr>
##$USER= <she>
##$AMP= (0..31)
100 100 100 100 100 100 100 100 100 100 100 100 100 100 100 100 100 100 
100 100 100 100 100 100 100 100 100 100 100 100 100 100 
##$AQSEQ= 0
##$AQ_mod= 1
##$AUNM= <au_zg>
##$AUTOPOS= <>
##$BF1= 200.13
##$BF2= 200.13
##$BF3= 200.13
##$BF4= 200.13
##$BF5= 200.13
##$BF6= 200.13
##$BF7= 200.13
##$BF8= 200.13
##$BYTORDA= 1
##$CFDGTYP= 0
##$CFRGTYP= 5
##$CHEMSTR= <none>
##$CNST= (0..31)
1 1 145 1 1 1 1 1 1 1 1 1 1 1 1 1 1 1 1 1 1 1 1 1 1 1 1 1 1 1 1 1 
##$CPDPRG= <>
##$CPDPRG1= <>
##$CPDPRG2= <>
##$CPDPRG3= <>
##$CPDPRG4= <mlev>
##$CPDPRG5= <mlev>
##$CPDPRG6= <mlev>
##$CPDPRG7= <mlev>
##$CPDPRG8= <mlev>
##$CPDPRGB= <>
##$CPDPRGT= <>
##$D= (0..31)
0 1.2 0 0 0 0 0 0 0 0.06 0 0.03 0 0 0 0 0.0002 0 0 0 0 0 0 0 0 0 0 0 0 
0 0 0 
##$DATE= 1571914814
##$DBL= (0..7)
120 120 120 120 120 120 120 120 
##$DBP= (0..7)
150 150 150 150 150 150 150 150 
##$DBP07= 0
##$DBPNAM0= <>
##$DBPNAM1= <>
##$DBPNAM2= <>
##$DBPNAM3= <>
##$DBPNAM4= <>
##$DBPNAM5= <>
##$DBPNAM6= <>
##$DBPNAM7= <>
##$DBPOAL= (0..7)
0.5 0.5 0.5 0.5 0.5 0.5 0.5 0.5 
##$DBPOFFS= (0..7)
0 0 0 0 0 0 0 0 
##$DE= 6
##$DECBNUC= <off>
##$DECIM= 24
##$DECNUC= <off>
##$DECSTAT= 4
##$DIGMOD= 1
##$DIGTYP= 9
##$DL= (0..7)
0 120 120 120 120 120 120 120 
##$DP= (0..7)
150 150 150 150 150 150 150 150 
##$DP07= 0
##$DPNAME0= <>
##$DPNAME1= <>
##$DPNAME2= <>
##$DPNAME3= <>
##$DPNAME4= <>
##$DPNAME5= <>
##$DPNAME6= <>
##$DPNAME7= <>
##$DPOAL= (0..7)
0.5 0.5 0.5 0.5 0.5 0.5 0.5 0.5 
##$DPOFFS= (0..7)
0 0 0 0 0 0 0 0 
##$DQDMODE= 0
##$DR= 18
##$DS= 0
##$DSLIST= <SSSSSSSSSSSSSSS>
$$ [...]
##$SUBNAM2= <"">
##$SUBNAM3= <"">
##$SUBNAM4= <"">
##$SUBNAM5= <"">
##$SUBNAM6= <"">
##$SUBNAM7= <"">
##$SUBNAM8= <"">
##$SUBNAM9= <"">
##$SW= 24.0689530833862
##$SWIBOX= (0..15)
0 0 2 0 0 0 0 0 0 0 0 0 0 0 0 0 
##$SW_h= 4816.95568400771
##$TD= 16384
##$TD0= 1
##$TE= 0
##$TE2= 300
##$TE3= 300
##$TEG= 300
##$TL= (0..7)
0 120 120 120 120 120 120 120 
##$TP= (0..7)
150 150 150 150 150 150 150 150 
##$TP07= 0
##$TPNAME0= <>
##$TPNAME1= <>
##$TPNAME2= <>
##$TPNAME3= <>
##$TPNAME4= <>
##$TPNAME5= <>
##$TPNAME6= <>
##$TPNAME7= <>
##$TPOAL= (0..7)
0.5 0.5 0.5 0.5 0.5 0.5 0.5 0.5 
##$TPOFFS= (0..7)
0 0 0 0 0 0 0 0 
##$TUNHIN= 0
##$TUNHOUT= 0
##$TUNXOUT= 0
##$USERA1= <user>
##$USERA2= <user>
##$USERA3= <user>
##$USERA4= <user>
##$USERA5= <user>
##$V9= 5
##$VALIST= <valist>
##$VCLIST= <CCCCCCCCCCCCCCC>
##$VD= 0
##$VDLIST= <DDDDDDDDDDDDDDD>
##$VPLIST= <PPPPPPPPPPPPPPP>
##$VTLIST= <TTTTTTTTTTTTTTT>
##$WBST= 1024
##$WBSW= 4
##$XGAIN= (0..3)
0 0 0 0 
##$XL= 0
##$YL= 0
##$YMAX_a= 152930
##$YMIN_a= -303603
##$ZGOPTNS= <>
##$ZL1= 120
##$ZL2= 120
##$ZL3= 120
##$ZL4= 120
##$ABSF1= 10
##$ABSF2= 0
##$ABSG= 5
##$ABSL= 3
##$ALPHA= 0
##$AQORDER= 0
##$ASSFAC= 0
##$ASSFACI= 0
##$ASSFACX= 0
##$ASSWID= 0
##$AUNMP= <proc_1d>
##$AZFE= 0.1
##$AZFW= 0.1
##$BCFW= 1
##$BC_mod= 2
##$BYTORDP= 1
##$COROFFS= 0
##$CY= 11.3945322036743
##$DATMOD= 1
##$DC= 2
##$DFILT= <>
##$DTYPP= 0
##$F1P= 20.1720416913024
##$F2P= 0.152960286110954
##$FCOR= 0.5
##$FTSIZE= 0
##$FT_mod= 4
##$GAMMA= 1
##$GB= 0.15
##$INTBC= 1
##$INTSCL= 1
##$ISEN= 128
##$LB= 0.24
##$LEV0= 0
##$LPBIN= 0
##$MAXI= 10000
##$MC2= 0
##$MEAN= 0
##$ME_mod= 0
##$MI= 1.114404
##$NCOEF= 0
##$NC_proc= 0
##$NLEV= 6
##$NOISF1= 3.799351
##$NOISF2= 2.8
##$NSP= 1
##$NTH_PI= 0
##$NZP= 0
##$OFFSET= 15.70392
##$PC= 1
##$PHC0= -9573.437
##$PHC1= 16.60082
##$PH_mod= 1
##$PKNL= yes
##$PPARMOD= 0
##$PSCAL= 0
##$PSIGN= 0
##$REVERSE= no
##$SF= 200.130013532006
##$SI= 16384
##$SIGF1= 3
##$SIGF2= 2
##$SINO= 400
##$SIOLD= 16384
##$SREGLST= <1H.CDCl3>
##$SSB= 0
##$STSI= 0
##$STSR= 0
##$SW_p= 3612.71676300578
##$SYMM= 0
##$S_DEV= 0
##$TDeff= 0
##$TDoff= 0
##$TI= <>
##$TILT= no
##$TM1= 0
##$TM2= 0
##$TOPLEV= 0
##$USERP1= <user>
##$USERP2= <user>
##$USERP3= <user>
##$USERP4= <user>
##$USERP5= <user>
##$WDW= 1
##$XDIM= 8192
##$YMAX_p= 0
##$YMIN_p= 0
$$ End of Bruker specific parameters
$$ ---------------------------------
##NTUPLES= NMR FID
##VAR_NAME=  TIME,          FID/REAL,        FID/IMAG
##SYMBOL=    X,             R,               I
##VAR_TYPE=  INDEPENDENT,   DEPENDENT,       DEPENDENT
##VAR_FORM=  AFFN,          ASDF,            ASDF
##VAR_DIM=   8192,          8192,            8192
##UNITS=     SECONDS,       ARBITRARY UNITS, ARBITRARY UNITS
##FACTOR=    0.0002076,     1,               1
##FIRST=     0,             0,               0
##LAST=      1.7004516,     0,               0
##MIN=       0,             -303603,         0
##MAX=       1.7004516,     152930,          0
$$ Real data points
##PAGE= N=1
##DATA TABLE= (X++(R..R)), XYDATA
0@%%%%%%Qj6J6k0K8l2M0n6P0q3R5j14J36j60J92k24K56k96L44l93M48n10N78o54
$$ 0 0 0 0 0 0 0 8 -8 8 -12 16 -16 24 -32 38 -45 50 -64 72 -88 104 -120 136 -160 184 -209 239 -271 307 -347
30c47P38q32R36j047J168j304J451j612J791j986K200k437K699k989L311l670
$$ -347 391 -441 495 -552 616 -688 763 -849 942 -1044 1156 -1281 1418 -1571 1740 -1930
46a930M074m531N053n659O369p211Q232r505J1141j3332J6440k1226K9650m8857
$$ -1930 2144 -2387 2666 -2993 3376 -3835 4397 -5108 6033 -7299 9141 -12085 17565 -31292
60c1292J72130J2092l17127j2560J17823J38405Q155L835o386k2860r6442o6730
$$ -31292 140838 152930 -164197 -176757 -58934 79471 87626 91461 85075 62215 -34227 -100957
72a00957J5957J07510Q9128J3473q1218r4411m6784K6743M8043M7980L6753J5712
$$ -100957 -85000 22510 111638 125111 43893 -50518 -97302 -70559 -22516 25464 62217 77929
84G7929m5811r1506o2167M3262J05674N9458l4166n6559k1741p014k7816r221
$$ 77929 32118 -59388 -121555 -78293 27381 86839 52673 -3886 -25627 -32641 -60457 -69678
96f9678N7281Q5679J5365p6576q3447o687M9094M0282J2553K922k944k1304l7375
$$ -69678 -12397 73282 88647 12071 -71376 -78063 -28969 11313 23866 26788 23844 2540 -34835
109c4835k7649P937M8640N6934J6437m8775p2660k4517M1483M9430R519j0493
$$ -34835 -62484 -54547 -5907 51027 67464 18689 -53971 -78488 -37005 12425 21944 11451
121A1451R35k142k8015l7086k145M1838N0746J8853k4850m9400m0646n18M4433
$$ 11451 12386 10244 -17771 -54857 -57002 -15164 35582 54435 29585 -19815 -60461 -60979 -16546
134a6546N2325J6340k6008l8184k2697k083J4658K7660L0598R087k6403l8619
$$ -16546 35779 52119 26111 -12073 -34770 -36853 -22195 5465 36063 45150 18747 -19872
146a9872j5320J1457J7857J7654K2081J0922k4299n0267k6782K8617N5878K6029
$$ -19872 -35192 -23735 -5878 11776 33857 44779 20480 -29787 -56569 -27952 27926 53955
158E3955k1862l8381k0186O135J5624O852M35R669J6166o265l9535l3018J9578
$$ 53955 32093 -6288 -26474 -20339 -4715 2137 2572 12241 28407 22142 -17393 -50411 -30833
171c0833N5831K5172l4182m0781M671K7560j824k4387J037L6205K5489k3590m5871
$$ -30833 24998 50170 15988 -24793 -20122 7438 5614 -18773 -17736 18469 43958 20368 -25503
184b5503j2911L0982L3363J235j8998q514O578K649j3134r724J5751K7668N432
$$ -25503 -38414 -7432 25931 27166 8168 -346 6232 8881 -4253 -13977 1774 29442 34874
197C4874k3514k2409K844J5639K772r301O357K5136L464l8829l8358J5162N3754
$$ 34874 11360 -11049 -8205 7434 10206 905 7262 32398 35862 -2967 -41325 -26163 27591
210B7591K3769l2635m0261K726K8545K866k5223p545K8149K7104j3277m2903k4684
$$ 27591 51360 18725 -21536 -18810 9735 12601 -12622 -20167 7982 35086 21809 -21094 -45778
223d5778K1204M1386J4296k2398k6431k525J2876J793j0149M474K3900R117k4321
$$ -45778 -24574 16812 31108 8710 -17721 -20246 -7370 -5577 -15726 -11252 12648 21765 -2556
236b556k9716J499K6566J7426n933j2264r69K939q029r048P609J9804R481j2999
$$ -2556 -32272 -30773 -4207 13219 7286 -4978 -5947 -3008 -11037 -20085 -12476 7328 16809 3810
250C810j9281m545J2140R780k351l474L326N136m126j2221o940R309J9308P081
$$ 3810 -15471 -20016 -7876 1904 -447 -3921 -595 4541 415 -11806 -18746 -9437 9871 16952
264A6952j5476j8873J998J8413Q270j2235j2434P900J8193J073j6910j3542N181
$$ 16952 1476 -17397 -15399 3014 11284 -951 -13385 -5485 12708 13781 -3129 -16671 -11490
277a1490J6113J1961l507j5300r293O358J1981J434q831l586J0369R122q047j7374
$$ -11490 4623 16584 13077 -2223 -11516 -5158 6823 8257 -574 -4160 6209 15331 7284 -10090
291a0090k861J4320J4144o09j1350p555N52K801m46K362Q271M151q292j3972l628
$$ -10090 -12951 1369 15513 14904 3554 -4001 -3449 -648 -1094 1268 9539 13690 5398 -8574 -12202
306a2202J0795J1718j187p694k347L265l42q275m383R185J7380K445k0247k0144
$$ -12202 -1407 10311 9124 1430 -917 2348 2006 -6269 -10652 -1467 15913 18358 -1889 -22033
320b2033P306K5810Q466j8108j5305R120J7740l868k1456m626K0984J9324r038
$$ -22033 -14727 11083 19549 1441 -13864 -4744 12996 9128 -12328 -16954 4030 23354 14316
333A4316k5041r944J7606K0748k487j9933p946J4248J3220p692j6130k99J6546
$$ 14316 -10725 -20669 -3063 17685 15198 -4735 -12681 1567 14787 7095 -9035 -9334 7212
346G212Q652j1497j3898M403J2895J184j0930n508R108R691n883j4293p92J4868
$$ 7212 15864 4367 -9531 -5128 7767 8951 -1979 -7487 1621 11312 5429 -8864 -9656 5212
360E212O651j2511j1834P422J6344L3j8905j1694J2808J9801L06j8701j2745Q105
$$ 5212 11863 -648 -12482 -5060 11284 11317 -7588 -19282 -6474 13327 13633 -5068 -17813 -9708
374i708J6701K141j4634r577J1319J5018n634j9122n935J6038J6715m699j7804
$$ -9708 6993 9134 -5500 -15077 -3758 11260 5626 -13496 -19431 -3393 13322 8623 -9181
387i181o803R828R756j915n517r80M371J694m579n005L158Q110K437m632m770
$$ -9181 -15984 -6156 3600 1685 -3832 -4812 -441 1253 -3326 -8331 -5173 2937 5374 742 -4028
402d028K15K759O36J92K573L120j745o781k509M708P476K027o265o269J427P369
$$ -4028 -3813 -1054 -418 -226 2347 5467 3722 -3059 -5568 -860 6616 8643 2378 -3891 -2464 4905
418D905K279n563m355L157O182K98o647n572L509P409K242n033p213j335P089
$$ 4905 7184 1621 -2734 423 6605 6903 256 -5316 -1807 5602 7844 2811 -4402 -5737 1352
433A352P612l131j0893l153Q076Q077k359r641l676O653O835k279p873j587O325
$$ 1352 8964 5833 -5060 -8213 -137 7940 5581 -4060 -7736 -1083 5752 3473 -4400 -5987 338
448C38N959l163r218j692Q421O939l846p870j347N239K722k364k579K982L046
$$ 338 6297 3134 -6084 -7776 645 7584 3738 -4132 -5479 -240 2482 118 -2461 521 3567
463C567k459o298l11O892N136l901p460p2P553K798p826n592P610R671k871j3360
$$ 3567 1108 -5190 -5501 1391 6527 2626 -4834 -4906 2647 5445 -2381 -7973 -363 9308 6437 -6923
479f923n029J0277J3276k442j4141o306R337J0648j562j1437m365R919J0117n919
$$ -6923 -11952 -1675 11601 9159 -4982 -11288 -1951 8697 7135 -4302 -8667 1252 11369 5450
493E450j3197j306J2343Q941o506j1839o85R502N771n070o704J860N527k67m925
$$ 5450 -7747 -9053 3290 12231 5725 -6114 -6799 2703 8474 3404 -3300 -1440 4087 3820 -1105
508a105k014M548M474l694o646N36O968J921o037m467L549O110j362q238k314
$$ -1105 -3119 1429 5903 2209 -4437 -3901 3067 4988 -1049 -5516 -1967 4143 2781 -5457 -7771
523g771P310O622l928r510k834Q137Q555k664j0429l884P936P263l064p617m92
$$ -7771 -461 6161 2233 -7277 -10111 -1974 6581 3917 -6512 -10396 -2460 4803 1739 -5878 -6370
538f370O288M049m346n370P54N949L312j890m468j857K616M240R79k494j051L66
$$ -6370 -82 3967 -379 -5749 -4995 954 4266 2376 -2092 -3949 -1333 2907 3886 1392 341 707
554G07J37O21J140J33j70r52r0P52j49j684L70K198J105k492k815m37J542K721
$$ 707 844 1465 2605 2738 2568 1616 1526 2278 2129 445 815 3013 4118 1626 -1189 -1626 -84 2637
572B637K55k552l134J84J913J764j90j751j828k79J251J905k37k341j902L700
$$ 2637 2892 340 -2794 -2610 -697 1067 877 -874 -2702 -2981 -1730 175 -62 -2403 -4305 -605
588f05L045k978m569q1N858L956k819o517k208N760O286j501o288l000M116O027
$$ -605 2440 -538 -5107 -5188 670 4626 1807 -4710 -6918 -1158 5128 3627 -2661 -5661 -1545 4482
604D482j238o420q29N642L137l819m758N24N005K697k790m225K34L400P64j699
$$ 4482 3244 -3176 -4005 1637 4774 955 -3803 -3279 1726 4423 1633 -2592 -2358 1042 1806 107
620A07j043J782J619k288l466J923N348L81n429k968L648M742j253m413j361M497
$$ 107 -936 846 2465 177 -3289 -1366 3982 4363 -1066 -4034 -386 4356 3103 -1310 -2671 1826
636A826M273l452o314j29O956M806l916q073j269Q061N352m536o892N89N763J921
$$ 1826 6099 2647 -3667 -3796 3160 7966 4050 -4023 -5292 2769 8121 3585 -3307 -2718 3045 4966
652D966l715m523J694M727R81m400l029J261L232J043k543j976J004P61j402p51
$$ 4966 1251 -3272 -1578 3149 4130 -270 -3299 -2038 1194 2237 -306 -2282 -1278 -517 -1919 -2670
668b670K622J260k176l712M46L720K124k565l393O18L874R97k809k710J535M489
$$ -2670 -48 1212 -964 -4676 -4230 -510 1614 -951 -4344 -3726 148 1145 -1664 -4374 -2839 1650
684A650J655m668l916K539N546J421m280k366J018L045O81j034j063O37Q08m30
$$ 1650 3305 -1363 -5279 -2740 2806 4227 -53 -2419 -1401 1644 2325 1291 228 865 1673 1243
700A243lo03k46J445Q73q38j199o78n54J147K205Pl147k091J336K897Q12k375
$$ 1243 1240 637 391 1836 2709 1871 672 -6 -560 587 2792 2799 -348 -2439 -1103 1794 2606 231
718B31k667N40K838L53k284j516J263K276J52k819j936J374K831L87j980j144
$$ 231 -2436 -1896 942 1295 -989 -2505 -1242 1034 1186 -1633 -3569 -2195 636 1023 -957 -2101
734b101M01O14N57K36Q61l35k288o78K919J980r73k815q19K205K189m20l099n63
$$ -2101 -1700 -1086 -529 -293 568 233 -2055 -2733 186 2166 1193 -1622 -2441 -236 1953 1533 -1566 -2129
752b129L154K339j926l981q03M476L771k298n050l49L662K405j479k174p18K192
$$ -2129 1025 3364 1438 -2543 -3346 1130 4901 2603 -2447 -2796 866 3271 1792 -382 -1100 1092
768A092J049j492k074J813J987m2j771j629P86J654q3p96L75O74j186j758P81
$$ 1092 2141 649 -1425 388 2375 2333 562 -1067 -281 1373 1290 494 869 1543 357 -1401 -620
785f20K328J133j703k649l97K935J726j987k666O17L101J049l374l544K113M885
$$ -620 1708 2841 1138 -1511 -1908 1027 2753 766 -1900 -1283 1818 2867 -507 -4051 -1938 2947
801B947L44m394k813J966L331nk379j622R68J400L17j277m83L42O18K29j256K17
$$ 2947 3291 -1103 -3916 -1950 1381 1376 -1003 -2625 -1657 -257 60 -1217 -1700 -1358 -740 -511 -1767 -1550
819a550J241J9j191M15J350k94j897K41J885J654r92k645n89K403L051r95k787
$$ -1550 -309 -290 -1481 -1066 284 -10 -1907 -1666 219 1873 881 -1764 -2353 50 3101 2106 -681
836f81j153K189K359q63k512j25K771R32k273j945J091K119P14j260j542q3Q90
$$ -681 -1834 355 2714 1851 -661 -786 1985 2917 644 -1301 -210 1909 2623 1363 -179 -262 628
853F28M27M54N0j062l67K6m26O76R35m10j799L0J665k4j742o27J470K071p40k631
$$ 628 1055 1509 1559 497 130 156 -270 406 1341 931 -868 -838 827 803 -939 -1566 -96 1975 1235 -1396
873a396j796K290K564m06j979j849Q25K417K88k288o95J601J098o98j333j63J092
$$ -1396 -3192 -902 1662 1256 -723 -2572 -1747 670 958 -1330 -2025 -424 674 -24 -1357 -1520 -428
890d28P73m88n48k33K69k4J63Q45j80N6p87o51J327J435n84k270n35K378J635
$$ -428 345 -143 -691 -924 -655 -679 -516 329 149 205 -582 -1233 94 1529 945 -1325 -1860 518 2153
909B153j000k320N7K116J093j897j716Q17K444O80j807k335R4K848J101j821j618
$$ 2153 1153 -1167 -1110 1006 2099 202 -1514 -697 1747 2427 620 -1715 -1621 1227 2328 507 -1111
926a111M24J156K63r75j40O01O84j034r26P42N50r9l95K01K26k34o36j027J433
$$ -1111 -687 469 732 -243 -383 218 902 -132 -1058 -316 234 135 -260 -59 167 -67 -703 -1730 -297
945b97J789k50k648j266J579K781k03k820p35J692K004j167j979q1J818J118n71
$$ -297 1492 1242 -1406 -2672 -1093 1688 1485 -1335 -2070 -378 1626 459 -1520 -1601 217 1335 764
962G64k067l64J461J777m80j293n02O76K36K30n43J015K89j393l60J097Q76n70
$$ 764 -1303 -1667 -206 1571 1091 -202 -704 -28 208 438 -105 910 1199 -194 -554 543 1419 849
980H49j178N07P56O91j058j237N17K021M68j933j676R32K344P62j919k261J167
$$ 849 -329 178 934 1625 567 -670 -153 1868 2336 403 -1273 -341 2003 2765 846 -1415 -248
997b48J935R0j254r06L26J215J99j425p77Q33J156l78j110o21Q84K40l01k86N89
$$ -248 1687 1777 523 -383 -57 1158 1357 -68 -845 -12 1144 766 -344 -965 -81 159 -142 -428 161
1016A61J71j121j063J146J585p74j194j213J074J578o62j527k75J755Q63r41j921
$$ 161 332 -789 -1852 -706 879 105 -1089 -2302 -1228 350 -312 -1839 -2114 -359 504 -437 -2358
1033b358k18J705K022j459j847m91J958J088l37j256j68J074K83n26n04J111J03
$$ -2358 -2576 -871 1151 -308 -2155 -2646 -688 400 63 -1193 -1361 -287 -4 -530 -1034 77 180
1050A80j24R9o46N08N29k51k27O25Q13q68j639J027J268N98j523j726J086K091
$$ 180 56 155 -491 17 546 295 68 693 1506 638 -1001 26 1294 1892 369 -1357 -271 1820
1068A820p2j858n32M66J735k85j738j126J425J606n1k226o07J623P20jj512j20
$$ 1820 1748 -110 -642 -176 1559 1274 -464 -1590 -165 1441 1390 -836 -1443 180 900 899 -613 -733
1086g33P78M96r75M21LK29k83l79J40P32N19j182k55O28O75k94j680M53J653N66
$$ -733 45 541 -434 -13 -10 219 -64 -443 -303 429 948 -234 -489 139 814 520 -1160 -707 946 1512
1106A512j123j609L9K035Q71r43j299q3J092M83p0j433P9J558K39j042n73J57
$$ 1512 389 -1220 -1181 854 1725 782 -517 -600 492 975 905 -528 -449 1109 1348 306 -267 -110
1124a10Q31O51q92l75M87k14m55N11Q05k61q68n51L12O17O71p85r88M33Q20J53
$$ -110 721 1372 480 105 592 378 -77 434 1239 978 110 -441 -129 488 1159 374 -614 -181 639 792
1144G92q77q32R14J378p17j405m70J238R03n36j095l28J53R46k6j078l31P34P5
$$ 792 -85 -917 -3 1375 658 -747 -1217 21 924 388 -707 -1035 -882 64 38 -1040 -1371 -637 -562
1163e62k40l60P0K54N6n62r6P82l23o68K30J011o1k99j329M81J607M25j015j297
$$ -562 -802 -1162 -1092 -838 -782 -1344 -1440 -658 -981 -1649 -1419 -408 -469 -768 -2097 -1616 -9 416 -599 -1896
1183a896O49J541M68j036p31M22J594J52j619o44J330J156m71p43m41N16J014
$$ -1896 -1247 294 762 -274 -1005 -583 1011 1163 -456 -1100 230 1386 915 172 -269 247 1261
1200A261k91m94kK44m78K57o1M96L12l23j012j10J368K8r94l75O90N64l25j157
$$ 1261 970 476 474 718 240 497 436 932 1244 921 -91 -201 1167 1195 201 -174 516 1080 755 -402
1220d02l37J399R93q56j246n70J163J077k73j834j62J092J313q49j396J76J002
$$ -402 -739 660 1653 797 -449 -1019 144 1221 948 -886 -1048 44 1357 508 -888 -712 290
1237B90N56q01m86j25J119J21p19J2j09J20l8K77j3L12o9n54m94J029K77m09p55
$$ 290 846 45 -441 -566 553 674 -45 -33 -142 -22 -60 217 204 516 447 -107 -601 428 705 296 -459
1258d59J93Q33J61p26q87P83P83J63r59p64M94R54M09o45j098M73Q02j65m94k80
$$ -459 -266 567 728 2 -885 -102 681 844 -115 -879 -385 569 978 333 -765 -292 510 345 -149 -429
1278d29K46K60Pk56n36J053j34l47K26k06j24Q6N7j05L34j36o24j57O78O94o56
$$ -429 -183 77 84 -172 -708 345 211 -136 90 -116 -240 -154 -97 -202 132 -4 -628 -785 -107 587 -69
1299f9r41K58M89O87q92j060N90Q36J30n53n40J21O81L90o77l37j0O00kj08j62
$$ -69 -1010 -752 -263 424 -468 -1528 -938 -102 28 -525 -1065 -944 -263 127 -550 -887 -897 -297 -299 -407 -569
1320e69M5J41p6l06Q48L27n90o0L09M14j80j47m26N53P48Q1j098n52R92J017l90
$$ -569 -524 -383 -459 -765 83 410 -180 -240 69 483 303 156 -270 283 1031 1112 14 -538 454 1471 1081
1341A081q49p54J366N01j77j137j54J099M0l81m41j41O03L92q34o04N53K82L62
$$ 1081 232 -522 844 1345 1168 31 -123 976 1016 635 194 53 656 1048 214 -390 163 445 807
1360H07l96m25P5N58n95p65J091K93j0j110j44O51L65j43n82l95P00J001j097
$$ 807 411 -14 61 619 24 -741 350 643 633 -477 -621 30 395 252 -330 -725 -25 976 -121
1379a21m92J76Q06K61q84p37P3J456J42r93m54L32N70K31o61n06P29L07J0m28
$$ -121 -613 -437 369 630 -254 -991 -918 538 680 -313 -767 -435 135 366 -295 -801 -72 235 245 -183
1399a83j43J60N53J4m16m08N84l87n8N09J40J12p25N5K36K76R2m76k71K93M69
$$ -183 -326 -166 387 401 -15 -423 161 -226 -284 225 365 477 -248 -193 43 319 411 -65 -336 -43 426
1420D26j55m85k23M37M57M2r06jP61M9k19o84J36K18K21J38m81M01k81N2j10J47
$$ 426 271 -214 -437 0 457 499 -407 -408 353 402 183 -501 -365 -147 74 212 -269 132 -149 -97 -207 -60
1442f0j88k82M14j3r4K33k18n35N85L24l6n40o29O15Q12l16m19m75O60M74j91
$$ -60 -248 -530 -116 -129 -223 10 -208 -743 -158 166 130 -410 -1039 -424 388 72 -347 -822 -162 312 121
1463A21m11j19K37M72l1q68K05P59K47o08Kj98L61j94j3K7q1L70m37L0M37K92
$$ 121 -290 -409 -172 300 269 -599 -394 365 612 4 6 -192 169 -25 -38 -11 -92 278 -159 -129 308 600
1485F00Jl92m61N98N89m06o35o4L29N00o7j036J13R23L40n20j053L56P27K08k57
$$ 600 601 209 -252 346 935 529 -106 -170 159 659 592 -444 -331 592 932 412 -641 -285 442 650 393
1506C93q71P7N16N59p85k87N05J19l91m09l2O77p3j46m09M06j17kJ2p4J04K86
$$ 393 -478 -401 115 674 -111 -398 107 226 -165 -574 -606 71 -2 -148 -557 -151 -268 -270 -258 -332 -228 58
1528E8l46k94K2O37R6m73l21N6R00m8n76m00N69O35l16o70L09L66L48k27m66l16
$$ 58 -288 -582 -560 77 173 -300 -621 -565 335 287 -289 -689 -120 515 199 -471 -162 204 552 325 -141 -457
1550d57L44M23j6j30r8L25k26o2o4M18j07l42j7L47J03k06j58K01j07J10k56k85
$$ -457 -113 310 294 164 66 391 165 103 39 457 350 8 -9 338 441 235 77 278 171 281 25 -260
1572b60K03K29K57j88o58N3O77J51m56m58L33N04m39r5O0J93J72l26k21J08J1
$$ -260 -57 172 429 241 -417 -364 313 464 8 -450 -117 387 -52 -147 -87 106 278 -48 -269 -161 -150
1593a50j86j39K72L1rp3o8P2J99J89o16jR4N06r9m82k04N64J91P0n95k32R49L16
$$ -150 -336 -475 -203 -172 -181 -254 -322 -250 -51 138 -478 -479 -385 121 22 -460 -664 -100 91 161 -434 -666 283 599
1617E99m99j47r6j6O90l81l64k0J23L76l55L8K54J67k07l7k16J58J63k66K8K45
$$ 599 100 -47 -143 -159 531 150 -214 -234 -111 265 -90 -52 202 369 162 125 -91 67 230 -36 -8 237
1639B37K9o1j07k09M64K5k96l06j50M25M44k59r38O30L16m11o1j32J97M04j01
$$ 237 266 205 98 -111 353 378 82 -224 -374 51 495 236 -702 -72 244 -167 -228 -360 -163 241 140
1660A40n04j69J58O29l16l0k06J09m9L37k50j24K16rl18K05Q0L45l59o4j73N71
$$ 140 -364 -533 -375 254 -62 -92 -298 -189 -238 99 -151 -275 -59 -68 -386 -181 -101 244 -115 -179 -352 219
1682B19k73K48o99N81L84K6n79l05O70L32k83p92L33Q07j06n82Q6j69L67Q3j30
$$ 219 -54 194 -505 76 460 486 -93 -398 272 604 321 -471 -138 669 563 -19 67 -102 265 348 218
1703B18j92K20P0J43j16l18J84K0k20M37Kj31k39j49L30j35n8k9k33J96J27J83
$$ 218 26 246 316 459 343 25 209 229 9 446 448 317 78 -71 259 124 66 37 -196 0 127 310
1725C10m10l74L70L48j73l03k46O6O54k14n56j82N71j59J12l86J04K44J48j12
$$ 310 -100 -474 -104 244 71 -232 -478 -412 242 28 -528 -710 -139 -298 -186 -572 -468 -224 -76 -188
1745a88j75l31P78j68l88P4J30KJ45l76M04O6j6k8n6K79J72j0n18NL50N6Ql42
$$ -188 -363 -694 84 -84 -472 -398 -268 -266 -121 -497 -93 -27 -43 -71 -127 152 324 314 -204 -199 151 207 215 -127
1769a27j25M17J32L12q99L13J62L58n11j91J83K17K74m73k49j38O18l65L33l41
$$ -127 -252 165 297 609 -290 23 185 543 32 -159 24 241 515 42 -207 -345 273 -92 241 -100
1789a00M80j56k87j48L81o2L4l05N2K58J59m69k0J70L63l59J02n41P0P75l03j91
$$ -100 380 224 -63 -211 170 108 142 -163 -111 147 306 -163 -183 -13 350 -9 93 -448 -378 397 94 -97
1811i7j57K92L68j21o17j27N61k6j89N9Q2L36j77q1j89p5J86P7r1K3L12q3l30
$$ -97 -254 38 406 285 -332 -459 102 76 -113 -54 28 364 187 106 -83 -158 28 105 14 37 349 266 -64
1834f4L43m3J16J06m21k12M92K39k46m35L79M3q2k00o6j6M56J36n57J95j95N33
$$ -64 279 236 352 458 37 -175 317 556 310 -125 254 297 215 15 -51 -67 389 525 -32 163 -32 501
1856E01k64k99j44Q6M20k80k00M3J79j98N1j10K41m5j74l03J82J45O4j27l38K20
$$ 501 237 -62 -206 -120 300 20 -180 -137 42 -156 -105 -215 26 -19 -193 -496 -314 -169 -105 -232 -570 -350
1878c50L04R6n77OL32J19n2j4k45K26J90l36q7J57K53K06k08j14j53K66J52l83
$$ -350 -46 50 -527 -521 -189 -70 -122 -136 -381 -155 35 -301 -388 -231 22 228 20 -94 -247 19 171 -212
1900b12LJ57J9J81k70J36k9J1J80l38J60K69o5k40J48N6o3m10K61k28M92J33l31
$$ -212 -209 -52 -33 148 -122 14 -15 -4 176 -162 -2 267 202 -38 110 166 103 -307 -46 -274 218 351 20
1923B0p5J79L53j68k19l08K69M81o14k78K01J91M9L7l13n0K46K4J08k96J56L03
$$ 20 -55 124 477 309 90 -218 51 532 -82 -360 -159 32 81 118 -195 -245 1 25 133 -163 -7 296
1945B96n49LJ89j91K97J05m85K69J0J4nm68K16N14q3k02j23K29L47l62j98k12
$$ 296 -253 -250 -61 -252 45 150 -335 -66 -56 -42 -47 -515 -299 215 132 -70 -193 36 383 21 -177 -389
1967c89N51K65l90j67K4M14p8M0m97J33J44M1j8l41L37L7K3P6k9k34Q1L5J00o4
$$ -389 162 427 37 -130 -106 308 230 270 -227 -94 50 91 73 -268 69 106 129 205 176 -58 23 58 158 94
1991I4J28J89j87k38L08k12J50k78J09k13N40l59j55lk65K45K76j82l05L86Q3
$$ 94 222 411 224 -14 294 82 232 -46 63 -150 390 31 -124 -127 -392 -147 129 -53 -358 28 111
2012A11k35o0N2K96l40M42p01J45M42o59J21J79J50k02J42J14k35l9L87j79J46
$$ 111 -124 -184 -132 164 -176 266 -435 -290 152 -507 -386 -207 -57 -259 -117 -3 -238 -277 110 -69 77
2033G7J52l33j86K78J7l0K10n84L44K32J23n38Q6L65j17Q0l07R0J60M43k16l13
$$ 77 229 -104 -290 -12 5 -25 185 -399 -55 177 300 -238 -152 213 96 176 -131 -41 119 562 346 33
2055C3L5M7K5r8k08J15K90j37k41K7O97o3p77j4M97rj27k24O3J86R0J16n11qN3
$$ 33 68 115 140 42 -166 -51 239 102 -139 -112 585 522 -255 -269 228 219 92 -132 -69 117 207 323 -188 -196 -143
2080a43M82r5n66J01L13K97n92l3p8M81j80o5j31j04M39K26m10k7m6K84L7m42
$$ -143 339 244 -322 -221 92 389 -203 -236 -314 167 -13 -78 -209 -313 126 352 -58 -85 -131 153 190 -252
2102b52N1K23L07k86j33j46L84K90n44k86L08M84n2n32K3J26L23l58L52m88J59
$$ -252 -201 22 329 43 -90 -236 148 438 -106 -392 -84 400 348 -184 -161 -35 288 -70 282 -206 -47
2123d7L09j86k01J00M83j95o3m09M6k0O57o37ok8J52K53j60l80P2K51L09k55k05
$$ -47 262 76 -125 -25 458 263 200 -209 -163 -183 474 -163 -169 -197 -45 208 48 -332 -260 -9 300 45 -160
2146a60Q3J59P0N8m23L2J56J88l58j00l7N44k60m9J3J87M3J5j75k21k1K97k4n3
$$ -160 -77 82 152 210 -213 -181 -25 163 -195 -295 -332 212 -48 -97 -84 103 146 161 -14 -235 -256 41 17 -36
2170c6J5M5J51l34k37L66L69r9j24l11k89Q67k37m66Q2L1K15J78j54k94J09M84
$$ -36 -21 24 175 -159 -396 -30 339 240 116 -195 -484 383 146 -320 -238 -207 8 186 32 -262 -153 331
2192C31k18O5l89m6O30j02n54m4K98J53J46j29l48K56J38j83k67j64N89K17m07
$$ 331 113 178 -211 -257 373 271 -283 -327 -29 124 270 141 -207 49 187 4 -263 -427 162 379 -28
2213b8m05N4O21j79k53J58j64N02J4n22k29L06L61n9n04j83M39N01m65j25q7K85
$$ -28 -433 -379 242 63 -190 -32 -196 306 320 -202 -431 -125 236 177 -327 -510 -71 430 -35 -160 -247 38
2235C8M21m70k19k00O74J00o42j31r5Q94N9m10n11L20O53k80m09k55K95N36j98
$$ 38 459 -11 -230 -430 244 344 -298 -429 -524 370 429 19 -492 -172 481 201 -208 -463 -168 368 170
2256A70k40k30K14M25m02p3O1K28L12m78j74J17J59J27J1m29J60M58o1k53m92
$$ 170 -70 -300 -86 339 -63 -136 -75 153 465 -13 -187 -70 89 216 227 -202 -42 416 355 102 -390
2277c90J88O61p5n70j21K37J09M67p32p8N97J68j82n55K54K21l2j73j07j24K58
$$ -390 -202 459 384 -186 -307 -70 39 506 -226 -304 293 461 279 -276 -22 199 167 -6 -113 -237 21
2298B1L55l40k70J39J99m0j22m43K08M72J5k48l05J53L77P2p66k8M62L24m3m72
$$ 21 376 36 -234 -95 104 64 -58 -501 -293 179 194 -54 -359 -206 171 243 -523 -551 -89 235 192 -280
2320b80R9M44J80k90m26k36N29K96j5n10L9M74j51Q6n23J46M19K50n21Nj61M81
$$ -280 -181 263 443 153 -273 -509 20 316 301 -209 -170 304 153 239 -284 -138 281 531 10 15 -146 335
2342C35L7k83m28K17M79k59j46l05K61M64Q5q33J46M32J65p5m57m26N42O48l26
$$ 335 372 89 -339 -122 357 98 -48 -353 -92 372 457 -376 -230 202 367 292 -165 -591 -49 599 273
2363B73m23J70J75J41m21k51J09P35k08m92k45K86P9k02K37m61L52N90M4o38j55
$$ 273 -150 20 195 336 -85 -336 -227 508 300 -192 -437 -151 -72 -274 -37 -498 -146 444 488 -150 -305
2384c05K75L20r5l90k61M27L59j30p78%P47K31k75k15k15O59M17q12n94M93N37
$$ -305 -30 290 195 -195 -456 -29 330 200 -578 -578 169 400 125 -90 -305 354 771 -41 -635 -142 395
2405C95l25n49P3N65L20r5n82j80K38N52n1m54p2M19L29k48o21k6N18K95m90l
$$ 395 70 -479 -406 159 479 384 -198 -378 -140 412 361 -93 -165 254 583 335 -286 -312 206 501 11 8
2427Hj57N30k9k85j34o1K56K39l07k56K6L45o5k35m56M41J66J57j80k26J31N45
$$ 8 -149 381 352 67 -67 -128 128 367 60 -196 -170 175 110 -125 -581 -140 26 183 3 -223 -92 453
2449D53k79o11k2M13K11l14j0j60L33K86n84O3N1L83J81m12j70K13r1K25r9k60
$$ 453 174 -437 -459 -46 165 -149 -159 -319 14 300 -284 -221 -170 213 394 -18 -188 25 -66 159 60 -200
2471b00K28Q0J34l90l07K07N73J25p94J82K43L36j56l70o47Q27M41r22K1O1N52
$$ -200 28 108 242 -148 -455 -248 325 450 -344 -162 81 417 261 -109 -756 71 512 -410 -389 -328 224
2492B24J38l61j86Q3P05k63o36R5K68K02k9l65l71P6Q43j7o51k32N08K6R9j74
$$ 224 362 1 -185 -102 603 340 -296 -201 67 269 240 -125 -496 -420 423 406 -245 -477 31 57 156 -18
2514a8m40O07R1J67o76n56P28M24m25q2m3M20L91o90k95K27J67L48l75k26L16
$$ -18 -458 149 240 407 -269 -825 -97 327 -98 -180 -223 197 588 -102 -397 -170 -3 345 -30 -256 60
2535F0K63j50j11l68L60N71o24mk7J69L3M8m66k2K64Q3J50p90L97L72N61j003
$$ 60 323 173 62 -306 54 625 1 -3 -30 139 172 220 -246 -268 -4 79 229 -561 -164 208 769 -234
2557b34j77L93M39K0m87l09L69L46l19j71k58L08M60j39r7m12N10k0q3o31L49
$$ -234 -411 -18 421 441 -46 -355 14 360 41 -130 -388 -80 380 241 144 -268 242 222 139 -492 -143
2578a43L52J10l98j05O3J17M88o64k13L44J98N2j79m23K9N59j80j09m10M63J69
$$ -143 209 319 -79 -184 -121 -4 484 -180 -393 -49 149 201 22 -401 -372 187 7 -102 -512 -49 120
2599A20j1m36k67M53N18p2q64M01L88J61j27m79k20Q00On52l61K77L80J07j93
$$ 120 109 -327 -594 -141 377 305 -559 -158 230 391 264 -215 -435 365 371 -181 -542 -265 115 222 29
2620B9j99K44J08L44q56M4J32M99j36l39K37k58O54k5p73J62r7L04P3j92j37J26
$$ 29 -170 74 182 526 -330 -286 -154 345 209 -130 107 -151 503 478 -295 -133 -230 74 147 -45 -182 -56
2642e6L17j80m98K24M04k1j90n41L54L38J52l12l80R6N02m5j88l91L0O19m1m60
$$ -56 261 81 -417 -193 211 190 0 -541 -187 151 303 -9 -389 -293 209 164 -24 -415 -385 234 193 -267
2664b67j06L79N2J27n80k50Q86k7k6m23l76N91L19k16k92J34K95P2l13l08K92
$$ -267 -373 6 58 185 -395 -645 241 214 188 -235 -611 -20 299 83 -209 -75 220 292 -21 -329 -37
2685c7J33j05l5l25N46l2J46l62R0j46N50j94k83j12N00j02J6m89L8L13L98m04
$$ -37 96 -9 -44 -369 177 145 291 -71 19 -127 423 229 -54 -166 334 232 248 -241 -203 110 508 104
2707A04m00l6L24N92p50k15J12K03M56m40l24N1O93k23m08Q6j52O89r5n02k15
$$ 104 -296 -332 -8 584 -166 -381 -269 -66 390 -50 -374 -323 370 147 -261 -175 -327 362 267 -235 -450
2728d50L48M03l67j92qR5J55P3n48J44J04L35m1m5q4K77p4J93m42J48J91k97o0
$$ -450 -102 301 -66 -258 -266 -171 -16 57 -491 -347 -243 92 51 6 -78 199 125 318 -124 24 215 -82 -142
2751a42j71L96J95N2m57j79N11K78j85n27K28K46j6R4n49J66K03K3l68K87k79
$$ -142 -313 83 278 330 -127 -306 205 483 298 -229 -1 245 229 323 -226 -60 143 166 -202 85 -194
2772a94K99J0J78m04l1K52K73n88L85k09L07J81n36p8q3L41P8k44k44J85N2o2
$$ -194 105 115 293 -111 -142 110 383 -205 180 -29 278 459 -77 -155 -238 103 181 -63 -307 -122 -70 -132
2794a32Rk1N1J91O7j60j68J48J64kl79M3M32k54k51M86n0J05j23n09K24m1J61
$$ -132 -123 -144 -93 98 165 5 -163 -15 149 147 -232 -189 243 -11 -262 224 174 279 156 -353 -129 -170 -9
2817il0Oj46M91J47n59R5m41N98J81j64j38j3K59k27k9l89M08J60j75j99r5J78
$$ -9 -39 -33 -179 312 459 -100 -5 -446 152 333 169 31 18 277 50 21 -368 40 200 25 -174 -269 -91
2840i1K86l2j61k35L5M75k50L49m21K94M36m80n13J56P6K98k0k09l3o0K28o3k98
$$ -91 195 163 2 -233 -198 277 27 376 -45 249 685 205 -308 -152 -76 222 202 -7 -40 -100 128 65 -233
2863b33j58N05Q1m4n07K50K15j24j76o9J31L17j83qo0j05M83k70k08j41L18M39
$$ -233 -391 114 195 151 -356 -106 109 -15 -191 -260 -129 188 5 -3 -63 -168 315 45 -163 -304 14 453
2885D53m97j65L78l27M21l10J81n56P02j81j17j78P9K66qj4k34l06L59N2k19K39
$$ 453 -44 -209 169 -158 263 -47 134 -422 280 99 -18 -196 -117 149 141 127 -107 -413 -54 -2 -221 18
2907A8j47M79mn77M5q8L86Q5m54K49p0L47p5Lj51K53k23L3m72K56o1J90n6K94
$$ 18 -129 350 346 -231 -186 -274 112 197 -257 -8 -78 269 194 197 46 299 76 109 -363 -107 -168 22 -34 260
2931B60n09L20L76m25n9M6K19q4q7k09K91l9j11j31o0J14O9p7N4k04L97l8m7L7
$$ 260 -249 71 447 22 -37 9 228 144 57 -152 139 100 -11 -142 -202 -88 -19 -96 -42 -246 151 113 66 103
2955A03J5j06j19K37m16J26L42j61N1k86J09J43j80K19m86K74M34n34M92l48J1
$$ 103 118 12 -107 130 -286 -160 182 21 72 -214 -105 38 -142 77 -409 -135 299 -235 257 -91 -80
2976h0LL63l58N1j7N2J64r1K2k63K21o9J40k05K20j75J68j73n9K96j09j1k8K4
$$ -80 -77 286 -72 -21 -38 14 178 87 109 -154 67 -2 138 -67 153 -22 146 -27 -86 210 101 90 62 86
3000H6ql7j88j2K46L13j32l02q1j09L00k25J58p1j68K50o7p6J72k7J90k29Q0k14
$$ 86 78 41 -147 -159 87 400 268 -34 -115 -224 76 -149 9 -62 -230 20 -47 -123 49 22 212 -17 63 -151
3024a51k4K31m70M96q0J89l88J19L9L0P9r0P2q9k2j28L99l86nK10k92L64l69L45
$$ -151 -175 56 -414 82 2 191 -197 -78 -39 -9 70 -20 52 -37 -59 -187 212 -174 -179 31 -261 103 -266 79
3048G9J25k29K37k69o1j3K37k1k98J13P8K75j09j60r8N9J76L3j9o8jp3kj46J64
$$ 79 204 -25 212 -57 -118 -131 106 85 -213 -100 -22 253 144 -16 -114 -55 121 154 135 67 66 -7 -9 -155 9
3073IK09l25J10j50J63K24j82k76L18k66L7J27m53L79Q8J94k37n4o5K00M5J17
$$ 9 218 -107 3 -147 16 240 58 -218 100 -166 -129 -2 -455 -76 12 206 -31 -85 -150 50 95 212
3095B12k17m69O72k84K41n15L60OL3k40N21k80j74K95m25K81j64K25k59L5Q5J07
$$ 212 -5 -474 198 -86 155 -360 0 6 39 -201 320 40 -134 161 -264 17 -147 78 -181 -146 -61 46
3117D6J02j01j32r5K62l39J81Q5O7j39q1J10M7K1j01M9q1J3J59n4k22M65p5k60
$$ 46 148 47 -85 -180 82 -257 -76 9 76 -63 -144 -34 13 34 -67 -18 -99 -86 73 19 -203 262 187 -73
3141g3K47j48J45j49O6M0j03n7J33M5P5k86L4m4J41j04P0j61L19j87K10l56J93
$$ -73 174 26 171 22 88 128 25 -32 101 146 221 -65 -31 -75 66 -38 32 -129 190 3 213 -143 50
3164E0P0R2l03K80J90l42L9J89k48K18j42j93J20k27J04Q6k01N97m08j01M45k00
$$ 50 120 212 -91 189 379 37 76 265 17 235 93 -100 20 -207 -103 -17 -218 379 -29 -130 315 115
3186A15Q4k79j67J53J02k91J48K37J23k83J14j04K45o5O1l18K49j34J85Jk2m30
$$ 115 199 -80 -247 -94 8 -283 -135 102 225 -58 56 -48 197 132 193 -125 124 -10 175 176 154 -276
3208b76K16n6L14k12M5J16l85J54k85O69j51n47M87n6k79K81J02k29r8J31O4k7
$$ -276 -60 -116 198 -14 31 147 -238 -84 -369 300 149 -398 89 33 -246 35 137 -92 -190 -59 5 -22
3230b2K56m83M74k08qK16l25j2l0K56l07J49J63N1k68j12M1L9J28J54j57O0m5
$$ -22 234 -249 225 17 9 225 -100 -112 -142 114 -193 -44 119 170 -98 -210 -169 -130 -2 152 -5 55 10
3253A0p0l9l45P27j48m4k06J5N55l90Q7r3l8J28N1l95J87M7k5Jr8k1M7L96l91
$$ 10 -60 -99 -444 283 135 91 -115 -100 455 65 152 59 21 149 200 -195 -8 39 14 15 -83 -104 -57 339 -52
3278e2N3kj82J63K1J17n32L40K57k37j26L8K23k01K01j81K65r7j7L6l19L0q9j
$$ -52 1 -1 -183 -20 1 118 -414 -74 183 -54 -180 -142 81 -120 81 -100 165 68 51 87 -232 -202 -291 -292
3302b92K48J29q4j45L34p1j00k83K54n4J13j12J63m9j95J57k29O5K59p8j22P0
$$ -292 -44 85 1 -144 190 119 19 -264 -10 -64 49 -63 100 51 -144 13 -216 -151 108 30 -92 -22
3324b2j62M23k54Jj43L39l14J29P4J87k57k68L02k3K98l52J77j61O9Rj2k12K21
$$ -22 -184 239 -15 -14 -157 182 -132 -3 71 258 1 -267 35 12 310 -42 135 -26 43 52 40 -172 49
3347D9l7lk1J4jK34j00k05O8j30j19M49J3k97J24j53J00J4J66j55j55j18K00J24
$$ 49 12 9 -12 2 1 235 135 -70 -2 -132 -251 198 211 -86 38 -115 -15 -1 165 10 -145 -263 -63 61
3371F1Lk63Q1K08O6O1m0l76K50j01j05J53j08M2L1P7R0N5k11L16O7k87q2K11J7
$$ 61 64 -199 -118 90 156 217 177 -199 51 -50 -155 -2 -110 -68 -37 40 130 185 -26 290 357 70 -12 199 216
3396B16q3r4l3j7K48j34j73j01K69k02J45j9r7K42l87L20P7n6K33l74j64J93N3
$$ 216 133 39 6 -11 237 103 -70 -171 98 -104 41 22 -75 167 -220 100 177 121 354 -20 -184 9 62
3419F2p1K34l19J5j7L93l96J06K86j10l20J03j95M05j85J11n3q2j41J52K8p4L35
$$ 62 -9 225 -94 -79 -96 297 -99 7 293 183 -137 -34 -229 176 -9 102 49 -33 -174 -22 6 -68 267
3442B67m42J15R3K36k23oJ43m1j72p6O4m3K67l24M0J87J61j39J53k12n5LM2J06
$$ 267 -175 -60 33 269 46 40 183 142 -30 -106 -42 -85 182 -142 -102 85 246 107 260 48 -7 -4 38 144
3466A44j59K23m86K52M8J51Q2J46j89m17L03k19K71pk69Q1N0L04l59L7K8P1r4
$$ 144 -15 208 -278 -26 22 173 255 401 212 -205 98 -121 150 143 -126 -45 5 309 -50 -13 15 86 -8
3489hj72K87j13m7m6q2K18L11o21L28j33K31p7J8J60k36k16m4J16o1L27k05J77
$$ -8 -180 107 -6 -53 -99 -181 37 348 -273 55 -78 153 76 94 254 18 -198 -242 -126 -187 140 -65 112
3512A12l43M55k80j86K37J93l49L46k80J77k17J48J60l35P4MP9M7j03Kj08o2L30
$$ 112 -231 224 -56 -242 -5 188 -161 185 -95 82 -135 13 173 -162 -88 -84 -5 42 -61 -59 -167 -229 101
3535A01k32kJ93K19l29N5J13m9ml54K65K22J40l36K32l27J81l75J15L5K67q4o8
$$ 101 -131 -133 60 279 -50 5 118 69 65 -289 -24 198 338 2 234 -93 88 -287 -172 -137 130 46 -22
3558b2J44k4p6M2k17J71J60k45k16J43Q0lK4k14oL68r2j46J15L4L1m85M85k3j07
$$ -22 122 98 22 64 -153 18 178 -67 -283 -140 -60 -63 -39 -253 -259 109 17 -129 -14 20 51 -434 51 28 -79
3583g9K4J4J06K25o7j79k42L26j60K78l01p0O6K67k78k02J95m7RO5K78k20L0m7
$$ -79 -55 -41 65 290 223 44 -198 128 -32 246 -55 -125 -59 208 -70 -272 -77 -124 -115 -50 228 8 38 -9
3607iJ2K69o18L95j39%j73J20K09l0Q8M2l42K72k4j10M39n57K14L8j73K76l30
$$ -9 3 272 -346 49 -90 -90 -263 -143 66 36 124 166 -176 96 72 -38 401 -156 58 96 -77 199 -131
3630a31K41p1k25K16Km2k7K63k26k8J61k4R2l45J61j0j70J22O8OJM7k57j46K77
$$ -131 110 39 -186 30 32 -10 -37 226 0 -28 133 109 201 -144 17 7 -163 -41 27 33 34 81 -176 -322 -45
3655d5J78k17J97p9M9K9j40L44l24J72p3Jo2q5K46k5k42K78m38J25KR6j77P7M96
$$ -45 133 -84 113 34 83 112 -28 316 -8 164 91 92 30 -55 191 166 -76 202 -236 -111 -109 -13 -190 -113 383
3680C83n60q7L21m3o3j19K54k33J94K8p7j62o6J56K00k0j09J47l1j31j23J09M0
$$ 383 -177 -264 57 14 -49 -168 86 -147 47 75 -2 -164 -230 -74 126 106 -3 144 113 -18 -141 -32 8
3703Hj7l6k09K87n7m7M07l24j2Jj49K91n4j37O8k5j05k32M03j34J22j3m39N42
$$ 8 -9 -45 -254 33 -24 -71 336 12 0 1 -148 143 89 -48 20 -5 -110 -342 61 -73 49 36 -403 139
3727A39k14J82j56r0K44n8k84N55m73J54P9k76L60o49O25L3k33Q5k5K5J01j31
$$ 139 -75 107 -49 -139 105 47 -237 318 -155 -1 78 -198 162 -487 138 171 -62 23 -2 23 124 -7
3749gJ2m6j75K02R6j32j02j1K08k46J15M11m14Q2k44r2J19J05L03j91J65j47j41
$$ -7 5 -41 -216 -14 82 -50 -152 -163 45 -201 -86 325 -89 -7 -251 -343 -224 -119 184 -7 158 11 -130
3772a30O7oK5P5Q7k00k8m0K40l32J48J8K82Nj35j04K76k46Q0m41L58P8l9j54J74
$$ -130 -63 -69 -44 31 118 -82 -110 -150 90 -242 -94 -76 206 211 76 -28 248 2 82 -359 -1 77 38 -116 58
3797E8j1J55j41j04O3j40m5j7L46k92m6J21L15m06K05LK53k87j0M3k74R6J50J20
$$ 58 47 202 61 -43 20 -120 -165 -182 164 -128 -174 -53 262 -144 61 64 317 30 20 63 -211 -115 35 155
3821A55J53l51j11K76p2N0j48L4q1o5NJ86k80L61k19o2K19q2p4K4L15j90J03%
$$ 155 308 -43 -154 122 50 100 -48 -14 -95 -160 -155 31 -249 112 -107 -169 50 -32 -106 -82 233 43 146 146
3845A46l0l18L28N9l0k66o0K21l52L15j21O8L21j87N1k60K77j01m0L1q1r0J84
$$ 146 116 -202 126 185 155 -111 -171 50 -302 13 -108 -40 281 94 145 -115 162 61 21 52 -29 -119 65
3868F5q5M1Q7j05J62j27J35l64K22j48K66p9J0p6n0L7p6J78l77K83pk12N04k00
$$ 65 -20 21 108 3 165 38 173 -191 31 -117 149 70 80 4 -46 -9 -85 93 -284 -1 -8 -220 284 84
3892H4r3jL2P8m4k45K14R1j54j63J93J38p2J90m30J70J09m7J55k5k10k5M7P7P4
$$ 84 -9 -10 22 100 56 -189 25 116 -38 -201 -8 130 58 248 -182 -12 97 50 205 180 -30 -55 -8 69 143
3917A43n16K31J10O1m4L00m49K62o3j7M9j07J8J86q5M2o0kR4R1j57l24M50m62
$$ 143 -373 -142 -32 29 -15 285 -164 98 35 18 67 -40 -22 164 79 121 61 59 153 244 87 -237 213 -249
3941b49K72O0r7P6j86N81k93j73L65m59K0J26l45L20Q2L6K07l61K29k59q4K9J15
$$ -249 23 83 -14 62 -124 457 164 -9 356 -103 -83 43 -302 18 100 136 343 -18 211 -48 -132 -103 12
3964A2j35J10m1j7Q7j14L01J42k13k28L3M2J35L4J08k42K33l38J03J95n14M47
$$ 12 -123 -13 -54 -71 16 -98 203 345 132 -96 -63 -21 114 148 256 14 247 -91 12 207 -307 140
3986A40nj18pK15k12k17J72j22M1Q3o0j20J69K14l33K27j69k12M42k11J40R3n8
$$ 140 135 17 10 225 13 -204 -32 -154 -113 -30 -90 -210 -41 173 -160 67 -102 -314 128 -83 57 150 92
4009I2o6j24K3R6p2%J73Mk28l2K30l16L46l60L81j65J4K22j37J95m04K51M0r6
$$ 92 26 -98 -75 21 -51 -51 122 126 -102 -134 96 -220 126 -234 147 -18 -4 218 81 276 -128 123 163 67
4033F7k57L29J05l38K34n9J04k27o7J97j48J87P6m30K14k28L20k16l7j96K71J27
$$ 67 -190 139 244 -94 140 81 185 -42 -109 88 -60 127 203 -227 -13 -241 79 -137 -174 -370 -99 28
4055B8j72J36J78l78Q9L62l43P4J6j07J10j5R6m5j01L24j48p0l55O04j39m1j78
$$ 28 -144 -8 170 -208 -119 243 -100 -26 -10 -117 -7 -22 74 29 -72 252 104 34 -321 283 144 103 -75
4078g5NK50R7j1j14k23J24PO5k03J10M3J65m48J00L51l24K09q6K33k01j19n7L90
$$ -75 -70 180 277 266 152 -71 53 60 125 -78 32 75 240 -208 -108 243 -81 128 42 275 74 -45 -102 288
4102B88m76L58l10j20L24l82M50q1J48L8o3k03J40n2j7K33l76k58L91j4J04J55
$$ 288 -188 170 -140 -260 64 -318 132 51 199 237 174 -29 111 59 42 275 -101 -359 32 18 122 277
4124B77j56l16K21L7k81K72J49l34K59m18K13N7J21K69l90j4J3j37K63J91m17
$$ 277 121 -195 26 63 -218 54 203 -131 128 -290 -77 -20 101 370 -20 -34 -21 -158 105 296 -121
4145a21L1J27m2J04l6L8n9n5K43l06m9K66j18j08p1J49j52m2J36J59K32l65jj22
$$ -121 -90 37 -5 99 63 101 42 -13 230 -76 -125 141 23 -85 -156 -7 -159 -201 -65 94 326 -39 -40 -162
4169a62j7K4J60jp3L17j61o0J24j65M91m78OK0q0J44j95J74J8J49k28P0o8j97
$$ -162 -179 -155 5 4 -69 248 87 27 151 -14 477 -1 5 25 -55 89 -106 68 86 235 7 77 9 -188
4193a88L51l85J37J84o7K2k03K07j45J89j61j56J09Q3J80j43Oj71P7J17K1J48
$$ -188 163 -222 -85 99 32 54 -149 58 -87 102 -59 -215 -106 -23 157 14 20 -151 -74 43 64 212
4215B12j85K69k55M0k33J96p9P3p8j91L82k33J92M1j65p8j8K43k3j40P0mK40l88
$$ 212 27 296 41 81 -152 44 -35 38 -40 -231 151 -82 110 151 -14 -92 -110 133 110 -30 40 36 276 -112
4239a12M28j01l28n6J93j20P8Q5J19k30rj03J30Q2l3J8M0j13J18j91J05L68m39
$$ -112 316 215 -113 -169 24 -96 -18 67 186 -44 -53 -156 -26 56 23 41 81 -32 86 -105 0 368 -71
4262g1L54m21J31j67M24p6q2n1M4j90J13L4ok21K87qk10J09j6J07N7j81J09P7
$$ -71 283 -138 -7 -174 250 174 92 41 85 -105 8 42 36 -185 102 94 -116 -7 -23 84 141 -40 69 146
4286A46j3n7o9j23J76j10J39R2j59k95J56K44l70M27j60J25k91qkJ55j36R7O0
$$ 146 133 76 7 -116 60 -50 89 181 22 -273 -117 127 -243 184 24 149 -142 -150 -152 3 -133 -36 24
4309B4J42N6j09o6o2r2K47q3q4k86J29L18o5J23k42O0j01K49l15j8J84K1r8q3
$$ 24 166 222 113 47 -15 -107 140 57 -27 -313 -184 134 69 192 -50 10 -91 158 -157 -175 9 30 -68 -151
4333a51R4j42K00j91K11l74L95J44j13K7l31J87mq6R8L19k49L5j97j3k84M66j3
$$ -151 -57 -199 1 -190 21 -353 42 186 73 100 -231 -44 -48 -134 -36 283 34 69 -128 -141 -425 41 28
4356B8J21j18K07m81M33j97J35J12l53Q8q1J69jmJ68k65K60j99n0j6R5J78l32
$$ 28 149 31 238 -243 190 -7 128 240 -113 -25 -106 63 62 58 226 -39 221 22 -28 -44 51 229 -103
4379a03J38j44L83k26M8j57J66k48K98M9j04j91J53K6k89L61k24O0R8m4%q3R5
$$ -103 35 -109 274 48 96 -61 105 -143 155 204 100 -91 62 88 -201 160 -64 -4 94 50 50 -33 62
4402F2j56K46l23M08j10j3o8L4l89K88k8L45l21M7l37mL29k75K47K56l01q9K27
$$ 62 -94 152 -171 237 127 114 46 80 -309 -21 -49 296 -25 22 -315 -319 10 -265 -18 238 -63 -152 75
4425G5l39L39Q9q0Ok22J57j02J6J15k49N53o35K15M2k98K10n5Q5k7L55k96J74
$$ 75 -264 75 164 84 90 -132 25 -77 -61 54 -195 358 -277 -62 -20 -318 -108 -163 -78 -105 250 -46 128
4448A28J00k66P2q6N0j35J47k25M3K27k40L71r5j64J32M1k56J0L72j34k88K06
$$ 128 228 -38 34 -52 -2 -137 10 -215 -172 55 -185 186 91 -73 59 100 -156 -146 226 92 -196 10
4470A0k4M4j4Lk9l87K48L83j50k13K41PJ14j01l8P5k04K56l33N47k78O8k53k45
$$ 10 -14 30 16 19 -10 -397 -149 234 84 -129 112 119 233 132 94 169 -35 221 -112 435 157 225 -28 -273
4494b73L30j35k5K93j85N3j2j71J02j30k43K21K09n4J81oj56qM1q4N3L9j34q4
$$ -273 57 -78 -103 190 5 58 46 -125 -23 -153 -396 -175 34 -20 161 155 -1 -9 32 -52 1 40 -94 -178
4518a78J93k51L34j33J73l1o3j0l48J95PJ56N4j9m1k22J8L32k32Q9K8K16k51O4
$$ -178 15 -236 98 -35 138 107 44 34 -314 -119 -112 44 98 79 38 -184 -166 166 -66 23 51 267 16 80
4542H0J55l55K52j68M3l7l02L80Lj07J71o6N3j68J15k04N9K94j07j36Q9N3j70
$$ 80 235 -120 132 -36 7 -30 -332 48 51 -56 115 49 102 -66 49 -155 -96 198 91 -45 44 97 -73
4565g3O7J64J06p4R3l23k8J98J87n23k1K29rj78N52l31l38M36j11K08j65PJ46
$$ -73 -6 158 264 190 283 -40 -68 130 317 -206 -227 2 -7 -185 367 36 -302 134 23 231 66 73 219
4588B19n5k21kO6J29k43J06P7j73K53k71j22J61n1n7K10k38J27J38k4r4nL04j49
$$ 219 164 -57 -59 7 136 -107 -1 76 -97 156 -115 -237 -76 -127 -184 26 -212 -85 53 29 -65 -70 234 85
4612H5J10k19J32j60J19o2P2j34J31j59l08M32q3k5L09j27p5j70K63J16k91j31
$$ 85 195 -24 108 -52 67 5 77 -57 74 -85 -393 39 -44 -69 240 113 38 -132 131 247 -44 -175
4634a75K4L02pj30r5j79L23j62J16P9k5j02j07k9J93P9m1j2j28J51J76l63J54
$$ -175 -151 151 144 14 -81 -260 63 -99 17 96 71 -31 -138 -167 26 105 64 52 -76 75 251 -112 42
4657D2P3n5k06K91l08K93k71J98j22K3k29P03p1m33L88k98K69r9j79l1K3j44K78
$$ 42 115 60 -146 145 -163 130 -141 57 -65 -42 -271 432 361 -72 316 18 287 188 9 -22 1 -143 135
4680A35k51Q0m5K06j19Q4k91q6J36l6j30N48m40Q6K70j47K11k02n5j86K58l4P0
$$ 135 -116 -36 -81 125 6 90 -201 -287 -151 -187 -317 231 -209 -123 147 0 211 9 -46 -232 26 -8 62
4703F2j7O6j06J0j64L02j60l6m9o0K08k16r7K78J88o7k69K01k94J70R9j47J55
$$ 62 45 111 5 15 -149 153 -7 -43 -92 -152 56 -160 -257 21 209 142 -127 74 -220 -50 49 -98 57
4726E7Q6k3k94n3K80k8pJ3P9o5J30J0J10k97k28K56j10K35l8r0K75l75J46K95
$$ 57 143 120 -174 -227 53 25 18 31 110 45 175 185 295 -2 -230 26 -84 151 113 23 298 -77 69 364
4750C64m78jJ50j02Q1J1J35k11n1P4J49l0p2j00PJ02j41p3K86j17l8J16J32k90
$$ 364 -114 -115 35 -67 14 25 160 -51 -102 -28 121 91 19 -81 -74 28 -113 -186 100 -17 -55 61 193 -97
4774i7J63J06p9j30J3n8j29o4K68P0k43L33p6r1n7O7m1l54M88J51l62J62k19J25
$$ -97 66 172 93 -37 -24 -82 -211 -275 -7 63 -180 153 77 -14 -71 -4 -45 -399 89 240 -122 40 -179 -54
4798e4p2Q1K04j18J73j31J81j43Lk53q6P8l7J92m0m5Q1J42j27l28J75J56j67K10
$$ -54 -126 -45 159 41 214 83 264 121 124 -129 -215 -137 -174 18 -22 -67 14 156 29 -299 -124 32 -135 75
4822G5k43k15M45L6o7n0q6K10J38l25J99k80o6L55J8rm04L86l03M54m87M21k54
$$ 75 -168 -383 62 98 31 -19 -105 105 243 -82 117 -163 -229 126 144 135 -269 117 -186 268 -219 202 -52
4845e2j52N35l77p3K24q7j84Q3L9J24r8q5k9N00m98qp5M56j75L01k58o0k32K39
$$ -52 -204 331 -46 -119 105 18 -166 -83 -44 80 -18 -103 -132 368 -130 -138 -213 243 68 369 111 51 -181 58
4869E8k41LL49n18j6P10l15K0j69J22p0j32j13J99j48K31J32M4k13J79o8j35k39
$$ 58 -183 -180 169 -349 -365 345 30 50 -119 3 -67 -199 -312 -113 -261 -30 102 146 -67 112 44 -91 -330
4892c30L72l5r9K42o9L5J78k39N3k37L43j8P5l78J71J37k25k7k6K0M1M2l0M6n3
$$ -330 42 7 -92 150 81 116 294 55 108 -129 214 196 271 -107 64 201 -24 -51 -77 -57 -16 26 -4 42 -11
4917a1j86L0K47J99k19l43L16L12l26q6m0K21l51L31K45m43J49k8O2q1K6K40k02
$$ -11 -197 -167 80 279 60 -283 33 345 19 -67 -107 114 -237 94 339 -104 45 17 79 -2 24 264 62
4940F2R0j05k51L76r0j71J17r2K03j10M6j30l8m9J22M2K3qj00J83j29L6O2j54
$$ 62 152 47 -204 172 82 -89 28 -64 139 29 75 -55 -93 -142 -20 22 45 37 -63 120 -9 27 89 -65
4964f5L34m86L44O8j67L7J06n9j5j0l4j90L04p5L5r6l11L95k37O5J77j25O5m1
$$ -65 269 -217 127 195 28 65 171 112 97 87 53 -137 167 92 127 31 -280 115 -122 -57 120 -5 60 19
4988A9j4N9l0j48K21K1J87j9l6m41M39k16P6K91n18L31j41k3j11O0j08j61J42
$$ 19 5 64 34 -114 107 128 315 296 260 -181 258 42 118 409 -109 222 81 58 -53 7 -101 -262 -120
5011a20J64mP5J28n05L95J1j13N2k56Q9J98l22l3L02j91r0K65L4l17j43J76J54
$$ -120 44 40 115 243 -262 133 144 31 83 -173 -84 114 -208 -241 61 -130 -220 45 79 -238 -381 -205 -51
5034e1k6L01k24K6j7K71m84M8oL39k35k23J98J11O2l6P8n9j19j02rN3K80j51n9
$$ -51 -77 224 0 26 9 280 -204 -156 -162 177 -58 -281 -83 28 90 54 132 73 -46 -148 -157 -104 176 25 -34
5059c4k01K76o1N2j36K78n3j19r2O5O3R7j04q0K50j30Q1k06K53m12J74J89j62
$$ -34 -235 41 -20 32 -104 174 121 2 -90 -25 38 135 31 -49 201 71 152 -54 199 -213 -39 150 -12
5082a2o5J14M0q6p3k1k68N85p3m00L44k21j07L24L2j65J08J5p0M0j94j0L50L7
$$ -12 -77 37 77 -9 -82 -103 -371 214 141 -259 85 -136 -243 81 113 -52 56 71 1 41 -153 -163 187 224
5106B24k06m5j12N5J05RJ03q8j33J59k5m25N39k23m2K14l52L05k86J39m3m6M12
$$ 224 18 -27 -139 -84 21 30 133 45 -88 71 46 -379 160 -63 -105 109 -243 62 -224 -85 -128 -174 238
5129B38k60nMJ08K70l51J10k02P9j31J16K13k01M0k8Q8l39O0K42L13m28q4L34
$$ 238 -22 -27 -23 85 355 4 114 -88 -9 -140 -24 189 -12 28 0 88 -251 -191 51 364 -64 -148 186
5152A86J5J27p8j51l29K64J63j2j5m60N69j27j53k16Q5j5M20k22J23r4J08K6q5
$$ 186 201 328 250 99 -230 34 197 185 170 -290 279 152 -1 -217 -132 -147 273 51 174 80 188 214 129
5175A29k06J96j66P9j10J12J2j0J80J38m68J97j95K5j70K30J13J31k64J67k59
$$ 129 -77 119 -47 32 -78 34 46 36 216 354 -114 83 -112 -87 -257 -27 86 217 -47 120 -139
5196a39L8K05j88J14K70l67N7J53q5J9m01L98K01j08R8j34q2m7j47Q1j49L01J38
$$ -139 -101 104 -84 30 300 -67 -10 143 58 77 -324 74 275 167 265 131 49 2 -145 -64 -213 88 226
5219B26l24L4Q5K11J16m76K08k72N89n37K9M4J88M1l53K96k06K88l9OR7n9k56
$$ 226 -98 -64 21 232 348 -128 80 -192 397 -140 -111 -67 121 162 -191 105 -101 187 148 154 251 192 -64
5242f4Q4j08L9J55j60j03Q9J87J10K6l97L20l39J1J66m2N7k7L07l42k4M9K40k18
$$ -64 20 -88 -49 106 -54 -157 -68 119 229 255 -142 178 -161 -150 16 -26 31 4 311 -31 -55 -6 234 16
5266A6K2l16L22P2r1Lk02L21l25M52j56m44L57J45k8k67k45L84k3l87M21mJ17
$$ 16 38 -278 44 116 25 28 -174 147 -178 274 118 -326 31 176 148 -119 -364 20 -3 -390 31 27 144
5289A44j38j3l13N47l2k91K6J19L0L9j3J91m48R6j07K13n8j78K86m30M03Q0j29
$$ 144 6 -7 -320 227 195 -96 -70 49 79 118 105 296 -152 -56 -163 50 -8 -186 100 -330 73 153 24
5312B4K44l8j34k24O8k0j4N4m9K27J27l53O0o1N0k36K78P6l49J67K87j29p9l8
$$ 24 268 230 96 -128 -60 -80 -94 -40 -89 138 265 -88 -28 -89 -39 -275 3 79 -270 -103 184 55 -24 -62
5336f2J59q7j24J85l87L44M2j24j12J22K35j57m2j57J09J11J11j15j1o2j5P2l74
$$ -62 97 10 -114 71 -316 28 70 -54 -166 -44 191 34 -8 -165 -56 55 166 51 40 -22 -37 35 -339
5359c39M19k29j6L76l2q1M9k40J19J8jj33k26N05k38qM12m76m9qJ6K54r7n5j56
$$ -339 80 -149 -165 211 179 98 147 -93 26 44 43 -90 -316 189 -49 -57 355 -121 -170 -178 -162 92 -5 -60 -216
5384b16K60J66k23k3K70J4j22K8L7k0j45J03p4l51n5J75L10k61J21q8K46L1l43
$$ -216 44 210 -13 -36 234 248 126 154 191 171 26 129 55 -296 -351 -176 134 -127 -6 -94 152 183 -160
5407a60o4L28l5L1j31m6j44L99P4j81l09K25j87J47n4J11M2j74J1L73m07L0K03
$$ -160 -224 104 69 100 -31 -77 -221 178 252 71 -238 -13 -200 -53 -107 4 46 -128 -117 256 -151 -121 82
5430H2L0L8k40Q3j7Q7j47Q7J93l1m0K02l32J08J05J61k79k3P6m4j04o2J23p9o4
$$ 82 112 150 -90 -7 -24 63 -84 3 196 165 125 327 -5 103 208 369 90 67 143 99 -5 -67 56 -23 -87
5455h7K00m57K54k12J66K58q7j06J07k26K63P0l04j62K12K69q4j68K06l39N6L08
$$ -87 113 -344 -90 -302 -136 122 35 -71 36 -190 73 143 -161 -323 -111 158 74 -94 112 -227 -171 137
5477A37m32L29N3m8k34K71j95K40K16l06q0K70k46k6J34q6J97j21k3k05N10k70
$$ 137 -295 34 87 39 -195 76 -119 121 337 31 -49 221 -25 -51 83 -3 194 73 50 -155 355 85
5499H5j99Q9Nk50L64N0k5J06k5l48N5J68k48q2K85j42PJ52o1J36R4m57M40j09
$$ 85 -114 -25 -20 -270 94 144 119 225 200 -148 -93 75 -173 -255 30 -112 -105 47 -14 122 216 -241 199 90
5523I0k71J2J95K17k46M0q9J52o2j92R6k32K33j43L24j10j01K18K2j01l01K05
$$ 90 -181 -169 26 243 -3 37 -52 100 38 -154 -58 -290 -57 -200 124 14 -87 131 153 52 -249 -44
5545d4L26l90L1K85k42l07K83L57l47J19q5j67L41k92L88j07j86J15l18K56M3
$$ -44 282 -108 -77 208 -34 -341 -58 299 -48 71 -14 -181 160 -132 256 149 -37 78 -240 16 59
5566E9j41J27r9r5L26k8Jj26J45P2k98J05r5J38l60L11l08L08P0k99K82j52r3
$$ 59 -82 45 -54 -149 177 149 150 24 169 241 -57 48 -47 91 -269 42 -266 42 112 -187 95 -57 -150
5589a50P8K12n15J86j9J00o5N0K64k46l8K80o9R0j66L27k52J6k51L61j48j08K7
$$ -150 -72 140 -375 -189 -208 -108 -173 -123 141 -105 -143 137 68 158 -8 319 67 83 -168 193 45 -63 -36
5612c6J75l40K85J41m70L49K26m04R9K3j60j85L97n8j44L39n3k80N1M1J74k27
$$ -36 139 -201 84 225 -245 104 330 -74 25 48 -112 -297 100 42 -102 237 184 -96 -45 -4 170 -57
5634e7m9j71M32j44K37k14j92K26K4k01J30j10K11k30J24P5p8nK35k44j43j79
$$ -57 -106 -277 155 11 248 34 -158 68 92 -109 21 -89 122 -108 16 91 13 8 243 -1 -144 -323
5656c23K24M15m36J62k01J87m8J19k5q5R1n0J17j74K18K1k31j10J60j6J73l7J29
$$ -323 -99 316 -120 42 -159 28 -20 99 74 -11 80 30 147 -27 191 212 -19 -129 31 15 188 151 280
5679B80j51j86N9k66J35k98L84L4m4K08k03R0j05j09K8L69k68K94l06r7K50j42
$$ 280 129 -57 2 -264 -129 -427 -43 -9 -53 155 -48 42 -63 -172 -144 225 -43 251 -55 -152 98 -44
5701d4N5J48L8N9k01k92K20k0J3K26k98K61j85K03K4o6j51J48J13k33k17k2M20
$$ -44 11 159 197 256 55 -237 -17 -37 -24 202 -96 165 -20 183 207 141 -10 138 251 18 -199 -221 199
5724A99l74M8K60j14n9j02K57p6m20M39o5K51K70k99j92r7r5RL62k68J00k35J11
$$ 199 -175 -127 133 19 -40 -142 115 39 -381 58 -7 244 514 215 23 -74 -169 -160 202 -66 34 -201 -90
5747i0KQ7J21j08p7k7Q9Q4p9k03P5J43R0j26O2p7J2KR4o9k4J31qj29n0j04J42
$$ -90 -88 -1 120 12 -65 -92 -3 81 2 -201 -126 17 107 -19 43 -34 -22 -20 74 5 -19 112 104 -25 -75 -179 -37
5774c7Q0k61N29m23K01R2k54p7M11k5m56J59j6J79J31o01K79K79k35O5k79M49
$$ -37 43 -218 311 -112 89 181 -73 -150 261 236 -220 -61 -77 102 233 -368 -89 190 -45 20 -259 190
5796A90j31k22k02K76J5R9pj22M97m22K12j56o4q9r7P5R2o0K37m66J08J41K02
$$ 190 59 -163 -365 -89 -74 25 18 -104 393 -29 183 27 -37 -126 -223 -148 -56 -116 121 -345 -237 -96 106
5819A06j34k13J80N1J61k28L44k08L3j80L1J6Jj12J74L73m08K25j42J3Q4k37M0
$$ 106 -28 -241 -61 -10 151 -77 267 59 92 -88 -57 -41 -40 -152 22 395 -13 212 70 83 167 -70 -30
5842c0O4J65k41K48n9k08m2J04o3K44p8j65K17j72p0P9K2J25p8j48K0M57k58P5
$$ -30 34 199 -42 206 147 -61 -103 1 -62 182 104 -61 156 -16 -86 -7 15 140 62 -86 -66 391 133 208
5866B08l89N7J48l04l2K72J46lj17J97k96K2L1J22K17l16K35m33J79j19J32L58
$$ 208 -181 -124 24 -280 -312 -40 106 103 -14 183 -113 -91 -60 62 279 -37 198 -235 -56 -175 -43 315
5888C15m87K88j1k51J46j36M6q7L39O1l27p9L31j76J93j58O5N5N6O8k08n0q8j3
$$ 315 -172 116 105 -146 0 -136 -90 -177 162 223 -104 -183 148 -28 165 7 72 127 183 251 43 -7 -95 -108
5912a08K03j42j28q9K70K16n22J43K09p2J56J14m11J18N7J18j81l8J54P9k29J35
$$ -108 95 -47 -175 -264 6 222 -300 -157 52 -20 136 250 -161 -43 14 132 -49 -87 67 146 -83 52
5934E2M8J25Qk09N53p55R9j4Q3k4nj12J72JL2L5j29j50K9L26j36J08j0k19K0p0
$$ 52 100 225 233 24 577 -178 -79 -93 -10 -34 -39 -151 21 22 54 89 -40 -190 -161 165 29 137 127 -92 -72 -142
5960a42rR3R3n7N8J6M9j10J30j03K21m01L33m6j87j38Q6J24j0j52l8R7mL0J05
$$ -142 -151 -58 35 -22 36 52 101 -9 121 18 239 -162 171 125 -62 -200 -114 10 0 -152 -190 -93 -97 -67 38
5985C8k99r0M38j66j29J52K71l10j35L39j52Q1K8%k84L38j50j32J7K04l5N0jl12
$$ 38 -261 -351 87 -79 -208 -56 215 -95 -230 109 -43 38 66 66 -218 120 -30 -162 -145 59 24 74 73 -239
6009b39K92l4K5O3j22K25j37j68N7q0K45l29K88r3r7M15l52K49l50K94n7k36l1
$$ -239 53 19 44 107 -15 210 73 -95 -38 -118 127 -202 86 -7 -104 311 -41 208 -142 152 95 -141 -172
6032a72M19l5j64j00L2R9l2k67K29j56J77j69L16o3l16K14j7K25m12K12j01J02
$$ -172 247 212 48 -52 -20 79 47 -220 9 -147 30 -139 177 114 -202 12 -5 220 -192 20 -81 21
6054B1n8J4J51m8J39j55k12M42l46j81J51j94L9M02J29m86N03j74m1l05J22j0
$$ 21 -37 -23 128 80 219 64 -148 294 -52 -233 -82 -276 -237 165 294 -192 311 137 96 -209 -87 -97
6076i7K27l3k79J54LK07j24J16j13q8q8K77j43j11K33k56l4L78m12R5R7L03l31
$$ -97 130 97 -182 -28 -25 182 58 174 61 -27 -115 162 19 -92 141 -115 -149 229 -183 -88 9 312 -19
6099a9l2k38J99L80k78o9MK79j38j59M5J92o0p8k19J68L9K44j18k19K22l21K77
$$ -19 -51 -289 -90 290 12 -57 -53 226 88 -71 -26 166 106 28 -191 -23 16 260 142 -77 145 -176 101
6122A01j00K0j63J24K06Nj07L4J25r9k55l24L02k7K28j65m5K84l32J78L41l15
$$ 101 1 21 -142 -18 188 193 86 120 245 146 -109 -433 -131 -158 70 -95 -140 144 -188 -10 331 16
6144A6o7l1P5k85L51m4O7k31N0J53r1K41k14o8L07j96q4J56j81n4j56N21k49k73
$$ 16 -51 -82 -7 -292 59 15 82 -149 -99 54 -37 204 -10 -78 229 33 -51 105 -76 -130 -286 235 -14 -287
6168b87M51k20J53J18k66j07o8Q5K70O6k13J59l26L50J5o0j89K64j83j96J97r
$$ -287 164 -56 97 215 -51 -158 -226 -141 129 195 -18 141 -185 165 180 120 -69 195 12 -184 13 4
6190DJ66k12J06K94m16K24l80M31n14J99N2K5J48l14O3O5K78Nk11k4j63J6P0P8
$$ 4 170 -42 64 358 -58 166 -214 217 -297 -98 -46 -21 127 -187 -124 -59 219 224 13 -11 -174 -158 -88 -10
6214a0K25J07m23N8j32K87K64n78O24k14n42L51l23L25l3L8K6l45J69J39J88l80
$$ -10 215 322 -101 -43 -175 112 376 -202 422 208 -334 17 -306 19 -14 24 50 -295 -126 13 201 -179
6236a79M0L39k48r8O8p6Q0k31K18QL40m93K63O6k66J54K41k96MJ25K6r7J2k07
$$ -179 -139 200 -48 -146 -78 -154 -74 -305 -87 -79 261 -232 31 97 -169 -15 226 -70 -66 59 85 -12 0 -207
6260b07NJ89K76m61L38K46p32N13j21J06L2k99j6J17p6P8j9k71N02j70k35L91
$$ -207 -202 -13 263 -198 140 386 -346 167 46 152 184 -115 -131 -14 -90 -12 -31 -302 200 30 -205 186
6282A86j82q8j73R5J93k5J02k63K36Jk84K77l01R9K17k42L10m29M05k73J07J6
$$ 186 4 -84 -257 -162 31 6 108 -155 81 82 -202 75 -226 -127 90 -152 158 -271 134 -139 -32 -16
6304a6J4J56j35L9K00l40k0q3J95Q1j04Q5q4k5J12L57n12j61K00m8M6J31j18Q6
$$ -16 -2 154 19 58 258 -82 -102 -185 10 91 -13 72 -12 -37 75 432 -80 -241 -41 -89 -43 88 -30 56
6328E6J18k14k7P8J86j53k75N04j02qj27j32L15o78M09J34L2n9j89L86l25m6J14
$$ 56 174 -40 -67 11 197 44 -231 273 171 163 36 -96 219 -459 -50 84 116 57 -132 254 -71 -117 -3
6351cO1j87J29K2j1j66J22n7J39kL3r5P4o1R7L7j85Nj50L65N8l15J73n1j0j06
$$ -3 58 -129 0 22 11 -155 -33 -90 49 47 80 -15 59 -2 95 132 -53 -48 -198 167 225 -90 83 32 22 -84
6377h4j64K53l61M75q9P5j55r8m1K93L0j25l8n1K50m5L9k58P1j93K57J07l34L28
$$ -84 -248 5 -356 119 30 105 -50 -148 -189 104 134 9 -29 -80 170 125 164 -94 -23 -216 41 148 -186 142
6401A42j9j35l9l13K94J11J73k31j79K45Mq4j75Q8n6J17L01r4j28K14p2k6k66
$$ 142 123 -12 -51 -364 -70 41 214 -17 -196 49 53 -31 -206 -118 -174 -57 244 150 22 236 164 138 -128
6424a28q9N25j7l91N8J15j48j49J50J32o4k8l0K01j81j32K41Mj75J08K55k30l9
$$ -128 -217 308 291 -100 -42 73 -75 -224 -74 58 -6 -34 -64 137 -44 -176 65 69 -106 2 257 27 -12
6447a2p8K58k19J95j41p1O7RJ66j68j28Q7J78m41J78K79K3k68j72M40k99R6j96
$$ -12 -90 168 -51 144 3 -68 -1 8 174 6 -122 -35 143 -298 -120 159 182 -86 -258 182 -117 -21 -217
6470b17K09K90j75J0l58K18p7K72j62m8K4k35K38K93k38o7k7p4L8R2M6k93M95
$$ -217 -8 282 107 117 -241 -23 -100 172 10 -38 -14 -249 -11 282 44 -23 -50 -124 -86 6 52 -241 254
6493B54j73k06L01j91J10k2O1p7j79J28o1J99k27J15n0O0j4j82K3J63k32J80M
$$ 254 81 -125 176 -15 95 73 134 57 -122 6 -55 144 -83 32 -18 42 28 -154 -131 32 -200 -20 -16
6516a6j7J47r0J47j66n5J12p2L4k86O58m36OKJ40m87N69l27M48l36K8l22K15K60
$$ -16 -33 114 24 171 5 -50 62 -10 24 -262 396 -40 -34 -32 108 -379 190 -137 311 -25 3 -319 -104 156
6540A56j77J31J93k0l90J77o4J33l31M71k39j1K09j72J8k15K63L7r0J25k50L9
$$ 156 -21 110 303 283 -107 70 6 139 -192 279 40 29 238 66 84 -131 132 169 79 204 -46 -7
6562gJ85k81K53j88K7j17J97j48p9J66r7JP1l7K46k41K9p2L49n52K09J2J23m7
$$ -7 178 -103 150 -38 -11 -128 69 -79 -158 8 -89 -88 -17 -54 192 -49 -20 -92 257 -295 -86 -74 49 2
6586Bq1J90k00p2J15M40m25j35J30J54q9J57l16K92J51m45L38m82L37j13K11l72
$$ 2 -79 111 -89 -161 -46 394 -31 -166 -36 118 29 186 -130 162 313 -132 206 -276 61 -52 159 -213
6608b13K59R0j68K22n74L04J93k39J10K23l96K67k36L32j61j29n6P3L31k78j33
$$ -213 46 136 -32 190 -384 -80 113 -126 -16 207 -189 78 -158 174 13 -116 -172 -99 232 -46 -179
6629a79K72l43J04j5K71O2j43o1K8r6lJ27J83l49M8k14M00n0k14K84k63J88M3
$$ -179 93 -250 -146 -161 110 172 29 -32 -4 -100 -103 24 207 -142 -94 -308 92 42 -172 112 -151 37 80
6652H0k32K21j20j72R2R4O1nJ26K83l36r9p1J62k11Q8K75n38M03m25L90Pl24K05
$$ 80 -152 69 -51 -223 -131 -37 24 19 145 428 92 -7 -78 84 -127 -39 236 -302 101 -324 66 73 -251 -46
6676d6j5K41l27K3N4o9R4j43K53n5N6l15K96l7j06M4L33k67p9M2J81k25r3K43
$$ -46 -61 180 -147 -124 -70 -139 -45 -188 65 10 66 -249 47 10 -96 -52 281 14 -65 -23 158 -67 -160 83
6700H3N7k63j55J49L01jl22K69n6K22l55r5K33r8N3J56p8j05J88j99J31k50n5
$$ 83 140 -123 -278 -129 172 171 -151 118 62 284 -71 -166 67 -31 22 178 100 -5 183 -16 115 -135 -190
6723a90J03p1K83M7N5l69L80r9n9P3J6Q4m44q7K25m2K1r7L20J00m49L83j16pK8
$$ -190 -87 -158 125 172 227 -142 238 139 80 153 169 253 -191 -278 -53 -95 -74 -171 149 249 -200 183 67 60 88
6748H8k9j6P7j39L6j83M32j81j08q1o6Q6m2O9M5K42j09k76M00p9m05L15J3j21
$$ 88 59 43 120 -19 17 -166 266 85 -23 -104 -170 -84 -126 -57 -12 230 121 -155 245 166 -239 76 89 -32
6772c2K9j0o3J05j94J16k8k6r9J05K6L60k50q4K77o7k85L12J96m69k27K54K42
$$ -32 -3 -13 -76 29 -165 -49 -77 -103 -202 -97 -71 289 39 -45 232 165 -120 192 388 -81 -308 -54 188
6795A88j72l1q1P9M8k17L64q9j36K0Q7j65%R4L07j34m9J24n17J03L89n8k32K51
$$ 188 16 -15 -96 -17 31 -186 178 89 -47 -27 60 -105 -105 -11 296 162 113 237 -280 -177 212 154 -78 173
6819A73k58Jj03K96J61k56M6Q4J0k70K16Mp8j2k46K72J73j99k49L94j13M0Q4k17
$$ 173 -85 -84 -187 109 270 14 60 144 154 -116 100 104 26 14 -232 40 213 14 -235 159 46 86 170 -47
6843d7J64j20m4O8PO5k60K54J81k19k33K56Nk4Q8j77J97j6j39pK55l72J40L63
$$ -47 117 -3 -47 21 28 93 -167 87 268 49 -184 72 77 53 141 -36 161 145 6 -1 254 -118 22 385
6867C85o12K38K49l10J04j60Q5r7K48m12N6K90k0k85J39M3j18K52j76O9P8j48
$$ 385 -227 11 260 -50 54 -106 -21 -118 130 -282 -226 64 44 -241 -102 -59 -177 75 -101 -32 46 -102
6889a02O6j35J39L27l21J86n6k60L27j18l04K75M3J05J2K28m89J2K03r1n9j29
$$ -102 -36 -171 -32 295 -26 160 104 -156 171 53 -251 24 67 172 184 412 -77 -65 138 47 -12 -141
6911a41J43J22j32j40J9q2q5K35j11P9l1K22m5m1l7p7R9O5k17M5M41n49N3K01
$$ -141 2 124 -8 -148 -129 -211 -296 -61 -172 -93 -124 98 53 12 -25 -102 -3 62 -155 -110 331 -218 -165 36
6935C6q9OK52k79jJ16q5J84l05L62q0j74K92j11k54Q8J16P9q1J3k10K8M6k00L94
$$ 36 -53 -47 205 -74 -75 41 -44 140 -165 197 117 -57 235 124 -130 -42 74 153 72 85 -125 -97 -51 -251 143
6960A43R7m59K75Q1m34K32Q7j06R3P4r9O9L74m13j00K18r6Q7j45m0J66m73L57
$$ 143 240 -219 56 137 -297 -65 22 -84 9 83 -16 53 427 14 -86 132 36 123 -22 -62 104 -369 -12
6983a2J87J1k81J11j56k9K58j79q3J88K13j4k26j16j02k36M79j14K07k67pL68
$$ -12 175 186 -95 16 -140 -169 89 -90 -173 15 228 214 -12 -128 -230 -466 13 -101 106 -161 -168 200
7005B00k55J75P9l47K12j42j35J80j10K47L01k13m10K04K12j51j36Q8K94k19j6
$$ 200 -55 120 199 -148 64 -78 -213 -33 -143 104 405 192 -218 -14 198 47 -89 -1 293 74 58
7026E8j59L38j60q3J44m4M06o01K88J86l99K9L16m49L5k52M77J50o24M12k8J16
$$ 58 -101 237 77 -6 138 94 500 -101 187 373 -26 3 319 -130 -95 -347 130 280 -344 68 40 156
7048A56p3r3j23Q9J78l20L24o3r4j14O6N7j07M16o17M24j42j62J36K61j50j26
$$ 156 83 -10 -133 -44 134 -186 138 75 -19 -133 -67 -10 -117 299 -318 106 -36 -198 -62 199 49 -77
7070g7J21k7n4J07j0j74J31j00J19j03K1Q4J66l28O8k8Q8J41j33K23l62J28k79
$$ -77 44 17 -37 70 60 -114 17 -83 36 -67 -46 38 204 -124 -56 -84 4 145 12 235 -127 1 -278
7093b78M65l31R3j70K78o1L3K1L6j77k03J01J0O5o9o4L53j80K53j22JM4N3m9l4
$$ -278 187 -144 -51 -221 57 -4 29 50 86 -91 -294 -193 -183 -118 -187 -251 102 -78 175 53 54 98 151 102 68
7118F8J17J1j61J45j95J79O0j63m7nK64l96L0J40k7K32j07p8P6JN3k98J60%r7
$$ 68 185 196 35 180 -15 164 224 61 14 9 273 -123 -93 47 20 252 145 67 143 144 197 -101 59 59 -38
7143c8k12L52R1j90J06j30P4j03j22J28Q0K57n3k79N31j86l47r8Q3l3J91l70N05
$$ -38 -250 102 193 3 109 -21 53 -50 -172 -44 36 293 240 -39 492 306 -41 -139 -56 -89 102 -268 237
7166B37j75j03m7K59k57KN2J84j70k7J16j10n0O0jj0p6K2J28o3J58k45o1L05q9
$$ 237 62 -41 -88 171 -86 -84 -32 152 -18 -45 71 -39 -89 -29 -30 -40 -116 -94 34 -29 129 -116 -177 128 39
7191C9R2nl22L47l40K51K8k80K10j37N2q1q5o7L58n7j50rJ03L9o8j4M9L16l02
$$ 39 131 126 -196 151 -189 62 90 -190 20 -117 -65 -146 -231 -298 60 3 -147 -156 -53 -14 -82 -96 -47 269 -33
7216c3J10l82L85n9o8J29j97J9L37o8j34o6N8j6M6J26j53k77K13J65j67%J44k17
$$ -33 77 -305 80 21 -47 82 -115 -96 241 173 39 -27 31 15 61 187 34 -243 -30 135 -32 -32 112 -105
7240a05K08k77J28K25j43k3l6j0k17K32p8K48j87j47L02l79M43J55j10l16J2L14
$$ -105 103 -174 -46 179 36 13 -23 -33 -250 -18 -96 152 -35 -182 120 -259 184 339 229 -87 -75 239
7262B39j73K58l09l9K67k33kK47j87J06J62l35j63J47J30m9Nj72Q9j98L52j61
$$ 239 66 324 15 -24 243 10 8 255 68 174 336 1 -162 -15 115 66 71 -101 -12 -210 142 -19
7284a9k20J48J17J29j88K06J15n9l17j24J93o0k5J7o5K12k81K0K70r4M1m2k22
$$ -19 -239 -91 26 155 -33 173 288 229 -88 -212 -19 -79 -104 -87 -152 60 -221 -201 69 -25 16 -26 -248
7307b48L97k2J65m45q1O7J84M22k86l10J42O3p7K47n7k89K23k0j24j10K1j21K60
$$ -248 149 127 292 -153 -234 -167 17 439 153 -157 -15 48 -29 218 161 -128 95 75 -49 -159 -138 -259 1
7330Aj71JO1KJ9J15j38n8N4K9pK82k7M5o7k60J66R3K52k63q9k7k69K89j68K72
$$ 1 -170 -169 -108 -106 -87 28 -110 -168 -114 -85 -92 190 163 208 141 -119 47 140 392 129 40 13 -256 33 -135 137
7356A37K3l05j2L04l76J67MJ8Q7j7m3O8j4J66J13n78K38m7L65k94J91l51K86m49
$$ 137 160 -145 -157 147 -229 -62 -58 -40 47 30 -13 55 41 207 320 -258 -20 -67 298 4 195 -156 130 -319
7380c19K20L26j83o9L2J60j6l37L17k8L85p39N8L53k76J22j3k26K68k93K09j29
$$ -319 -99 227 44 -25 7 167 151 -186 131 103 488 -251 -193 160 -116 6 -7 -233 35 -258 -49 -178
7402a78K80J16l01r2j20L95J78j99p1O2j66K26j33PJ85J06J5l38q0J78l8o2J68
$$ -178 102 218 -83 -175 -295 100 278 79 8 70 -96 130 -3 4 189 295 310 -28 -108 70 32 -30 138
7425A38j19j08K05k72J07J89j85K13q0j28K38j97J30L6m5j99K80l40L20j74N7
$$ 138 19 -89 116 -156 -49 140 -45 168 88 -40 198 1 131 167 122 -77 203 -137 183 9 66
7446F6j30j8J18M3N8L8k18m7L1p7J08k7K38j80j55J4Q1L8J40l27M12r4j26M9P7
$$ 66 -64 -82 36 79 137 175 -43 -90 -59 -136 -28 -55 183 3 -152 -138 -57 -19 121 -206 206 112 -14 35 112
7471A12k58L94j86k1l48K01K5K28l8l06J39J93k22J17Q1j03K08l49K67q4j77p6
$$ 112 -146 248 62 41 -307 -106 -81 147 109 -197 -58 135 -87 30 111 8 216 -133 134 50 -127 -203
7493b03J63j67K67k08O7J29O1n2j19J87k62J49j40P6J34qJ36l04L6r4K01JK03
$$ -203 -40 -207 60 -148 -81 48 109 57 -62 125 -137 12 -128 -52 82 74 210 -94 -58 -152 49 50 253
7516B53l32k77J62K45Lk38K87j31J8R9K93n95J87R8j5Q1j00qj7L8L2k07P7J63
$$ 253 -79 -356 -194 51 54 -184 103 -28 -10 89 382 -213 -26 72 57 138 38 30 13 51 83 -124 -47 116
7540A16k04k1J5J72j21J41j36j33P8O2K0K05j44J93j23l4N8k90l4K91Q9l38K45
$$ 116 -88 -109 -94 78 -43 98 -38 -171 -93 -31 -11 194 50 243 120 86 144 -146 -180 111 200 -138 107
7563A07l7m26P20m27j40J21K13j64m0r1K79J09k64pJ21j24j36J46n4n7J38k54
$$ 107 70 -356 364 -63 -203 -82 131 -33 -73 -164 115 224 -40 -47 74 -50 -186 -40 -94 -151 -13 -267
7585b67M32p7J52j89M6q6jkj56P1J95j02k01L65k03J96k57p5j52M22j19j89j06
$$ -267 165 88 240 51 97 11 10 8 -148 -77 118 16 -185 180 -23 173 -84 -159 -311 111 -8 -197 -303
7608c03K84J96l5j14l1j44Q2M6Q4j00q1J86j87Q9k01Q5N39m58k3J56k06J34K91
$$ -303 -19 177 142 28 -3 -147 -65 -19 65 -35 -116 70 -117 -28 -229 -144 395 -63 -86 70 -136 -2 289
7631B89j10k08R0J1J72k70j8n4L50j09j84n4J42k75L33j7N5qr9j9j46L68j90J04
$$ 289 179 -29 61 72 244 -26 -44 -98 252 143 -41 -95 47 -228 105 88 143 135 36 17 -129 239 49 153
7655A53l72K39j93R7j4j4m2O1K98k58K8J21l76O58n31J95o1P0j54J73j52P5j81
$$ 153 -219 20 -173 -76 -90 -104 -146 -85 213 -45 -17 104 -272 386 -145 50 -11 59 -95 78 -74 1 -180
7678a80K20k35L1K44j51J19m3p0p9J43j13R1K3J19K01l09K84k76j06K44l70K56
$$ -180 40 -195 -164 80 -71 48 5 -65 -144 -1 -114 -23 0 119 320 11 295 19 -87 157 -213 43
7700D3L4R0k71J97p7l6m7J87n74M88j76r7K91k99J11K13r6j09K41j77J02J36k51
$$ 43 77 167 -104 93 16 -20 -67 120 -454 34 -142 -239 52 -247 -136 77 -19 -128 113 -64 38 174 -77
7723g7J75L4j52M3L5m32K80pPP2K9L4L24l16k41J58L1P6k38j75K60r9K16J66n15
$$ -77 98 132 -20 23 58 -374 -94 -101 -94 -22 7 41 365 49 -192 -34 -3 73 -165 -340 -80 -179 37 203 -312
7748c12K81L8J1%J8Oo5J09m01K65O9o8J53j09j15M7K45j01o5j69J24j96K2L24
$$ -312 -31 7 18 18 36 42 -23 86 -315 -50 19 -49 104 -5 -120 -73 172 71 6 -163 -39 -235 -213 111
7772A11k23K27j54J30pj69J61J24k70L83m25j54M53j66j21K19q2l88K52M4K29
$$ 111 -112 115 -39 91 84 -85 76 200 -70 313 -112 -266 187 21 -100 119 37 -351 -99 -55 174
7793A74k70L2L3N7j01J0j87J67M05k29r8R2p5q5P5p3K61j98K68l38j74J28Q1J31
$$ 174 -96 -64 -31 26 -75 -65 -252 -85 320 91 -7 85 10 -75 0 -73 188 -10 258 -80 -254 -126 -45 86
7817H6j51N4J73o9k65M01m13Q9L87l91L1k25L61JOk40J46k20J25L25m0k8j93J4
$$ 86 -65 -11 162 93 -172 229 -184 -95 292 -99 -68 -293 68 69 75 -165 -19 -239 -114 211 171 143 -50 -36
7841c6n5M5M01k24n3k61J54p5Qk5L50k79K96n71L09P4N5P3k48m9l3P0p0L00l09
$$ -36 -91 -46 355 131 78 -183 -29 -104 -96 -121 229 -50 246 -325 -16 58 113 186 -62 -111 -144 -74 -144 156 -153
7866a53K38J75k20j0k88K69J96j30K44k70q8j36J60LR5j75j5L86k09o1%j22K9
$$ -153 85 260 40 30 -258 11 207 77 321 51 -37 -173 -13 -10 85 -90 -105 281 72 11 11 -111 -82
7889h2J66M0j13JR8k31J92Q2P9l50K51j28Q1J6k17J51l2j49Q1K89k35L05l40N1
$$ -82 84 124 11 12 110 -121 71 153 232 -118 133 5 86 102 -115 36 4 -145 -64 225 -10 295 -45 6
7913FJ86N1k37k00K27p4K71K4j67M1j94L32M8n68o3N98q2k79P3j10r5K47K70n15
$$ 6 192 243 6 -194 33 -41 230 254 87 128 -66 266 314 -254 -317 281 199 -80 -7 -117 -212 35 305 -210
7937b10k70O58j05M0k08o6J34Q9j94K36j1q9q5m7K82j12K60k75K01k95l2MK05
$$ -210 -480 178 73 113 -95 -161 -27 62 -132 104 93 4 -81 -128 154 42 302 27 228 -67 -99 -95 110
7960A10l70N25n04L49q3k4j52J83j06M8K26k83O1j63Q4J57j40K66j47j39K38j2
$$ 110 -260 265 -239 110 27 3 -149 34 -72 -24 202 -81 -20 -183 -99 58 -82 184 37 -102 136 124
7982A24M3o5r9p5N4K68k27j1q4J86k85J20L5K60l48J71j2p9O1j95M1K3J35k20
$$ 124 167 102 3 -72 -18 250 23 12 -72 114 -171 -51 -16 244 -104 67 55 -24 37 -158 -117 -94 41 -179
8006a79J34j02J88J37l96J62j56J55r4O2J48p2J0J26ok94L79m09L00p3j53M05
$$ -179 -45 -147 41 178 -218 -56 -212 -57 -151 -89 59 -13 -3 123 117 -177 202 -207 93 20 -133 272
8028B72l95J30J86l00rj49J09J2L18l82K72j63J1K1O0k34M24J1k66J99J87o50
$$ 272 -123 7 193 -107 -116 -265 -156 -144 174 -208 64 -99 -88 -67 -7 -241 183 194 -72 127 314 -336
8050c36K82K0j75J48J82l37J42J03o0l1K9K12j35K30k55J24L02k54o9k0n0R3J12
$$ -336 -54 -34 -209 -61 121 -216 -74 29 -31 -62 -33 179 44 274 19 143 445 191 122 102 52 145 257
8073B57l88J0K35l7j47J32j05k13J27J29K5o6qKk38M04ql67N90m84qJ44K13l36
$$ 257 -131 -121 114 77 -70 62 -43 -256 -129 0 25 -41 -49 -47 -285 119 111 -256 334 -150 -158 -14 199 -137
8097a37J21M5J5M4j38R7N6o55P60j7k69K43k88K03Q1j19K64k58J24J7j36R2j33
$$ -137 -16 29 44 88 -50 47 103 -552 208 191 -78 165 -123 80 161 42 306 48 172 189 53 145 12
8120A2L1o4O2n9K44r2j56L64l99K37l89J14j7N9L20j66k7j40k13L93j02m7O1k77
$$ 12 43 -21 41 -18 226 134 -22 342 -57 180 -209 -95 -112 -53 267 101 74 -66 -279 114 12 -35 26 -251
8144b51M24l06R3K02j11j33P7L3L24m28PK02k94L55l55J67k04K6L14m44J65J35
$$ -251 173 -133 -40 162 51 -82 -5 28 352 -76 -69 133 -161 194 -161 6 -198 -172 142 -302 -137 -2
8166bk13L03j55KpN8n9L9Q4p1pJ89k92Q1J45m9j17J54r9J03Q7m7r3O2j32
$$ -2 -215 88 -67 -65 -72 -14 -73 -34 50 -21 -28 161 -131 -50 95 46 -71 83 -16 87 174 127 34 96 -36
8191c6
$$ Imaginary data points
##PAGE= N=2
##DATA TABLE= (X++(I..I)), XYDATA
0@%%%%%%%%%Qj6J6j6J6k4L2l3M1m9N7p1Q3r5J08j25J45j64J87k12K37k67L00l36
$$ 0 0 0 0 0 0 0 0 0 0 8 -8 8 -8 8 -16 16 -17 24 -25 32 -39 44 -51 57 -68 77 -87 100 -112 125 -142 158 -178
33a78L75m17M67n20N78o42P11p86Q70r64J067j182J309j456J625j817K039k300
$$ -178 197 -220 247 -273 305 -337 374 -412 458 -506 561 -621 688 -768 857 -960 1079 -1221
51a221K615l005L496m138N023o320Q414j2350K2284r0558k27843J06965K14073
$$ -1221 1394 -1611 1885 -2253 2770 -3550 4864 -7486 14798 -75760 -303603 -196638 17435
64A7435J16787m1273n8122l4046l8480o4296r183P7378J10222L7804n6744j04372
$$ 17435 134222 92949 34827 781 -37699 -101995 -111178 -33800 76422 114226 57482 -46890
76d6890o6903J2478P2240O5580K9233m040l0272o3926o5159k190Q7176J00990
$$ -46890 -113793 -101315 -29075 36505 65738 61698 31426 -32500 -97659 -99849 -12673 88317
88H8317J2535p8805p2512o587K1728L089J3770N6040N0306l1570r8065o0438L7469
$$ 88317 100852 22047 -50465 -57052 -35324 -32235 -18465 37575 87881 56311 -41754 -102192 -64723
101f4723P8414L5534j4369k4369j8264k1643k1448Q83L3130M8576K7451k4128
$$ -64723 13691 49225 34856 10487 -7777 -29420 -50868 -49985 -16855 31721 59172 35044
113C5044o5889n3278J4064O7506M8003j1625l2598j0959k804j8575j4498K1984
$$ 35044 -30845 -84123 -70059 -2553 45450 33825 1227 -9732 -12536 -31111 -45609 -23625
125b3625M9408L3003j5066m7483m2879q963L2425N4981L4661j5142m7249l5850
$$ -23625 25783 58786 43720 -3763 -46642 -55605 -23180 31801 66462 51320 4071 -31779
137c1779j823K2841K8105K3168R667j3924l6465l0486N493L0901K4637Q152J045
$$ -31779 -33602 -10761 17344 40512 50179 36255 -210 -30696 -25203 5698 30335 38487 39532
150C9532j0570l1774l5450Q89M7240M9244o93m5714m0806m188K3547K2393N641
$$ 39532 28962 -2812 -38262 -37373 9867 59111 58418 12704 -28102 -32290 -8743 13650 19291
163A9291n431K96L066j3810l1406j2002L5149M9881L840m9913l8798J6509L5395
$$ 19291 13860 14156 17222 3412 -27994 -39996 -4847 45034 48874 -1039 -39837 -23328 12067
176A2067l67k3150L425L1288R416l4412l9401N937M3049K7806j3930k9159r176
$$ 12067 11700 -11450 -8025 23263 32679 -1733 -41134 -35197 7852 35658 21728 -7431 -16607
189a6607R888N453q248l512J7059J9114p284k9272j6812J3257K1362K769j0757
$$ -16607 -6719 -1266 -9514 -13026 4033 23147 15863 -13409 -30221 -16964 4398 7167 -3590
202c590K104J4336n302l5126j9922L1915N0059M699m5829l6830J5956L5795K638
$$ -3590 -1486 12850 7548 -27578 -47500 -15585 34474 39173 -6656 -43486 -27530 8265 10903
215A0903k4392l475K7488J6112k4453l8066n081L6721L8410k038l5287k4785Q108
$$ 10903 -13489 -16964 10524 26636 2183 -35883 -40964 -4243 34167 32129 -3158 -27943 -19835
228a9835K0843M541q303L423J6566n65k7295k0947J4402L2087J0590j5874j7665
$$ -19835 1008 5549 -2754 669 17235 16670 -10625 -31572 -17170 14917 25507 9633 -8032
241h032o48N615k652m112J0173J5761n6j9643j6394L819J7204R427n940p320J903
$$ -8032 -8680 -3065 -5717 -9829 344 16105 16049 -3594 -19988 -16169 1035 10462 4522 -2798 -895
256h95K844n643p893j30J2596J4693j695j9804j3901R444K0363M124j4623j0245
$$ -895 1949 -3694 -11587 -11717 879 15572 13877 -5927 -19828 -10384 9979 14103 -520 -10765
270a0765J0427J5770m198j8332p499J2871J7518M483j1152j5892l142J1551J2247
$$ -10765 -338 15432 11234 -7098 -14597 -1726 15792 20275 9123 -6769 -9911 1640 13887
283A3887j507j0228k687R418N520j0163j4024L500J7898R358q162j4704n253N097
$$ 13887 12380 2152 -535 8883 14403 4240 -9784 -6284 11614 20972 12810 -1894 -7147 -2050
297b050O361R69J077M079j066j0386j0305K984J3742Q569n449j1541k300N125
$$ -2050 4311 5280 6357 10436 9370 -1016 -11321 -8337 5405 13974 8525 -3016 -5316 -191
311a91L54n511j011J0331J0271n241k1075j2275J5531K4839Q33k2990j3309J2787
$$ -191 163 -5348 -6359 3972 14243 9002 -12073 -24348 -8817 16022 16855 -6135 -19444 -6657
325f657J6547o672j9403R7K2601J2307j6855k4057m21K2949J6882r953k1682l377
$$ -6657 9890 3218 -16185 -16088 6513 18820 1965 -22092 -22513 436 17318 7365 -14317 -17694
339a7694J7375J0849j0649j4694M213J7017M681j4537j1589P689J4439j073j1796
$$ -17694 -319 10530 -119 -14813 -10600 6417 11098 -3439 -15028 -7339 7100 6027 -5769
352e769l337J0554P742q131j1953L105J4991L741j3608r094J0092J4320m413j8056
$$ -5769 -9106 1448 9190 1059 -10894 -7789 7202 10943 -2665 -11759 -1667 12653 8240 -9816
366i816n559J6794J6761o550k0592p165J3711J5628k651j5721n862J3084J1653
$$ -9816 -15375 1419 18180 11630 -8962 -16127 -2416 13212 10561 -5160 -11022 2062 13715
379A3715r008j7615L88J8798J2158j1117j8703k157J4539R336n034p932l04M920
$$ 13715 4707 -12908 -12520 6278 18436 7319 -11384 -13541 998 10334 5300 -2632 -2936 1984
393A984N02m791l170M765P024m55p223m444K317L853J560j067J113J036l405n110
$$ 1984 2486 -2305 -5475 -710 6314 5859 -1364 -5808 -3491 362 1922 855 1968 3004 -401 -5511
409e511o5O950N176j607p171n128M113P546J084o638l632M860N676j804p016k759
$$ -5511 -5576 1374 6550 4943 -2228 -7356 -3243 4303 5387 -1251 -4883 -23 5653 3849 -3167 -5926
425e926N782P175p78p136m958K365Q121M730n535r740K62R800O274n573r333r54
$$ -5926 -144 7031 6253 -883 -5841 -3476 4645 9375 3840 -5900 -5638 4162 10436 4863 -4470 -5424
441e424Q797N634m675p370NP155L745n156p888N55R407M740o403q506P10O192
$$ -5424 3373 9007 4332 -3038 -3033 4122 7867 2711 -5177 -4622 4785 9525 3122 -5384 -4674 1518
457A518K615l314l222K073K316l401n060J737O881K349n914o645J593P548J582
$$ 1518 4133 819 -2403 -330 1986 -1415 -6475 -4738 2143 4492 -1422 -8067 -6474 1074 2656
472B656p593l802P693P298n712j1866p09J2945R821o793j4400k139J2444R378
$$ 2656 -4937 -8739 -1046 6252 540 -11326 -12035 910 10731 3938 -10462 -12601 -157 9221
486I221n114j1129j153J0768P298p676j1698K618J3790N428j0205j0827K946J1740
$$ 9221 4107 -7022 -8175 2593 9891 2215 -9483 -6865 6925 12353 2148 -8679 -5733 6007
500F007L979p611o921L549O048q16n111j052M947K834m161o038K156P034O42p013
$$ 6007 9986 2375 -4546 -997 5051 4235 -876 -1928 3019 5853 1692 -4346 -2190 4844 5486 -1527
516a527l465N313N056k961o992l49P654M392o316q561Q95R305N867n550j0097
$$ -1527 -4992 321 5377 2416 -4576 -4925 2729 7121 805 -7756 -6861 2444 8311 2761 -7336
531g336j009J0021N739n750p651J038P530K133n429n014K643O479J138m666m359
$$ -7336 -8345 1676 7415 1665 -5986 -4948 2582 4715 -714 -5728 -3085 3394 4532 -134 -4493
546d493m3M289L446j199l928r15J096J070L39M46k8r16p56P4J108k50r32Q20K169
$$ -4493 -4536 -247 3199 2000 -1928 -2843 -1747 -677 -338 108 80 -836 -1592 -1518 -410 -660 -1592 -772 1397
565A397l96k389j344J054K333K248r80l055j641J452K901J496r33j995q19J157
$$ 1397 1001 -1388 -2732 -1678 655 2903 1923 -1132 -2773 -1321 1580 3076 2143 148 -671 486
581D86J344J403q52j985p20L563J816l120l991J475N617K163n118n489L09O504
$$ 486 1830 3233 2381 396 -324 3239 5055 1935 -2056 -581 5036 7199 2081 -3408 -3099 3405
597C405M260l866p156j221N410M611k975o385l37O117J814n189m324K073N258
$$ 3405 7665 3799 -3357 -4578 832 5443 2468 -3917 -4254 1863 3677 -1512 -5836 -3763 1495
612A495J058m272l796J480L593P49k328j373K152J207k133k266K327M846n83n591
$$ 1495 2553 -1719 -5515 -4035 -442 307 -2021 -3394 -1242 -35 -2168 -4434 -2107 2739 2156 -3435
628c435j596N324L782k418m494L32M972K633m088n193J805P342K569n616p009
$$ -3435 -5031 293 4075 1657 -2837 -2505 2467 5100 1012 -4181 -2376 4966 7535 1919 -5090
643e090J288Q766L520o597o537K385O199J210m932l351K585M486m61n000k083
$$ -5090 -3802 4964 8484 1887 -4650 -2265 3934 5144 212 -3139 -554 3932 3471 -1529 -3612
658c612K595L501j35l122k036J759J283n56r19J457J183k658k509J663L499J237
$$ -3612 -1017 2484 2349 -773 -2809 -1050 233 -323 -1242 215 1398 -1260 -3769 -2106 1393 2630
674B630l460l160J445L945O13l509k076K234L937n70m577k692M060M960r98n059
$$ 2630 -830 -3990 -2545 1400 2013 -1496 -3572 -1338 2599 2029 -2548 -5240 -1180 3780 2782 -2277
690b277j698K274L044L28k291r30Q64P17M4o66j85J58J035R6m82j143j5O00J055
$$ -2277 -3975 -1701 1343 1671 -620 -1550 -686 31 75 -591 -776 -618 417 513 31 -1112 -1127 -527 528
709E28J485o97k613r25K004L054nk844k210J977K891j80k471j193K149K037l70
$$ 528 2013 1316 -1297 -2222 -218 2836 2831 -13 -2223 -246 2645 2465 -6 -1199 950 2987 2617
726B617l155n75J831L163j026k523p26J130Q40K84l67o7p04j718J81K520Q40j710
$$ 2617 -538 -1113 718 3881 2855 332 -394 736 1576 1860 1493 1426 722 -996 -815 1705 2545 835
744H35k673J48J931J547j345k879k22L128J990l099l483M88M679J904l467m490
$$ 835 -1838 -1690 241 1788 443 -2436 -2658 470 2460 -639 -4122 -3634 1045 2949 -518 -5008
760e008R73M336J734k482k885Q75K373O25j765j391J969K186n48k479n92J640
$$ -5008 -4035 301 2035 -447 -3332 -2457 -84 541 -1224 -2615 -646 1540 992 -1487 -2079 -439
776d39K131o04j115J39Q17p29r88R94K370K30k176k041L50K992J316k672k273
$$ -439 1692 1088 -27 112 929 200 -788 206 2576 2806 630 -1411 -1061 1931 3247 575 -1698
793a698J650K552J64l086k534K874L865p33m984j629L339L333j078k827j539J294
$$ -1698 -48 2504 2668 -418 -2952 -78 3787 3054 -1930 -3559 -220 3113 2035 -792 -2331 -1037
809a037K238l47j727m06R90N71l93o65j24J462k04j243K76R46m63j303J19J835
$$ -1037 1201 854 -873 -1279 -289 282 -111 -776 -900 562 358 -885 -609 337 -126 -1429 -1310 525
827E25R81j665k412O10K545J939j963k753k26K184K475j501k503Q1K895P19k941
$$ 525 1506 -159 -2571 -1961 584 2523 560 -2193 -2419 -235 2240 739 -1764 -1683 1212 1931 -1010
844a010r20J175K378K14j729j727R67J324J67m3O4p73m04J62K73N38Q14m47j702
$$ -1010 -1930 -755 1623 1837 108 -1619 -652 672 839 796 860 87 -317 -155 118 656 1470 1023 -679
863f79L80J432l56j334l5J678J281p61l166m82K677K045p49l006q53J723K267
$$ -679 -299 1133 777 -557 -592 1086 2367 1606 -1560 -2042 635 2680 1931 -1075 -1928 -205 2062
880B062n93k427o42J659J460j439j640K75J613P08j150j283L67O17l43J55J35
$$ 2062 1469 -958 -1600 59 1519 80 -1560 -1285 328 1036 -114 -1397 -1030 -413 -756 -601 -466
897d66l1o36l87K84Q99J189j118k275J04K728R92j491k350Q64K532P57k535j688
$$ -466 -497 -1133 -1520 -1236 -337 852 -266 -2541 -2437 291 1283 -208 -2558 -1694 838 1595 -940 -2628
915b628K024K509n50k060j226J139K561L90k070j350Q33J373K36o26m63P94P52
$$ -2628 -604 1905 1355 -705 -1931 -792 1769 2159 89 -1261 -428 945 1181 555 92 886 1638
932A638j043p64N61R24p5o59L36R7k20n22j67J163J346q01k534p08K333K143p95
$$ 1638 595 -169 392 1316 1241 582 918 1015 795 273 106 1269 2615 1814 -720 -1428 905 3048 2253
951B253k868o62K097J387j402k166O80J918N10j622j613j68J834J216j277j456
$$ 2253 -615 -1277 820 2207 805 -1361 -681 1237 1747 125 -1488 -1656 178 1394 117 -1339
967a339J32N86M42k70k40L41l3m78p13J189N39r23o78R5J274M76r83j111P11K237
$$ -1339 -1207 -621 -179 -449 -689 -348 -381 -859 -1572 -383 156 -767 -1445 -1350 -76 400 -583 -1694 -983 1254
987A254m42j432j414J484J935N23k654j375J456K253k90j951m43Q37J413k90j570
$$ 1254 812 -620 -2034 -550 1385 1908 -746 -2121 -665 1588 1298 -653 -1096 -259 1154 864 -706
1004g06k87J217J007p42j258n5P04Q36m37m90O6K37q69k46J380J032r74j810N1
$$ -706 -993 224 1231 489 -769 -824 -120 716 279 -211 -145 92 -777 -1023 357 1389 415 -1395 -1344
1023a344J161J295m79j951Q3J847L13j266j552O40K143J008j872k255N89J940
$$ -1344 -183 1112 633 -1318 -1235 612 925 -341 -1893 -1253 890 1898 26 -2229 -1640 300
1039C00P61q33r36j19O34O92p80l78O34L30k64j85J27K47K97k67o39Q15N51j007
$$ 300 1061 228 -708 -827 -193 499 -281 -659 -25 305 41 -144 -17 230 527 260 -379 436 987 -20
1059b0j083J049J877k85j757j288J681J848k11k423j3J374J335o37j335p58J686
$$ -20 -1103 -54 1823 1538 -219 -1507 174 2022 1811 -612 -625 749 2084 1447 112 -646 1040
1076A040J481r06k127J38J664R91j104j106j32O93P75n07k64L34j76k61j54K4
$$ 1040 2521 1615 -512 -374 1290 2281 1177 71 -61 632 1407 900 636 970 794 533 379 403
1094D03N07j38l61q59Q71N92n66j614N64J250N1j194j672R21J811M01j858j313
$$ 403 910 772 411 -448 423 1015 449 -1165 -601 649 700 -494 -2166 -1245 566 967 -891 -2204
1112b204L68J400O85r33j111K1J439K08j399n99R66J113n5j193j80P57M14n70
$$ -2204 -1836 -436 249 -684 -1795 -1774 -335 -127 -1526 -2125 -1159 -46 -101 -1294 -1474 -717 -303 -873
1130h73M46O71n05n39k17Q37O91q8p62p02Q30J405m75j242k39J463N23o08j772
$$ -873 -427 244 -261 -800 -1017 -180 511 423 -339 -1041 -211 1194 719 -523 -762 701 1224 616 -1156
1149a156Q3J696O91j141j119K96Q85N28r3j085k91J159M21r06j86o5N95j02o29
$$ -1156 -1073 623 1314 173 -946 -650 235 763 670 -415 -706 453 874 -32 -218 -283 312 210 -419
1168d19j15O24L57q68K20J116n04q55l51K68J701o3j092j204P17J400L6j184q81
$$ -419 -534 90 447 -421 -201 915 411 -444 -795 -527 1174 1111 19 -1185 -468 932 968 -216 -1097
1187a097P13J468j30j778l83J579J071r74j231KJ272P03l38r41J47L55r1k94L86
$$ -1097 -384 1084 954 -824 -1207 372 1443 469 -762 -760 512 1215 877 -64 83 438 347 53 439
1206D39K81Q0j11r92K46J229j86j056j30Q60P46j016p95L70J057R55j181j185
$$ 439 720 800 689 -303 -57 1172 986 -70 -200 660 1406 390 -405 -35 1022 1977 796 -389
1224c89Q1P86J250o58j431j98J397P96j220j122P40Q69l81o13o14L62R52k28r00
$$ -389 -308 478 1728 1070 -361 -559 838 1634 414 -708 32 901 520 -93 -707 -345 607 379 -521
1243e21k57L29J32k73J11Q7M3l06m49Q5M55O20j093m32J83P25L16q71l69O08Q45
$$ -521 -778 -449 -317 -590 -479 -392 -349 -655 -1104 -1019 -564 56 -1037 -1469 -1286 -561 -245 -1116 -1485 -877 -32
1264c2l40q01j82O05P49N68j500r29J322J024l97k81l56M31L67j45k87J41L61
$$ -32 -372 -1173 -1355 -750 -1 567 -933 -1862 -540 484 87 -194 -550 -119 248 103 -184 -43 318
1283C18R7j49O7m1%j87M89mp4j84p42J38J086K50q63l77M9Q24K49r10p53N20R65
$$ 318 415 266 333 292 292 105 594 590 516 332 -410 -272 814 1064 201 -176 -127 697 946 36 -717 -197 768
1306G68k79o72k59L59N64J55p31n87N01N98j46k19m4NJ64m93J2Q14j11m28n73
$$ 768 489 -183 -442 -83 481 636 -95 -682 -181 417 271 52 8 13 177 -316 -304 510 399 -29 -602
1327f02N76N94o54m23J74M61J71J41j093j75J076P24m20j002j45Q02R62o47j254
$$ -602 -26 568 -86 -509 -335 126 297 438 -655 -830 246 970 550 -452 -597 205 1167 520 -734
1346g34J64J422p1m71o62J93P37K55p16n54P00L80l71l19J99J01M8j56l40L10
$$ -734 -570 852 781 310 -352 -159 578 833 117 -437 263 643 272 -47 152 253 301 145 -195 115
1366A15Q08m17q71M6N53L11m6r02j02R44K26p35o95L00R80Np52p84M16J692m72
$$ 115 923 506 -365 -319 234 545 499 -403 -505 439 665 -70 -765 -465 515 520 -232 -1016 -600 1092 620
1387F20j413l95O14P54n5j002K53K18L32k2p26K38j15L93J85l75j72L64l29o7
$$ 620 -793 -1188 -574 180 125 -877 -624 -406 -74 -96 -822 -584 -699 -306 -121 -496 -668 -304 -633 -700
1407g00M98J37k52k82j33O50J99M8n49j39M77O04l60l34l98P73L51k3r11M36O14
$$ -700 -202 -65 -317 -599 -732 -82 117 165 -384 -523 -46 558 198 -136 -534 239 590 567 -344 92 706
1428G06J58n82j93K8J11J41M60l61o3q1j86L0J84Kk69l4J21K22J6P6l83L4M60
$$ 706 864 282 89 117 228 369 829 468 405 324 138 168 352 354 85 51 172 394 410 486 103 137 597
1451E97m45m26j79P29L46k30p77n70J018L47l22m36n2K80M93l70o59K80P54k10
$$ 597 152 -274 -453 276 622 392 -385 -955 63 410 88 -348 -400 -120 373 3 -656 -376 378 168
1471A68m40n48L97O07k73n12N5P28l54l16j22Q49K70p88j69L02O3O14l17p28M01
$$ 168 -272 -820 -423 184 -89 -601 -546 182 -172 -488 -610 239 509 -279 -448 -146 -83 531 214 -514 -113
1492a13N11M73p06o49J56J035L27r50n87J23J256n39J79q48L0P57J71o91k40R27
$$ -113 398 871 165 -484 -328 707 1034 84 -503 -380 876 337 516 -332 -302 455 626 -65 -305 622
1512F22R9l38l98p3N23l3j59m98L44N1j70j93K97L09k28p4o33L3R34j48q74k44
$$ 622 721 383 -15 -88 435 402 243 -255 89 140 -30 -223 74 383 155 81 -552 -519 415 267 -607 -851
1534h51P24M10j54m76j31N86M98o92o52RP18O2m9j09m32O15K34l38l59L0L54k
$$ -851 -127 283 129 -347 -478 108 606 -86 -738 -729 -11 51 2 -107 -539 76 310 -28 -387 -357 -3 -5
1556em1j22M3K99p4r7j1J93j79J42j11K00L44n01m70J93P85k18j64l18m9N05j19
$$ -5 -46 -168 -125 174 100 3 -8 185 6 148 37 237 581 80 -390 -197 588 370 206 -112 -161 344 225
1579B25p2n78P33K95l64k73J17J76n4R8k25p4k17L03J7L52k47k27J27j32J19L8
$$ 225 153 -425 308 603 239 -34 83 259 205 303 78 4 -213 90 107 459 212 -15 112 -20 99 137
1601A37p8l13J09J24P6m11n1m1P6J81k00n37M91L16K89o61Q2q5M15K76l28m09
$$ 137 59 -254 -145 -21 55 -356 -407 -448 -372 -191 -391 -928 -437 -121 168 -493 -411 -496 -81 195 -133 -542
1623e42o3M00L55k46n4r3K30K42l92J16L30j66k05k09N84m6Ol88J08O61K36q27
$$ -542 -605 -205 150 -96 -150 -243 -13 229 -163 -47 283 117 -88 -297 287 241 247 -141 -33 628 864 37
1645C7k90L83M15J15n70l22L82M65j61p54r5P12K29k31l05l08O19K77m14k01q
$$ 37 -253 130 545 660 90 -232 150 615 454 -300 -395 317 546 315 10 -298 321 598 184 -17 -25
1666b5J45p8K2j97J97J96l5o53K47J76K33k04m90L80j47J66j03j43M17M2l22l68
$$ -25 120 42 64 -133 64 260 225 -428 -181 -5 228 24 -466 -86 -233 -67 -170 -313 104 146 -176 -544
1688e44K2rN08j22m76K67L65P7l28n41P99oK65l25l20K07K64P4m89p0L02J63j64
$$ -544 -522 -531 -23 -145 -621 -354 11 88 -240 -781 18 12 277 -48 -368 -161 103 177 -312 -382 -80 83 -81
1711h1R8K4J22k17J23J5M28j75m64L3J26K75p4k69k49M84K89J29n31k97M89K99
$$ -81 17 41 163 -54 69 84 512 337 -127 -94 32 307 233 -36 -285 199 488 617 86 -211 278 577
1733E77j60p36j53L87L82l76l88J97j09M94kn85P10l81K83l79J03j91L49J02o41
$$ 577 417 -319 -472 -85 297 -79 -467 -270 -379 115 113 -472 238 -143 140 -239 -136 -327 22 124 -517
1754e17N42L5k00m05K70J63N07p74L3N9K27K23k53j90K46P5K79l05n53M41M99
$$ -517 25 60 -140 -545 -275 -112 395 -379 -346 -287 -60 163 -90 -280 -34 41 320 15 -538 -97 402
1775D02J97n46m96N47L30k38j54L61l78j25L30o3J25K54m12L5q9R9M81l07m99
$$ 402 599 53 -443 104 434 196 42 403 25 -100 230 167 292 546 134 169 80 179 660 353 -146
1796a46K68L26J93n15L2J69P8j43j94l7K75m4k74k53k1M61j43J6j42l44M22J65
$$ -146 122 448 641 126 158 327 405 262 68 31 306 262 -12 -265 -286 175 32 48 -94 -438 -16 149
1818A49l94m0Q2J87L8K15q05K32K25j14n9pK07k54j0K52l12L53o1m34L07K62j06
$$ 149 -245 -285 -203 -16 22 237 -568 -336 -111 -225 -284 -291 -84 -338 -348 -96 -408 -55 -116 -550 -243 19 -87
1841h7O5n24L07L14J28l41j60K21N29j41p03K06R6L63q8l05J77K28o6k6j13K39
$$ -87 -22 -546 -239 75 203 -138 -298 -77 452 311 -392 -186 -90 273 185 -120 57 285 219 193 80 319
1863C19j94k6P4K9j53L38j45o14N47J24m20L5M6N8J86l01j61J65L70N8l07l32
$$ 319 125 99 173 202 49 387 242 -372 175 299 -121 -86 -40 18 204 -97 -258 -93 277 335 28 -304
1885c04j20K88J96r7n35L06L69J40j89j97r0K44J78r4k8j2k42L29j68LK16l31
$$ -304 -424 -136 60 -37 -572 -266 103 243 54 -143 -233 11 189 95 67 55 -187 142 -26 -23 193 -138
1907a38L50m31M88r6L1m18K24K57J50l53k92K36O39n21L2m27N44k0j27n5n10M33
$$ -138 212 -219 269 173 204 -214 10 267 417 64 -228 8 647 126 158 -269 275 255 128 73 -437 -4
1929dO93j66p52j21P57J10l59J6r7K9L34j85l19K15J45l9j20q6J38J03l42j72
$$ -4 689 523 -229 -350 407 517 158 174 77 106 440 255 -64 151 296 257 137 51 189 292 -50 -222
1951b22Q2M60j57l22j75K93L8J62k45j42O3J80j80j88P0K69k36Qj35J67M79n22
$$ -222 -140 320 163 -159 -334 -41 -3 159 -86 -228 -165 15 -165 -353 -283 -14 -250 -242 -377 -210 269 -253
1973b53J57l31K41J61p0jj35M62j97l2k76L1M14j15J56K3l25Q8J12l97M13n3k
$$ -253 -96 -427 -186 -25 -95 -96 -231 231 34 2 -274 -243 171 56 212 235 -90 -2 110 -287 126 73 71
1996G1j15J2K5k3K53j05P4j27J24Jk5R3k10O6L50l27j94K68J9r0j5K37n79L38
$$ 71 -44 -32 -7 -30 223 118 192 65 189 190 165 258 48 114 464 137 -57 211 230 140 125 362 -217 121
2020A21L4l04M34J6l69K17k9Q4o30L12J80J35m24n5L0P0L87l50K14k38L34l38
$$ 121 155 -149 285 301 -68 149 120 204 -426 -114 66 201 -223 -278 -248 -178 209 -141 73 -165 169 -169
2042a69J40j20J84J12K0m00K55J68j56P1j70j18K85J80m80J18J9q3K50j88m9J20
$$ -169 -29 -149 35 147 167 -233 22 190 34 105 -65 -183 102 282 -198 -80 -61 -144 106 -82 -131 -11
2064a1K1M81n46j79L36L19l61o7k12M52j52K06l22k0K22K36l18j54j4O46N5p29
$$ -11 10 491 -55 -234 102 421 60 -7 -219 233 81 287 -35 -55 167 403 85 -69 -83 563 618 -111
2086a11m09Q88L8n3k22k28R4K13j63J3j31j1J13M07p45j07K27M24m50r6K38L78
$$ -111 -520 368 406 353 131 -97 -3 210 47 60 -71 -82 31 438 -307 -414 -187 237 -213 -309 -71 307
2108C07Oj68j73J1J88j55j03o4R8M0L7k05P7l1L33m37j6j15L25J98pn21J52M10
$$ 307 313 145 -28 -17 171 16 -87 -151 -53 -13 24 -181 -104 -135 198 -239 -255 -370 -45 153 146 -375 -223 187
2132A87J50o9n46LN68Q5n23k93K49K07M0p2j40J94O7L49l09k03J12j1J01m18l5
$$ 187 337 268 -278 -275 293 378 -145 -438 -189 18 58 -14 -154 40 107 456 147 -56 56 45 146 -272 -307
2155c07J66K23K17l33K81j93J81k14NJ80k99L07k96j07j50L67M18n43J21k81L52
$$ -307 -141 82 299 -34 247 54 235 21 26 206 -93 214 -82 -189 -339 28 446 -97 24 -257 95
2176I5nm50J71j56Q16j27m06l20M14L2j13j07l21M41K15J8o14J19J55J85K55l18
$$ 95 90 -360 -189 -345 471 344 -62 -382 32 64 -49 -156 -477 -36 179 197 -417 -298 -143 42 297 -21
2198b1l53K85L47k41j70M1K30J83j38l95o9L54K81l33p5K1M00j28m60J39J29M38
$$ -21 -374 -89 258 17 -153 -112 118 301 163 -232 -301 53 334 1 -74 -53 347 219 -241 -102 27 465
2220D65l27k47j32R1Q42k90p22K08J98M18l75m66j64O65M23k95p48Q0P56j56n16
$$ 465 138 -109 -241 -150 692 402 -320 -112 86 504 129 -337 -501 164 587 292 -456 -376 380 224 -292
2241b92q6LO73J62n48m19M48M98l26j42m17L94L78p0p40J79K34L12k42l89M21
$$ -292 -378 -375 298 460 -88 -507 -59 439 113 -29 -446 -52 326 256 -484 -305 -71 241 -1 -390 31
2262C1J32O6j33n41L20L01J77n59k25K53L45K24o16r7J99L57n7m25N6m2N93r5
$$ 31 163 229 96 -445 -125 176 353 -206 -431 -178 167 391 -225 -322 -123 234 177 -248 -192 -234 359 264
2284B64o05L42J01J36j87k44R4O7M45m88l89K38N82J04l65m42K70J60K30m19m13
$$ 264 -341 1 102 238 51 -193 -99 -32 413 -75 -464 -226 356 460 95 -347 -77 83 313 -106 -519
2305e19N50K37l5l80n73Q49kL25m88q36O70M80j36m17OK08L76l36l15J41K35K3
$$ -519 31 268 233 -147 -720 129 127 452 -36 -872 -202 278 142 -275 -269 -61 315 -21 -336 -195 40 63
2327F3l42m1J63M70p4m96k07L55M65J30m27l92M09Q6J36n05m16O84L27j95l96
$$ 63 -279 -320 -157 313 239 -257 -464 -109 356 486 59 -333 76 162 298 -207 -623 61 388 193 -203
2348b03J19L32j33L1k91j95L79M76k77m18k2K60K39L7n38j2M05L49o46p8J42M53
$$ -203 -84 248 115 146 -145 -340 39 515 238 -180 -202 58 297 334 -204 -216 189 538 -108 -186 -44 409
2370D09k67l70j8M22L51m99j78j03K83K88r3n93k30P13L12n98L9j79L26K21m37
$$ 409 142 -228 -246 176 527 28 -150 -253 30 318 225 -368 -598 115 427 -171 -132 -311 15 236 -201
2391b01r9K18M23L4o46k44M90O03l16n40k74L32L43q2l62j86L59K56K75m85k27
$$ -201 -300 -82 341 375 -271 -515 -25 578 262 -278 -552 -220 123 41 -321 -507 -148 108 383 -102 -329
2412c29M62L49k08m52j86L61K59k60k71j79Q08O1m06p18O69J83j8l86r7K35M91
$$ -329 133 482 274 -178 -364 -3 256 -4 -275 -454 354 415 9 -709 -40 143 125 -261 -358 -123 368
2433C68l7k00m03J56N29j63n04m3N81J30k26m23j8L65K37l30l30%M91J03k04n95
$$ 368 331 131 -272 -116 413 250 -254 -297 284 414 188 -235 -253 112 349 19 -311 -311 180 283 79 -516
2455e16M32J45K49k87l83J75L74L44p07l79M49L41P7n84j83O21l3J41n01k24M55
$$ -516 -84 61 310 23 -360 -185 189 533 -174 -553 -104 237 314 -270 -453 168 135 276 -225 -449 6
2476FM15p52r5KO05j25l2j59o8K46L97o63j06J65P72k36p02N4K49M99j28m87l23
$$ 6 421 -331 -426 -424 181 56 24 -135 -203 43 440 -223 -329 -164 608 372 -330 -276 -27 472 344 -143 -466
2499d66O18K15j73l83k91L07P76n05k27k64P92nk45o31l7O21L11k04o93K08M76
$$ -466 152 367 194 -189 -480 -173 603 98 -129 -393 399 394 149 -482 -519 102 413 209 -484 -276 200
2520B00J04k50o22K76N69j84m24K05L08J06j94m51n3L74K92q0o34j69R77r6j76
$$ 200 304 54 -568 -292 277 93 -331 -126 182 288 94 -357 -410 -36 256 176 -458 -627 350 254 78
2541G8m12J70L64J06k68o06N46n9K46l7l03oL94J73l14n81O34K52k35l50l16M31
$$ 78 -334 -164 200 306 38 -568 -22 -81 165 128 -175 -181 213 386 72 -509 125 377 142 -208 -524 -93
2563i3M04n2o53j26N68K20n8k22l37M72J75J49p31K12K03J52k24n88N21L70k66
$$ -93 311 259 -394 -520 48 268 210 -12 -349 123 298 447 -284 -72 131 283 59 -529 -8 362 96
2584I6l06m15N01L95m9n43L45n4J79o2m18j95L29O02k39l18k52J62M10m2l72N5
$$ 96 -210 -625 -124 271 222 -321 24 -30 149 87 -331 -526 -197 405 166 -152 -404 -242 168 126 -246 -191
2606a91J07L01l16l42K88K63J90Q0q59K70K56K7k61j58L6O22o3m21l72N95jK29
$$ -191 -84 217 -99 -441 -153 110 300 380 -479 -209 47 74 -187 -345 -309 313 250 -171 -543 52 51 280
2628B80l40k52M59M29l28l73J83Q1J5K4k96P3O14j09p8o29M68J23kn71J02o5M96
$$ 280 -60 -312 147 576 248 -125 58 139 154 178 -118 -45 569 460 382 -247 221 344 342 -229 -127 -192 304
2651C04q0k42l95O55Q6j88l06j6J66M19o4l50j49J77M34m25j69j80M57L08o01
$$ 304 224 -18 -413 242 328 140 -166 -182 -16 403 339 -11 -160 17 451 26 -143 -323 134 442 -159
2672a59k13L08L50M7k60k85p5O15j66q8o44Q18j7Kk62o47P10K78n2m83pM55M8
$$ -159 -372 -64 286 333 73 -212 -287 328 162 74 -570 248 231 233 -29 -676 34 312 260 -223 -230 225 273
2695B73l19m70J74L33J99j99m62J44O84j16l36Kj10M27J75m57k18L76J21k89P6
$$ 273 -46 -516 -342 -9 190 -9 -471 -327 357 241 -95 -93 -203 224 399 -58 -276 100 221 -68 8
2716Hk84K69J16J05m21L28K62k68L14m86M2L47J84l25l58L22j0L54l29k69j52
$$ 8 -276 -7 109 214 -207 121 383 115 429 -57 -15 332 516 191 -167 155 145 499 170 -99 -251
2737b51M72M5l28l26K24J93j0k10O8q7L68J13n83J35K55P5m0k41N6J10J9l29J85
$$ -251 221 266 -62 -388 -164 29 19 -191 -123 -210 158 271 -312 -177 78 153 113 -128 -72 38 57 -272 -87
2760h7q3O3K64m3k09j99M34k40J32k38K57K4L21k93j68J55K28j24l55L68j93L59
$$ -87 -170 -107 157 114 -95 -294 140 -100 32 -206 51 75 396 103 -65 90 318 194 -161 207 14 373
2782C73k42K0l18L39j0j95j11q2L12M03k18p01M50j35K09l34L42j53L18M56p39
$$ 373 131 151 -167 172 162 -33 -144 -226 86 489 271 -430 20 -115 94 -240 102 -51 267 723 -16
2803a6k20L08J54k0m95J51J04M26l74J07n28N32L48l36l16L6N3K12L7o15J97J18
$$ -16 -236 72 226 206 -289 -138 -34 392 18 125 -403 129 477 141 -175 -139 -86 126 163 -452 -255 -137
2825a37K51J66m45P3K3M69l26l10K85j3L09n78j30K71K88q6k23o6J06K00j2j55
$$ -137 114 280 -165 -92 -69 400 74 -236 49 36 345 -233 -363 -92 196 110 -113 -179 -73 127 115 -40
2847d0l4Q1O7K33m07J01k52L83q2O0l41K00J72q3l21Q5M61k48J00kq2L26o0m31
$$ -40 -74 7 74 307 -100 1 -251 132 50 110 -231 -31 141 58 -263 -178 283 35 135 133 51 377 317 -114
2871a14p2J97N11k86n37J85JJ19pJ62o56O27K45m05q8l9j7L62k02k2K4j22M15
$$ -114 -186 11 522 236 -301 -116 -115 4 -3 159 -497 130 375 -30 -118 -157 -174 188 -14 -36 -12 -134 281
2894B81k25K9j26j42M40m8k90j15N56k14k34R0J07L15m18K5n1J46l09K29j71m0
$$ 281 56 85 -41 -183 257 209 -81 -196 360 146 -88 2 109 424 6 31 -20 126 -183 46 -125 -165
2916a65N02k15K7l44L51%N4k63Oj52L48K64J4n42O9RL3k01j41K73K92m9k19M3
$$ -165 337 122 149 -195 156 156 210 -53 -47 -199 149 413 427 -115 -46 -37 -4 -205 -346 -73 219 170 -49 -6
2940fQJ30k11j11K22j23K42j78j86J21J73K41m59p2j0L8J21J86l76K28J28J80
$$ -6 2 132 -79 -190 32 -91 151 -27 -213 -92 81 322 -137 -209 -219 -181 -60 126 -250 -22 106 286
2962B86l15j4r0j7J87j62q8Q5N36k79m12K19N4J01n7l72J07L8K26j8j29M53l14
$$ 286 -29 -43 -133 -150 37 -125 -213 -128 408 129 -283 -64 -10 91 34 -338 -231 -193 33 15 -114 339 25
2985B5j0L5k82N5L52J7k36M0J69j08p8J56j99k04L65k11M4l59K29Q4M54l17q0
$$ 25 15 50 -232 -177 175 192 -44 -4 165 57 -21 135 -64 -268 97 -114 -70 -429 -200 -116 338 21 -59
3008e9L21j48r7J66k13L8P9r6o1Q4k00K45l26J44N7J39Mk42J58L52l05q3R8j18
$$ -59 262 114 17 183 -30 8 87 -9 -70 14 -186 59 -267 -123 -66 73 77 -165 -7 345 40 -43 55 -63
3032f3k4L8O3j91R5p3K02O7l6j10j72M76j60k43J73N4j54K64n39L49K67m75L37
$$ -63 -87 -49 14 -177 -82 -155 47 114 78 -32 -204 272 112 -131 42 96 -58 206 -333 16 283 -192 145
3055A45k56j5P3N20n13j26P5J17K68l48J2J88L06k41j67rL0Q8j85M39jk62j95
$$ 145 -111 -126 -53 467 -46 -172 -97 20 288 -60 -48 140 446 205 38 29 59 147 -38 401 400 138 -57
3078e7m1kJ69j7P3K5p21M32L20n87J76J97j36R5R5n5l8q7K75l0l8k74K32K84q2
$$ -57 -98 -100 69 52 125 150 -571 -139 181 -406 -230 -33 -169 -74 21 -34 -72 -159 116 86 48 -226 6 290 208
3103B08k28nL90m09P0r8l9P3j23O2j17L02j98Q8O2j03j44L50r5M9n8k23K77o2
$$ 208 -20 -25 365 -44 26 -72 -111 -38 -161 -99 -216 86 -112 -24 38 -65 -209 141 46 95 37 -186 91 29
3127B9k42l8J52J51L22m98O3L26k14J36k81N3R6J23m3l27K2L35p2O8l97K42k91
$$ 29 -213 -251 -99 52 374 -124 -61 265 51 187 -94 -41 55 178 135 -192 -170 165 93 161 -236 6 -285
3150b85K67p1j6Q9J49k83J71oj23K14O5j17k0k5K6k21O8M68q6m21J29R9k9p4j02
$$ -285 -18 -89 -105 -16 133 -150 21 15 -108 106 171 54 34 9 35 -186 -118 350 264 -157 -28 71 42 -32 -134
3175a34J34K6M2j47L04k98k79J01Q7K14j23J89j49J85J69m25J24n4J22k65K12
$$ -134 0 26 68 -79 225 -73 -352 -251 -164 50 -73 116 -33 152 321 -104 20 -34 88 -177 35
3196C5k16J74r7N3J00m38M65J34j61j79J45j30L02l71m2L17j75l3N3K98l21R6
$$ 35 -181 -7 -104 -51 49 -389 76 210 49 -130 15 -115 187 -184 -226 91 -84 -117 -64 234 -87 9
3218IK01k04m4J74k53J20j16J10j86L92k28K7k03M67m32l8N2J27j28M8M01j96
$$ 9 210 6 -38 136 -117 3 -113 -3 -189 203 -25 2 -201 266 -166 -204 -152 -25 -153 -105 296 100
3240A00j30R9j27j01M35k83J16j56Rq8J31k11M82n99L87R8n3j52Lr4n9L34J0j42
$$ 100 -30 69 -58 -159 276 -7 109 -47 -38 -126 5 -206 276 -323 64 162 109 -43 -40 -134 -193 141 151 9
3264Ik12L16l09J55L85k37k96K07j10K85O5k39J31K51m51K50k55j0L01k39RQ5
$$ 9 -203 113 -196 -41 344 107 -189 18 -92 193 258 19 150 401 -50 200 -55 -65 236 -3 6 91
3286I1j22K1r1K29k27K4J15r0J68k56K9J35J10q2O3j12J9P3k57m4J42K25rl36
$$ 91 -31 -10 -101 128 -99 -75 40 -50 118 -138 -109 26 136 54 117 5 24 97 -160 -204 -62 163 154 -182
3310a82j38L16n1J1K17l61L36j95k3mQ2j76K73o3l7J81l36J70K21j07pj23j49
$$ -182 -320 -4 -55 -44 173 -188 148 -47 -70 -74 8 -168 105 42 5 186 -150 20 241 134 127 4 -145
3333a45O5M6p0J39K9j56J50j90N6J15J19l6j53m9K90m57J31K18K3r9kj20J06k8
$$ -145 -80 -34 -104 35 64 -92 58 -132 -76 39 158 122 -31 -80 210 -247 -116 102 125 26 24 -96 10 -18
3357a8J44J42m57L4L4L32k80J57l11J11k1K45l78J82L54n4k92j20K95m3K7j44
$$ -18 126 268 -189 -155 -121 211 -69 88 -223 -112 -133 112 -266 -84 270 216 -76 -196 99 56 83 -61
3379f1J78k7j80K99l68m4M82k22k19j78K64PL99l06J07j12k11J4L10r3j11j7j1
$$ -61 117 90 -90 209 -159 -203 279 57 -162 -340 -76 -69 330 24 131 19 -192 -178 132 39 -72 -89 -100
3402a00L2Q2o5J92k89K86q3K00j83n6N1M0p4k13L71j69R3j28j19k5K18n0K07k41
$$ -100 -68 14 -51 141 -148 138 55 255 72 16 67 107 33 -180 191 22 115 -13 -132 -157 61 11 218 -23
3426b3J35OR7j83j62L91j59j74j80L07P6k78L65k17ol8k24L13q8LJ40R1k3L72
$$ -23 112 118 215 32 -130 261 102 -72 -252 55 131 -147 218 1 -5 -43 -267 46 -42 -39 101 192 169 541
3450E41m80k30M00l14K9K19l04N11o38J62k3m6K59l25p0O2K78k16J80O6l98K47
$$ 541 61 -169 231 -83 -54 165 -139 372 -266 -104 -127 -173 86 -239 -309 -247 31 -185 -5 61 -337 -90
3472i0J60j07K52j15k0k38J05K0J80p3J05m85M33k57J11J90m49L77rK4j0k24K73
$$ -90 70 -37 215 100 80 -158 -53 -33 147 74 179 -306 127 -130 -19 171 -278 99 90 114 104 -120 153
3495A53n20K05J91K5o2O8m0j69O5J89q0l28K73K63k27l17K53J23k32o8J70O8l9
$$ 153 -367 -162 29 54 -8 60 20 -149 -84 105 25 -303 -30 233 6 -311 -58 65 -167 -235 -65 3 -36
$$ [...]
8191a05
##END NTUPLES=NMR FID
##END=
