##TITLE=1H_EC-3063x
 DMSO, 56 sc, 
 24.10.2019
##JCAMPDX= 6.0         $$ Bruker NMR JCAMP-DX V2.0
##DATA TYPE= NMR FID
##DATA CLASS= NTUPLES
##ORIGIN= UXNMR, Bruker Analytische Messtechnik GmbH
##OWNER= root
$$ XWIN-NMR		Version 3.5
$$ Thu Oct 24 14:17:12 2019 Russian Standard Time (UT+4h)  she@DPX200
##.OBSERVE FREQUENCY= 200.1315
##.OBSERVE NUCLEUS= ^1H
##.DELAY= (6, 6)
##.ACQUISITION MODE= SIMULTANEOUS
##.ACQUISITION SCHEME= undefined
##.AVERAGES= 56
##.DIGITISER RES= 18
##SPECTROMETER/DATA SYSTEM= spect
##.PULSE SEQUENCE= zg30
##.SOLVENT NAME= DMSO
##.SHIFT REFERENCE= (INTERNAL, DMSO, 0, 15.7039)
##AUDIT TRAIL= $$ (NUMBER, WHEN, WHO, WHERE, WHAT)
$$ ##TITLE= Audit trail, XWIN-NMR		Version 3.5
$$ ##JCAMPDX= 5.01
$$ ##ORIGIN= Bruker BioSpin GmbH
$$ ##OWNER= she
$$ F:/spectra/data/she/nmr/H-F/1/audita.txt
$$ ##AUDIT TRAIL=  $$ (NUMBER, WHEN, WHO, WHERE, WHAT)
(   1,<2019-10-24 14:16:07.67 +0400>,<she>,<DPX200>,
      <continue with go, POWCHK disabled, PULCHK disabled
       configuration hash MD5:
       00 E9 B6 7A A2 85 ED C7 34 08 36 98 17 FE 4E 26
       data hash MD5: 16K
       F8 68 0B A0 01 53 DB 2E BC FE 76 F8 75 04 8F B5>)
$$ ##END=
$$ 
$$ hash MD5
$$ 71 EB CF BF 65 E7 E5 62 DA 13 AA 70 54 91 E4 AD
##$RELAX= 
##$RELAX= 
##$RELAX= 
##$RELAX= 
##$RELAX= 
##$RELAX= 
$$ Bruker specific parameters
$$ --------------------------
##$DU= <F:/spectra>
##$EXPNO= 1
##$NAME= <H-F>
##$PROCNO= 1
##$TYPE= <nmr>
##$USER= <she>
##$AMP= (0..31)
100 100 100 100 100 100 100 100 100 100 100 100 100 100 100 100 100 100 
100 100 100 100 100 100 100 100 100 100 100 100 100 100 
##$AQSEQ= 0
##$AQ_mod= 1
##$AUNM= <au_zg>
##$AUTOPOS= <>
##$BF1= 200.13
##$BF2= 200.13
##$BF3= 200.13
##$BF4= 200.13
##$BF5= 200.13
##$BF6= 200.13
##$BF7= 200.13
##$BF8= 200.13
##$BYTORDA= 1
##$CFDGTYP= 0
##$CFRGTYP= 5
##$CHEMSTR= <none>
##$CNST= (0..31)
1 1 145 1 1 1 1 1 1 1 1 1 1 1 1 1 1 1 1 1 1 1 1 1 1 1 1 1 1 1 1 1 
##$CPDPRG= <>
##$CPDPRG1= <>
##$CPDPRG2= <>
##$CPDPRG3= <>
##$CPDPRG4= <mlev>
##$CPDPRG5= <mlev>
##$CPDPRG6= <mlev>
##$CPDPRG7= <mlev>
##$CPDPRG8= <mlev>
##$CPDPRGB= <>
##$CPDPRGT= <>
##$D= (0..31)
0 1.2 0 0 0 0 0 0 0 0.06 0 0.03 0 0 0 0 0.0002 0 0 0 0 0 0 0 0 0 0 0 0 
0 0 0 
##$DATE= 1571911970
##$DBL= (0..7)
120 120 120 120 120 120 120 120 
##$DBP= (0..7)
150 150 150 150 150 150 150 150 
##$DBP07= 0
##$DBPNAM0= <>
##$DBPNAM1= <>
##$DBPNAM2= <>
##$DBPNAM3= <>
##$DBPNAM4= <>
##$DBPNAM5= <>
##$DBPNAM6= <>
##$DBPNAM7= <>
##$DBPOAL= (0..7)
0.5 0.5 0.5 0.5 0.5 0.5 0.5 0.5 
##$DBPOFFS= (0..7)
0 0 0 0 0 0 0 0 
##$DE= 6
##$DECBNUC= <off>
##$DECIM= 24
##$DECNUC= <off>
##$DECSTAT= 4
##$DIGMOD= 1
##$DIGTYP= 9
##$DL= (0..7)
0 120 120 120 120 120 120 120 
##$DP= (0..7)
150 150 150 150 150 150 150 150 
##$DP07= 0
##$DPNAME0= <>
##$DPNAME1= <>
##$DPNAME2= <>
##$DPNAME3= <>
##$DPNAME4= <>
##$DPNAME5= <>
##$DPNAME6= <>
##$DPNAME7= <>
##$DPOAL= (0..7)
0.5 0.5 0.5 0.5 0.5 0.5 0.5 0.5 
##$DPOFFS= (0..7)
0 0 0 0 0 0 0 0 
##$DQDMODE= 0
##$DR= 18
##$DS= 0
##$DSLIST= <SSSSSSSSSSSSSSS>
$$ [...]
##$SUBNAM2= <"">
##$SUBNAM3= <"">
##$SUBNAM4= <"">
##$SUBNAM5= <"">
##$SUBNAM6= <"">
##$SUBNAM7= <"">
##$SUBNAM8= <"">
##$SUBNAM9= <"">
##$SW= 24.0689530833862
##$SWIBOX= (0..15)
0 0 2 0 0 0 0 0 0 0 0 0 0 0 0 0 
##$SW_h= 4816.95568400771
##$TD= 16384
##$TD0= 1
##$TE= 0
##$TE2= 300
##$TE3= 300
##$TEG= 300
##$TL= (0..7)
0 120 120 120 120 120 120 120 
##$TP= (0..7)
150 150 150 150 150 150 150 150 
##$TP07= 0
##$TPNAME0= <>
##$TPNAME1= <>
##$TPNAME2= <>
##$TPNAME3= <>
##$TPNAME4= <>
##$TPNAME5= <>
##$TPNAME6= <>
##$TPNAME7= <>
##$TPOAL= (0..7)
0.5 0.5 0.5 0.5 0.5 0.5 0.5 0.5 
##$TPOFFS= (0..7)
0 0 0 0 0 0 0 0 
##$TUNHIN= 0
##$TUNHOUT= 0
##$TUNXOUT= 0
##$USERA1= <user>
##$USERA2= <user>
##$USERA3= <user>
##$USERA4= <user>
##$USERA5= <user>
##$V9= 5
##$VALIST= <valist>
##$VCLIST= <CCCCCCCCCCCCCCC>
##$VD= 0
##$VDLIST= <DDDDDDDDDDDDDDD>
##$VPLIST= <PPPPPPPPPPPPPPP>
##$VTLIST= <TTTTTTTTTTTTTTT>
##$WBST= 1024
##$WBSW= 4
##$XGAIN= (0..3)
0 0 0 0 
##$XL= 0
##$YL= 0
##$YMAX_a= 519157
##$YMIN_a= -707332
##$ZGOPTNS= <>
##$ZL1= 120
##$ZL2= 120
##$ZL3= 120
##$ZL4= 120
##$ABSF1= 10
##$ABSF2= 0
##$ABSG= 5
##$ABSL= 3
##$ALPHA= 0
##$AQORDER= 0
##$ASSFAC= 0
##$ASSFACI= 0
##$ASSFACX= 0
##$ASSWID= 0
##$AUNMP= <proc_1d>
##$AZFE= 0.1
##$AZFW= 0.1
##$BCFW= 1
##$BC_mod= 2
##$BYTORDP= 1
##$COROFFS= 0
##$CY= 11.3945322036743
##$DATMOD= 1
##$DC= 2
##$DFILT= <>
##$DTYPP= 0
##$F1P= 20.1720416913024
##$F2P= 0.152960286110954
##$FCOR= 0.5
##$FTSIZE= 0
##$FT_mod= 4
##$GAMMA= 1
##$GB= 0.15
##$INTBC= 1
##$INTSCL= 1
##$ISEN= 128
##$LB= 0.24
##$LEV0= 0
##$LPBIN= 0
##$MAXI= 10000
##$MC2= 0
##$MEAN= 0
##$ME_mod= 0
##$MI= 1.114404
##$NCOEF= 0
##$NC_proc= 0
##$NLEV= 6
##$NOISF1= 3.799351
##$NOISF2= 2.8
##$NSP= 1
##$NTH_PI= 0
##$NZP= 0
##$OFFSET= 15.70392
##$PC= 1
##$PHC0= -9584.799
##$PHC1= 31.80082
##$PH_mod= 1
##$PKNL= yes
##$PPARMOD= 0
##$PSCAL= 0
##$PSIGN= 0
##$REVERSE= no
##$SF= 200.130013532006
##$SI= 16384
##$SIGF1= 3
##$SIGF2= 2
##$SINO= 400
##$SIOLD= 16384
##$SREGLST= <1H.CDCl3>
##$SSB= 0
##$STSI= 0
##$STSR= 0
##$SW_p= 3612.71676300578
##$SYMM= 0
##$S_DEV= 0
##$TDeff= 0
##$TDoff= 0
##$TI= <>
##$TILT= no
##$TM1= 0
##$TM2= 0
##$TOPLEV= 0
##$USERP1= <user>
##$USERP2= <user>
##$USERP3= <user>
##$USERP4= <user>
##$USERP5= <user>
##$WDW= 1
##$XDIM= 8192
##$YMAX_p= 0
##$YMIN_p= 0
$$ End of Bruker specific parameters
$$ ---------------------------------
##NTUPLES= NMR FID
##VAR_NAME=  TIME,          FID/REAL,        FID/IMAG
##SYMBOL=    X,             R,               I
##VAR_TYPE=  INDEPENDENT,   DEPENDENT,       DEPENDENT
##VAR_FORM=  AFFN,          ASDF,            ASDF
##VAR_DIM=   8192,          8192,            8192
##UNITS=     SECONDS,       ARBITRARY UNITS, ARBITRARY UNITS
##FACTOR=    0.0002076,     1,               1
##FIRST=     0,             0,               0
##LAST=      1.7004516,     0,               0
##MIN=       0,             -707332,         0
##MAX=       1.7004516,     519157,          0
$$ Real data points
##PAGE= N=1
##DATA TABLE= (X++(R..R)), XYDATA
$$ [...]
2616a402J050J760m53j727p63J024J888J13k710q00K791P21p24j663m41J427J680
2633A771j762k077Q71K550l08j324p48N02J446L15j820k437K488J698q24p83o78
2650a120J59L029j045k099K82J828P59j976j464N40J444J140j476j601M20K099
2666I19K75j093j635P68K020J010k873j654K002J925j103j185n48J377J659p42
2682A122k575j99J087J311k11j000j018J433K237j813j481N11R97R63j670l99
2698g05k73K080N68j780j123J115J199k9j063j533J158Q72J042k310p94J712J429
2715A565j106j469o03K100J440j719j335m28K624M69j031j249m5K843q7j661j959
2732a651J278K065n36j582j117J775Q34K8j976o91J448R52l66j070q84J673J422
$$ y = [-1402, -352, 1408, 955, -772, -1535, -511, 1377, 1490, -1220, -2020, 771, 1492, 768, -895, -1336, 91, 1771, 9, -2068, -1197, 1353, 1045, -279, -1027, -525, 921, 1236, -584, -3021, -533, 1165, 341, -442, -1120, -961, 2068, 1023, -1076, -794, 1034, 1793, -183, -1647, -1107, 337, 1477, 1, -1600, -1180, 919, 1194, 101, -1534, -766, 1254, 2264, -609, -2263, -261, 1664, 561, -624, -1172, 205, 1864, 1122, -1453, -1652, -565, 746, 535, -465, -1483, -50, 2187, 374, -1107, -596, 401, 1364, -306, -705, -978, 1102, 1670, -110, -1233, -118, 1081, 1052, -11, -1544, -386, 486, 1528, -782, -1576, 136, 1565, 459, -1010, -1613, 487, 1927, 208, -1127, -1555, 1069, 1538, 507, -742, -787, 2056, 1969, 308, -1651, -373, 1692, 1156, -426, -1543, 232, 1066, 1094, -882, -1573, -125, 827, 461, -609, -1493, 180, 1602]
2749A602j293j836L44J991K64q83k73j152J049J198n17j300L08J145M17q26q44
2766f06L95J471n33j706l69J471L68j40j406k18Q37J320J273l489j157L171O09
2783A291j435j76o21J496J121j671j083k6J837k1p49j044O93J688n90j358n84
2800a232J487J131m90j381o86M25K353j117j360J01J074O99p58l63m0O17P33j092
2818A01j018J117O08L89j841N4P2R42Q89j121j245R84R01q43L46j581J232J157
2836A143j60k355P77R22Q83j190n24Q6O86M69j94k060J201P96K71q66p88p9J961
2855I79K57j805o66Q01Q10L41k37j419P28J097n74r77P90l66J405J6j732o89R35
2874c06J831j489k38p43J323N62n14p48k77M13J154p43j200J052M54N57j004r07
$$ y = [1602, 309, -1527, -1183, 808, 1072, 189, -84, -1236, -187, 1011, 494, -806, -498, 647, 1064, 238, -606, -211, 1260, 727, -979, -1348, 123, 491, 351, -1055, -1273, -436, 884, 2157, -1332, -2489, 682, 1291, -144, -320, -941, 555, 1676, 5, -1078, -1104, 733, 712, -37, -1081, -388, 1300, 710, -648, -1232, 255, 1386, 896, -485, -1171, -746, 1607, 490, -870, -769, 305, 1004, 246, -117, -157, 460, 1193, 101, -917, 200, 808, 1197, -644, -590, -518, 424, 1313, 192, -1053, -69, 832, -11, 335, -1246, -14, 1143, 983, -1372, -595, 327, 1210, 20, -504, -418, 268, 737, 543, -1517, -316, 480, 751, -115, -903, -982, 979, 1236, -569, -1235, -434, 376, 717, 480, -939, -211, 886, 312, -665, 125, -241, 1164, 1180, -552, -1241, -306, 1525, 36, -202, -945, 378, 940, 426, -322, -599, -186, 968, 225, -975, 77, 531, 1088, 84, -823]
2892h23O63Q88K17j222o00J04J521p56q3j571J392J716j535o56k8J349P86j811
2910d49l33J031Q97P4j323m50O21k69J113o14p08r58J828K5j725k05J700J21L73
2929G49l22k010J005J392l44j257O68J007r4j031m7m16J273N6q09p70O43N21O40
2948H54r31j90j90J420p63n02o23R77l8L52o13k85N42L67n67o92M43K30Q49o02
2968C8p57j52P76J384o32j070N08J67L69p78m88Q68J585j575n12m32OR17K11k09
2988B24q38O70O28n48n15K80M34L63K06r85o76J305J39j093j68p0M26J35K35q42
3008f90k0J227P54j245m15R02K33o11k98j53M93l3k38J96m31L78M62l11l63k81
3028d44P14M91j308k44o2N08J102p48k15o92J370p1l82l60o63J446j64k04n94
$$ y = [-823, -160, 728, 945, -277, -877, -773, 748, -8, -91, -1662, -270, 1446, -89, -745, -773, 576, 1362, -449, -782, 249, 1146, 1220, -103, -553, 68, -201, 912, 298, -410, -1368, 460, 485, -1240, -1445, 255, 376, 749, 427, -1583, -578, 814, 470, -787, -119, 888, 794, -237, -284, -700, 573, 629, -180, -950, -307, 214, 854, -77, -267, -457, 963, 200, -302, -925, 52, 14, 366, -247, -532, 10, 377, -190, -882, -439, -209, 640, 38, -719, -871, -95, 1289, 657, -413, 95, 262, 631, -147, -635, 233, 1818, 243, -269, -701, -695, 222, 433, 224, -614, 56, 684, 136, -379, -99, 335, 698, 904, -81, -757, 548, 687, -406, -574, -644, -218, -83, 152, -690, -710, 517, 1271, 26, -389, 513, 746, 135, -163, -316, 177, 144, -94, 102, -329, 49, 511, 200, -163, -444, 270, 761, -547, -791, -853, -345, 757, 9, -206, -898, 472, 401, 19, -341, -1004, 442, 278, 74, -520]
3047e20K65M65j07m18m99J022L22n81L95l52K84J51l58o17m53J180l02J021j667
3066g69N0P10M23m39K45q05J258m44N92j223N82N2k39o18P36K48r40P28l93j36
3086c82J30J059j010jN18o01J230M09j225m60M13K29o66J15N80l91L52p99o78
3105a178L19J602l18o75m15R80m73R25l56l89O56k34o36M61o2j56J142q23j48
3124B22p82O18j44l55M61L14o49J475n15o35L06R1q6j54k78j043J250J78j10j078
3144i14J218N55j037l52J11j32N75N18j099O50P12r26K90J17m23J3k3O28k04K15
3164D92K9P6j002Q89j275J143k91Q7o02P06N0k03m40Q80n55P12m71k08p17Q45
3184A45R05j090k60J42mj49R66j030m45Q26m46O30n01q39P50N29k7r36J147n69
$$ y = [-520, -255, 210, 103, -315, -814, 208, 530, -51, 344, -8, 276, 427, 69, -548, -1001, 179, -123, 898, -769, -719, -9, 414, -25, 220, -585, 673, 229, 821, -402, 180, 232, -7, -625, 111, 359, -581, 147, -246, -382, -252, 807, -203, -204, 314, -287, 943, 1352, 127, -333, 80, 309, -357, -242, 338, -53, 299, -500, -1178, -859, 743, 425, -250, -665, 315, -158, 767, 411, 22, 678, 444, -192, 269, 207, 51, 1193, 370, 222, -560, 58, -86, -441, 20, 334, -315, 1160, 645, 10, 316, 407, 321, 167, -111, -1154, 96, 274, 164, -914, 304, 859, -178, -530, -419, -551, 24, 542, -557, 93, 805, -121, 169, 286, -137, -124, -147, 481, 277, 492, 521, 597, -405, 484, -791, 352, 61, 148, -454, 252, 302, 99, -341, 539, -16, 696, 225, 17, -700, 145, 1050, -40, -300, -158, -162, -311, 655, -375, -820, 6, -440, 190, -311, -1150, -400, 129, 102, -834, 313, -256]
3204b56N5J19m6q21J250L23m13j48R9K07k22n70P42j267J027K21m01l1P43K93
3224I04m15p71k2M91l61n9Q2k85K77N74j288J012m59M62P01j439M01Q60j177K46
3244b66Q74r11M20o67J67P0O20q16N77k52Q24n10p60R25o46L68n07R56K72p35
3264Ck2M01m01L31q48K46L55m01N11N7p93j2R21m27Q38j232Q42O0l71J15n41k5
3286c93J60R78q07K41M26j117M58k63K84k57P27m07M45n10Q33j318O66J45p19
3305d28J082k89j133K63M96k7R75j423L65P8m28J52m66J163p36J007j197N91n32
3324d87R27j52R6q65O01k37L76l77j65O55n13J320j772N42j81P3J02J18q91J273
3344D43J34m90l99P5J48k98R04j58k40L66k39K68q56N93n00P8L45k50M83l87P03
$$ y = [-256, -201, -82, -128, -949, 301, 624, 211, 63, 162, 369, 147, -423, 319, -948, 79, 300, -101, -132, 611, 904, 489, -282, -304, 187, -174, -233, -151, -436, -159, 415, -873, 139, -320, 142, 843, -596, -195, 665, -512, -266, 608, -303, 117, -550, -383, -313, 307, -509, 68, -184, 640, 130, -630, 295, -351, 17, -490, 466, 738, 3, -19, 382, -19, 312, -536, -290, 65, -336, 175, 232, -561, -573, 348, -79, 759, -473, 369, 429, 58, 173, -368, -393, -233, 745, -62, 179, 605, -512, -54, -317, -33, -290, 437, 30, 475, -35, 798, -520, 146, 291, -428, 654, 365, -768, -505, -9, -36, 939, -484, -119, -41, -469, -317, -783, 380, -356, 651, -546, 45, -487, 440, 288, 384, -481, 120, -117, 259, -118, -283, 372, -141, 1179, -593, -51, -232, -159, -57, 61, -830, 443, 577, 87, -312, -237, -89, -387, 517, 359, 119, 485, 246, 514, -342, 251, -249, -171, 174, -76, 407, 20, 723]
3365G23r80P80k43o98K26Q82q84L42n62K42J28K09L88p84L52P85j281K17J8M24
3385B84m43O40j92k00M56L55j332N96n7j055J006M96j074l3O48m61rN15M78j329
3405g11J177p81J15Q50p11O80n35L22j167J608r03jj10P18p35k13J532j511J042
3424F66j115K33M66m57J92J5n59N55J71P1p67Q33q13K08J51l42O96j4k2o89J92
3445c29O62q66J060r82P33p14j11J223l68J21r64J044K29r74M1j16O7j94R40m35
3465F7r9P10l91j15n11M09J05j23O6k7K45J72k43J78k04J5J87o01P3k88L55q3
3487a03O22j43n57N4m59J416q81j29p05J586j049O74p01O9R23q89P21n44J072
3506I77r57j051J176R9p35K65J077j412M95ll44N11j37p7M07m92P08k73k17J55
$$ y = [723, -257, 523, 280, -418, -192, 690, -194, 148, -414, -172, -44, 165, 553, -231, 121, 906, -375, -158, -140, 284, -159, 481, 289, 89, 545, 900, -432, 164, 107, -948, 58, 554, -520, -553, 95, -366, -375, 140, 618, -711, 466, -315, -200, 650, -61, 619, 84, 406, -761, 847, -56, -57, -167, 551, -184, -397, 1135, -376, 666, -449, -216, 250, -207, -15, 0, -559, -4, 167, 238, -529, 304, -509, -301, -150, -492, 204, 190, 168, -521, -329, 333, -533, 527, -455, 278, -436, -547, 676, 308, 429, -535, 509, 738, -236, -195, -311, -244, -438, 502, 67, -32, 678, 287, 172, -339, 70, 175, 52, 118, 91, 336, 508, 265, 443, 239, 254, 441, -160, -87, -375, -20, -103, 519, 376, -181, -127, -586, 830, -51, -180, -885, 701, -348, 326, -375, -306, 617, -272, 449, -95, 977, 20, -1031, 145, 244, -491, -226, 851, -561, -66, -69, -413, 98, -39, -116, 291, -201, 507, 234, 17, 172]
3526A72l88p4J40J74n03J121m39Q36l50n24M2ml28L63j85K95r53J007o1j78L39
3547E02o73J018r40l55O87n06l71P33j28k14nN19J54K75m14O76q14k73J56L02
3567C29J4q92M72n52j3Q42j21l8Q47j093M44j01m26M61k93m56N81J23J41j88j58
3588g7N37m03M6M39j35o4n03P71q99J07N30m3n32j77R71p31o6J41P59n32k88l1
3610a80J58J49p74O93ok77k8O10l01O20j88n86l16J171n74J42J49L55n73k99l67
3631d22N16J028j368l20K13J139k25K50o93K89L7p56L33l8j88p83J528m2j197
3650f99R80K12J92j14o64l2K19L75o02N88l13n28Q78j013Q85j113J176p42J24
3669a91O49j539Q58J355j342o6j4M57M4j26M2m68L97rl78K2K50j3J08m19J044
$$ y = [172, -216, -290, -150, 24, -479, 642, 203, 1039, 689, 165, 207, 203, -125, 238, 53, 348, -605, 402, 341, 163, 502, -171, 847, -93, -448, 239, -267, -638, 95, -33, -247, -252, 267, 421, 696, 282, 958, 144, -129, 27, 329, 343, -549, -77, -629, -642, 200, 79, 41, 888, -205, 239, 138, -288, 173, -120, -576, 5, 128, 269, 81, -77, 460, 57, 103, 542, 407, 343, -160, 611, -288, -181, 349, 306, -226, -403, 568, -163, -229, -88, 671, 139, -149, -180, -22, 127, -647, 46, 40, -237, -265, 345, 44, 664, 476, -110, -426, 745, 171, 313, 462, 817, 244, -55, -422, 94, 1122, -246, -566, -353, 786, 561, 811, 118, 407, 444, -312, 21, -17, -205, -988, 540, 498, -699, 281, 493, 685, 571, -93, -125, 94, 469, -133, 455, 142, -386, 492, -521, 364, -749, 427, -315, -191, 458, -1081, -223, 1132, -210, -276, -290, 167, 211, 85, 127, -341, 56, 47, -331, -309, -59, -72, 36, -383, 661]
3690F61l91r23J029n61M2J22J27k69K44L96J37j053N26o3P0j96O91n72k70R85
3710G32j322J204r80m81L54N87n13L60Q97p39K10k52O20j415K78N95l47N95k0
3729C63l48k65N23k34j22N92j033N25O6j41K54N70j401L25J029k09o73j72O43
3748B92j20m1Q60j234M01p97J7O55Q0r71J858j229L11m88M71k99P9j69l39O24
3768c9o32N93K47q2k02K19mL48l63J08o71M87L24M19m95l76k51P45J27m90L43
3789C55o02k84Q21M25j304J063m94o3r39Q55N84o02O91m68m64N82O33j360M47
3808a24q0K97M06r70j65Q40J60m45K4M17m5q13l0J162o16k97%m8K12k28P17o30
3830b56O66m62j55Q22j380R15q64J81k36P68l69L57o22J183k02J19m20R3k22j72
$$ y = [661, 270, -653, 376, -185, -143, -21, 106, -163, 81, 477, 614, -439, 87, 24, 94, -102, 589, 17, -253, 732, -590, 614, -366, -847, -493, 94, -419, -59, 838, 99, 309, 57, 677, -738, -460, 135, -212, 383, 363, 15, -250, 273, 39, -83, 509, -524, 1, 67, -74, 180, 750, -651, -326, 703, 494, -179, -351, 292, 172, 131, 991, -243, 158, -639, -622, 33, 113, -858, 1000, -229, 82, -406, 65, -234, -155, -324, -663, -39, -671, -78, 169, 87, -115, 104, 100, 448, 85, 193, -478, 9, 333, 752, 257, -119, -370, 375, 502, 12, 355, -247, -531, 290, 715, -589, 474, -20, -83, -1022, -167, 417, -185, 506, 38, -426, 156, 789, -571, -124, -204, 93, 499, -471, -636, 204, 364, -81, -57, 360, 315, -498, -528, 634, 18, -279, -279, -327, -115, -343, 374, -256, 410, -52, -207, 615, -765, 150, -714, -533, -769, -1, -370, -13, -635, 548, 346, 465, 45, 138, -84, -256]
3850b56j76R22k89L40n09M42m93K60r18L60k08K36L66Q23j418J09L96r18R19O73
3870F61n45J97n64o66R74n76K87L25k15K16j027K58N63K3L7P06m41j288R03J47
3890b5P05p23K06n98Q35k90j92j04L38m82J23j72J87k76J105o75J11J68m88O44
3910C97J19O3r45l5L01Q90q91K83K87j425J519q63P88k4l35k6m8r23O11P01o51
3931b07o36P05N7n08K52J089j70n39m68O76n9j141N55N25n83N10l61j2K56K05
3951A46n00N87j90K53p49L21k45l22R58o49R96J21n87K47j78n51J23q2m66N41
3971b26n5O29p64L41K46r42Q25m87Q44n45P20j43q78K84L53j88m90J090o44L67
3991C37l19L67L34J75q00k50R28k85o41J88L93r32Q60j65O90j155j39J14O95l05
$$ y = [-256, -432, 490, 201, 541, 32, 474, -19, 241, -677, -317, -525, -289, 77, 900, -518, -409, -13, -931, -12, 661, 116, 313, -251, -917, 57, -519, -232, 93, -122, 94, -933, -675, -112, -89, -52, 654, 213, -1075, -172, -25, 680, -43, 163, -435, 400, 110, -82, -186, 152, -330, -207, -379, -192, -468, 637, -38, 73, 241, -247, 397, 516, 579, -366, -401, -100, 790, -101, 182, 469, -956, 563, -300, 488, 464, 129, 103, 55, -868, -257, 444, -207, -843, -138, -81, -589, -337, 752, 582, 43, -425, 251, 192, -949, -394, 131, -452, 58, -303, -315, -59, 146, -354, 233, 43, 296, -453, -132, -377, -699, 259, -390, 606, 727, 140, 387, 209, -342, -219, -301, -767, -226, -281, 348, -416, -75, 171, -771, 54, -433, 411, -134, 586, 443, -435, -151, 202, 14, -476, 614, -30, 337, 18, 385, 719, 894, 94, -156, 772, 487, -154, 34, 427, -505, 355, 190, 880, -275, -414, -300, 395, 90]
4011I0J29j179P90M90q41M0k5P20l30Q84j101j59R47k83l38N57o68J73J89q3n85
4032e83P94M85k02j356Q08o68L28K50K17J39n15M28N45j99N90j017J35k00Q5K92
4052C56p73R40l46j85J061j157N74K8n63k39N65l28L72k59O76j218P61N0n48o45
4072h78J347J08J69p29l20j89J210m08p87J037o63l06p7M92r5j75P43k20k76M40
4092D23n09l77O33p07J111j228M52L2M59k41j14P21r31J116j004l1j42o5K26N79
4112D03l50m17q8L60j73J82o51P12O40p07J80k03l8O7n23K62L72o42N07j59m7
4133c13M53j105P9J131l25J48M02j14n21L31M23p57R7q35R45m05N51M7n99J67
4153b00N32n54n00R44m99P25n66j35N3M4O10m10k98L46Kj24J11m35O50J69j31
$$ y = [90, 219, -960, -170, 320, -521, -481, -506, 214, -116, 768, -333, -492, 455, 172, -166, 391, -277, -104, 85, 2, -583, 211, 696, 494, -862, -54, -722, -394, -144, 73, 212, -303, 125, 670, 471, 1061, 44, 179, -21, 64, 356, -417, 523, 177, -8, 1053, -104, 470, 498, -65, -304, 261, -67, 305, 46, 722, -496, 265, 315, -233, -878, 469, 577, 746, 17, -303, -492, 718, 310, -477, 560, -103, -409, -486, 6, -89, -264, 479, 259, -17, 423, -86, -463, 170, -537, 574, -654, -202, -170, 289, 48, -66, 655, -276, 840, -164, -195, -337, -402, -176, 403, 53, -364, -452, -92, -265, -83, -734, -22, 618, -89, 91, -112, -150, -83, -606, -344, 28, -614, -107, -266, -313, 140, -965, -886, 245, -80, 68, 470, 356, -165, 166, 589, -168, -71, -906, 39, -366, 185, 232, -367, -200, 332, -222, -722, 222, -277, 448, -118, -253, -200, -156, 454, 44, -254, 92, 94, -30, 81, -354, 296, 465, 334]
4174C34J38j27l73o09O04k20n17P21L55j085Q64L80m84n77Q30k23J91K63n79Q91
4194G77n73m1j069Q35l54O2O67J50j267M96K82M63o78L84m20q23L24J010j242
4213a017P82O6R17r01K37M22m69R4j51k67M15J42m86k86Q76r71M60M78j261Q80
4233d0L34j51q4j7l17k45O36N23o37M49l97r5M64m41n06M79M27j176P19R83l36
4254E72j141J111p30J08N92j79L44r50P42L40j352L97K93L96o75J03K74p89K26
4273c18N87p41N57J43l19m0m21J027l02N26r49k84J92k49M39K39m1k36M23j34
4293I9o00M25O30l80L66n71K5J27k63mL55M39r01p9N12j71j79o9r1L0J82j13J82
4316d9O78j80l56l29M66K89o08L32j84p6j74K32o14O56l13M32k27M59M0p63K50
$$ y = [334, 472, 345, -28, -637, -33, -253, -770, -49, 306, -779, 85, 465, -19, -596, 234, 11, 202, 465, -114, 777, 204, 163, -906, -71, -425, -363, 304, 454, -813, -317, -35, 428, -250, 134, -286, -1109, -785, 225, -1017, -235, -169, 748, -153, 84, 506, 37, 131, -20, -287, 128, 270, -216, -502, 374, -597, -137, 341, -920, -40, 294, 143, 59, 42, -275, -520, 116, 639, 2, 451, 54, -41, 423, -18, -524, -45, 382, -794, -75, 908, 572, -569, 542, -188, -80, 512, 333, 677, -273, 469, 809, -543, -146, 147, 543, -132, -29, 245, -544, -318, 269, -472, 85, 228, -91, -131, -552, 475, 173, 699, -250, -534, -342, -591, -152, 87, 46, -190, 233, 99, -501, -76, 554, 174, 540, -31, -6, 121, -142, -146, 209, 648, -253, -332, 180, 9, -170, -239, -330, -300, -118, -231, -49, 629, 449, 93, -236, 230, 519, -89, 243, 59, -17, -191, 41, -573, 83, -230, 202, -25, 434, 474, -289, -39]
4337c9l47j7M41L61L11o30l07P80l96l39J22j09J060j141R9J74r39O19P80m21
4357F2q7m64J10P55j47j85q54P68M83r06N06k4j043P59K85j33J37N5l43K80l58
4378c44N39O9p56k4L84N9l77J183q29K2L10N1N36n41J54p68J042o85k54O47q17
4399c99l89K57L36m0M59k56o86O32L44o16k18J054j083P96k86J76Q58q54q0p10
4419g05P31L23l65q11R94r83J84L22k69J468q43n7n41L08L37j04K82Qp63M38j14
4440a60k53P19J31n15J40j92K14m71K47j14N17k81J39k40r9L05o3m22P59j68l8
4461A55k71k72N80j02K51j150P36N7L38l3P60q55l11L10L3l96K89j70n47O31l45
4482c12P64m54P33n63o47J319J75j034K84M04p67R5j07LQ7N85p64k78Q06q42m9
$$ y = [-39, -386, -403, 38, 399, 710, 80, -227, 553, 157, -182, -60, -169, 891, -250, -151, 23, -916, -297, 483, 62, -25, -489, -379, 376, 229, 44, -810, -42, 441, -465, 41, 17, -1026, -267, 18, -115, 22, 77, -266, 14, -344, 195, 264, -492, -516, -132, -73, -450, 733, -96, -74, 236, 287, 823, 282, 436, -332, 710, 25, -229, 418, -399, -788, -531, -195, -235, 224, -32, -718, -86, 258, -358, -576, 478, -605, 191, -95, 81, 939, 85, 5, -705, 26, 349, -16, -827, 167, -816, -632, -310, -579, 889, 46, -11, -552, -244, 93, -11, 271, 279, -484, -46, -160, -413, 306, 437, -78, 62, -130, 84, -387, -140, -254, 263, -18, 121, -119, -218, 87, 24, -398, 361, 193, 155, -116, -388, 192, 90, 341, -809, -73, -16, 322, 289, 1049, 194, -117, 193, 226, -170, 119, -51, -598, 33, -312, 452, -2, 731, 168, -479, 840, 1015, -19, 265, 669, -98, -3, -110, -107, -20, 565, -199, -477, 329, -513, -562]
4503e62J194j168P46J76j70J20K71j130K60P68p07L55p32M17j03N09k69L49j116
4522g92J036L21m32K84l20N17m89m47Q2L07k75J2j26l99K76j70P03n21J73o17
4542h77L20K92R0J078j369j8o8K27k6R38m58Q36q74m73N01L09n67K73m77R6M60
4563B13m59j1L94k2J08m14K96Q2J80k01k71N7m76j62P87l22k31L61m25Q46m91
4584a61JO36m35L7j3m71Q06k61L33p74Q14j59N15j062K44L23o8n05J57M75o40
4605b08J22R60j053l07j40J487n08k21o65P10m96J242n66o60M43r13J089o15J63
4624a36K22N05n01j26L89m82q2J218o34k03K42q6o63j080J757p93Q81j109J160
4643D79J1j144J009r5N83M04p98l91L7J91r0k02j64L26Lk49j167Q13O88p38K7
$$ y = [-562, 632, -536, 210, 386, 216, 336, 607, -523, -263, 505, -202, 153, -579, -162, -265, 244, -25, 324, -792, 244, 565, 133, 417, 97, 614, 125, -322, -240, 67, -208, -196, -322, -721, -445, -615, 88, -433, -260, -877, -557, -265, -175, 903, -466, -484, -552, -325, -351, 587, 129, 965, 91, -382, 119, 428, -139, 134, -343, -247, 213, -246, -257, 137, 115, 223, -191, 105, 187, 367, 166, -105, -48, -524, -686, 101, -221, -452, -91, -516, 330, -161, -160, 476, 41, 78, 65, -406, 400, 139, 472, -302, 512, 353, 868, -194, 50, 373, 305, -200, -43, 432, -208, -86, 874, -179, -486, -626, 861, 353, 132, -533, 177, -319, 923, 357, -303, 140, -773, 316, -299, -136, 86, 591, 90, -36, 353, -129, -211, 1007, 373, 170, 412, 326, -337, -1417, 340, -453, 428, -681, 479, 490, -654, 355, 260, 843, 1247, 449, 58, 95, 286, 196, -6, -170, 156, 159, -90, -1257, -444, 244, -494, -467]
4664d67L78j35M05J87k17o54J345j109j43R31n32Jk67q0N22q28R25k08n18O33
4684A69j16l25J115o22n47K38J95o25m55O92j56O56J93o10l6O09J12J58j286Q17
4704A76m53L36p6L69o32O25n33m35L44M77j07K27j22k44k21O00n65q81Q15J120
4724H20m21k96J73L3q91L92O2m1R15p60J61o8o29J046o4J79j611J843n07j467
4744a131J599r86Q87P8o03p9k1R68n84N44n72M1L70k85j22j6l12N20l9p80M71
4765e2k95k94J119l65k33P08K68q86m4j99j79O30n95J22K84L73m22l89R50p74
4785b73j07Q51p06l4M09M10p08K78J50m54j57j56P93K48j274N77J98k11M36j00
4805A70L21o25R12j718K104j394J054n60M23j135N96j64O1j17l0o9K64J54N49
$$ y = [-467, -89, -224, 181, 368, 151, -503, 842, -267, -410, 521, -11, -10, -277, -357, 165, -663, 262, 54, -464, 169, 53, -272, 843, 221, -326, -88, 107, -518, -973, -281, -437, 219, 412, -198, -234, 375, 487, 645, -641, 176, -277, 59, -17, 352, -280, 345, -188, -623, -279, 198, 91, 318, 196, -48, -269, 331, -234, -1115, -300, 820, 399, 103, 276, 309, -582, -190, -128, -169, 746, -14, 147, 79, -550, 496, 432, 611, -1000, 843, 336, -1131, 468, -518, 369, 447, -156, -235, -256, 712, 128, 672, 100, 141, 511, 226, 104, 88, -224, 296, 257, -523, -52, -347, -641, 478, 113, -120, 588, 856, -30, -74, -273, -452, 178, -417, -295, -11, 362, -60, -449, 501, -273, -380, 471, -235, -269, 140, 550, -158, 120, 270, -184, -341, -497, 296, 544, -730, -153, 45, -166, 270, 170, 491, -134, 778, -940, 1164, -230, 824, 264, 687, -448, 148, -16, 45, -72, -102, -171, 93, 247, 796]
4824G96p29j76P6k01K50L3J039j838J468n61l81n41L61L31L07l25N63o34p9J92
4844d9Q7k3k84K07r67N63P59J48j379K46P47L66k51L30m33k91M72k92N37q52m67
4865h26P31N92m2l21J62p20k62L86N0L31o99J435q81j29M93j74k65J41K53M68
4885G23r60M39l38p3L38M83m92k52R20n31r56K14N33j43j18N08p86Q28m12q5M74
4906C14n19j69P88j370O14O44r25R63n10r1l66J083p35M54r3L32n25Q00n40m16
4926b67O64o73J36M69j098P98K3j431K134p09n70N38N4O74j251P42J99m26K15
4945B21q45N05K05o9K7M6M98o83J19M29k86j69n51J315p99J87m88Q76m91q41K46
4966e48R34l25O49J3q45P59k45j84n42k49R88m31o23O80L55n14N5j79L99k39K69
$$ y = [796, 67, -109, -33, -234, 16, 49, 1088, -750, 718, 157, -224, -765, -404, -73, 234, -91, 472, -162, -241, -49, 38, 15, -269, -62, -1029, -466, 293, 441, -938, -692, 55, 421, 170, 500, 67, -224, 248, -44, 493, -359, -826, -95, 497, 455, 134, 296, -424, -686, -300, -250, 81, -618, 817, -64, -193, 300, 126, -139, 2, 255, 723, -237, 202, -136, -209, 129, 612, 120, -132, 788, 257, -699, -485, 48, -95, -213, 295, -491, 337, -75, -160, 314, -205, -374, 414, -956, -342, 302, -623, 340, -170, -261, -627, 456, -279, 175, 82, 414, -111, 689, 149, -267, 397, -276, -140, 329, -769, 29, 52, -1379, 755, 46, -524, 14, 68, 742, -509, 233, 432, 6, 221, -624, -119, 86, 17, 44, 90, 588, -95, 24, 453, 167, -2, -553, 762, -37, 150, -338, 538, 47, -794, -548, 386, 61, 710, 723, -122, 637, 392, 208, -334, -583, 405, -26, -649, 31, 386, -128, -73, -252, 147, -92, 177]
4987A77k24j11L94N06n10L09p59J5N06n72P10L47j182L88m03p5O56l38N56n06
5007a16j12N56L06r15j05N92o63j27Q24n66J49N42K17J02j027j80j85J275m52
5026A15K59m63J81o19P66Mj23j99Q31o46J65l52j77L11J63k52L76k53L89o85L3
5047a76K34k39j2R10j101n48O95N84l3j020O52K33j20p80M97m48N92k37l40n6
5067g13L25l67J737j519Q72J45m9m65M29j048M27N2P47l99o10O28k38L85n13m97
5087f71O73q5J66K83p99J046q78j68J47k70Q74m78L55j28l0M35o07J06k11K80
5107D0R25j002p62J207K25l89o0J53J62j158Q22M9mk04p49K86K94P34p8q55J1
5128c53Q90k08o61N11n3J35l66M8J17K59n13k34O74p8n18L88M23L85o33k13L33
$$ y = [177, -47, -158, 236, 742, 232, 541, -218, -203, 303, -269, 441, 788, -394, -6, -409, -484, 172, -166, 390, -116, -228, 328, 634, -281, -386, 206, -457, -584, 240, -326, -177, 365, 582, 684, -343, -523, -708, 567, 115, 374, -89, 92, -527, 239, 243, 120, -79, 752, 106, 271, -81, -258, 53, 216, -36, 340, 87, 476, -209, -176, 58, -181, -193, 717, -384, -932, -237, 347, 314, -706, -54, 179, 59, -721, -224, -672, -80, -317, -657, -713, -388, -755, 982, -537, 335, 480, 431, -34, 395, -653, -226, -174, 573, 174, -436, 192, -46, 339, -174, -671, 2, -83, 83, 366, -433, 613, -265, -433, -286, -556, 318, -160, 195, 67, 37, 472, -135, -29, -240, 40, 965, -37, -799, 408, 633, 244, 184, 337, 499, -659, 163, 212, 208, 4, -745, -459, -165, 569, 491, -364, -353, 537, 329, -332, 179, 126, 261, -105, -57, 60, 319, -194, -428, 246, 168, -350, 38, 461, 846, 213, 0, 333]
5149C33M40r04J65l73K03m2J78K48m59R15q39kJ75J01k50O70p42O00p66J208q35
5170B4n5n7M63L89p09L93l8l47l55K89K63l14j36K81k2q3J59N59r66J01k26j27
5192e14J135o6n14m24R56n31R1m97N52j119Q61K00n63R48m94j74L66n88j50J212
5212F87p42L08q84L32M35J69K39k43K65n71p80J19K69Q85r21N89J58j69k79l07
5232d41L28K13J70r82J114j04l76M55m48J01m87N25j98M53J01q93J504r15P56
5251H76o53p55M51R29j106o83K52N22M17n48qk7o06R15n48K01O98m91l54J34P96
5272D12j86k38J96m42K52L10r07J41J104l43J94L00m3j409M02R6O85n30J057j243
5292a92Q3l18M3j11N20M7q69P22n58J080l63J051j068k95K36K23j05K9N07m29
$$ y = [333, 773, -131, 34, -339, -136, -178, 0, 248, -211, 704, -135, -137, 38, 139, -111, 559, -183, 417, -349, 859, 24, -31, -88, 375, 764, 55, 448, 410, 63, -292, -3, 260, -54, -190, 91, 69, -14, 145, 704, -262, -161, -387, -514, 621, 555, 41, -383, 573, 42, 133, -364, 188, -931, -70, 130, -433, 515, 21, -153, 213, -375, -525, 687, -55, 253, -631, -299, 136, 305, 544, 301, 566, -5, -785, -666, -397, 488, -433, 156, 314, 145, -134, -441, -113, 100, 270, -712, 402, 298, -78, 377, -71, 30, -457, 68, -130, 323, 424, -469, 1035, 120, 876, 223, -532, -81, 848, -258, -941, -689, -167, 250, -298, -306, -333, -939, -24, -572, -371, 327, -164, -518, -384, 412, 226, -12, 184, -258, -6, 304, -603, -462, 642, 299, 493, 793, 750, -659, -257, -161, 524, -6, 1051, -192, -109, -427, -384, -495, 25, 72, -797, -75, -633, 447, 84, 1135, 67, -228, 8, 231, 126, 155, 662, 233]
5312B33l57N5l15N72q23R77p92O1m17R08p8j92M52K11r76Q17J75j44m06l6M96
5333D21k79Q78j390J85L59q9p69J258r95N97N77p55m69M98J88n02L74m71J077
5352F93j151N26m69K49Q04p87k35n60K136j143m51L28O6j8r6N42q68M03m93N41
5372A7k07K94K71j055P00L84O28p81o49J91l04J037j18o14K99R84p38l96j14L97
5392B26O73j254M11M14l18L9M75j049J88m9J46P98k13m65J01N61k26q71P03O12
5412I02p97L41L81j105l9L83m31J96O02Q2n88l36O05n25p0R29J5n21J65m96r3
5433d00l18N72R6m26O03j36L42J40l82n01K66Q2l11M49j76P37J65j025N19k80
5453A6J36k27N96l74m24K28k09J07o3m5P98p19J013q44L04r33P15K58m8M25k12
$$ y = [233, -124, -69, -384, 188, -635, 342, -450, -389, -806, 102, 24, -168, 284, 495, -481, 336, 511, 367, -39, -75, 421, 142, 1020, -370, -185, 174, 85, -684, 574, -421, 176, 753, -2, -471, 27, 215, -287, 87, -384, 693, -458, 68, -401, -152, 652, -135, -370, -930, 1206, 63, -388, -60, 6, -12, -108, 434, -434, -31, -524, 17, -190, 104, 375, -680, 20, 404, 1032, 251, -398, -207, -511, 526, 408, -206, 93, 1077, 339, -57, -171, 226, 899, -355, 56, 470, 152, 191, 666, -383, -195, -244, -98, 700, 487, 22, 123, 684, 458, -413, 290, 902, 105, 446, 827, -278, -317, 66, -365, -169, 433, 515, -73, -409, 196, -329, -399, 530, 545, 24, 189, -307, -400, -718, -146, -50, -476, 127, -9, 333, 473, 91, -410, -144, -62, -373, 76, -100, 637, 802, -223, 296, 16, 152, -75, 521, 147, -277, -49, -258, -151, -214, -259, 539, -180, 833, -11, 293, -640, 75, 333, 285, 710, 498]
5474D98j74n0l64J96M13M72j307O26K75p21L16R0l28K36M50p59L84j85R2K51l20
5495I1P8k11o59L18oK00q4j35P26n48j27P87k25l20j01j04l24O94l90Q43j254
5516g51N51L48l74P10j72q70L06M62M35m08p32J430j163L04J70q39M07k8J42q3
5536a55r0M52j121K19J432r37O41m30P26j283nK10P40p30J76J74n3K61p4n19Q86
5557E20p60N63o80n07M46P7R97j110M69J95l39o1K27k88J84L25M46j174L36K54
5577A20m89l9l27R74Q6l64l27N73l96Q97j58q2l12p66R03J23r77R32k85L60o29
5598a83r5N66m81J78o77J065l84n5o76J203m85K75k62K59q30N51k06J54r4q7k
5619b66J076o78n2j33k60Pn26N63J50j94KJ144j193J43O7P9k58O70j024Q24n23
$$ y = [498, 324, 274, -90, 106, 519, 991, -316, 310, 585, -136, 180, 270, -58, 178, 628, -131, 253, 68, 160, 411, 91, 169, -42, -701, -383, -389, -189, -273, -408, 318, -230, -357, 430, 205, -115, -216, -320, -644, 50, -340, 503, -751, -200, 148, -226, 484, 312, -558, -252, 210, 645, 237, -495, 935, -228, 76, 246, -593, -186, -214, -72, -155, -245, 207, -914, -695, 737, -200, 441, 11, 737, -546, -551, -341, 399, -331, -155, 19, -34, 227, 153, -366, 520, -240, 323, -357, -864, -418, -341, 656, -454, 15, 210, -129, -190, 37, -251, -67, 258, 704, -470, -134, 120, -369, -408, -735, 239, 325, -39, -366, 207, -189, 708, 550, 468, 156, -610, 293, 416, -561, 371, 86, 446, -183, -278, 288, -193, -15, -692, 373, -11, -66, -742, 461, -24, 251, -11, 248, -582, -31, -237, -83, -177, -264, -266, 810, 132, 80, -53, -313, -306, -832, -269, -119, -313, -311, 833, -360, -217, -150, -71, -329, 341, -683, 141, -382]
5640c82P24m34P8L32r59J254n48J14q75J161m05r83M81M53j85O09o46o4L56K10
5660B91p63M90K95m5J7n29O14l34q52J259j051L67J71m44M87J88R9k15J07j001
5680h49L48k92Q17k68j24N92K68K19q36k39O13p0k45r4L79J86j06k70j04m78j0
5701e63Q33l35Q71l21q02l47N50P64l86P26q08l24L1L16p88K03Q8P2j92j39O8
5722d83R19j162J410k55o36L30n39P58O6p45L00q96j88Q38M30K02q62N38O64j074
5742c85O03m15R90n83J75j65j70n1j185J774j173l41K64K85K44r79J875p85K63
5761B41k6k89j27J04m2J63R5o9n26M97J32j59L72m47k70J008l66r4N7l92O26j92
5783B96j3o44O83k81k20l85J145j92r88N55k09J29j76Q63O6r29m91O32M79m16
$$ y = [-382, 342, -92, -14, 318, -641, 613, 65, 179, -696, 465, 60, -923, -442, 11, -174, 435, -211, -275, 81, 291, -472, 18, 313, 268, 285, -244, 370, 36, -816, 443, -608, -241, -70, -514, -27, 161, 260, 45, 152, -849, -501, -793, 24, -244, -368, 224, 492, 711, -125, -364, 249, 179, -66, -160, 219, 405, 299, 29, -75, -553, -563, 270, -65, 806, 485, -317, -664, -114, 650, 264, 990, 182, -142, -111, 205, -583, -380, -292, -220, -412, -551, -483, 436, -726, 684, 429, -207, 123, -416, 342, 408, -337, -37, -933, -1121, -283, 147, 349, -513, 25, 689, -385, 218, -197, 793, 210, 385, 220, 50, -1, -1186, 588, -585, -926, -662, -377, -133, -1112, 763, -22, 241, 215, -74, -201, -97, -139, 24, 119, 50, -476, 21, 153, -6, 366, -81, -351, 657, 291, 197, 254, -138, 488, 296, 283, -361, 322, 41, -179, -564, 581, 389, -599, -44, -253, -124, -300, 563, 629, -300, -791, -159, 320, -96]
5803i6p4J91j79O14K3l62m28M25M77p07R07o24l29M47o42K35J14L60k71j73L25
5824B33l54l11K70P32j095J221n11O9m6j8j49L14o3l49L37l5L42r7j064P24q85
5845g35J361l16o15K69K52o8j8j74K6J15k03mn07O66K80K82j410Q62n12L68k20
5866c01R78q4j237R69P1j13l97o35O01Q9J45o27P14L33q51l30N25l16P35K7m98
5887b02K90k60M61p26J093r86K06K36k98K81Q1O8j40k30J41n60J028j137K73m27
5907h08M23Q61l29O96j074M63l1L55l23K32p78M65L92m34j12L96k09P3l44j22
5927b08n54O54L41K5k10J088r33j39n4l05O79J03q11N15n00L32K41n35k23N43
5947D9j15R5N72j092J039p26M77J2p27P68k3o7p36K70L71M56L56o24m14o78J54
$$ y = [-96, -170, 21, -158, 456, 479, 117, -311, 114, 591, -116, 791, 167, -162, 285, -357, -122, -8, 352, 81, -92, 233, -121, -432, -162, 570, -525, 696, 185, 254, 208, 190, 41, 355, 292, -57, 280, 245, 587, 490, -574, 150, -735, 626, 310, -305, -36, 216, 148, 130, -44, -18, 97, -106, -110, -617, 49, 329, 611, -799, 63, -449, -81, -301, 677, 593, -644, 325, 396, 283, -114, -749, -148, -59, 86, -541, 173, 506, -345, -675, -150, -466, 269, 296, -202, 88, -172, 289, -437, 656, -330, -124, 112, -186, 95, 176, 244, 104, -126, 15, -545, 483, -654, -381, -808, -385, 476, 147, 843, -231, 232, 201, 556, 233, 465, -313, 152, 544, 110, -2, 394, 185, 258, -86, -208, -762, -108, 233, 258, 48, 1136, 203, 64, 10, -295, 384, 487, -324, 191, -309, 23, 264, -271, -494, 49, -66, 29, 601, -491, 548, -178, 299, 311, -416, 352, 329, 262, -474, -204, 167, 623, 979, 355, -59, -737, -583]
5968e83L84L72M27k30M10j018N93j27l51j6K21K78q7m74O53m54K91l38J154q27
5988B78m99N92L93o09j21j8N38k35l63O56m7n06N34n28J040q18L12m47n03K53
6008i8J19q9k04L44k86l64P14P10n71n67K10m88P59m34n01O75P09p82m5j0N88
6029C89r38J416j574m44P52m70M71L75L16m17L01M95q59Q05j072L02J57k15k66
6048d76O75j070J301j156J406j179l48J338Mj36L50l27j024P72K08j02o52M74
6066E8O83o55j097J283l45M13n16K8L70n54m28Q56j56K07K68p78jM22o27O70j09
6087hN60q07M42k6k57R04n35k43M07L95l63n92l86O16M29m60n67k15M54j4O3N31
6109C28Jj82p15J290n08o08l1L56l07M13k94K98nl20N65P3m02k21P03l78p03K96
$$ y = [-583, -199, 173, 600, 370, 780, -238, 355, 228, -123, -139, 82, 360, 273, -201, 452, -2, 289, -49, 1105, 278, -221, 371, 764, 155, 34, 16, 554, 319, -44, 612, 565, 59, 593, 65, 1105, 287, 599, 152, -351, -98, 21, -68, -272, 72, -214, -578, 136, 846, 275, -292, -82, -570, 189, -245, -746, -71, 638, -144, -189, -199, 389, -549, 867, -707, -1151, -399, -869, -398, -23, 293, -124, 177, 672, -187, 618, -454, -152, 5, -210, -476, 199, -871, 430, -726, 680, -499, -847, 491, 495, 359, 709, 382, -642, 130, 338, 236, -416, 58, 741, 86, -1011, 272, -73, 340, -176, -148, 222, -332, -760, 96, -60, 147, 415, -363, -364, 58, -569, 101, -8, 552, -255, 187, 161, -96, 808, 273, 30, 437, 832, 469, -123, -509, 107, 536, 76, -491, -706, -252, -266, -203, 328, 329, 147, -568, 722, 214, -394, -425, -69, -376, 37, -257, 41, 36, -284, 281, 354, -48, -269, 434, 56, -647, -351]
6131c51O60n26J70M39J8n33k61j25O35n71NJ007m16k93M52m59M96m85R2k57N90
6152B87r0n2l70k35Q69n57m17K82K67m96O66L85n79J34N49m75J1n72P31k36l5
6173F7k37m26J094j128J067m82N32r47O47o30O80j41p43J132j515J250j42j21
6191d3o08M3J034k14k26j03l27O77Q1J02q24R0m07J669j463N55J50n48K97L92
6211C27l36J92O73j430J90O65N2qm08M01q17P29P55j003j319J564j36J48M6l31
6231d6J11K17mj063Q36N04q19K52r91P31j25O67n93M41q9n61J003J7l21n76L14
6252i5q51J422O2n77P30n74L3l04N70j93j250N00K21J07K61m57O11l23p2L97j94
6273B4J073K67j183J14o22J27L50p8k83L36j40J81k35k69O49m64J7NK08J01o99
$$ y = [-351, 309, -217, -47, 392, 410, -123, -384, -509, 126, -445, -440, 567, 151, -142, 310, -149, 347, -138, -46, -303, 287, 197, 145, -225, -460, 409, -148, -565, -283, -16, -512, 154, 539, -40, 94, 643, 168, 179, -393, 338, 102, 67, -170, -596, 498, -630, 437, -45, 487, -460, 187, -443, 237, 96, -647, 485, -1030, 220, 78, -43, -651, -608, 426, 212, -14, -117, -444, 233, 314, 416, -408, -318, -725, 944, -519, 36, 186, -362, -65, 327, -9, 183, 856, -574, -384, 281, 333, 325, -83, 318, -499, 230, 985, -18, -1337, 227, 91, 239, 285, -46, 65, 282, 278, -785, 51, 555, -264, -12, -1003, -272, -397, 270, -323, 118, 29, -532, 471, 488, 167, -409, -95, -946, 476, 538, -39, 691, 117, 150, -154, 416, 223, -1027, -527, -306, -199, 62, -395, 216, -107, -179, 218, 24, 1097, 1364, 181, 295, -327, -200, 150, 72, -211, 125, -15, 166, -69, -338, 311, -153, -136, -131, 77, 178, -521]
6294e21O49m88O49L5k68m06R45j01J35n89K74n49j72K53O80j56k38O6n81M43J94
6315B54l24K77p40N92O5q27J350k59j099J141k82k82K94q7M22j016R40j382P16
6334b47k71L12M67k95K41M6j057m4P04PN1K17q7O2l88J57K88r22l99Q40j42L31
6356a29j07L86J9O10p95l05K10r95J469o81K25J5l64N88m04R0n6K30n0m65l9r
6378e57j95P52m13j87O16J59p85J177l31o04K9p4L87L3j57j04J258l37r15L2k64
6399d80nK8O13L80l00r5m29K32L9J34j65m40P83k51J63j69l54m1L60R6l43J024
6421G80n42m41j45O32l43J1L19n26J229j483M36l79j98L32J30O30n41N60j63r6
6441B02m71P53l81l79L57M1k15N79n21r11P54L96j08L1o36R35j38l05p60N84L61
$$ y = [-521, 128, -360, 289, 324, 56, -350, 595, 494, 629, 40, 314, -235, -407, -154, 526, 370, 132, 198, -383, 60, 254, -70, 207, -533, 59, 124, -703, 647, 388, -711, 430, 148, -134, 160, 73, 495, -521, 419, -963, -247, -518, -206, 261, -34, 207, 253, -804, -848, -144, -137, -86, 131, 44, 106, -282, -125, 163, -759, -1158, -318, -460, -129, -236, 150, 169, 779, -16, -321, -111, -1106, 363, -318, -93, -78, -442, 146, -258, -168, -224, 6, -44, -509, -548, -557, -752, 0, -413, -600, 16, 175, -610, 567, 236, -368, -339, -413, -26, 7, -150, -254, 1004, 667, -248, -216, -480, -485, -457, 156, 536, 236, 141, -288, -56, -17, 117, -48, -488, 295, 44, 207, 38, -316, -357, 3, 99, -244, 780, 238, -203, -348, 284, -59, -48, 271, -255, 974, -509, -73, -452, -650, -318, -188, 442, -99, 461, 298, 202, -269, 484, 103, -276, 81, 122, -93, 486, -35, -946, -192, 204, 96, 127, -509, 426, 288, -17, -777, -193, 168]
6462A68l2j70O62o6m96j86K64j06N4l28k32J14j26J44L36k82o91N89Q13r69l12
6483h52J087O75j433Q36L38p82n20J362j336J04m1N95k90O80m71j4M99L8k89J62
6503C48k91O9m99n7J097n72J80p64P94L66p27l1O8nO5M15M26o25j10M44r41O94
6525C44j125L32M88k20K80Q5p5n1M09p17J029r89KP62p92J43O15n22m4j62L62
6546A54l75j25O20J47l48K14l32J43J18o34J145j501J184m50j1K02N42j070Q01
6565D24j53K08o23m47R7O17n13O04K75o70J43K81r32K79O95n79l0l57N85j28R23
6586F99m9k90j240J42L36N3M62N48o39p5J48M40j176N02k35O5N75L55m90j42j56
6607a67K17q02R26L38l31J72k73j27L61Pp11P40l33N54k96n39J065q26J9K59m05
$$ y = [168, 136, -34, 628, 562, 66, -120, 144, 38, 92, -236, -468, -354, -480, -336, 0, -282, -973, -384, 429, -540, -852, 235, 910, -523, 313, 651, -131, -651, 711, -625, -521, -562, 33, -257, 423, -48, -62, 437, 475, 186, 348, 57, 126, -373, -430, 667, 95, 275, -489, 305, 671, -56, -87, -19, -24, 41, 456, 882, 257, 147, 591, -350, 344, -781, -449, 39, -181, 99, 184, 109, 58, 467, -250, 779, -210, -208, 554, -238, -95, 520, -2, -46, -208, 154, -221, -346, 274, 421, 73, 287, -45, 98, 216, -418, 727, -774, 410, -40, -51, 151, 693, -377, 424, 271, 479, -144, -591, -494, 123, -390, 214, 489, -181, -38, 243, -689, -410, 285, -294, -324, -681, -96, -224, 699, 650, 360, -880, -738, -402, -349, 113, 661, 22, -53, 95, 535, -641, -139, -374, -309, 266, 621, 131, -11, -167, 50, -752, 174, 512, 181, 353, 80, -47, 314, 321, -390, 350, 17, 571, 275, -264, 801, -25, -6, 253, -152]
6628a52M56o94O62j72l06J46J7J79k19n77J111m83K27p1N34J01o36P7R9L05n35
6649F9jJ15o00p16J667J91q64J4k43J51m1J24J62L09q79Q43m53j23M81J77J08
6670D91K34j344J215m54q90P90p30R52K23m82K77J69p49N1j03N62k03o1j90O12
6690C70p39K19j99j094J973K7r16M39K0O36j165L52o2p5K38O5N32j045R81p81
6710b24q44Q70J07J7M41o07K62j79L11O3K16k63O76m77L86j083P78k75L11m55
6730C1l13K91J84n2m06M86j29L5L26J32o49J12jm24O15p65N4J4Q70o09L23L14
6752D39K69j231M13j32m25M62J14k63L00M39l73J72q7M06m6L31r25kj39K20k96
6773c54J8J71O88k31O84k53m33p24N48J44l27JK82j27l4J14J17m52m32p2R92J40
$$ y = [-152, 304, -390, 272, 100, -206, -60, -43, 136, -83, -660, 451, -32, 195, 124, 658, 759, 123, 200, 299, 604, 69, 68, 183, -417, -1133, 534, 725, -139, -125, -368, -217, -258, -134, 28, 337, -542, 301, -152, -275, 206, 383, 491, 725, -619, 596, 142, -748, 42, -688, 264, 487, 5, 282, 451, -298, -247, -350, 212, 9, -52, -242, 370, -369, -150, -349, -1443, 530, 557, -359, 80, 100, 736, -429, -77, -139, -214, 24, 89, 621, -424, 557, -224, -1068, -198, -91, -74, 367, -240, 22, -157, 154, 217, 433, 170, 846, 369, 755, -328, 450, 175, 486, 31, -282, 9, 193, 141, -265, 221, 92, 127, 453, 585, -64, 48, 47, -377, 238, -527, -473, -459, 411, -198, 125, 439, 708, -523, -110, -242, -667, -205, -91, -354, -54, 385, 12, 184, 97, 503, 457, 788, -137, -139, -278, -58, -354, -336, -165, 523, 292, 976, 723, 290, -434, 114, 258, -69, -68, 214, 87, 53, 167, 284, -168, -600, -672, 320, 460]
6795D60n3l71k31J88M74j018J4L31K60n52K68N24p03n3M78M6l14M74Ok77n49K2
6817e76J022l43L69m50j87J01N58m88K18j778J763k51n12P95n77rk6O11l19n89
6837f68J016p58N90n5L67k13P4l34j77k6J76O6K54l13k22J184r56j27j43n25M24
6858c66j50P42m02O32P23j180M34r87N57k68L60r33O63L96n09M06q46J064o13
6877b77O45K99p85n9j36K63K30q83O51O02n65k64P41m97N75j344P65J029m55j020
6897d85M40L51m47J92J03N8j66l88P27m59m58J28R04m39Lk54N7K08K73l23m34
6918d09J075o46L72K32j28n67j96n2M9Q13n44M61n16k94O7k42P39n32M18r20Q32
6939A2j08n1O66m58k22j67L6Q48q09P92pm98N43r15Q54p1o41k55k69P83m0J30
$$ y = [460, 407, 36, -195, -7, 467, -551, -537, -206, 54, -498, -230, 294, -409, -462, 16, 62, -252, 222, 228, -49, -598, -576, 446, 103, 472, 22, -165, -64, 494, 6, 224, -1554, 209, -42, -554, 241, -336, -345, -371, 240, -79, -668, 348, -410, 180, 125, 492, 279, 353, 19, -158, -184, -8, 58, 312, -1, -223, 961, 5, -122, -265, -790, -366, -516, 226, -176, 456, 1179, -1, 433, -554, 3, -265, 95, -838, -175, 221, -288, 118, -728, 336, -277, 368, 667, -118, -177, -313, -50, 180, -703, -52, 550, -15, -279, 462, -35, 540, -804, -39, 990, 535, -485, -45, 306, -141, 51, 154, 212, 46, -342, 385, -74, -532, -404, 500, 61, 64, -190, -133, 75, 348, 25, -409, 666, 20, 392, 624, 496, -71, -267, -319, -270, 543, -1, 460, -56, -350, -283, -525, 214, -318, 100, -820, 12, -96, -147, 519, 61, -161, -328, -292, 556, -253, 539, 532, 34, 577, -338, 516, 445, -196, -451, -720, 63, 23, 153]
6961A53p33O24n6Q01m68L0n65Q20M3p39O18j156M87l83N55J9j11L80j95Q7o61
6982d50J354q47r1N2L43M3n84J20O6R9n42O21R5oq70O18N81k65j47O80j026K91
7004A35l20J76K90l50k0p9j76J347r16j51o36O12M88o77M00q24K88J100n32m74
7024c19k98J205k08N2m80K81J45q02j67J226k26n47P68j025N26k19K93M56q21
7043a60k96J25K98Q11l4j158M49l17K59P03j062N56M00o46k47P43l00J40Kr36
7063f70J003j090O82J088k2r18m81O9K84l08K31K61n24M61l22L21j42L97m27M90
7083C83n22k39J064n28L9l64P22k16q90N80j40M67k03m40n5J23K80L36k76n13
7103c92R99K61j148n76O66O20j25m85k37K32N31n97L73M4L02m60J54J66r84Q73
$$ y = [153, -580, 44, -12, 789, 321, 351, -214, 606, 649, -90, 528, -628, -141, -524, 31, 50, -61, 319, 124, 211, -450, 904, 57, -34, 18, 361, 404, -180, -60, 6, 105, -437, 184, 279, 273, -597, 21, 602, 337, 190, 870, -156, 135, -185, -9, 281, -69, -89, -168, -344, 1003, 87, -64, -700, -88, 400, -277, 123, -701, -413, 687, 155, -319, -617, 588, 380, 432, -48, 233, 378, -424, -591, 635, 409, -138, 630, -395, 131, -88, 205, 661, -160, -456, -331, -33, 778, 744, -414, 35, -282, -23, 680, -382, 174, 574, -72, -319, 424, 124, 264, 266, -670, 333, -757, -75, 1013, 991, 73, -408, -339, -55, -363, -132, 129, -395, 66, -256, 65, -77, 320, -107, 383, -139, -378, 686, 158, 197, -167, 555, 339, -551, 29, -111, 356, 153, -287, -342, -219, 61, 397, 121, -392, 607, 868, -280, -856, -190, 430, 305, -180, -417, -185, 346, -251, 122, 166, 468, 8, 162, 328, -656, 217]
7123B17L02J65j479J94l6K61K8R82m54k94j8J74N17j071k61K46O69l6Q14r74L90
7144C36K96q22O02k16K78m42o76R55l06k4O5P4K72r79N34k1N89l06m27J58J11
7165E1K82n7k20k09l6Q00m32k85J83k72l86J06O95o19K03L39m22L7k7J79J139
7186A049q90K6K07l86K4p3q4M16j10k22j04P17q48J79M79q9P0J68j246O71m77
7207e23N9l8J22N44k58N18L63p61o34P90o61O94n45J0j6J95j09Q17l19K19o82
7228b15K28L87p0p2j139O81M10l58K51J5p52J031j13k40N18j202P11K43j21n13
7248c20L43K10o67N70k71K8P73q52J45O4k9K0j54j33K1K83l52j97P42J14m51L96
7270B83k33M11r80O23K77K60R15j239k63J37J18l92J55k76r8P76m93K92Q4q01
$$ y = [217, 519, 684, -795, -601, -637, -376, -348, 634, 180, -114, -132, 42, 559, -512, -773, -527, 142, 106, 920, -54, 336, 632, -190, 412, 196, 474, 32, -644, 311, 5, -19, 46, 120, 392, -587, -53, -74, 515, 209, -218, -60, 51, 333, 276, 56, -153, -189, 611, 179, -106, 77, -195, -581, -475, 220, -399, -196, 143, -279, -242, -269, -90, 1049, 159, 185, 392, 6, 30, -43, -127, 289, 179, -43, -147, 570, -278, -99, 380, 291, 361, 529, -717, -46, -523, -464, -502, -380, 164, -94, 424, 787, 26, -608, 182, -479, 215, -330, -320, -336, -141, -250, 567, 248, 467, -215, 13, 400, 330, 258, -881, -200, 210, -148, 103, 118, -634, 397, 284, 44, 562, -640, 71, 314, 193, -320, 23, 233, -434, 136, -135, -107, 666, -186, -41, 23, -6, 14, -140, -273, -252, 31, -321, -518, 224, 338, -113, 283, 50, 461, -519, 104, 381, 641, 1556, 317, 54, 191, 309, -83, 72, -204, -302, 474, -19, 273, 357, -444]
7290d44O09k48j12M00k12r8L50j39o42J65M93N40j280P84O52j310J114q62O45
7309D05n90J021r77L65l22L36k25l26p4L87k8j85N86l57n81N62l01l83R38J95
7329D46j116O21l12N47K75n64P63j59k72P77j223l07N91O70m14J3l71R8L24l72
7349A5M14j09p72L79Q3l8n22J143j183P4N53J98n89l0Q66p0n58Q82q7j179J109
7370E79n66P8m04P45o71J86p3l6J83m35P94o62P39L00n65l24R61j662Q61M41M23
7391H92j415L59M81l47J61K19m36m9M04m77R9P07r47J45L0J8O11p50K00L91j0
7412B86J51n41K09K78l56L59k89q32J44J089j097P80L49n89j60N51m91j13L42
7431G0qJ44p78L8J054k61l67K32k64N15O27k95j039o6O4J13L09M98j341O81q77
$$ y = [-444, 165, -83, -195, 205, -7, -105, 245, 106, -536, -371, 122, 662, -618, 166, 818, -492, 622, -240, 405, -185, 836, -141, 224, -98, 238, 13, -313, -387, 0, -28, -213, 373, 16, -565, -3, -304, -687, 251, 446, -670, -49, -361, 186, 461, -103, 660, 501, 229, 1006, -217, -524, 67, 737, 323, 336, -35, 63, 387, 15, 429, 320, -452, -73, 10, -28, -550, 593, -590, -516, 37, 235, -354, -384, 482, 412, -146, 736, 649, -530, 579, 13, 91, -313, 432, -239, -53, -126, -162, 21, -414, 380, -282, 457, 757, 192, -132, 829, -833, 28, 469, 892, -523, -164, 317, -30, 131, 350, -86, -135, 269, -208, -109, 598, -349, -204, -174, -156, 455, -295, -95, 296, 286, 437, -104, 105, 383, 27, 386, 97, -735, -591, 498, -599, 181, 530, -59, -219, 332, -159, -272, 70, 62, 206, -572, -534, 520, 259, -108, 124, -140, 375, 1002, 707, -332, -398, -334, -221, 88, 586, -755, -74, -951]
7452i51J063j75J77L30o87N12n72L64o00J127r32j23M93J45M11j256K76L44P13
7471F59k98n45k88J479p49K88n53o62N99L88o88N20k33l98P83m94m9N12n45jP66
7492D91j114N33N40k49N95p57J18m98J59L39J19j112P58L87j49K28k25L56r09
7511c90R67k99q20N63L12l3k29N1l96M8P03q54M90r07N28M25o8p87J087k95m60
7532c64J77K67K25n61j90l78O21K94L99k51j084P64P02j008P62j014J33Q2j82
7551f06K69J14M90m54L84O43n25n08L28l73K94k87K95p5J94l85P32j03o23M32
7571B36p30l5J54L62J44o53J353q38L32q93J156r38O47J16k28j89K64j32n29J094
7591F93j72l73p3N98q04M16N0k74o52Q01K05M64j037K97l35L84j47l80Q12m47
$$ y = [-951, 112, -63, 114, 444, -243, 269, -303, 61, -539, 588, -344, -467, 26, 171, 582, -674, -398, -54, 659, 361, -184, -472, 1007, 258, 546, -7, -669, -70, 318, -370, 150, -83, -481, 302, -192, -241, 271, -274, -275, 491, -623, -90, 450, 201, 796, 39, 157, -341, -182, 157, 276, -836, -78, 309, 160, 388, 163, 519, -390, 577, 278, -542, 21, 333, 300, 71, 122, -274, -226, 477, -377, 113, -794, -266, 159, 91, -696, 391, 96, -364, -187, 80, 305, -256, -446, -824, -203, 91, 490, 239, -845, -81, 621, -387, 375, -639, -506, -424, -606, -337, -223, 267, -187, 197, 840, 315, -193, 135, -238, 56, -231, 64, -11, 183, -202, 530, 427, -196, 236, -494, -529, -375, -13, 131, -522, 831, -7, 325, -568, 588, -350, 297, 413, 185, -4, 260, 128, -401, 693, 521, 148, 75, 673, -131, 285, 335, 61, -591, 210, 415, 879, -158, 139, -196, 188, 41, -339, 473, 26]
7611B6j24J72n13O48j08K31k84n68J092P5n22m70N7M78L76p83l58N94r2k31L37
7632C3l6j43J017o96p62O87j91O16m91J0l45M82m92J37L9N95J18k42r6k5K53j193
7654g25P31k78l4K48N63r88J83K89O0J94k80L86n73l47O29m64k92J530o07q17
7674e92Q68L9m13O11k20K44k20q4l00k51Q10m14n05M75N11m03n63n35J761k13
7694F06m3j007P59q67J93N44o5L47P04j473k72n91O59R09O5o74N08K91l79P6k05
7715H5K53n62m93N19k71P94m25j08P04o96K69q06O88J097r03J40p05K63q86J452
7735D09j200J107m05M24j74l15K34K16m38p1J07j6L51n23R00p00M09m72N63j017
7755f11j17J436j160N98M67j02j21P28j554O89J24j188J001o72M14m3q6J48M52
$$ y = [26, -98, 74, -439, 209, 101, 332, 48, -520, 572, 647, 125, -345, -288, 190, 566, -217, -575, 19, -73, -304, 33, -3, -146, 871, 175, -587, 100, -91, 525, 34, 44, -301, 181, -311, -174, -135, 460, 578, 336, 240, 215, 468, -725, 6, -272, -306, -58, 505, -483, -300, -11, 49, 243, -37, 349, -224, -571, 58, -406, -698, 832, 225, -592, 276, 315, -98, 513, 293, 537, 317, 233, -67, -318, 492, 78, -427, 48, 559, 156, -407, -942, 819, 606, 563, -444, 315, -552, -359, 185, 120, 467, 1171, -302, -574, -1165, -506, 403, 468, -206, 302, 593, 214, 290, 85, 338, -224, -717, -198, -469, 325, -100, -208, 496, -200, 69, -737, -49, 1048, 145, 285, -420, -157, -1043, 409, -791, 316, -89, 335, 161, -154, 80, 296, -142, -213, -106, -122, 229, -294, 606, -94, 315, -157, 406, -611, -728, 708, -452, 146, 613, 511, 390, 1118, -436, 253, 377, -811, 190, -482, -68, -111, -197, -49, 403]
7774D03k42M70q06L12p74J186l91L63k70q34j2O18M31l31j22N91J56n34n76L25
7794c7Q24j073K85o89K99m94O11M70J84q68M05k75L10n5K50m32P74k12o23L06
7814d0j27L81l18m62J171m81l82m15J209J72j632J010J03J32j48l68r2K65K07
7833A85N60o28l34J27M8NJ70p2N56l8l85N77q4l44p81q8j15J077o26l52N78l7
7855ap32J222J51m76n43l2R5N46m96J70J40m7O19j99J58l71p2k43k1M11k92r8
7877a11J71k20R49o61p96R22r43J039k65l41K50R5M19m88N04j133J144l16K14
7896D33o66O86o0m28M92j046Q41K51l29q77R95l54j42m02J88L3O64m52K50k47
7916a70O09n03l80N43Q50q53q26N25m28j57L01J482j213J0L19n47O12n36lM31
$$ y = [403, 161, 631, -175, 137, -637, 549, 158, 521, 251, -583, -595, 23, 454, 123, 1, 592, 748, 214, -362, -37, 787, -286, -1, -690, -391, -885, -274, 196, 380, -488, -83, -358, -48, -103, 147, -285, 489, 277, -346, -40, -167, 214, -104, -566, 605, 124, -258, -673, 536, 708, -924, 86, 189, 321, 173, -195, -287, -22, 185, 745, 117, -217, -90, -42, -37, 133, 61, 617, 579, 194, 771, 687, 343, -438, -526, -641, 436, -190, -542, 36, -1, -733, 489, 640, 164, -379, -411, -316, 230, -266, -96, 44, -3, 616, 417, 575, 204, 132, -111, -132, 279, -13, -111, 60, -160, 789, 128, -668, 254, -689, 350, 85, -256, -6, 89, 508, 20, 524, -609, 535, 219, 433, -233, 453, 393, -35, 457, -589, 252, 503, 174, -703, 292, -62, -204, -606, -418, -385, 279, -173, 77, -170, 439, -64, -444, 99, 949, 96, -730, -205, -633, -790, -489, 993, -220, -210, 109, -438, 174, -362, -365, 66]
7936F6o43J92R16j045O86k15j27P1j92K16O2K05m70N01J34o41K75N2M7k01N58
7957D47r0q32N73M80p02q7M77M2n04J058j521N50J84L31Q4o26K7L91j336O21M73
7978D0l24L84r07J321o97K8J06J99N8l61P09m15M27K74j48r26q1Q03m32n68K27
7999b83Q65m62o1l84m50K02J148q58J015o37P48o90r08M21J66L01l48k86L65P5
8019f1M28m80p9M72j28o6n2L06j37K5l24K60k61K75Q53j334K93J84j27L16k85
8040G8l14M15L8J08l82L45J40o58M97OR7o81O65n28nL09R2k94O63j87p61M81K25
8063C49p46P78K04p37k69J084p4q67M14N38k06k83K44N3n78n5j03m8K43O99j009
8084c69O55m51R49q11p9R8j08m32N95L48p50J279j747J358N4r46P07K78k35o22
$$ y = [66, -577, -385, 531, -514, 172, -43, -170, -99, -291, -75, -13, 192, -278, 223, 357, -284, -9, 43, 90, -111, 447, 357, -475, 98, 578, -124, -211, 266, 308, -196, 862, -659, -109, 75, 406, 490, -136, -109, 282, -1054, -433, 40, -284, 100, -807, 514, -183, -155, -49, 150, 208, -153, 556, 141, 568, 842, 694, -232, -313, 490, 58, -510, -283, 582, 120, 59, -325, -775, -573, 575, -283, 732, 95, 843, 153, -755, -334, -168, 133, -215, -501, -136, -61, 367, -113, -192, 280, 152, 86, 34, 340, 203, 228, -96, 164, -97, 178, 1031, -303, -10, 174, 47, 363, 78, -236, 179, 217, 325, -57, 288, 428, -230, 267, 273, 370, -311, 354, -174, -179, 130, 222, -72, 591, 404, -357, 124, 349, -397, 381, 585, -152, -421, 663, 589, -278, 136, 674, 468, 185, 429, 482, -96, -151, -254, -302, -59, 640, -369, 286, -165, 784, -27, -106, -8, -116, -548, 47, 395, -355, 924, -823, 535, 589, -357, 350, 628, 393, -229]
8104b29J41M30k14O15j186P50j47j40j24M14J82n16k17Q71j125L15J037j083N14
8123B88M08l66N31l66j80j21l00L56k98J67l96R5n4n18O49r6po41N65N30J81p88
8145c61M51l18k71L67r6l57K62m47J331p48j86M96L96j362J101q22O74K92o91
8164b89m8L98j56l30O65j30N81j167J041q70N60l9p38P34k55j181O99J168o05
8183C8l73l48K93M35o7k64p3j45
$$ y = [-229, -88, 342, 128, 743, -443, 307, 160, 20, -104, 310, 492, -24, -241, 630, -495, -180, 857, -226, 288, 696, 330, 861, 495, 315, 194, -106, 250, -48, 119, -277, -182, -236, -754, -105, -201, -208, -849, -284, 246, 427, -361, 90, -228, -499, -132, -228, -585, -323, -770, 561, -187, -373, 123, 519, -843, 258, -564, 110, 402, -289, -337, 61, -95, -425, 240, 110, 691, -476, 565, -305, 255, 216, -522, 212, -43, -1224, -525, 643, 38, -335, -683, -390, 45, -22, -286, -359, -504]
8191e04
$$ Imaginary data points
##PAGE= N=2
##DATA TABLE= (X++(I..I)), XYDATA
0@%%%%%%%%%%%%%L7r3J12j12J12j12J31j84K21k30K66l17L61m12M71n36N99o73
31c59P64q51R48j063J180j311J467j627J797j991K202k441K704k992L323l696
47a946M112m595N164n829O630p611Q839j0456J2684j5928K1139l0920N5415k15452
61a78754n28578L49387O23297K53805l66591m58519p3525L36435K82522j9178
71B20301k19908j55883k4512R7042J56415J38425k7833k40493k66353N1248L90148
82A18597L00506j78525m72365k19773L05259M75623Q5172m04153l94704O2908
92c21455L97147K60569j20270l14397j56735J07680J98478J07790j1613j13549
102C3645j64018p8284J28085K49126J14687j94141l42125r0720L16314L76465
$$ y = [0, 0, 0, 0, 0, 0, 0, 0, 0, 0, 0, 0, 0, 0, 37, -56, 56, -56, 56, -56, 75, -109, 112, -118, 148, -169, 192, -220, 251, -285, 314, -359, 405, -446, 502, -561, 619, -692, 775, -852, 945, -1046, 1156, -1285, 1419, -1573, 1750, -1946, 2166, -2429, 2735, -3094, 3536, -4075, 4764, -5692, 6992, -8936, 12203, -18717, 36698, -178754, -707332, -357945, 265352, 519157, 152566, -305953, -379478, -43043, 239479, 220301, 393, -155490, -180002, -82960, 73455, 211880, 184047, -56446, -322799, -271551, 118597, 419103, 240578, -231787, -451560, -146301, 329322, 414494, 10341, -384363, -321455, 75692, 336261, 215991, -98406, -255141, -147461, 51017, 158807, 147194, 33645, -130373, -208657, -80572, 168554, 283241, 89100, -253025, -343745, -27431, 349034]
112C49034j6651m03685l26198J34660M39518K22548k44208l87441q6557K56193
122f2787K77442K1235k05481j86292n513J16422J23970P1650l3891j57848j61495
133b02588K3001K35744K21539p3489l38319k16799J91037L87910J27676k82437
143G3275l61820k2577L32721K82965q6493l05448j60272J14917K14518Q9015q1271
154H9530j26532o7554k438O8561J34923Q6038j03059k25632j03136J77234K94303
165B22238O3542k84358l06065N0432L49060K29775j49611l41184j32336K11700
175h6807K77039L0771j95676j73150j72J21983J10690K5039m6190r0269r8247
186a24989j0661J50444J76996k0212k33928j96973R0611L05171J63544j95201
$$ y = [349034, 332383, -71302, -397500, -262840, 176678, 399226, 155018, -232423, -318980, -62787, 214655, 235890, 30409, -155883, -161396, -44974, 78996, 150646, 116755, -41093, -202588, -179587, 56157, 277696, 204207, -134112, -350911, -159874, 228036, 355712, 73275, -288545, -311122, 21599, 304564, 218071, -87377, -247649, -132732, 81786, 170801, 89530, -37002, -104556, -106994, -38433, 96490, 182528, 79469, -146163, -249299, -72065, 222238, 285780, 1422, -304643, -254211, 94849, 324624, 175013, -166171, -298507, -86807, 190232, 221003, 25327, -147823, -147995, -26012, 84678, 109717, 63527, -26742, -124989, -135650, 14794, 191790, 171578, -62350, -259323, -168712, 136459, 300003, 104802]
196A04802l22723o0374K60739K62680k9158k64578j81809R0708K16474Q9100q1540
207H4321j24762o2358J9980P1551Q2934M5264n1427j47439r9973J04306K22223
218A44620P6750j84561k49508j6306K59212K31315q1067k88456j47602J48215
228a07388K47290O8232j63813j83005l036J29771R9500J500n4550o9746n2592
239h7837Q340Q6227J11159J1789j47047j63162L4448K19944J51508j05935k54443
250a35009j05695J79718K50997J6939k19459j80332N1001J91217J08523p1697
260H6203j38934n0021M7436O4577M4879J9445l6090q9307o6086N0374J50494Q9563
272A72533j12330k09723m6293J88319K03796k1769k26045j64909R3536K30668
$$ y = [104802, -217921, -278295, -17556, 245124, 215966, -48612, -230421, -139713, 76761, 165861, 84321, -40441, -102799, -82819, -11268, 71666, 116930, 65503, -81936, -181909, -77603, 144620, 221370, 36809, -212699, -229005, 30207, 261522, 180455, -108001, -255603, -107388, 139902, 208134, 44321, -138684, -141720, -11949, 87551, 89051, 34501, -35245, -87837, -79497, 6730, 117889, 129678, -17369, -180531, -146083, 73861, 225369, 119434, -135009, -240704, -60986, 190011, 206950, -12509, -192841, -141840, 49377, 157900, 86203, -52731, -102752, -55316, 9261, 54140, 73585, 37495, -51812, -117898, -67524, 82970, 172533, 60203, -149520, -195813, -7494, 196302, 174533, -51512, -216421, -122885, 107783]
282A07783Q7182j37835j74855k2847J21357J15246o083p9746n6627j1843J1919
293d6349N1527P5767J1565r4663j17600j168J49016J42725n1881k04711j10902
304a96674J20699K09191N2389j61321j81485J3271J73098J12703n5201j27188
314d0518n9161M3762P9922L7752j3032l3491m9848m4363K7267J03561P1701o2873
326F0679j49031o7608J17672J80088J6504j75172j51975M7537J84629J02642q8848
337G7117j67768m5600J08661J13165K151p4991o4582p302L4118M1092L5480J0161
349F1702n4307q8204j4192J02097J10992j5848j41105j12365O3851J74842P4156
360A61619j19183j61957j4802J34242J22245k5871j25922p0529M5121Q1953L4793
$$ y = [107783, 194965, 57130, -117725, -140572, -19215, 96031, 89948, 10202, -46425, -58268, -46349, 5178, 80945, 92510, -2153, -119753, -120921, 28095, 170820, 118939, -85772, -196674, -75975, 133216, 185605, 24284, -157201, -143930, 29168, 141871, 86670, -40518, -99679, -55917, 24005, 61757, 48725, 15234, -34614, -78977, -51710, 51851, 123552, 60679, -88352, -155960, -38288, 141800, 158304, -16868, -168843, -121306, 63323, 165965, 77117, -90651, -136251, -27590, 85575, 87726, 12735, -51847, -59149, -25031, 16061, 51541, 61702, 7395, -80809, -95001, 7096, 118088, 102240, -38865, -151230, -87379, 87463, 161619, 42436, -119521, -134323, -81, 122164, 96293, -29629, -100158, -55037, 26916, 61709]
371F1709j9345m3374l7811j1613K1811N7074N1872k8369j06202o0254P2313J33598
383I1409L6418j14484j39681O826J50690J08074n9070j43554n8602P8790J15532
394G2348K1407p9940p0488J595M1750L6196J9102m791l7269n0675j5179N9256
406f688Q7275P676j05237r6982L3364J30295P9054p1916j42103m0227J10793J17408
418A02712q710j08095p5555K8295Q4569M3633l0590m7797k2070k659J8595M2533
430B4861L1368k1388o6764m8936L8139J03317M3937q2322j14147p795J07052R8471
442A05793k3468j18906p0349N6872J03939K9474n8933p2200j2951M6338M4864
453C0473P465j6643k5539l4517p239M3224N8011N923o3547p5687O142R8288P3866
$$ y = [61709, 42364, -1010, -38821, -50434, -28623, 28451, 80323, 51954, -54248, -114502, -42189, 91409, 127827, 13343, -126338, -119512, 31178, 139252, 80182, -63372, -121974, -43184, 72348, 93755, 13815, -56673, -55078, -13328, 22868, 41970, 37179, -90, -50765, -65944, -6688, 80587, 88263, -16974, -113956, -80592, 49703, 128757, 56841, -85262, -125489, -14696, 102712, 94002, -14093, -89648, -61353, 23216, 66849, 36259, -11538, -33608, -36267, -17672, 24861, 56229, 34841, -31923, -80859, -42720, 60597, 104534, 22212, -91935, -99730, 7322, 105793, 82325, -36581, -106930, -50058, 53881, 83355, 24422, -47778, -60729, -14391, 30473, 37938, 21295, -4244, -38761, -46000, -2776, 55235, 61158, -2389, -78076, -71934, 26354, 100220]
466A00220m5108j10042m5778O8324J03603J8579q5719q1260J5331P5176M4671
477E7997j7168n1279l1442J0467K9453K4335J4938j3489m6709l5375K6420O8043
489C6191L7353m4296q7550k5957P5687Q9839p436r0646o7377K8192R0743M4189
501G8932m6993p4100j4741M1722M4265J2106k3936l3579j5344O071K5072L6828
513C6303R217m4559n6170K156O4019N9614j7074q4434n2666M7091Q8354K3106
525G4957o1583p0557m737O2328N4885j3444n1940k8403R620K8674K5969M633j9506
538A0896k9956j9953J3082N1005L2442l1733o6733k3191M9128O8925J1572o6590
550a106o6596J4879P3903M3138k8717o2513k8112L3496N0290J0990k5267k9572
$$ y = [100220, 55112, -54930, -100708, -32384, 71219, 89798, 4079, -77181, -61850, 13326, 57997, 40829, -10450, -41892, -31425, -1972, 22363, 37301, 23812, -22897, -58272, -31852, 36191, 73544, 29248, -58302, -84259, -8572, 81267, 73831, -16815, -84192, -56000, 34743, 78932, 31939, -42161, -56902, -15180, 29085, 41191, 17255, -16324, -31668, -25597, -525, 36303, 45520, 961, -55209, -53053, 10966, 70580, 53506, -30928, -83594, -36503, 51851, 74957, 13374, -57183, -61920, 408, 55293, 41849, -10091, -38494, -28874, -200, 25769, 30402, 10896, -19060, -39013, -25931, 25074, 57516, 25783, -40950, -64141, -15013, 53912, 65484, -1106, -67702, -52823, 21080, 64218, 35501, -27012, -55124, -21628, 28662, 39652, 14385, -15187]
562a5187j4105O828K8078K6025q08l0894l6454n028M5347M9090j0075o1033m1626
575e9842K4624O5912L3510m0464o7422j1945M9292M8757O54m1986l9230N425L5945
588C230K3748k717j6746k4486j4151J5726L5514J7552j7398m5235k4873L2965
600a6871N6385J2086m7394n0835l21N2529M7741j5331n6665k8666K4092M2510
612A9260J8786j9394l4575j4303J6353K2444J6412j496k5523k7995R81L2009L1788
625C4747K90m0845m1632J4808N3624K9944k7901n1415j9659L3847M8829O558l8629
638B566l3505O48K7733K8601J206k4806k2067l114J3220K4347J6073j6455l5129
651b0682j4563K1653L8769J5218k9545m5813o141M1266L9070m757m1497l3121
$$ y = [-15187, -29292, -22464, 5614, 31639, 30831, -63, -36517, -41545, 3802, 52892, 42817, -18216, -59842, -35218, 30694, 64204, 23740, -43682, -55627, -6335, 42422, 43076, 1090, -38140, -32715, 3230, 26978, 24261, 7515, -16971, -31122, -15396, 20118, 37670, 20272, -24963, -49836, -16871, 39514, 51600, 4206, -46629, -46950, 5579, 53320, 37989, -18676, -47342, -23250, 19260, 38046, 18652, -15923, -30226, -13873, 8571, 24983, 23487, -2036, -30031, -29050, 2959, 34747, 35037, -5808, -47440, -32632, 20992, 50936, 23035, -28380, -48039, -14192, 34637, 41195, 2566, -30939, -30291, -2558, 26043, 27249, 2443, -19624, -22738, -9518, 14829, 30902, 14447, -20682, -35245, -13592, 25177, 40395, 10850, -34963, -41104, 162, 39232, 34475, -7022, -40143]
663d0143J2736M1752K0956j7740l0480j3961R649K4744J7442p897k0994j7619
675b1555p94K3610K7444j319l3280k7275O962L5896L0802j5824m4782k0033K5731
688a4417L7685J2084k4708l5342o460K7442K7024j390j7391k0434o968J5206K3836
701A6167O181j2290k4028j4216J5339L3468J1620k5287l0886p807K6865L4062
713B9188J935l4945k7447Q172K9116K2149p232k9352j7471J0806K2168J3563l783
726A6867k0471j7970M269K2118J6679j103k2802k4483N031L0027K1037j1362k8996
739a1159j8676J3280L2796J4045k0618k7629o480J7368K3987P041j9351k2348
751a7744j111J2755J8834Q453j2040k4088p513J5658K0797Q589j3986k7586p583
$$ y = [-40143, -27407, 14345, 35301, 17561, -12919, -26880, -17231, 7513, 24955, 17058, -3936, -21555, -22349, 1261, 28705, 27386, -5894, -33169, -26207, 9689, 40491, 24667, -20115, -40148, -14417, 23268, 35352, 10644, -24698, -31158, -3716, 23308, 21918, 4527, -15907, -22875, -7669, 16167, 22348, 10058, -13970, -28186, -12847, 20621, 32241, 6954, -23932, -31739, -4874, 29188, 31123, -3822, -31269, -23097, 6019, 28168, 20936, -8416, -25887, -15081, 7087, 20650, 16867, -3604, -21574, -17305, 4813, 21492, 20389, -2413, -26896, -21865, 8162, 29199, 17837, -11159, -29835, -16555, 16241, 30286, 9668, -17961, -24441, -7073, 16914, 23955, 4604, -17744, -18855, -6100, 12734, 21187, 9147, -14941, -22454, -6796, 14001, 22590, 8604, -18982, -26565]
764b6565K2689K5202R77k0308k5146n38K6782K1147p242k2371j5633L726K1791
777D511J6263o349k0177j2017K923J6962J8290l586k1717j5062M337J9247J8097
790B1722l922k5724j6155J2088K2625J1113r033k4354j2093J5458K3268N400j4030
803F363j7830q211J2297K0289M838j2171j6585p137J0239K1601N533j4510j8676
816a3960m686J2968K0192O844j9369j9831N5J6984J7331J193j8500j8299M391
829a4687J8293J2496k578j4257j6253L242J7986J1496l772j3764j4428J877J8361
842D012J3611o081j6781j1388M211J8958J3195j0125j8855p744P854J6975J0787
855A8629j1283j8493m477J0334J3718P002q125j8268o099J2556J4645N483r610
$$ y = [-26565, -3876, 21326, 22303, 1995, -23151, -23689, 3093, 24240, 16998, -5373, -21006, -17280, 4511, 20774, 14425, -5752, -17769, -14846, 2116, 20406, 16820, -4897, -19959, -15622, 3625, 21722, 17800, -7924, -24079, -11991, 10634, 21747, 12714, -11640, -23733, -8275, 14993, 20393, 6363, -11467, -19678, -7381, 12908, 17746, 5575, -11010, -18147, -7908, 13693, 19226, 4716, -13960, -18646, -5678, 14514, 21358, 1989, -17842, -17787, -803, 16528, 17721, -779, -19078, -14687, 3606, 16102, 13524, -733, -16986, -13744, 4242, 15738, 11966, -1798, -16226, -14349, 4012, 17623, 11542, -5239, -16627, -12416, 6542, 19737, 9612, -9243, -16987, -9133, 7842, 18629, 7346, -11147, -15624, -5290, 8428, 15430, 7305, -10963, -17062, -4506, 10139, 15622, 6012]
868F012j7403o086J3553J7576J471j2256j5002m729J5612J5557l04j4921j2303
881a3223n22J3448J5677j356j7112j0291J782J2730J2756j583j5230j1768N093
894i599J2127J0813j200j6056j2180O602J4924Q825m341j4254j1942P320J6283
907G322O648p868j2243q911P138J6721N693r147j2747n280O563J4975O008j0989
921C883j4089k073Q174J2806N008j0078j5225m0J0529J0170L340j0255j3616M37
935a1029J1402R402O36r242j2743p67J3963J0029k713r568j0238l56J2564J1442
949A2782l797j2463p211J445J2186R135n198j2294n795M042J0841Q345m398j3346
963e726o680P159J0293O119m681j3291n705Q288J1355L760n812j1999m676Q046
$$ y = [6012, -11391, -17477, -3924, 13652, 15123, 2867, -12135, -16864, -1252, 14305, 14001, -920, -13223, -13745, -297, 15380, 14024, -3088, -13379, -11597, 1133, 13889, 12306, -2924, -14692, -9599, 2528, 13341, 12141, -3915, -16095, -9493, 5431, 14256, 9915, -4339, -16281, -8961, 7322, 13970, 6102, -6141, -15052, -7914, 8807, 14500, 5353, -7394, -12674, -6111, 8864, 14872, 3883, -10206, -12279, -4105, 8701, 13709, 3631, -11594, -11634, -1105, 9065, 12405, 2150, -11466, -11029, 373, 9775, 10411, 1169, -11574, -12341, 1622, 11651, 8938, -630, -10868, -11224, 1340, 12782, 8985, -3478, -10689, -9244, 2942, 12077, 6879, -5415, -11210, -7168, 3673, 12018, 7620, -5726, -12406, -5247, 5046, 11165, 6484, -6807, -12512, -4224, 7131, 10891, 5079, -6920, -11596, -3550]
977c550J1908J831p340r750m189O886J2410J960r754q500k239Q326J1347J115
991A0461j1026r056J175Q043R513O69j0898q760J623R493P076O58r723r924K660
1006h016J0632O583j766r849p562K837J2008N034n209p908o407L268J0951O172
1020A0768o815q296m195L165R736O271o824j0514j752M592Q333N610o895j0043
1034f859k768P682Q348J214m612j0107j946Q705P135l44m870q140j655Q218Q005
1049H006r74o919o152k094P742Q763j025r117n298Q79O095Q685j554r748n139
1064g850K307P063O465k122r113n519L771P998M064j657q053o517N986Q191J363
1079F377l030o465m965K852J0796K008n090p249l286M337Q937K702o350o291j422
$$ y = [-3550, 8358, 10189, 2849, -6901, -11090, -4204, 8206, 10166, 412, -8088, -10327, -2001, 9346, 10461, -565, -9621, -8446, -403, 9110, 9779, -1119, -9879, -8256, 1237, 8313, 8971, -752, -10676, -8016, 2616, 9199, 7433, -2416, -9978, -7141, 4867, 9901, 4692, -3216, -9623, -6355, 4596, 10768, 3953, -4343, -8538, -5373, 4363, 10634, 3810, -6704, -8456, -3864, 4469, 10079, 3184, -6859, -9627, -1945, 6403, 7617, 3005, -7102, -9048, -343, 6792, 6448, 1578, -6562, -8217, 1, 8006, 7032, 113, -6039, -8133, -391, 8372, 7347, -1770, -7068, -6189, -94, 8591, 7037, -2711, -7850, -5543, 1520, 7985, 5863, -3250, -8769, -4998, 3000, 7064, 5407, -2646, -9163, -3177, 5014, 6377, 3347, -3118, -8083, -5231, 5565, 7573, 2483, -4766, -8052, -3715, 5222, 7924, 1574, -4717, -6139]
1094f139L407Q129K770p100q130O98O066N572K218p439o808K064N798L112J001
1109E219m791o545N04O706N053k270l094o412j89P946O205m858n086m909J040
1124e481Q072N114m008p311k018K913N833M599n028p081r58K841M723M128j935
1139D403q521k421M009O581J110k172p271k987O623O287k0l801o424k542P258
1154A12O401k496m398m250l94M039O596j337m820l515q60L425O555L89o201n224
1170e978Q46N229M312J231o289o112K803O610K349k182n065l886K905O906P67
1185D446k102l395l491R54P254N67k726k013l465l10N965M515m426n275j974K748
1201b728O175K892n880o167N14N225L353K099m317n949J549M785J501K53j869
$$ y = [-6139, -2732, 5397, 8167, 1067, -7063, -6365, -299, 5273, 7491, 52, -6756, -4692, 1106, 4218, 5219, 428, -6117, -5613, 1093, 6146, 3876, 782, -5630, -5819, 2127, 8332, 3474, -1612, -6521, -5481, 2591, 7705, 3697, -3614, -5632, -2719, 3114, 7713, 2685, -4396, -5354, -2513, 2210, 6338, 4403, -4118, -6539, -2530, 4051, 5161, 2989, -4282, -7269, -646, 5641, 5621, 1820, -4604, -7146, 112, 6513, 4017, -381, -4631, -5025, -986, 5610, 4273, -547, -4062, -4922, -1497, 5058, 5447, -754, -5978, -5132, 97, 4409, 5640, -649, -6761, -3958, 2652, 5001, 2819, -2246, -6132, -3227, 3679, 4446, 2344, -1051, -4542, -3588, 3666, 4233, 1507, -506, -3971, -4281, 1684, 6199, 1773, -3502, -5476, -2728, 3447, 6339, 459, -5708, -5194, 31, 3384, 5483, 1166, -4783, -3234, 1551, 3052, 3305, 1436]
1216A436m604j134M269K755L90j962m298k238N830N256j808m540l128o43M909
1231D90O427l576o258j910K247L417M262k715n751j87K750J920J221M22m376k981
1247d598L084L275J594J7n204m195M067N455P82k954l801k696M039O512p12n074
1263d09k806M09K120M775R4n278j790J144M15L615R86k157m584M47L150K030J881
1280D042l248o494K309M603K747m42m759l772J680O439K78k379j769k182O14M060
1296A727J410k092j997j511n78L132L179j476l780j638J241K943M620k729o103
1311c652j015M204K581J627l190m480P21L752J687o40r25k874l85L240J769l72
1327B048j263j387l419K080N359M96l596k464j875L662M720m44n409k300K343
$$ y = [1436, -3168, -4302, -33, 2722, 3112, 1150, -3148, -5386, 444, 5700, 3892, -648, -3776, -4419, 490, 6917, 3341, -2917, -4827, -2580, 837, 5099, 2384, -3367, -3554, -804, 1116, 2337, 2759, -1617, -4598, -1514, 1761, 3355, 3372, -1832, -6027, -1960, 3495, 4277, 1323, -2478, -5174, -1135, 5377, 4665, -409, -3215, -2806, -686, 4089, 4183, -1095, -2885, -1741, -1326, 2289, 3275, 1118, -3466, -3019, 131, 2161, 4042, 794, -5700, -3391, 1212, 3959, 3517, -1242, -5014, -3334, 3105, 3383, 1004, -765, -2947, -2333, 1727, 3137, 1045, -952, -2463, -3041, 91, 3270, 1794, -1986, -3624, -2383, 560, 5180, 2451, -3652, -4667, -463, 2118, 3745, 555, -3925, -3204, 548, 2235, 1595, 670, -2204, -2589, 651, 2420, 2048, 785, -602, -4021, -1941, 3418, 3914, 318, -2146, -4021, -359, 4361, 3917, -1492, -3792, -1449]
1342a449K435K606p81n003k041M492R17O52n59k201j907J131K601Q70L30j838
1358B55m064J730M001J105k134j621l161J573N950N6l937l000J633M09M207J23
1374C125m535j536K474M73J179J603j835k621J06J453L78L185j517m957n24M590
1390A041J139j82j901l484o2N252J909k932k033n02K83K771J051k562j021M42
1406g91p56K007J915n98k941q08Q09J295K167L99m884q87K246J803J720j387m025
1423b716k69L609J684p83q85k655j27K204K435j574j123k41j428N79L988q5k599
1440A4j275j043L92M150N84l539k568K321K119P11J078m581p60J754K333q14N88
1457A464j854j792J970J438j95j55n9k299j85K633Q49j890P15k742l51L625K105
$$ y = [-1449, 986, 3592, 2811, -2192, -4233, 259, 1176, 1828, 1269, -932, -2839, -1708, 893, 1763, 2093, 255, -3809, -2079, 1922, 3027, 893, -728, -3889, -2316, 3634, 3690, -247, -3247, -1614, -1205, 3002, 3125, -1410, -2946, -472, 1, 1180, 2783, 948, -1673, -1567, -114, 264, 3449, 1932, -3025, -3549, 1041, 2180, 1998, 97, -3387, -3449, 1803, 3712, 780, -1253, -1755, -1472, 1299, 2350, -212, -1233, -791, -1547, 460, 2375, 1777, -1164, -1972, -1163, 132, 2299, 2698, -2186, -3073, -827, 976, 2696, 1309, -2716, -2985, 624, 2308, 1525, 640, -2015, -2142, 62, 2497, 923, -200, -441, -1869, -1290, 2698, 2613, 14, -1261, -2304, -1912, 2238, 2822, -717, -3285, -964, 1155, 1866, 2944, -1637, -2397, -643, 1690, 876, 1464, -390, -2182, -212, 1226, 1031, 876, 817, -1482, -1667, 966, 1815, -75, 640, -2102, -2453, 1172, 3277]
1474C277k955k235k88J439K451J337m041r17Q23J618N0J211j236k091R13P45N72
1491F73J234n28k787p45J753J982m62l51k596j515K959L057j787j681q44o3K247
1508E46K002k320j982R61J67J15J358P20k775j35L97N3K013J173l215k065J478
1525a509K270J380q05k440j271J867K510m91j361j544m36J754J424p82o63P29
1541F32j671q33L150J004k379q6p52m71K435J224k280j581Q31J005J057k99l59
1558F27l250K106K163n75k66J00l203J765J618j42p40k05r81p28J826J599j452
1575B62o72j083J05J814J691j523j994J874j734J502K579k185k094P72J574J76
1591A064O46j024l186L14L128p92K41P55j996r93J480J817j217J46j494j403K126
$$ y = [3277, 322, -1913, -2201, -762, 1689, 3026, -1015, -1932, -1109, 509, 559, 1770, 534, -1557, -644, 101, 673, 1907, 1379, -1408, -2153, -400, 1582, 1120, 769, -1827, -3342, -383, 2674, 887, -794, -1638, -1701, 546, 2548, 228, -1754, -793, -626, -511, 847, 1567, -1208, -1343, -946, -893, 1120, 2293, -922, -2987, -1509, 761, 2141, 1336, -1104, -2375, -508, 2002, 1511, 150, -1394, -1830, -76, 1348, 566, -97, 632, -1039, -1872, 1278, 2282, -97, -183, -935, -1406, 1029, 2253, -27, -1608, -777, 228, 1285, 986, 627, -2623, -517, 1646, 1071, 805, 905, -2298, -533, 1085, 943, 203, -2, -983, -1711, 115, 1714, 262, -410, -1493, -1388, 426, 2117, 594, -1400, 474, -1260, 242, 2821, 636, -1458, -686, 888, 1064, 1710, 686, -2500, -2186, 942, 150, 391, 1146, -850, -1843, -363, 1454, 237, 383, -1111, -2514, -388]
1608c88J782n33j272o52j98N52K354q34k341Q90L0M31J191R78k624o06Q74N00
1626A34K13K37j101j744J970J472r97O95q07k184J641J528n4l73j563L89r74K848
1644A330K46k118O8L62o34K032L53k155m55Q19Q3J097O03k517m4J212j95J90Q28
1663A105l93k067O53J982n25L12K02k439J67K063m52j007J73q09k89J203M94m17
1681d4m00L9o94J162J430j01k496K51N05P84N23q1k211M26J310j56N60K8k227
1700a392K25R22Q11Q28r73o30j326J573J127j362K06q71Jp10J671P48j428j13
1718f93P43j161K375K9k242M43R05j215Q72J491j494j565J532L60l69M22r59j476
1736b002J239J502m93M48j31j636N9J420N42k028J708j083j117K285N64j554q0
$$ y = [-388, 1394, 861, -411, -1063, -1261, -709, 1645, 811, -1530, -640, -610, -179, 1012, 1990, -634, -1240, -366, 134, 347, 584, -517, -2261, -291, 1181, 184, 879, 72, -2112, -471, 1057, 1003, 630, -933, -544, -1518, 1330, 1576, -542, -474, -112, -746, 1286, 1639, -516, -971, -152, -69, 1028, 1631, -886, -930, 282, 87, 277, 1105, 712, -1355, -702, 1280, 755, 1067, 1269, -1170, -1003, 1060, 608, -399, -226, -1035, -1324, -121, 373, -44, -444, -405, -1099, 63, 1493, 1392, -1104, -853, -348, 436, 959, 878, -1333, -907, 403, 247, 807, 835, -1392, -1167, -245, 566, 1394, 421, -209, -1535, 38, 1165, -197, 9, -862, -861, -1571, 100, 848, -580, -693, 50, -1111, 1264, 1293, -949, -506, 399, -816, 56, 1547, 53, -1512, 20, 380, 11, 433, -526, -2002, -763, 739, 246, 694, 563, -1073, -1014, 406, 948, -1080, 628, -455, -1572, 713, 1277, -277, -357]
1753c57L2r42J701N85j231k68Q45k00n12J097L72j604k97P42K22O10p56p50r20
1772a631L094q77K85m88m50j483J429J756k120P01O55k328J549J374j309o86N41
1789A2p3l4J109K44j237m38R53q13J114M10r12j702J615o62l9J452j501o49J110
1808d1J137n28l01N4k142J835Q10l58j394J392q09n25J793N92j860n73J193o20
1826c45J096k1j484m38M06J221m73J005j338l20M99L62m88O02O82j929J348L17
1844G02q81l36J044p76j246J994l4p70N39r50j14M70J646j688p38J217J60p68
1862e29J624k40j247n49M71O80L39J02j131m52Q26L62q91J536p71r41Q52R45j120
1881a34P98j114n11J371K32n26q12P28q85J85J198J07p24J104j144j244J981N10
$$ y = [-357, -325, -1267, 434, 1019, -212, -480, 365, 165, -347, 750, 1122, -482, -779, -37, 185, 795, 39, -711, -1631, 1463, 586, 871, 383, -67, -1550, -121, 1635, -485, 216, 871, -1457, 92, 1466, 157, -529, 12, -61, -95, 1014, 1258, 21, -417, 536, -277, 837, 1247, 335, -1367, 248, -414, -453, 999, -502, -1151, -41, 1096, 568, 267, 321, -1821, 14, 824, 466, -928, 464, -345, -870, 923, 1515, -345, -918, 275, -345, 751, 730, -754, -1192, -786, 435, -38, 967, -371, -691, -192, 170, -318, 284, 966, -963, 385, 702, -179, -515, 529, -247, -1493, 501, 467, -303, 236, -714, -828, -358, 1288, -400, -1138, 79, 239, -529, 1095, 855, -392, -941, -470, 210, 549, 651, -480, -932, -106, 256, -635, 901, 130, -811, 41, 986, -134, 664, -450, -961, 410, 642, 116, -696, 32, -853, -668, 530, 637, -87, 1017, -127, -1371, 610, 1120]
1899A120r44l40O00j57p42J996k174N55K68j05n94Q61r97r56J385J500j017p31
1917d72J472k034O84J213rj107L56K09j035J127J26r7q51L93K00o2Q74j334l9
1936c86M69j60J74K24J55l28m79R75m96L59k9r94J80M90L83o88J083n04n01k37
1956c10O08M66j266N33p87Q42P11o11j997J750j05o7J002j016n28R22j26k26m36
1975f41J204r53l45J472n88k39O21o04p44J002k56Q7P40j222q66J083J054k81
1993E24j989J767m18J85O35p0j143N18R67j278K19M83o49j25L47k07p2N82R09
2012A185j572l31J760m44o15k57q81P98J946j242r60P94j053R68P81j497l2M08
2030b44O18k65r15J091p62R33o18j522J233J175M4j624L51R69jj44L11j583J04
$$ y = [1120, 176, -164, 436, 279, -463, 1533, -641, -86, 182, 77, -517, 344, -653, -1609, -224, 1276, 259, -472, 1000, -1034, -350, 863, 854, -253, 103, 312, -723, 404, 530, 433, -418, -25, 175, 113, 987, -347, -386, 83, -77, 97, 321, 476, 148, -331, 644, 148, 507, 478, -516, -336, 154, 537, -151, 932, 428, -73, -310, 298, 764, -502, 31, -756, 86, 797, 186, -1811, -61, -166, -233, 769, -247, -775, 147, 21, -205, -641, 563, -390, -735, 737, 149, -90, 531, -73, -817, 185, -71, 16, 756, -466, -1332, -249, 805, 524, -1465, 302, -116, 69, 704, 634, -509, 9, 976, -302, -83, 400, -249, -374, -27, -234, -306, 276, 1185, -387, -718, 1042, 598, -17, -274, -1155, -357, 1589, 347, -613, 181, -872, 96, 877, -620, -652, -244, 374, 109, -806, 285, -477, 456, -162, -1684, -451, 724, 768, -856, -505, 464, 463, 319, 630, -953, -849]
2049h49J412m91o91J90J0k82J572j533q17J980K03m07r35M27M69J93L94j733m64
2068a352K072N82k246l7L37R09J37k31j024N93J419p55n26o2K87l91Q86L3j571
2087i40J861m40k0p30J94K90P37m18j902O43J728l6j548L56k77J232j01N50k132
2106i53n46K671q53J71j221N12K46P62n71l02L20Q31j102j618J186K19J362m28
2124F86j581J22J688N46k012L66o92J514K44j124r85J176J051l50r13Q66q40Q41
2142F03J088j788j579K372O57j172j481L69J39J304L12j998J39J935R64j499m40
2159g5n19r2J099k35j693N60J447M6j082j85P52N23L04o10k168J356K138q86k475
2178a795R46j62J642l23j848K92J828M31p38r81P79p06J865k17j466j17J371j29
$$ y = [-849, 563, 72, -619, -429, -419, -701, 871, -662, -1479, 501, 704, 297, -638, -211, 258, 451, 845, -888, -1352, 720, 1302, -944, -981, -644, 265, 402, 171, -853, -260, 1159, 404, -122, -184, 103, -288, 598, 631, -940, 921, 481, 461, -269, -75, 215, 952, 534, -1368, -725, 1003, 967, -581, -225, -502, 730, 629, 1179, -953, -1499, 1172, 319, 490, -731, -219, 27, 789, 218, -84, 236, 1067, -35, -1653, -467, -248, 1114, 686, -895, -773, 915, 1461, -551, -185, -877, 637, 881, -243, -1228, -52, 999, 649, -264, 602, -238, 603, 1691, -97, -1676, 696, 1353, 181, -1300, -931, -792, 512, 824, -1174, -1035, 900, 1864, 365, -75, -594, -686, 413, 178, -1515, -955, 492, 538, -544, -729, 23, 546, 850, 240, -1928, -572, 1566, 680, -1795, -849, -1011, 631, 308, -1540, -1248, 580, 1011, 273, -708, 71, -635, 1230, 1013, -453, -570, 801, 672]
2196F72j243n9J55L14J104q86j516J772J595j209q10r94O47J332l09j776n79K244
2214D54J081j807p29M45m1J665l70j485l98K032L10j184p72K36J743k53j132j548
2232a753J637J406j038j02r35J15J615N63k705J71J687N18j263p49J97J036O95
2249A095k53k679Q64J987J29j515m09k28J182J170j478r07L38K286m23j433r66
2266a240L65K192p5k160j085J951J533p37j277m49N02J604r17j673O90J843p8
2283I89j296j350L29K607j41j328k140J965J728j61j215q87j45K273K04k910p21
2300b199K114J523j102p60j183K242J229j276k077L72K299N48j255j218j089K615
2316G83J960k068j967N62K426j294j137n10j26K266O37k162l39J191O99j79n92
$$ y = [672, -571, -630, -475, -161, 943, 57, -1459, 313, 1908, 699, -111, -1105, -458, 874, 565, -1211, -1790, 454, 1535, -272, -1001, -556, -597, 1068, 698, -787, -1185, 847, 1157, -27, -799, -563, 1180, 927, -205, -1753, -116, 1290, 252, 150, -785, -670, 945, 1508, -1197, -1026, 661, 1179, -84, -833, -636, 400, 1095, 842, -1837, -973, 1014, 1143, -372, -781, -1009, 173, 1343, -135, -1042, -704, 1582, 1159, -274, -1240, -875, 1317, 1242, -918, -2003, -52, 1481, 744, -533, -982, -480, 1124, 207, -1466, -776, 1067, 989, -307, -1657, -1328, 1279, 1138, -190, -2330, -365, 1363, 1202, -13, -900, -1045, 1228, 1432, -1478, -2199, -85, 1438, 336, -424, -1607, 635, 1864, 588, -1489, -1117, 1182, 1730, 475, -743, -1832, 783, 2743, 675, -1292, -730, 1696, 402, -735, -1245, -1371, 895, 1532, -630, -969, 222, 921, 742, 150]
2333A50p74M78J513o31k948R33K219O21j547j253j55K363J106j356k862N39K948
2350A344o02q0k006M87J698R56k511j561K367Q96L07k460m37J137J769J77k363
2367h82n19K594J18j021j534o84K151J628j787j874Q27J753m6r04n75q12K902
2384A335J55k012k216K989O71l53p85j450J147J960q79j767j072K445M30K3j982
2401a361j056L200J592k013k520O55K152J236k143o70o02K305P35j371j802J225
2417d38J867p34q80j414J472J164n7k085q78J932J163K38k156p98J914K048k338
2434B0j610Q43J726R18k049r57j86K021O60j293j726J695J550lj443k225J331
2451g28K614m11k475l03J262J262k78j654j254J457K116j077j885J45J733N07
$$ y = [150, -624, -146, 1367, 736, -2212, -1279, 940, 1561, 14, -1239, -1394, 969, 2075, 719, -2143, -1604, 1344, 742, 662, -1344, -857, 841, 1797, -714, -2275, 92, 988, 1295, -1165, -1602, -465, 1304, 1481, -882, -1401, 1193, 1311, 290, -1244, -1928, 223, 1851, 64, -1810, -983, 770, 724, -180, -755, -1567, 1335, 1490, -522, -2738, 251, 922, 569, -216, -1666, -519, 1441, 562, -1205, -2277, 168, 598, 621, -1361, -2417, 783, 2375, 362, -2158, -1503, 649, 1885, -258, -928, -1530, 775, 1510, 139, -1663, -438, 1429, 695, -185, -1599, -127, 1037, 980, -1105, -1983, -51, 1112, 1350, -806, -1604, 310, 2358, 20, -1590, -747, 979, 1897, -152, -1109, -1295, 726, 1386, 93, -1633, 62, 1612, 1609, 166, -2059, -728, 1886, 1475, -1000, -1303, -41, 1221, 943, -711, -1965, -508, 1608, 531, -1354, -1209, 524, 1031]
2467A031p45k228k74L250J199k945j429J895J409L35k662q89P61L231l98k012
2483d71j425K184J733j618j149j882K722J480m35k403K06J613M74m79k020M29
2499a041J082J556j775j230L18K303J2q96k409J090L279l49l354J14Q99J269N71
2516A439k597r6J647J224r13j651p37K475J82j72k110J12J958J062j716j986O35
2533a244K021P37j459r42l03K319j34j741j132J148K018k00k108l77K72L195j343
2550G27k037R15L82J138N0j849n29J343J282k322j456K042J132Q58j139k771M51
2567a783K800R08k802K08L69J003O50j452k416J324L347j427k280O15J128J512
2583A704j148k022P07M86J870j201j758O17R28J331l61l355N31K745L80j891j416
$$ y = [1031, 286, -1942, -2216, 1034, 2233, -712, -2141, -246, 1163, 1498, -1164, -2053, -1292, 1939, 1541, -471, -1896, 288, 2021, 403, -746, -2628, 94, 1574, 1139, -1264, -1058, 555, 1029, 550, -1470, -1041, 41, 1597, -178, -1408, -1090, 1213, 1225, 329, -2080, -990, 2289, 1940, -1414, -1300, -401, 868, 1439, -1158, -1254, 393, 1617, 704, -947, -1684, 791, 973, 801, -1309, -1197, 761, 1823, 107, -1879, -1244, 777, 1514, 55, -887, -1190, 1129, 995, -746, -1878, -730, 1288, 1088, -1020, -1397, -1125, 2070, 727, -1310, -395, -13, 1125, 1175, -674, -1203, 140, 1422, -900, -2356, -314, 818, 1676, 537, -2234, -1783, 1017, 1925, -877, -669, -300, 703, 1353, -99, -2515, -1191, 2156, 729, -1551, -936, 192, 1704, 556, -1466, -759, -273, 1597, 396, -1362, -745, 183, 1514, 1153, -2202, -1671, 1074, 1454, -437, -1853]
2600a853J312J422J1j004j952J584K848j608j829N9N80J303j82j576l71J046J799
2617A589j216j464n31J953J181j120k056P46J979P00k371j282J473J422M57j805
2633c45l03M38K210j682j124j362K505N09j16j623j033K158P86n47j678J08R28
2650a71J618n26k683n5K822R90j711j421L01J604R34j354k693R00K808M67k398
2667e68r16O08K476p45j251k021K409J592j239j294k97J854Q33j03k391q29L683
2684A801L50k726j59Q0J638J173j402k094Q58K166l83j983p21J055J578N99j672
2701A58k388K004J624n8k690N69K59K372j311j200m94K031J899k519q70j45M98
2718b61J383j698n96O2K590J6k050j054N67J835R98j411j651J092J512q59j292
$$ y = [-1853, -541, 881, 892, -112, -2064, -480, 2368, 760, -1069, -1010, -430, 873, 691, -885, -1256, -210, 1589, 373, -1091, -1622, 331, 1512, 392, -1664, -918, 1061, 1761, -610, -1892, -419, 1003, 1460, -345, -648, -210, 2000, 318, -806, -2168, 337, 846, 730, -893, -1926, 232, 1018, 471, -1207, -1099, -171, 1447, 921, -1762, -1817, 1005, 1995, 284, -1137, -836, 768, 1702, 348, -2345, -1445, 1363, 1830, -568, -1484, -876, 1600, 855, -396, -2417, -8, 1584, 345, -949, -1246, 608, 1441, 1338, -1053, -1882, 1801, 2151, -575, -734, -654, 984, 2157, 755, -1339, -481, 1685, 1302, -681, -1402, -347, 1231, 1830, 158, -2230, -226, 1398, 1340, -1350, -781, -522, 1850, 539, -661, -1155, 876, 2775, 256, -614, -759, -261, 1122, -576, -1172, -1110, 1480, 1496, -554, -1608, -1041, 794, 1792, 381, -1270, -178, 1334, 475, -817]
2735h17m73R65J421l87k027J55K101Q92j869j272M66J186J181j354j443K48J186
2752A59Q69j381q71R06R16J62k98k262J446Q80l67o55j42J207R03m18j679o44
2770a269J139J652j095j099p59J173J967j499j099PJ883L49j027k103Q10K064
2786A094k26r60k013J324K185m66r80j298J240J123J05j818k58K298j054K05l38
2803A63j454J214J192j33k052J31J353P31q54j156K1P57J672j510j253K35K126
2820A183j397p92L92K91J436l57j265l71J091O89r15k46r44R84J332M5k133n01
2838a478K434L36j248n46j32R03J035j067j316O70J722j358N6o7l79J210n50n81
2856c56j227J318P15J88j224p25J194J044j85j508k41K237Q7j907N08p09M03J663
$$ y = [-817, -1290, -325, 1096, 709, -1318, -1163, 938, 1830, -39, -1311, -845, 341, 1522, 168, -1275, -1027, 159, 1028, -353, -1224, -318, 598, 760, 462, -1800, -354, 526, 159, -496, -638, 569, 1472, 1054, -625, -1269, -130, 1522, 427, -672, -1431, -258, 1709, 210, -889, -882, 1001, 1350, 323, -1780, -970, 1094, 868, -92, -2105, -781, 1404, 938, -42, -1340, -100, 1023, 1128, -690, -948, 1350, 296, 501, 163, -1291, -77, 1115, 982, -1070, -939, 414, 1145, 291, -865, -844, -87, 1585, 75, -1178, -943, 1183, -214, -1006, -614, -323, 1113, 756, -509, -880, 211, 900, -15, -261, -1205, -221, 1111, 1156, -977, -1478, 956, 1292, 44, -502, -634, 269, 1304, 237, -1079, -409, 1313, -45, 11, -56, -435, 775, 225, -356, -1583, -265, 450, 638, -586, -1311, -117, 927, 742, -766, -1007, 1230, 1317, -590, -82, -791, -388, 1275]
2874A275k060r84J210J689l04n45j280J312J526j458p62j05L19J077m8j607k41
2891i86M83J333m22j060J14O84J056j499J70J58J71R18r26o77j76J840o41o24
2909h4j87n54J489Q20j028j353N65N03O39r59n50P41Q87n78j221J45J361r3q40
2928b97l69l22Q18J450p67j761N02J274j31l99j71r06J725j48q25r35J122R53
2946H13r22R06j832Q33J124k42j382L61P56P4j67p83q11R20J368j358j154O60
2964h36J269M6n26p80q20K014J140j615r63K287p32K16j063n04O13Q16j5j496
2982i49N82Q15M63n99o94n55J404P50n67j141j138J665O98m17o42m55P84R43j010
3001f3j43q12R97M82q63M8m26J042O6k14p29O85L11K38o57m14L08J796r58j232
$$ y = [1275, -785, -1769, -559, 1130, 826, 281, -999, 313, 1839, 381, -381, -486, -167, 910, 862, -745, -986, -503, 830, 408, -652, -538, 146, 1202, -297, -127, 31, 202, 1120, 194, -483, -659, 1181, 540, -84, -271, -825, 664, 1484, 456, -897, -332, 171, 810, -149, -699, 42, 929, 351, -870, -725, 636, 543, -297, -666, -988, -170, 1280, 513, -1248, -746, 528, 397, -2, -173, -1079, 646, 498, -327, -1262, -140, 813, -109, 797, -1035, -202, 922, 680, -702, -341, 415, 489, 322, -461, -1272, -352, 1016, -342, -1496, -836, 433, 479, -47, -827, -1647, 367, 1507, -108, -1071, 1216, 484, 700, -363, -867, -254, 562, 547, -949, -367, 448, 911, 312, -382, -937, 467, 1217, 650, -491, -1629, 36, 734, 317, -325, -780, 4, 947, -63, -206, -1018, -21, 461, -402, -354, -780, 262, 328, 114, -615, 70, 381, 619, -38, -452, -144, 1652, 694, -538]
3021e38R5K41J133n75o38j99R86O10j812N4L03L21L35j339o19R41J300m03m62
3040b66J8O76k74Qk5L37j052J625k36j266P00K40j071L57j90k29M56N90r3q28
3060e23J116n91P27m21p97j37J273q34k49k34Q98O34k62K11j091Q11N74j247l15
3079d57j40P09n10M44N39j047K01R03m56o93N20P96j117Q08j479NJ406o0R3n45
3099h0n17R07n83P7M76q51J172o53j006N11L95R93q22P74o62K06K6l34n47J053
3119E35L9k14o27q34N31L66O44o02k66N3L90O02o50k39j84R96n83J42j083M80
3139e04P49q2n40l97M06M36n49n81J239m14j67J120q60o41N18O21n82L57M98j067
3159d40P83Q4q14K96j80N45k73k02L18K20p8p33k10R15j98j16l31R15n62l5m3
$$ y = [-538, -443, -202, 931, 356, -282, -481, 505, 1115, -697, -643, -340, -19, 316, -1023, -1642, -701, 599, 196, -266, -248, 428, 154, 162, 137, 474, -578, 1047, 811, -455, 245, 485, -586, -229, -419, -648, -192, 398, 305, -523, 593, 2, 729, 308, -489, -626, 647, -187, -436, -670, 228, 862, 600, 811, -280, 531, 1105, -142, -457, -597, 112, -398, 46, 585, -462, -261, 642, 186, -507, 13, 809, -308, 500, -979, -974, 432, 372, 465, -80, -597, 310, -273, -196, 280, -571, 601, -52, -1058, -547, -152, 841, 19, 793, 131, 337, 363, 29, -518, 535, 574, 360, -267, -1101, -570, -204, 440, -162, -428, -375, 15, 617, -33, -272, -456, 540, -43, 99, -984, -504, 245, 163, -377, -774, -368, 68, -481, -1062, 177, -237, -404, 716, -144, -785, -267, 354, -228, 129, 627, -440, 343, 427, -387, -91, -271, 274, 1, -201, 117, 337, 259, -474, -684, 231, 33, -83, -414, 501, -61, -96, -139]
3180a39P3J78L20L07p64n74Q08l35j03K37k17L56R13j045p0n3j34j62O40k84N9
3201A1k03P63j076J24m37J292j051J102n01n92J7N94K36n80O75q75J62N27j52
3220C6l33M78o25L16M56j017O00J164p20l17l72N96o82O02L26j76j020J196j552
3239a044L39J271N93j751O28m57N44l9K59m84k27Q3O64J07q13O19q95O96j07l42
3259c56P21L42o1o10l76j23J139R2q11k87K96m7n46J070o36j14R28k29o86j61
3279d55L08N18r58J373j220J21O72K09l44k13R55j418J76M38J34K65r31k54N59
3298f5J62J5l93M30n84M75k10k85L30l10L00k74m5J85Q51r26P00q52k38O66n1
3319a19J331r83n42p5J94M97j038N36N82n47N26J16l57M1L5J2m9p89J521j735
$$ y = [-139, -66, 112, 432, 739, -25, -599, 209, -126, -229, 8, -209, 147, 1060, 15, -55, -108, -242, -404, 236, -48, 11, -192, 571, -505, -381, -818, 474, -577, 525, 24, -568, -551, 43, 279, -301, 374, -501, -339, 188, 36, -297, 181, -444, -128, 328, -689, -89, 1075, 355, 38, -334, 262, -420, 182, 508, 332, -688, 508, -1044, -705, 566, 1159, -592, 36, -421, 123, 84, 343, -141, -368, -285, 379, 486, -327, 292, -603, 93, -14, -356, 365, 707, 646, 36, -340, -463, 676, 768, -43, -330, -34, -81, -627, 443, -193, -307, 621, 392, -294, -455, -147, 371, -587, 786, -434, -313, 359, 568, 224, 11, 966, -452, -276, 162, 296, 561, -370, -624, -65, 97, 112, -281, 149, -435, 40, -170, -455, -125, -435, -135, -409, -454, -269, 582, -344, 356, -496, -734, -68, -119, 1212, 229, -313, -388, -194, 303, -735, -199, 383, -164, 362, 478, 121, 162, 197, 209, 160, -629, 892, -843]
3339h43k01J320m92j53K89o91O18N74o08N16n66K01o4j1M69k44n28J80J113q42
3359C7K06K97k55p9k83%K69K43r31k75O75k53l22R98k14k23J98L11n54J77l04
3380b82K1oN17l37O18L2p62m75R40n50K6R08p55J66k99M12l52k77L61J49l56O86
3402C85J0r8J37o88L29r7o55Q11N62q67k06N63k32M54n8k77k7k02K83o6j42J87
3424A06n34J55P48l5j454J249p9J05n93Q95j136P3M12k37J035m97M58o45J77n23
3444c20K27K23o29N15k16O70o0j36j8L32k86j06j70r8j04N19p76K68N59J97m65
3465A26K38J68r62M07k92k7j46L41O4m25qK68l21O32J21l71j89L13O03r03J42
3486b21M1m02O70J38m86l07P80J50n95r9O0J87J61l68N72p1o90K21Q66N2j87M0
$$ y = [-843, -1044, 276, -216, -369, -80, -771, -153, 421, -187, 329, -237, -36, -100, -111, 358, 114, -414, -234, 879, 37, 243, 540, 285, 206, -77, -77, 192, 435, -496, -771, -96, -349, -671, 327, 113, -110, 88, 399, -155, 22, -282, -261, -267, 250, -87, 531, 563, -199, -674, 266, -284, -258, 650, -105, 61, -238, 174, -178, -455, -94, 55, -301, 385, 395, 297, 434, -254, 75, -22, -677, 134, 696, -171, -377, 186, -46, 408, 350, 73, 46, -156, 127, 61, -81, 106, -428, -273, 475, 440, -1014, 235, 156, 261, -332, 563, -573, -500, -88, -325, 710, 213, 671, 26, 203, -320, -93, 130, -499, 16, -200, 470, 410, 274, 256, 588, 302, 196, 26, -72, -176, 343, -433, -165, 394, 591, 126, 364, 532, -430, -23, -315, -342, -488, -147, -83, -508, -516, -248, -569, 63, 184, -187, -376, -63, 540, -363, -221, -180, -582, 88, 226, -260, -567, 213, 363, -232, -331, -271, -84, 77, -291, 281, 210, -480, -259, 607, 659, 472, 512]
3508E12j57l44K3Q0j18l51J145k34j307N64j2L71j8J12m57K19K96l0r50R26m65
3529a95j90N64l24K67n6O05L3o80J43p4J98l36K22L21j252O81l37M82m64K89j63
3550b66L48q78P55J15k84J447j099k34j6m2J170o31r91J339j120Q92j118N8K13
3569c42P15q76N14N71n15K60J97R1n96M46o49J79L03n44P69J00j3m24j22J76J3
3590B53J3m46K51j35L99k0j50J94m90J32M4J241j941l0J655n22p08Q31J8q29P77
3611E37j106O1O08J81m90K65J8j060Q05l9J93J40j32j53k84K42J024j029M27P69
3631I77j24J49j244P45p17L54n49O65m66O19j869J192R83j060j0L9M84k62Q24
3650G30p28L53m3k33J4L0k72L48j419K088j518N88M65n27M16p8J01N00k13m47
$$ y = [512, 355, 11, 34, 114, -4, -355, 790, 556, -751, -187, -199, 172, 154, 266, -191, 28, 324, 294, -656, 270, -195, -385, 179, -145, 122, 66, 671, 704, 24, 167, 93, 291, -45, 177, 498, -754, -73, -410, 72, -392, -103, -266, 82, -796, -41, 74, -210, 1237, 138, -96, -112, -154, 1016, 385, -606, 733, -387, 505, -613, -555, -342, 373, -503, 11, 582, 67, 327, 524, 615, 19, 465, -184, -5, 298, -246, 523, 623, 610, 186, 64, 240, 253, 266, -180, 71, -64, 335, 315, 165, 359, -131, 1, 45, 1286, -655, -685, 970, 448, -260, 571, 589, -240, 537, -569, -508, 100, 281, -209, 56, 74, -986, -181, -220, -27, 113, -19, -172, -456, -214, 810, -219, 208, 977, 853, 1002, -242, 503, -214, 140, -409, 256, -210, 409, -1460, -268, 715, -345, -355, -316, 168, -94, 730, 2, 355, 312, 79, 93, 123, -149, 199, -1220, 868, -650, -62, 403, -124, 292, 214, 315, 815, 602, 155]
3670A55K50r1o28q67J288j20o8K00P52j242K48J40K47p68J46J04J25N68r42M16
3690h7P2P12q91J73M06j025J96Q39l41q2n61O49J20J32m26l80P49j9n36J96r15
3711a019K55N36j86P89o8K93r85M15p19R01j17m93K85M16l14l98O77m30j37K63
3731c6n73n16O01J536j866J124n93J73p35N28L54K85J7n29P75l12m79k12N84O5
3751A91j27l23Q85j56r64M11n42M58j87L12L11K42j497R86Q32l93j58n59k02N55
3771G5j83L75l9l71j25j67L51J43N20p77L93q24J062j41J37n96O1l1k20L18nj31
3793a75Q51p06M47p25N49J94m70L28o88k32J079m25p45P58k1O08n94j48R15j355
3813e55Q09n0l08L64o63L52K67N85o41q6m65k56L94K59L3k4j31n1o04m42J148
$$ y = [155, 405, 314, -314, -1181, 107, -13, -81, 119, 871, -371, -123, 17, 264, -504, -358, -254, -129, 439, -503, -87, -15, 697, -194, -21, 385, -640, -444, 395, 54, -28, -589, 60, 180, 312, -114, -494, 255, 236, -300, -104, -1019, -764, -228, -414, 375, 307, 600, -385, 30, -689, 212, 95, -398, -113, 303, -11, -409, 268, -162, -299, -36, -609, -1125, -524, 1012, -854, 270, -323, -150, -885, -357, -3, 282, 299, -230, 545, 233, -246, -458, 126, 191, 64, -259, 626, 470, -494, -83, -625, -167, -354, -42, 269, 511, -986, 0, 832, 439, 281, -278, -480, 75, -108, 267, 228, -143, -268, -435, -84, 59, 579, -198, 195, -629, 433, 292, 429, -167, -106, -137, -357, -39, -44, -175, 676, -30, 417, -308, 241, 435, -35, 293, -395, -627, 452, 27, -718, 40, 19, 627, 33, -115, 800, -555, 254, 204, -104, 260, -403, -51, 216, 801, 160, 74, -391, -647, -253, 6, 39, 15, -116, -167, -771, -1213, -65]
3834f5m22P12M90o0n09M8N74q14J02m47L36J01K48n87l61O99n7p76N57k8j63J78
3856b44r7L49M86J40o8q43L05j84o3O43q86P34k09L62j76O14j010k76M93J67j33
3877A04n65k65M35K94J89L43l53RK81p85O28o03P0P43j299J105K60r02M82M51
3897F22m69M61k82p00L02k31K10O08o07M43J16j129O10N75n66L0L03J49p31J62
3917a24k76J1K55K47k1L21J53n06o06L40K42oN9K41p89J172l04n34j53P09r65
3938e34L03L31j42N2K80M19n12p34J92N53J88k73n43l23J033p43L61M33r0n04
3958b53Q46l58r24O6m5L10L02n1L21l46L69K62j5r19L39N98n84QJ19L60l15l64
3980b74J54N06q92P20n48O08j05R4P7q12J386p15o35K78L56m19K70n2l34J51P27
$$ y = [-65, -487, 225, 715, 655, 146, 194, 768, -46, 56, -391, -55, 46, 294, -293, -654, 45, -12, -788, -231, -259, -422, -244, -341, 8, 494, 634, 566, -277, 28, -156, -219, 424, -462, 272, 63, 425, 249, 863, -147, -423, 70, 237, 104, -461, -726, -291, 3, 192, 535, 182, 191, 472, -313, 315, -288, -218, 525, -774, 331, 591, -311, 171, 622, 153, 614, 332, -368, -66, -297, -87, 521, -86, 357, 473, -656, -46, 529, -37, -7, 296, 445, -286, -124, -400, -389, -134, 113, 92, 413, 566, 60, -546, -206, 36, 30, 89, 330, -459, 713, 409, -125, -278, 431, -534, -231, 100, -42, 10, 290, 709, 197, -537, -345, 208, 396, 123, -420, -743, 290, -453, -92, 341, 251, -253, 593, 235, -689, -623, -668, -358, -56, -107, 214, -132, 237, 499, 484, -435, -96, 502, -82, -74, 45, 405, 90, -274, -120, 386, -506, 214, -334, 274, 169, 263, 340, -472, 914, 199, -436, -158, 198, -221, 49, -3, -337, -186, 541]
4001E41p69K31K1M79k41k26Q24j843J824p94j90r0N64l78l21K0O71n07k85J97
4021b72J63L15Po23L04R83q06m91M6R51j255Q09j22M13l18j001P12l36J187n23
4041A43k11o7R98r17m6J035j065L72l37L06Rm16k84l92R17m23K86l37M05L36m74
4062a62N37j458J283M48r75P77Pq31M60j62p0K79K0J56n04K21l30j95L88l85L57
4083a39Q5J11o25O45l26M09k26k74J39p41Q60J91m51q8N1J000j005J086j049o15
4103i62P65n54Q03k21M31m16m8j22M75k25M70K19o95p44K78k10O78L65j40l25
4123a78J90q33J265J62k98n77P22m36K32p68L13O0l67J241o96K81m49l5L65j09
4143H5N86o04k97O5J74N05q95J055n03j36Q35l85o10Q6L9N22p49L05k1M47l31
$$ y = [541, -228, 3, 24, 503, 262, 36, 860, -983, 841, 47, -143, -233, 331, -47, -368, -348, 323, -184, -469, -272, -109, 206, 213, -410, -106, 877, 71, -420, -374, 577, -678, 131, 9, 422, 104, -897, -185, -521, 666, 143, -68, -135, 863, -54, -100, 935, -130, 242, -95, 211, 220, -196, -480, -872, 45, -378, -92, -429, -24, 312, -162, 375, -1083, 200, 648, -327, 450, 457, -374, 86, -76, -146, 133, 153, 309, -195, 26, -304, -499, -111, -496, -139, -54, 57, -568, 77, -249, 160, -66, -340, -201, -942, -82, 109, -342, -430, -379, 621, -384, 702, -347, -962, -197, -751, 52, -169, 262, -154, -202, -324, 151, -74, 396, 615, -80, -824, -546, -756, -78, 287, 147, -178, 12, -821, 444, 606, 308, -269, 453, 17, 249, -519, -206, -146, -513, 728, 32, 313, -136, -171, 194, 85, 671, 67, -230, -165, 9, 514, -381, 674, 171, 35, 870, 485, -125, -39, 0, 522, -227, 78, 57, 504, 173]
4164A73m60P83l09q47N28o1l00J326j281O97m33K60kj18L66l21m44L43j35Q01
4184E66j77J02r71N41o1q48R31o70O52M09p53L63O1O77r4p28N05l69k8N5q0l50
4206b67J126j47p69M10n19J85M2o73L55L56N98K24p85M09k7o82L57k77PP10o08
4227B5k17K04K58K28m8n29j02K08o4m36O8N2O66o84k02N01r76J383J94k60o38
4248c69Pj74N15M91j04q68J143m33k58j91m41J040n14N30J40r01O45n39J43L94
4268B56j90K31M42p5j416R07o72R95p8O6o39p81Q83P58p55j14J74o6k81J63K50
4289E8m26N55p37j3Q01M5j42K33p05K17M00m47J87l70K69l76K6R75l83k15k4K90
4311B18n37O81p56N42j558J596m46K3M84K95L89q21m8k29l94p41J632J68j13k53
$$ y = [173, -287, 496, 187, -660, -132, -193, -493, 833, -448, 249, -184, 76, 74, -44, 322, 1, -443, -100, -235, 566, 389, 491, -480, 61, 0, -848, 83, -587, 65, 474, -279, 84, 145, 822, 728, 0, 505, 136, 108, 163, 83, -267, 859, 712, -57, 353, -166, 19, 61, -612, -257, 99, 697, 921, 136, 545, 518, -164, 193, -84, -77, 633, 25, -192, 12, 270, 498, 450, -79, -181, 27, -37, -473, -405, -353, 313, -371, -573, -72, -1048, 335, 529, 269, -369, -362, -536, -21, 470, 366, -502, 641, 208, -50, -241, -682, 358, -156, 374, 514, -387, 258, -281, -138, 256, 66, 297, 739, 664, -752, 155, -517, 478, 400, 466, -173, -954, -71, 687, -68, -182, -8, -74, -355, -192, 58, -368, 187, -550, -563, 238, 283, 141, 374, -331, -114, 286, -161, 26, -344, -75, -451, -425, 550, 167, -48, -72, 218, -319, 362, -394, 148, -1410, 186, -260, -237, 247, 542, 931, 110, 62, -167, -561, -1302, 330, 498, 385, 132]
4331A32k54N04L5l01p2M45o26L98m28M43K65j016J80K11O72p05j05J160q2j374
4351e18J570o94m78j2M08j375J825o19L0J181j959O78m41R47o46k70J172q00k52
4370b53m6N68q68P46k88K08M2J06J56j113J167L25r72m40J265q59m70J113l40
4389D7n16Q59j016J146o49j20L20J67m19J86J78l83K19J76l8k04J64J96n43k9
4409b59K42L34r5l90l23N21r05Q19N32j77r7p41j90j0J104J90l5m14n11J06j60
4430d59O41p31R71P5K26J08n17p1j20r1O23j221Q08l74j64Q84r79M88k15P22j093
4451d89O37p26N48J97j039J369j229N74K55N32j6q23Nl77M34K84K70r35L61R2
4471g6L4J53l18J97o68O57M07k91k68M76m85M58O4n67Q26p58N51k19k52R7m96
$$ y = [132, -122, 382, 417, 116, 44, 489, -137, 261, -167, 276, 541, -475, -295, -84, 588, -117, -222, 938, 856, -518, 1052, 358, -120, -132, 276, -1099, 726, 107, 137, 1318, -641, 37, -404, 543, -103, -373, 799, -1, -253, -299, 269, -599, 147, -141, 67, 109, 215, 371, -742, 425, 750, -222, -662, 603, -256, -726, 387, 47, -469, 390, -626, 520, -129, -249, 71, 238, -181, 5, 183, -200, 19, 195, 157, -47, 117, 313, -230, -259, -17, 317, 222, -168, -491, 30, -875, -56, 476, 299, 202, -539, -729, -739, 365, 555, 520, 106, -405, -299, -459, 182, -549, 422, 497, 723, 831, 314, 243, 123, 32, 655, -566, 242, -132, -296, 588, -391, 97, -118, 604, -489, 148, -578, -30, 167, -872, 497, -732, -158, 97, 629, 613, -210, -205, -582, -148, 136, 406, -529, -168, -76, -42, 111, -207, -10, -678, -21, 386, 95, -173, 303, -182, 276, 340, -227, 599, -159, 392, 173, -79, 18, -478]
4492d78M83j61j11M89l42J66n3k04N26r88Q20r38R42J13o69L03n3N29N99q29p87
4513f43K64J5k75N38J33M11q78j03J80k36L64M53K19l28m54l4L69o80J224L21
4533H60j233j88M38K82o99R32p30L26M63p67M78M00J70p98L00m84n84P21J87n96
4553e22J102p9k49o51L71Q36r27m9k0R88n03p37O23M01r89Q61m88j69j44K89P53
4574F97j101K12K35k98j01n1M92n72M64O6P32j307K17P05n21J47k4j42l21P06
4594B35j65k92K01j00P8L69L38j046J20M89m30j67L01J60J62q2l92J92K97p68
4614e00R36l43r3n4l00O37M8r7J80o90N25k56J45j95p4O52r38N12l74L20L70l59
4636E2r3K32R7K84n63N8l56L25J73m55J54j87P31p20n18J583J93j102o70K00M32
$$ y = [-478, 5, -156, -267, 222, -120, 46, -7, -211, 315, -673, 147, -791, 151, 264, -405, -102, -155, 374, 973, 144, -643, -379, -364, -639, -101, 32, 443, -435, -538, -358, -594, -230, 223, 442, 114, -340, -374, -5, -685, 539, 860, -373, -561, -123, 159, -540, 392, -338, -12, 451, -316, 162, 562, 732, -66, 234, -250, -834, -113, 74, -522, 580, 501, 252, -399, -28, 808, -119, -168, -188, 800, 297, -440, 183, 584, -405, 456, -32, -201, -345, -56, 697, -404, -192, 43, -255, -356, -407, 85, -487, -23, 43, 775, -532, -315, 390, -131, 16, -8, -150, -471, 235, 70, -222, -21, -121, -43, 326, 664, -382, -262, 227, -203, -370, -69, 91, 253, 171, -221, -29, 268, -500, 436, 93, 0, -54, -354, 283, 331, 234, 414, -276, 249, -7, 138, -57, -131, 521, -417, 95, -279, 41, 411, 52, -41, 191, 288, 572, 9, 67, -289, 36, 209, -246, -92, -279, 452, -268, -786, 797, 990, -112, -782, -582, -150]
4657a50j86K65K77m26L0O12q21N52l5k78K41j27o41k9J275n97j65K17M87r35J204
4678G70R2o71m26k05r7P78q74K66Q43k76j49p2k53N83p90J05Q46l4l92oM6K26
4700C10l92n37O1L25n61J482k05j237J403j006Q33n64J94m06o92J355p96N18L48
4719D33p11K49l69R55k60j57l34ML2J249j152r28J186M04j34P4O5p43j94J99K02
4740G0L6m01Mn79Q66qk93Q80p4l37J84k81O7o47M82l38O2N05m24J28O54k14K37
4763E79q22J205p95M00j90J75m14o09J71J70P85j50l44n37J024j198O69p26Q70
4782B63j64L53n31J81j4M04n54n4R42n56Rr3Q8j97M29k00M08k95J61l58K07Qj034
4805e97j06J243m14k14r8L78l40J23m02M45j17J62n97K66l15n63R93n86L79K37
$$ y = [-150, -336, -71, 206, -220, -190, 422, -399, 153, 118, -160, 81, -46, -687, -716, 559, -38, -203, 14, 501, -434, 770, 862, 191, -235, -440, -537, 241, -633, -367, 476, 200, 51, -21, -274, 309, -481, -376, 470, 436, 44, 38, 84, 310, -82, -619, -558, -233, -794, 688, 483, -754, 649, -357, 476, -88, 106, -300, -992, 363, -433, 85, 433, -278, -29, -398, 557, 297, 140, -194, -190, -158, 1091, -61, -989, 197, 601, 467, 541, 606, -137, -331, -132, 70, 106, -295, -291, -870, -4, -12, -305, 575, 501, 164, 348, 67, 134, -513, -31, -369, -307, 198, -226, -98, 556, 342, 579, -243, 962, 167, 567, 377, 552, 138, -471, -300, -130, 655, 505, 161, -376, 648, -550, 119, -607, 263, 99, 452, -79, 102, 88, 492, -62, -116, 826, 270, 279, 186, 274, 77, 506, 306, 714, 419, 580, 222, 429, 437, -597, -703, 540, 126, -88, -186, 192, -148, -25, -427, 18, -99, 63, -534, -268, -583, -1146, -153, -739, -360, -123]
4825a23j03R47p67j30j13j98J026p67R14l57j35K43m73n1j93Q53p19k93L44M77
4845C82l41km6M5j58M15o67L36P61q43K81j66M4j70p4L75j26r20J465p90n08O73
4867c4j7r9R4O03q63k37l79J343n94M21L76n17n48mQ13o94O80l24r8l50p42P72
4889c98K34L01m44n7O60p32N70o81J029o76p9J17N86Ol46K2m0m07M38K1k32K98
4911A90M3J20J44m88O4J3l01L72m99m00Q89o69J007q70N73m9p5M7p2O00p39k40
4933c40M36m78J71j3K30O06o52o51N75L12j189L60P94J41J13%p82N40O70l28M98
4954A013o11n41J82R6r3K56k58p9m61O0p7Q50o51P20r57N81j27k11Q44j000O18
4975A54j10J48n76j18R19m22J49m00P42m65J92k40m01j25R10k21k57M21n19L64
$$ y = [-123, -226, 721, -46, -176, -289, -487, 539, -228, 686, 329, 194, 437, -36, -87, -280, 573, -146, -439, -95, 382, 41, 39, -7, 38, -120, 295, -372, -36, 725, -118, 163, -3, 41, -129, -203, 172, 46, -874, 591, -199, -707, -34, -51, -150, -56, 547, -316, -553, -932, 411, -183, 238, 614, 97, -451, -455, 358, -336, 344, 20, -78, -428, -1170, -398, -164, 137, -307, -364, 296, -436, 134, -547, 482, -194, -273, -156, 430, 436, 90, 112, 72, -335, 103, 124, -108, 190, 233, 353, 497, 9, 73, 86, -215, 157, -342, -742, 147, -522, 485, -385, 188, 139, 64, 111, 39, 639, -100, -340, 96, -382, -211, -224, 6, 612, -40, -691, -116, 196, -993, -633, 161, 302, 415, 415, -367, 173, 843, 515, 1013, 402, -139, 43, 139, 46, 302, 44, -35, -496, -436, -513, 337, -314, 406, -551, 30, -97, -308, 536, -464, 154, 44, 192, -384, -502, 417, -5, 144, -256, 486, 21, 213, -27, -428, -553, 357, 136, -121, 300, -219, 145]
4995A45K06L6j194P74N71j004L40p14L57L32l90J48P01o66O07m21o32M38O35j32
5015A37j24N49k74J59k27L1L7q53j61R67n29k23L91M57l56J73O41j085J158r25
5035e7m21R69j425P08p0J6K2P32p54P52q82K62J03q76R97m01J222j358J103m59
$$ y = [145, 351, 387, -807, -33, 538, -466, -126, -840, -483, -151, -541, -393, 308, -358, 249, -172, -804, -366, 269, 137, 13, 562, 288, 447, 220, 251, 288, -565, -726, 241, -288, -511, -120, 337, -19, 154, 795, -290, 868, -57, -478, 491, -934, -226, -296, -280, -258, 474, -280, 472, -410, -148, -45, -921, 76, -325, 897, -461, 642, 183]
$$ [...]
8191H9
##END NTUPLES=NMR FID
##END=
