##TITLE=1H_EC-3059(XIII)
 CDCl3, 8 sc, 
 3.06.2021
##JCAMPDX= 6.0         $$ Bruker NMR JCAMP-DX V2.0
##DATA TYPE= NMR SPECTRUM
##DATA CLASS= NTUPLES
##ORIGIN= UXNMR, Bruker Analytische Messtechnik GmbH
##OWNER= root
$$ XWIN-NMR		Version 3.5
$$ Thu Jun  3 11:58:08 2021 Russian Standard Time (UT+4h)  she@DPX200
##.OBSERVE FREQUENCY= 200.131506
##.OBSERVE NUCLEUS= ^1H
##.ACQUISITION MODE= SIMULTANEOUS
##.ACQUISITION SCHEME= undefined
##.AVERAGES= 8
##.DIGITISER RES= 18
##SPECTROMETER/DATA SYSTEM= spect
##.PULSE SEQUENCE= zg30
##.SOLVENT NAME= CD3CN
##.SHIFT REFERENCE= (INTERNAL, CD3CN, 0, 17.4238)
##AUDIT TRAIL= $$ (NUMBER, WHEN, WHO, WHERE, WHAT)
$$ ##TITLE= Audit trail, XWIN-NMR		Version 3.5
$$ ##JCAMPDX= 5.01
$$ ##ORIGIN= Bruker BioSpin GmbH
$$ ##OWNER= she
$$ F:/spectra/data/she/nmr/H-F/1/pdata/1/auditp.txt
$$ ##AUDIT TRAIL=  $$ (NUMBER, WHEN, WHO, WHERE, WHAT)
(   1,<2021-06-03 11:56:45.71 +0400>,<she>,<DPX200>,
      <created by zg, POWCHK disabled, PULCHK disabled
       configuration hash MD5:
       00 E9 B6 7A A2 85 ED C7 34 08 36 98 17 FE 4E 26
       data hash MD5: 16K
       7A A9 6A DE F3 83 AA 5A 5C 56 34 5C EF F7 58 4F>)
(   2,<2021-06-03 11:56:48.96 +0400>,<she>,<DPX200>,
      <Start of raw data processing
       efp BC_mod = 2 LB = 0.24 FT_mod = 6 PKNL = 1 PHC0 = -11481.64 PHC1 = 14.20099 SI = 16K 
       data hash MD5: 16K
       DF 20 44 DB 70 EE F8 B9 83 82 06 E6 2F DF C4 29>)
(   3,<2021-06-03 11:57:11.15 +0400>,<she>,<DPX200>,
      <pk PHC0 = 3.020801 PHC1 = -2.6 
       data hash MD5: 16K
       D5 D5 B8 11 37 53 8F 28 30 1A 76 54 C9 CB 14 9E>)
(   4,<2021-06-03 11:57:14.34 +0400>,<she>,<DPX200>,
      <abs ABSG = 5 
       data hash MD5: 16K
       06 9D 6F EC 35 F4 F2 A7 E4 D3 E3 59 1B CD 90 D6>)
$$ ##END=
$$ 
$$ hash MD5
$$ F7 62 1F C3 15 24 20 AD 82 54 AF 10 D4 CA 4F AE
##$RELAX= 
##$RELAX= 
##$RELAX= 
##$RELAX= 
##$RELAX= 
##$RELAX= 
$$ Bruker specific parameters
$$ --------------------------
##$DU= <F:/spectra>
##$EXPNO= 1
##$NAME= <H-F>
##$PROCNO= 1
##$TYPE= <nmr>
##$USER= <she>
##$AMP= (0..31)
100 100 100 100 100 100 100 100 100 100 100 100 100 100 100 100 100 100 
100 100 100 100 100 100 100 100 100 100 100 100 100 100 
##$AQSEQ= 0
##$AQ_mod= 1
##$AUNM= <au_zg>
##$AUTOPOS= <>
##$BF1= 200.13
##$BF2= 200.13
##$BF3= 200.13
##$BF4= 200.13
##$BF5= 200.13
##$BF6= 200.13
##$BF7= 200.13
##$BF8= 200.13
##$BYTORDA= 1
##$CFDGTYP= 0
##$CFRGTYP= 5
##$CHEMSTR= <none>
##$CNST= (0..31)
1 1 145 1 1 1 1 1 1 1 1 1 1 1 1 1 1 1 1 1 1 1 1 1 1 1 1 1 1 1 1 1 
##$CPDPRG= <>
##$CPDPRG1= <>
##$CPDPRG2= <>
##$CPDPRG3= <>
##$CPDPRG4= <mlev>
##$CPDPRG5= <mlev>
##$CPDPRG6= <mlev>
##$CPDPRG7= <mlev>
##$CPDPRG8= <mlev>
##$CPDPRGB= <>
##$CPDPRGT= <>
##$D= (0..31)
0 1.2 0 0 0 0 0 0 0 0.06 0 0.03 0 0 0 0 0.0002 0 0 0 0 0 0 0 0 0 0 0 0 
0 0 0 
##$DATE= 1622707005
##$DBL= (0..7)
120 120 120 120 120 120 120 120 
##$DBP= (0..7)
150 150 150 150 150 150 150 150 
##$DBP07= 0
##$DBPNAM0= <>
##$DBPNAM1= <>
##$DBPNAM2= <>
##$DBPNAM3= <>
##$DBPNAM4= <>
$$ [...]
##$SUBNAM3= <"">
##$SUBNAM4= <"">
##$SUBNAM5= <"">
##$SUBNAM6= <"">
##$SUBNAM7= <"">
##$SUBNAM8= <"">
##$SUBNAM9= <"">
##$SW= 20.0188882624521
##$SWIBOX= (0..15)
0 0 2 0 0 0 0 0 0 0 0 0 0 0 0 0 
##$SW_h= 4006.41025641026
##$TD= 16384
##$TD0= 1
##$TE= 0
##$TE2= 300
##$TE3= 300
##$TEG= 300
##$TL= (0..7)
0 120 120 120 120 120 120 120 
##$TP= (0..7)
150 150 150 150 150 150 150 150 
##$TP07= 0
##$TPNAME0= <>
##$TPNAME1= <>
##$TPNAME2= <>
##$TPNAME3= <>
##$TPNAME4= <>
##$TPNAME5= <>
##$TPNAME6= <>
##$TPNAME7= <>
##$TPOAL= (0..7)
0.5 0.5 0.5 0.5 0.5 0.5 0.5 0.5 
##$TPOFFS= (0..7)
0 0 0 0 0 0 0 0 
##$TUNHIN= 0
##$TUNHOUT= 0
##$TUNXOUT= 0
##$USERA1= <user>
##$USERA2= <user>
##$USERA3= <user>
##$USERA4= <user>
##$USERA5= <user>
##$V9= 5
##$VALIST= <valist>
##$VCLIST= <CCCCCCCCCCCCCCC>
##$VD= 0
##$VDLIST= <DDDDDDDDDDDDDDD>
##$VPLIST= <PPPPPPPPPPPPPPP>
##$VTLIST= <TTTTTTTTTTTTTTT>
##$WBST= 1024
##$WBSW= 4
##$XGAIN= (0..3)
0 0 0 0 
##$XL= 0
##$YL= 0
##$YMAX_a= 749346
##$YMIN_a= -493076
##$ZGOPTNS= <>
##$ZL1= 120
##$ZL2= 120
##$ZL3= 120
##$ZL4= 120
##$ABSF1= 17.54354
##$ABSF2= -2.4755
##$ABSG= 5
##$ABSL= 3
##$ALPHA= 0
##$AQORDER= 0
##$ASSFAC= 0
##$ASSFACI= 0
##$ASSFACX= 0
##$ASSWID= 0
##$AUNMP= <proc_1d>
##$AZFE= 0.1
##$AZFW= 0.1
##$BCFW= 0
##$BC_mod= 2
##$BYTORDP= 0
##$COROFFS= 0
##$CY= -3
##$DATMOD= 1
##$DC= 0
##$DFILT= <>
##$DTYPP= 0
##$F1P= 0
##$F2P= 0
##$FCOR= 1
##$FTSIZE= 16384
##$FT_mod= 6
##$GAMMA= 0
##$GB= 0
##$INTBC= 1
##$INTSCL= 1.334414e-10
##$ISEN= 128
##$LB= 0.24
##$LEV0= 0
##$LPBIN= 0
##$MAXI= 10000
##$MC2= 0
##$MEAN= 0
##$ME_mod= 0
##$MI= 1.114404
##$NCOEF= 0
##$NC_proc= -6
##$NLEV= 6
##$NOISF1= 3.799351
##$NOISF2= 2.8
##$NSP= 0
##$NTH_PI= 0
##$NZP= 0
##$OFFSET= 17.4238
##$PC= 1
##$PHC0= -11478.62
##$PHC1= 11.60099
##$PH_mod= 1
##$PKNL= yes
##$PPARMOD= 0
##$PSCAL= 0
##$PSIGN= 0
##$REVERSE= no
##$SF= 200.130022181191
##$SI= 16384
##$SIGF1= 3
##$SIGF2= 2
##$SINO= 5.538805
##$SIOLD= 16384
##$SREGLST= <1H.CDCl3>
##$SSB= 0
##$STSI= 16384
##$STSR= 0
##$SW_p= 4006.41025641026
##$SYMM= 0
##$S_DEV= 0
##$TDeff= 16384
##$TDoff= 0
##$TI= <>
##$TILT= no
##$TM1= 0
##$TM2= 0
##$TOPLEV= 0
##$USERP1= <user>
##$USERP2= <user>
##$USERP3= <user>
##$USERP4= <user>
##$USERP5= <user>
##$WDW= 1
##$XDIM= 16384
##$YMAX_p= 389993211
##$YMIN_p= -3050689
$$ End of Bruker specific parameters
$$ ---------------------------------
##NTUPLES= NMR SPECTRUM
##VAR_NAME=  FREQUENCY,     SPECTRUM/REAL,   SPECTRUM/IMAG
##SYMBOL=    X,             R,               I
##VAR_TYPE=  INDEPENDENT,   DEPENDENT,       DEPENDENT
##VAR_FORM=  AFFN,          ASDF,            ASDF
##VAR_DIM=   16384,         16384,           16384
##UNITS=     HZ,            ARBITRARY UNITS, ARBITRARY UNITS
##FACTOR=    0.24454680195387, 1,            1
##FIRST=     3487.02538337165, 0,            0
##LAST=      -519.384873038613, 0,           0
##MIN=       -519.384873038613, -3050689,    0
##MAX=       3487.02538337165, 389993211,    0
$$ Real data points
##PAGE= N=1
##DATA TABLE= (X++(R..R)), XYDATA
$$ [...]
7253B64060n3741q8339r6862m2408R3697O3716j16704J31151j74822j09723l4387
7242a64362R2657J66471Q7886j31973j22009l380M0649P831k4754l5359J29441
7231D3098J97949l2084J23252j92858j63773J33701r4719m0090J57222P878J5460
7220A55036m4232L4578k53335p9508q7964K42565L33080R7211k37032j22915j58610
7209a21126R5883L9184j13943L0111r9366L6073J70108k854j0494j22063r5099
7198a93586J78081r9849N9403J84956n2228j13865m7751M4007j97957m9368K61489
7187b6668J88199J21225j48542j15619j55444K00753J9166k00406q5199Q0029
7177a22506M5716l4814K05512l9765k7527k10904O6510j39503J39670k9673K0691
$$ plain form
7253 264060 210319 121980 25118 -17290 76407 140123 23419 154570 -20252 -129975 -164362
7242 -164362 -71705 94766 182652 50679 -71330 -74710 -34061 -26230 -50984 -86343 43098
7231 43098 241047 208963 332215 139357 -24416 109285 14566 -25524 131698 139576 155036
7220 155036 110804 145382 -107953 -187461 -275425 -32860 300220 397431 160399 37484 -121126
7209 -121126 -25243 13941 -100002 -69891 -169257 -133184 36924 34070 23576 -98487 -193586
7198 -193586 -15505 -115354 -55951 129005 76777 -37088 -84839 -40832 -238789 -288157 -26668
7187 -26668 161531 282756 134214 18595 -136849 63904 83070 -117336 -202535 -122506
7177 -122506 -76790 -111604 93908 54143 26616 -184288 -117778 -257281 -117611 -147284 -126593
7166a26593J43306j43594M7911L7438o2153o3361J15377j6684r148J51998L5543
7155A10040n3013n7334j7273J6999k67585J98970j683K2341k9117K893j67002
7144b41764p2729o9866L81565L871k9267j19877M6331j228J0318l9031k26142
7133c57819j801K0774J27198M8676J31085J81761r3453k70193O6029R8355P6472
7122B7084j31815K5613J7953L5277J35079K7725p3369N351j59542J14248j48100
7111a24496J09108j48269J31484J72605j21500l4051o8758J42472n2117N5636
7101F2114N651n3575j51662j98344P5925K71312j3495J5284j16623k1227j9023
7090a43663R8159P2790k38380L8256J13025O6438K4293j97600L8941k4962K77149
$$ plain form
7166 -126593 16713 -126881 -78970 -41532 -103685 -167046 -51669 -68353 -77501 74497 110040
7155 110040 57027 -307 -17580 -581 -268166 -69196 -70879 -48538 -77655 -74762 -241764
7144 -241764 -314493 -384359 -2794 1077 -28190 -148067 -101736 -102964 -92646 -131677 -357819
7133 -357819 -359620 -338846 -211648 -162972 -31887 149874 56421 -213772 -147743 -49388 27084
7122 27084 -104731 -79118 -61165 -25888 109191 136916 63547 68898 -90644 23604 -124496
7111 -124496 -15388 -163657 -32173 140432 18932 -15119 -83877 58595 6478 62114
7101 62114 67765 14190 -137472 -335816 -259891 11421 -2074 13210 -103413 -124640 -143663
7090 -143663 -45504 27286 -211094 -172838 -59813 6625 30918 -166682 -127741 -152703 124446
7079A24446L1595j84090K607r0198J71460l5104m5492r8523j38901K4088L8728
7068a99384K557M7862L8546K4647Q1775P4917O189q6425j10873o9312J14396k8212
7056a03317r3267l07594J26306J54665J29600K0531K8835p1664j13490P3501P0345
7045h5549l4007N7774l4086k6848J92986k48036n9949R7180j01707K05118k15604
7034b52728J26003Q1831k95983P2322n3060K89986r1600J29228O9943k36841K07607
7023D6708q8179j22913j1410N4398J14299J38R4722k88723m2161q8738J29033
7012b02826J48528k27472J18446l3486j9537K39218o2953j0923k82567L7409j2397
7001c08560O2907Q1756O3705K8607n2121J6404J44686p074K0803l57083J89499
$$ plain form
7079 124446 156041 -28049 -25442 -115640 55820 20716 -24776 -123299 -262200 -238112 -199384
7068 -199384 -196827 -148965 -110419 -85772 -3997 70920 77109 -9316 -120189 -189501 -75105 -103317
7056 -103317 -196584 -504178 -377872 -223207 -93607 -73076 -44241 -115905 -229395 -155894 -85549
7045 -85549 -119556 -61782 -95868 -122716 70270 -177766 -237715 -140535 -242242 -37124 -252728
7034 -252728 -126725 -44894 -340877 -268555 -321615 -31629 -123229 5999 75942 -160899 46708
7023 46708 -41471 -164384 -175794 -121396 -7097 -6959 87763 -200960 -243121 -331859 -202826
7012 -202826 -54298 -281770 -163324 -196810 -216347 22871 -40082 -51005 -333572 -296163 -308560
7001 -308560 -245653 -163897 -100192 -71585 -123706 -107302 37384 30310 51113 -305970 -116471
6990a16471L2042P3900J15394k00618l796p071j41910K45469N477K6616k01205
6979a72173J14134J04908Q081N8070l78676m2990m7468K90839n1556J10227m6946
6968e3550J8530r01J2345j55050q6929j92719L72011K19810n4355o6809k14134
6957b01751p5151j32500O9659P1657R2589O1226j23791J65626j11653j62885L3245
6946c13729P0431R4319K3181M7732j8033j3015K5212j28229r5064J28560J54654
6935b3981j64922L7115K55564K302j62723l26916j11200K02765Q9091M5079J3274
6924a44552J31051J20874j31440k12149n8245P0620j15251o0328L73667j10941
6914a36694o7850M7075l6648J00053o8491M1808p1077K0772J89747j32143K379
$$ plain form
6990 -116471 -84429 -10529 104865 -95753 -99549 -106620 -248530 -3061 2416 29032 -172173
6979 -172173 -58039 46869 54950 113020 -265656 -308646 -356114 -65275 -116831 -6604 -53550
6968 -53550 -35020 -35921 -23576 -178626 -265555 -458274 -86263 133547 79192 12383 -201751
6957 -201751 -276902 -409402 -339743 -268086 -175497 -114271 -238062 -72436 -184089 -346974 -313729
6946 -313729 -243298 -148979 -125798 -78066 -96099 -109114 -83902 -212131 -307195 -178635 -23981
6935 -23981 -188903 -151788 103776 106078 -56645 -383561 -494761 -291996 -202905 -157826 -144552
6924 -144552 -13501 107373 -24067 -236216 -294461 -223841 -339092 -399420 -25753 -136694
6914 -136694 -204544 -157469 -194117 -94064 -162555 -120747 -191824 -171052 18695 -113448 -111069
6903a11069R4908j11082j66287Q8468K36635l41970J1416L0055J76889J54416
6893F2379k45703J5035L983p06J54706M070M2606k08886O1363P4990L3716K7506
6881B5059n0511n3895j90375J31425n8868J49078J9404j46036m3904J34421J25174
6870D0972m6547o4714K3081p9372J5564N643L4742j86347m9072J00641q3234P8248
6858b10395j5721J97319l8021p2939J59510k50630J56620O5201J27145j74632
6848e6543j8301J5672j94967k2773l5386J22865k8568J49503L7217R714J71460
6837A49893n5694k97154j54469k4847J84488J235J24016Q8482j71557N8352j85892
6826b83147J08226m6715Q5804l8536j54919K74579J9524O636r7500p9323j10197
$$ plain form
6903 -111069 -16161 -127243 -293530 -205062 31573 -310397 -298981 -268926 -92037 62379
6893 62379 -183324 -168289 -164306 -165012 -10306 -6236 36370 -172516 -111153 -36163 -2447 25059
6881 25059 -25452 -79347 -269722 -138297 -197165 -48087 -28683 -174719 -218623 -84202 40972
6870 40972 -5575 -70289 -47208 -126580 -111016 -105373 -70631 -256978 -306050 -205409 -288643 -210395
6858 -210395 -226116 -28797 -66818 -139757 19753 -230877 -74257 -9056 118089 -56543
6848 -56543 -74844 -59172 -254139 -276912 -312298 -189433 -218001 -68498 -31281 -21567 149893
6837 149893 94199 -202955 -357424 -382271 -197783 -196548 -72532 15950 -155607 -97255 -283147
6826 -283147 -174921 -221636 -135832 -174368 -329287 -54708 -35184 -28548 -126048 -205371 -315568
6815c15568l2653J32014N0039p7053J80306K5857L8976M4890n6781j11980l3182
6804a55135Q7185o5145L8882J9756m0494J9530L7764k0884k13768K97593n7403
6793e2119J7859J38241k25108K0654j56202n6802j45669J30714K08434l0966K0945
6782a30019p638L08568o1967k3995j62158p7121l372J46299L5796n3184q9844
6771a18635j41745r2394J32757J46686n3292J24005o9404j3795P9627r4180j81841
6760b82211p504J386O7865J46984P0214m4408N9210o3201p2361L6869j45800P6918
6748a56039k0274J87973O8810J12707r8149r9540r8772j10558k5881K42374k5431
6737b2780J7945p2667L2576j56936l8221N1727l6950J41225r5235K17606j35347
$$ plain form
6815 -315568 -348221 -216207 -166168 -243221 -62915 -37058 1918 46808 -9973 -121953 -155135
6804 -155135 -67950 -133095 -94213 -74457 -114951 -95421 -57657 -78541 -292309 5284 -52119
6793 -52119 -34260 103981 -121127 -100473 -256675 -313477 -459146 -328432 -119998 -150964 -130019
6782 -130019 -137657 170911 108944 84949 -77209 -154330 -157702 -11403 24393 -28791 -118635
6771 -118635 -260380 -352774 -220017 -73331 -126623 -2618 -72022 -85817 -6190 -100370 -282211
6760 -282211 -289715 -288329 -220464 -73480 -3266 -47674 11536 -51665 -124026 -87157 -232957 -156039
6748 -156039 -176313 11660 80470 193177 95028 -4512 -103284 -213842 -239723 2651 -22780
6737 -22780 -4835 -77502 -44926 -201862 -240083 -188356 -225306 -84081 -179316 38290 -97057
6726i7057Q1402R2315j83391K6148l3817Q3594J60477j65668R8380j25290q7529
6715a50436L0608N581j07102M8613J97516Q7391j01870n9257o8921M079r5393
6704b09191J25775n4762M5079J54908P6273J75459k41000j94968l1653J59412
6694E332l9293P1015P3244j19783P5079l8621l105K4354M8859M8812Q1501r0834
6682A36560l2478m2668Q7078j21741j00930N6549j23310k3301J01173J11807N0793
6671I9532M87Q2067j44674J04168q9877L561O7230q8589J29185r3665M5407p3524
6659D1308l6229r526k04637K86645p4378l428J16418k2039r2658j32641K09145
6648G7980J01931k46550n3209J5129O9699p7296Q9090o2939j79738J08741j628
$$ plain form
6726 -97057 -15655 76660 -106731 -80583 -114400 -30806 129671 -35997 62383 -62907 -150436
6715 -150436 -119828 -114247 -221349 -172736 24780 112171 10301 -48956 -117877 -113798 -209191
6704 -209191 -83416 -138178 -93099 61809 138082 313541 72541 -122427 -154080 5332
6694 5332 -33961 37054 110298 -9485 65594 26973 23868 48222 97081 145893 227394 136560
6682 136560 104082 61414 148492 26751 -74179 -17630 -140940 -164241 -63068 48739 99532
6671 99532 100019 182086 37412 141580 51703 55264 122494 33905 163090 69425 114832 41308
6659 41308 5079 -4447 -209084 77561 3183 -245 116173 94134 1476 -131165 77980
6648 77980 179911 -66639 -119848 -104719 -35020 -112316 -23226 -86165 -265903 -157162 -158790
6637a58790J54692M2188k41346K7162O0834J57206j46395p038J87816L6472k00796
6626h7995J90002j00562K822M2127j63998k9432r0026M7959j10382r776J53382
6615a55879K16779j08466P1484p6038q1197J21508j6064J0595n153N8838J5854
6604E2261l13422J51160j23486Q1245J42466J0548J00775k790j05384k3622o9988
6593a00237N2034K9902k3647N8999P1912r2083o0881N9845j25032M1378J29883
6582D2073K4785j0185l27834L80808j45336j9422J61608r6144P1053k77700J04289
6571i2005J57221m8399R1034r2791k32566J01671L31472k92123K622j1138k10526
6560b95528K67183J03885p2805J39490k89805n714K6818K56560P1075p3311K3703
$$ plain form
6637 -158790 -4098 38090 -203256 -176094 -115260 41946 -104449 -111487 76329 112801 -87995
6626 -87995 102007 1445 4267 46394 -117604 -147036 -237062 -189103 -299485 -309261 -155879
6615 -155879 60900 -47566 23918 -52120 -133317 -11809 -27873 -17278 -22431 36407 52261
6604 52261 -261161 -110001 -233487 -152242 -9776 772 101547 98757 -6627 -30249 -100237
6593 -100237 -48203 -18301 -41948 17051 88963 -3120 -64001 -4156 -129188 -87810 42073
6582 42073 66858 56673 -271161 109647 -35689 -55111 106497 10353 81406 -196294 -92005
6571 -92005 65216 16817 107851 15060 -217506 -115835 215637 -76486 -73864 -85002 -295528
6560 -295528 -28345 75540 2735 142225 -147580 -153294 -126476 130084 201159 127848 151551
6549A51551l28757q3446J34112O019P9319j57225J10028N4719R0906P4515j61830
6538c0089j59300k473J33299J12944k0626L9698m5630j45358q63J04672j72121
6527a85847m2622M9995l7292K34254j65393O9587L6779L4416l8499j9472o2892
6516a26986j25221j56972K55637J6837K01549J90229k31505j40032j43117J29837
6506a29744J0643J96536p5370j79350J9210r9552L17952j05770j613j15597L0407
6495a32248K0087J10236K32018q5781n6756j78155j63905n640l4324J30176K43101
6484G8809j49347k45866J54615l22978K10159J71276Q9740l6731q0513k6778J12586
6473d5028Q1525j25376l2752N0268O7295J27454P9266J41820o7657j28659k43080
$$ plain form
6549 151551 -177206 -260652 -126540 -120521 -41202 -198427 -88399 -33680 57226 131741 -30089
6538 -30089 -189389 -191862 -58563 54381 33755 73453 27823 -117535 -118398 -13726 -185847
6527 -185847 -228469 -178474 -215766 18488 -146905 -77318 -40539 -6123 -44622 -64094 -126986
6516 -126986 -252207 -409179 -153542 -136705 64844 255073 23568 -116464 -259581 -129744
6506 -129744 -119101 77435 2065 -177285 -158075 -257627 60325 -45445 -47058 -162655 -132248
6495 -132248 -112161 -1925 230093 144312 87556 -90599 -254504 -260144 -294468 -164292 78809
6484 78809 -70538 -316404 -161789 -484767 -274608 -103332 -13592 -50323 -130836 -157614 -45028
6473 -45028 36497 -88879 -121631 -71363 -4068 123386 202652 344472 276815 148156 -94924
6462i4924o5273R4261J45489k11552J1996O4420j07047N9974K6590k1967r3117
6451a91150J37115Q6699k4685r1038O5265l3794j2367j75772O2364O3312J12447
6440a604R5526j15828K15349p6090k94299l4351J85403L5054J63583J93606j29644
6429B36705k10767p3551J57818o6098k26877r2312K92846J09185m9278j16206
6419c8535n1457q6506j60624O3665J45791J92315R6425k26024o7675m0894J03009
6408g0510J35182P9184k89552l0231J81118k3255K33425j04042k12162j98096
6398b98939j40075K5441L51539N3985K3077J60097j44117j54626k33737J43953
6388b13402J49600n4323J39620r0289j71629M8288r7121P3353N9888j37966k8455
$$ plain form
6462 -94924 -160197 -65936 79553 -131999 -120003 -55583 -162630 -102656 -76066 -98033 -191150
6451 -191150 -54035 32664 7979 -83059 -17794 -51588 -63955 -239727 -177363 -114051 -1604
6440 -1604 93922 -21906 193443 117353 -176946 -211297 -25894 9160 172743 366349 236705
6429 236705 25938 -47613 110205 44107 -182770 -275082 17764 126949 77671 -38535
6419 -38535 -89992 -176498 -337122 -273457 -127666 64649 161074 -64950 -132625 -173519 -70510
6408 -70510 64672 143856 -145696 -175927 5191 -18064 215361 111319 -100843 -298939
6398 -298939 -439014 -413573 -62034 -8049 15028 175125 31008 -123618 -357355 -213402
6388 -213402 -63802 -118125 21495 -68794 -240423 -192135 -289256 -215903 -156015 -293981 -322436
6377c22436J99961K7589R9341o32j2400r3431J841K8932L24844n3310j25483n188
6365F9628j30395l8024J7053K00836k6713k07963n0046K845j1284J34434J56058
6354A16429J69532j17742j32660J50952j10674J81011j25069m9847j65953o5617
6344a49638O2476O9526O20j07525N8455p9717K0051K34063J59273j43357m0420
6333H3807q2071p6928j23502Q6644J28778n3272n5218O402J46292Q3484n9383
6322H5033o5346j40461J38537j03150J02712O6679m3217O80k37670q153r0491
6311b94847J44884K04913K30785k7034j52806j27056j03052l0745K2765O1147
6301g1046j3681J11957K1608J68814R015k09307j28677J25026j39110o5165K21070
$$ plain form
6377 -322436 -122475 -94886 4455 3823 -8577 -102008 -100167 -71235 253609 200299 74816 69628
6365 69628 -60767 -98791 -81738 119098 92385 -115578 -165624 -162779 -174063 -39629 116429
6354 116429 285961 168219 35559 186511 75837 256848 131779 81932 -84021 -149638
6344 -149638 -87162 -17636 -17016 -124541 -66086 -145803 -125752 108311 267584 124227 83807
6333 83807 1736 -75192 -198694 -112050 16728 -36544 -91762 -85360 60932 144416 85033
6322 85033 19687 -120774 17763 -85387 17325 84004 40787 41467 -196203 -204356 -294847
6311 -294847 -149963 54950 285735 258701 105895 -21161 -124213 -154958 -132193 -71046
6301 -71046 -84727 27230 48838 217652 226667 17360 -111317 13709 -125401 -190566 30504
6290C0504K10812j07800n4423q3758j08224N7924J38532J09931j37651j52599
6280i6752J1354M1463K4054J36129n4550Q7952j82761r8575O1904j22154J06471
6269h5465k5939J24174R014j00945l302J9137M0827r2516n1561M0330Q789r7459
6257b14916J04625q472K34123M7527p117j17942J6540N4804k91055M9036r5562
6246b28409J66136K1916J821j08208r1304l1130J7546O2654O7088K30096J10155
6235B18361j24544M272m7430j65540j36458L05897L3452j20464J24644J3978K8135
6224A34303k9526k18414o357n2307n761J00885J13518M5171N8625j17971n4363
6213c2197o6391Q8779Q1035o5842j63743J35617M0951R3168o4227j73416k0202
$$ plain form
6290 30504 241316 133516 79093 -4665 -112889 -54965 83567 193498 55847 -96752
6280 -96752 -85398 -43935 -19881 116248 61698 149650 -33111 -131686 -69782 -191936 -85465
6269 -85465 -111404 12770 21784 -79161 -82463 -63326 -22499 -115015 -166576 -126246 -117457 -214916
6257 -214916 -110291 -118763 115360 162887 155770 37828 54368 109172 -181883 -132847 -228409
6246 -228409 -62273 -40357 -38536 -146744 -238048 -269178 -251632 -188978 -121890 108206 218361
6235 218361 93817 98089 50659 -114881 -251339 54558 88010 -32454 92190 106168 134303
6224 134303 104777 -113637 -119994 -172301 -178062 -77177 36341 81512 140137 22166 -32197
6213 -32197 -98588 -9809 71226 5384 -158359 -22742 18209 111377 47150 -126266 -146468
6202a46468O4907J09030J14366Q9541q2441N07j05868J5869k2353J35382P8312
6191B50784p7602k15553l5119J03688j7365J24445n8719P200Q3529j06014j19550
6180f0276J14372J10761j38697O9829k42550k7188K03299J15076j48213O943r6964
6169i3608p256J13609J17801j12293n2882k3489M7185Q372l322J50971j02229
6158D2859j05790J12566k2428j9704k2151k3043R7346J6310J04545m4192j05602
6147C0716r4142J7464n7594p6927J74521P553J16562m4135L4769r5727j30767
6136a17707q2104K20302K86488r3643j18937j97096j01040J66382L86660p6807
6126B72498k19985o9709J4012J42590K26148K4219l33799m7449l8442Q7891o5597
$$ plain form
6202 -146468 -81561 27469 141835 231376 148935 149442 43574 59443 37090 172472 250784
6191 250784 173182 -42371 -77490 26198 8833 133278 74559 81759 165288 59274 -60276
6180 -60276 54096 164857 26160 95989 -146561 -173749 29550 144626 -3587 3356 -93608
6169 -93608 -100864 12745 130546 18253 -34629 -58118 -10933 -2561 -5883 145088 42859
6158 42859 -62931 49635 27207 7503 -14648 -37691 59655 75965 180510 136318 30716
6147 30716 -63426 -45962 -103556 -180483 -5962 1591 118153 74018 108787 13060 -117707
6136 -117707 -199811 20491 306979 213336 94399 -102697 -203737 -37355 349305 272498
6126 272498 52513 -17196 -3184 139406 365554 389773 55974 8525 -29917 57974 -7623
6115g623K60095K2410j34050j36501M3637P9504r0501J67063P6672j62910N7754
6104A75550K5718p1651Q8363L6685j35332j42752J09863K07173K9510J10032l5344
6093C97815j82079m5423k5263J52266K3665R5440q6759j17975j91693O8067K36032
6082C24093J55666j37424j61790n9908N3638J36252R7979N9747q1629j49758M7528
6071B84394n0237N1436m849k39701J45290J15527m2181n6753J01553J19889j38336
6060B86032j7923j253j29214P1590J72632J8796k21095r4860m208j54413K31328
6049A57412J66865J2710J9232j07231j9024j61412J71025K11704j43055l75425
6039f7199J51603J24032p3840M41J60883P5459k73647K6446J04936j27155J22823
$$ plain form
6115 -7623 252472 274882 140832 4331 47968 127472 36971 204034 280706 117796 175550
6104 175550 201268 129617 217980 254665 119333 -23419 86444 293617 323127 433159 397815
6093 397815 215736 170313 145050 297316 320981 416421 329662 211687 19994 88061 324093
6082 324093 479759 342335 180545 120637 174275 310527 408506 468253 386624 236866 284394
6071 284394 234157 285593 280744 41043 186333 301860 259679 202926 304479 424368 286032
6060 286032 268109 266856 137642 209232 381864 400660 179565 84705 80497 -73916 157412
6049 157412 324277 336987 356219 248988 229964 68552 239577 451281 308226 -67199
6039 -67199 84404 208436 134596 135037 295920 371379 97732 124178 229114 101959 224782
6028B24782O9144k77217K44254j13940Q1927N0732m7027K3985L4188l00473K7622
6017A7977J32944m3508q474Q6177m0765L1449j93601J77639J16807j64499N2852
6006A64998k23454P0091J77293m1690J12701l35065p6291O5934K26774M5991j40487
5995D6795R2440N861l5330J06790j20881j81912J4463Q5782M6849P4981o8141
5984F7697Q9769J78101j34140K1321j03406j7269r9763J72756K67161o7617j12651
5973B61959j71272M5372J8831j43047K52815q0913m8615p1738p015L773k2233
5962C7917p8428Q3770J35357j32383m169J82460j09714j6175p2489o5589P2911
5951C3468O4895P2186K62612q5149j01926k61704L583J83410j41625L56943L08772
$$ plain form
6028 224782 293926 16709 260963 147023 228950 279682 232655 256640 290828 -9645 17977
6017 17977 150921 107413 98939 185116 144351 175800 -17801 159838 276645 112146 164998
6006 164998 -58456 11635 188928 147238 259939 -75126 -151417 -85483 141291 187282 46795
5995 46795 139235 145096 109766 216556 95675 -86237 -71774 14008 60857 135838 67697
5984 67697 157466 335567 201427 222748 119342 102073 2310 175066 442227 374610 261959
5973 261959 90687 136059 154890 11843 264658 183745 135130 63392 56377 60150 37917
5962 37917 -40511 43259 178616 46233 42064 224524 114810 98635 26146 -39443 33468
5951 33468 98363 170549 433161 348012 246086 -15618 -12035 171375 29750 386693 695465
5940F95465k45442j53474m3791K3873j1978N9219j99389M1621K04218L13846K1214
5929G05382p0429k7764j76794j9576j03815L0354J13882j525j0668K09631j99102
5918D49576j02412n2378m1371J33053J36989n9673q0782J19652j83930J47166
5908D65890j87882j40841P226o4925M15598Q2545r63j18179k58375L2869K1009
5897B53972K16820N0946j25877K4768k36475R0143J62831m4674J49465j25100
5887D16819R1120P8926K5351k2353k9559l449j80779o624j43956J88171J49159
5876E62826j3367P9086Q1264k5939J7786P2605M7194R8545p4452j85836K17743
5865H77455j4151j54647J2126n316K2250j15951J61487J35100j12970K93892j82760
$$ plain form
5940 695465 450023 296549 252758 276631 264653 323872 124483 166104 370322 684168 705382
5929 705382 634953 607189 430395 410819 307004 337358 451240 449715 439047 648678 449576
5918 449576 347164 294786 253415 386468 523457 463784 383002 502654 318724 465890
5908 465890 278008 137167 144393 79468 495066 577611 576648 458469 200094 232963 253972
5897 253972 470792 521738 395861 420629 184154 274297 437128 392454 541919 416819
5887 416819 507939 586865 612216 589863 560304 556855 376076 369452 225496 413667 562826
5876 562826 549459 628545 709809 683870 701656 774261 821455 920000 845548 659712 877455
5865 877455 863304 708657 720783 715467 737717 621766 783253 918353 805383 1099275 916515
5854I16515q9587k1290k6256P8250j6074p8082k03982p6452M3277J1120J08049
5843F45488j52230j11617J25441r2161J6967J5799Q9085L336L2780r3175P64o8438
5831D12039n7023J15561K43916N3029j67723p0981j62418j340J40724J4321r1048
5820D29057n1521J03989J18574j5974l5368j98811k8595m5229J38283J0170q8501
5809C36074R6949o6595Q5008n9726K03692k68919q3654J85457J03319o2755k22614
5798B46236K89703r594J9323j9323k73713J12962N3942o0685K1241J47233q5382
5787D41943q4650J00959M3784n317J63893r0511j14468Q3880m3375m6608J39173
5776E88703K7896p8065J7383L3316M4217O4685j46358j59196k47909O3551J34861
$$ plain form
5854 916515 826928 805638 779382 857632 841558 763476 559494 483042 526319 537439 645488
5843 645488 493258 381641 507082 414921 431888 447687 536772 540108 572888 479713 480477 412039
5831 412039 355016 470577 714493 767522 599799 528818 366400 365060 505784 520105 429057
5820 429057 377536 481525 600099 584125 548757 349946 321351 276122 414405 424575 336074
5809 336074 433023 366428 451436 391710 595402 326483 242829 428286 531605 468850 246236
5798 246236 535939 526345 545668 526345 252632 365594 419536 358851 380092 527325 441943
5787 441943 357293 458252 502036 496719 660612 570101 455633 539513 496138 449530 588703
5776 588703 616599 538534 555917 589233 633450 698135 551777 392581 144672 208223 343084
5765C43084J22993J83912q8972O7769j50653K9321Q993J25911j53715J9141m6593
5754D61191P3250j7993J83369q5052L7732n4089J8085L4000l8574J95117K06709
5743A013745j17018j28537J37659r5251J75699N4117r1263P9538k6498K7835N1259
5732A081285J23512p3325N529N6521R906P1627K59467J94042K18146L8441j53042
5721A832109j11297J39014J22215K57898J0469J47471p3579j44890p5797J25322
5711B228935L03487j90627J23467M2867J53384K27657L19257k1571L218j38363
5701C051711J22036J44335L84025M9578j19049j18169J3620J64909K6739K37210
5691C956945J52939J76119P9322k0066K42592j51580K04947M4510P2492L26975
$$ plain form
5765 343084 466077 649989 561017 628786 478133 507454 516447 642358 488643 507784 461191
5754 461191 534441 516448 699817 614765 652497 598408 616493 650493 611919 807036 1013745
5743 1013745 896727 768190 905849 810598 986297 1040414 949151 1028689 1002191 1030026 1081285
5732 1081285 1204797 1131472 1137001 1193522 1203428 1275055 1534522 1728564 1946710 1985151 1832109
5721 1832109 1720812 1859826 1982041 2239939 2250408 2397879 2324300 2179410 2103613 2228935
5711 2228935 2532422 2341795 2465262 2508129 2661513 2889170 3208427 3186856 3190074 3051711
5701 3051711 3173747 3318082 3702107 3751685 3632636 3514467 3528087 3692996 3719735 3956945
5691 3956945 4109884 4286003 4365325 4345259 4587851 4436271 4641218 4685728 4758220 5085195
5681E085195K95767J64840L55706K62069K33050K09221M72580M32675M68416L62113
5671H341632L39786M20905M66097Q98351P25423Q87253J171176J358565J756005
5662A6365193K072726K704020L004005L634829M068635N300276O609991Q018455
5654E1778130R199550P728219L810674j603221n539660o749257n403913k991043
5646E0229479r83224Q21762K705197M484732O437344P178355N921356J348655
5638G8143656m148434q452021r758829q549522o473837m968858l860803k950003
5630B8981349k387873k103795j594193j406077j099559p79511p57501m64924o32450
5621A7755466j84582m39665m94174k05367p6991J78626Q9093P0271M09567K10297
$$ plain form
5681 5085195 5380962 5545802 5901508 6163577 6396627 6605848 7078428 7511103 7979519 8341632
5671 8341632 8681418 9102323 9568420 10466771 11192194 12079447 13250623 14609188 16365193
5662 16365193 18437919 21141939 24145944 27780773 31849408 37149684 43759675 51778130
5654 51778130 60977680 68705899 72516573 70913352 65373692 58624435 53220522 50229479
5646 50229479 49246255 50068017 52773214 57257946 63695290 70873645 76795001 78143656
5638 78143656 73995222 65543201 55784372 47234850 40761013 35792155 31931352 28981349
5630 28981349 26593476 24489681 22895488 21489411 20389852 19610341 18852840 18387916 17755466
5621 17755466 17570884 17131219 16637045 16431678 16354687 16533313 16622406 16692677 17102244 17312541
5611A7312541K70815M36719N56201M13184N72458P29113N94863J073029J099011
5602B3057934J368979J817602J934096K702232L219384M346242N315152O155280
5594D9916901P432388Q992503J1328846J4037227J6374591J5347464R375250J50040
5586A32955210q591897j2149568j1126785p599240l196253j50715L149908O367510
5578I9658170R676039J1997811J0993180M530185m923126j2929635j6872840j6104413
5570H6025371j3357771j0265013p593818o050168n051904m231542l833617l323434
5562C2318104k690004k292156j712940j559126j207218j258543j057483j285135
5554A9255499j135884r93079p78100o57718n42212l74199l44726n13150m73188
$$ plain form
5611 17312541 17583356 18020075 18576276 18989460 19561918 20291031 20885894 21958923 23057934
5602 23057934 24426913 26244515 28178611 30880843 34100227 38446469 43761621 49916901
5594 49916901 57349289 66341792 77670638 91707865 108082456 123429920 132805170 132955210
5586 132955210 124363313 112213745 101086960 93487720 90291467 90140752 93290660 99658170
5578 99658170 109334209 121332020 132325200 136855385 131932259 119002624 102129784 86025371
5570 86025371 72667600 62402587 54808769 48758601 43706697 39475155 35641538 32318104
5562 32318104 29628100 27335944 25623004 24063878 22856660 21598117 20540634 19255499
5554 19255499 18119615 17126536 16348436 15690718 15148506 14774307 14429581 13916431 13443243
5545A3443243m79935l35682m70553l78450m06273m92036m56111l18911l77809
5536I727483m02766l07313j97794l48911p9547j32487k77635k13011r7491k5017
5526G645511l89926o9457j16113k38926K19726Q812n8000n6430l10927k60245
5516F374025j16625J42063j96834p0391r0478P0307j11192j27872J4974j29245
5506E758732N5980N8042p7089J87172J46734r6550p5940k4186m0923O7808k4177
5495E935603K744K51747K16649J9643R7190q2442N1697J75850J66323K49215L13303
5484G397522L19413Q1865J33319J11384J70416K63113J51504L05755J08004K13724
5474I256019R6749J48351N6277L56355M49258N59207M92134M95508K83932M87970
$$ plain form
5545 13443243 12963308 12627626 12157073 11778623 11372350 10880314 10424203 10105292 9727483
5536 9727483 9324717 9017404 8819610 8470699 8391152 8258665 7981030 7768019 7670528 7645511
5526 7645511 7255585 7186128 7070015 6831089 7050815 7059627 7001627 6945197 6634270 6374025
5516 6374025 6257400 6399463 6202629 6132238 6041760 6112067 6000875 5873003 5887977 5758732
5506 5758732 5814712 5872754 5795665 5982837 6129571 6033021 5957081 5932895 5891972 5959780 5935603
5495 5935603 5938347 6190094 6406743 6426386 6523576 6441134 6492831 6668681 6835004 7084219 7397522
5484 7397522 7716935 7798800 7932119 8043503 8213919 8477032 8628536 8934291 9042295 9256019
5474 9256019 9352768 9501119 9557396 9913751 10363009 10922216 11414350 11909858 12193790 12681760
5464A2681760N43793M39498M69318O08538J068238J062487R10312J135076J306791
5455B0225811J849457J900827K316416K587916L701357M828594N880844O973066
5447E0264288P832979R651820J1591168J4334931J5376248J2396079M434311n734021
5439A20147803j3073456j5189474j2830049r620129o567619m362192k652648j317365
5431E4534871j51098J444174K908217M538712O008919Q153478J0714662J3657788
5423A01809723J5047012J2834100M376660o315707j4596137j7166361j5248671
5416H0740619j2082615q881678o706920n372802m400048l683602l361059k799737
5408C3452158k460447j824515j265268j420015j138667q12544p13125o60354n65972
$$ plain form
5464 12681760 13225553 13665051 14134369 14742907 15811145 16873632 17783944 18919020 20225811
5455 20225811 22075268 23976095 26292511 28880427 32581784 37410378 43291222 50264288
5447 50264288 58097267 67749087 79340255 93675186 109051434 121447513 125881824 120147803
5439 120147803 107074347 91884873 79054824 69434695 62867076 58504884 55852236 54534871
5431 54534871 54383773 55827947 58736164 63274876 69283795 77437273 88151935 101809723
5423 101809723 116856735 129690835 134067495 127751788 113155651 95989290 80740619
5416 80740619 68658004 59776326 53069406 47696604 43296556 39612954 36251895 33452158
5408 33452158 30991711 29167196 27901928 26481913 25343246 24530702 23817577 23157223 22591251
5399B2591251j78948m6800j49941j20122K3185L50461M25818N44232R89974R54027
5389B5383137J114224J281637J742560K104045K335792K712472L279938M279110
5381D4232915N699020P218529Q207239P687255M058243j733202o651842q467875
5373F0250282p636782n769236m022966k628386j694255p73672q7253Q07471J606883
5364D0052086K500791L360164M397942N904354P684696Q794647Q607039M689916
5356H5991635j962900p284640j0211211r692604p958614o044730m650801l801250
5348C4384885l039143k654968k072457j957941j798148j411451r81029p06561
5340A9763187o80783p75610o36188n34593o66367q13918o04645o63004q54460
$$ plain form
5399 22591251 22412303 22365503 22215562 22095440 22118625 22469086 22894904 23439136 24429110 25383137
5389 25383137 26497361 27778998 29521558 31625603 33961395 36673867 39953805 44232915
5381 44232915 49931935 57150464 65357703 73044958 77103201 75369999 68718157 60250282
5373 60250282 52613500 46844264 42821298 40192912 38498657 37724985 37637732 38445203 40052086
5364 40052086 42552877 45913041 50310983 56215337 63900033 72694680 81301719 85991635
5356 85991635 84028735 76744095 66532884 56840280 48881666 42836936 38186135 34384885
5348 34384885 31345742 28690774 26618317 24660376 22862228 21450777 20469748 19763187
5340 19763187 19082404 18306794 17670606 17136013 16469646 15655728 15051083 14388079 13533619
5331A3533619p73584m38753m46335l32495m42054k21185m04125j67929l05600
5322A0001559n21069k47278k56167k31553k73556k6477k27166O0741m9274n5713
5312H174047Q9040R3523m8571j39002l1548J53573l6605l10884j67802j79001
5302G596770j24894k79570j13754k01880j66137O2234l86415k73277k98065j98949
5292E616063l68484J86112k02217l73845O9456l36696j33096j11347r4186m3753
5282D208007j60946k45219k19999L2257j2919q2491L6366j76168k23796j02477
5272C052615K3745j31354N4912p7991k49021j4462j45069P3045R3070j30473Q9098
5261B638115K00159j549k1439j7948j08469q1343N6632j58105J6047j10720k89232
$$ plain form
5331 13533619 12760035 12321282 11874947 11542452 11100398 10879213 10475088 10307159 10001559
5322 10001559 9480490 9233212 8977045 8745492 8471936 8445459 8218293 8279034 8229760 8174047
5312 8174047 8263087 8356610 8308039 8169037 8137489 8291062 8254457 7943573 7775771 7596770
5302 7596770 7471876 7192306 7078552 6876672 6710535 6772769 6386354 6113077 5815012 5616063
5292 5616063 5247579 5433691 5231474 4857629 4927085 4590389 4457293 4345946 4251760 4208007
5282 4208007 4047061 3801842 3581843 3614100 3601181 3518690 3555056 3378888 3155092 3052615
5272 3052615 3076360 2945006 2999918 2921927 2672906 2658444 2513375 2586420 2679490 2549017 2638115
5261 2638115 2838274 2836725 2815286 2797338 2688869 2607526 2664158 2506053 2522100 2411380 2122148
5250B122148J09372j05191q6983n0288N1909N9330P034K2370k29259k14374j50955
5239A535113J10586r7943k2329j73051R6850L8301K53203j01238m47064j83680
5229A008748L8019J76404n2310K8017p873k9571j04027M7847J08750l2071j11924
5218A070009L3455r3921J77270j60336j40482M2176k3914K5166k04659j97384
5208E27380K12092J72046n2778K5142K24772j88520p5972m4998k1942K92208k43004
5197H26426p2055O6815K4589q6451j58855Q9444N35J89695o3358N1064J27152
5186I95001k48846j47323P8891O7665j36804k9739L00254J43540j68093Q4103
5176I38649j19504j65400j46307N1038K30297O0186Q184j20227J95469j21223
$$ plain form
5250 2122148 2231520 2126329 2039346 1989058 2040967 2100297 2107331 2129701 1900442 1686068 1535113
5239 1535113 1645699 1547756 1525427 1352376 1449226 1487527 1740730 1639492 1192428 1008748
5229 1008748 1046767 1223171 1170861 1198878 1191005 1161434 1057407 1105254 1214004 1181933 1070009
5218 1070009 1103464 1009543 1186813 1026477 885995 928171 904257 929423 724764 527380
5208 527380 739472 911518 858740 883882 1108654 920134 844162 799164 777222 1069430 826426
5197 826426 754371 821186 845775 759324 600469 689913 690448 880143 816785 867849 995001
5186 995001 746155 598832 677723 745388 608584 578845 879099 1022639 854546 938649
5176 938649 819145 653745 507438 558476 788773 848959 857143 736916 932385 811162
5166H11162j13672K13546L2164q7801Q9408L55980r3311J8520l21939j42945J12447
5155H73559j35258K83406n1793r711M5486k97326J9335q4815R7322P7102L5314
5144H52621m0648n4389J22986o7350J91693O8289M3434J00522k55555J2262k34940
5133G38925m038K0405j61750J64375j67080j68180N5321J19335k0251j7022J17790
5122F77830j32727K09209P262k9418n2494k26934J15298r6822l2031J23513J76154
5111G38840N5982o7714r0895j8779L0736k4969Q7188k6039Q3213q9020R5118j5339
5099G58322J24r1762m7180J77522J09922J27257k13387R8196j30938o6013r0704
5088F31359k775J55674J41591j05312J1435n5475j27646Q0792Q3879l9085r0311
$$ plain form
5166 811162 697490 911036 943200 855399 944807 1300787 1207476 1225996 904057 761112 873559
5155 873559 738301 1021707 969914 960203 1005689 708363 727698 642883 740205 817307 852621
5144 852621 811973 757584 880570 813220 1004913 1073202 1116636 1217158 961603 973865 738925
5133 738925 734887 755292 593542 757917 590837 422657 477978 597313 577062 560040 677830
5122 677830 545103 754312 761574 732156 679662 452728 568026 471204 439173 562686 738840
5111 738840 794822 727108 636213 617434 648170 623201 710389 684350 767563 678543 773661 758322
5099 758322 758446 666684 619504 797026 906948 1034205 820818 919014 788076 722063 631359
5088 631359 628584 784258 925849 820537 831972 776497 648851 729643 813522 774437 684126
5077F84126L35094K73055J8458N4442O5991K0671k62924J85631n6866j56049J19228
5066A280857o019J90076k97026k09392J549N8292K76287q7693J57660r7879P1573
5055A338285L1890r8039P2284J57038j1157k0175O6994P3796j20512L5832J8031
5044A544267r2727j90461q2676K82635m4825J00427J9184j59008K4965j40320
5034A261461K60202k71829R0524K83956K05672K51295l4186N17913L99868L44548
5024C309424K87375j4053k28777k03550j39483j15578k92284J60708J50913L17194
5014C231889K99066K31551L02315k70536l73290l26802r5260j5952J42855L55243
5004C481079K97203M73202r5072m56859n67305m25680k92392o5192M4077K75301
$$ plain form
5077 684126 1019220 1292275 1310733 1365175 1431166 1451837 1188913 1374544 1317678 1161629 1280857
5066 1280857 1274838 1464914 1167888 958496 960045 1018337 1294624 1206931 1364591 1266712 1338285
5055 1338285 1370175 1272136 1344420 1501458 1490301 1470126 1537120 1610916 1490404 1526236 1544267
5044 1544267 1451540 1261079 1178403 1461038 1416213 1516640 1535824 1376816 1401781 1261461
5034 1261461 1521663 1249834 1340358 1624314 1829986 2081281 2047095 2565008 2964876 3309424
5024 3309424 3596799 3582746 3353969 3150419 3010936 2895358 2603074 2763782 2914695 3231889
5014 3231889 3530955 3762506 4064821 3794285 3420995 3094193 2998933 2982981 3125836 3481079
5004 3481079 3778282 4251484 4156412 3699553 3132248 2706568 2414176 2348984 2393061 2668362
4994B668362J53645J80957L10744Q0411L46917m2322l34571n12146m02634l06781
4984B142582m84006J4321k49259M0090q6636l8793l9028l26468m331K43987K159
4973A214618N553k60902O2070j77062K1630J33895j90944L04641p3832j12045
4963I27622O0080R586o5384j59619Q0288k35626J47162n7713J10350R3520k09230
4952G01036O7160q6695M9423k73154j3410J98816R6250K97538k8498m7871M8854
4941A009449O3551O3231j63120O7443q8794k52892K14040J70228r4237j02799
4931H86100j71062q0563J80739J77041j65788N7708o6788j6926l1140N3739l7792
4920G85268m8040K3017n9611r4095n1177N470J62687J3587J7694q4106k28254
$$ plain form
4994 2668362 2822007 3002964 3313708 3394119 3741036 3698714 3364143 2851997 2449363 2142582
4984 2142582 1658576 1672897 1423638 1463728 1377092 1338299 1299271 972803 968472 1212459 1214618
4973 1214618 1220171 959269 1021339 844277 865907 999802 808858 1113499 1039667 927622
4963 927622 987702 997288 931904 772285 852573 616947 764109 706396 816746 910266 701036
4952 701036 768196 681501 730924 457770 444360 643176 739426 1036964 1008466 960595 1009449
4941 1009449 1073000 1136231 973111 1040554 951760 698868 912908 1083136 988899 886100
4931 886100 715038 634475 815214 992255 826467 884175 817387 800461 769321 823060 785268
4920 785268 737228 760245 700634 606539 555362 560832 723519 737106 754800 670694 442440
4909D42440m0151K99667Q4033L7047k24011k70226Q0770K3277J58562P2730q0317
4898E83821k35802l396J18156J41348K86229k00821j65125M1317j075J34864K3677
4887G23193J7226l55j91171n8265l1735P4747P9890j41978k1445j10980R3580
4876D32707j6031J20640J27988M3349L2126j34561J7502J05212J05500l6184n4931
4865G43317J54929j18172R8828r0439j87548O3619O891J34943p1608P8143n9512
4854G53391r3235p187o0488J34873J53648n8104R6917q3527L3199j45444K00448
4843I24491l8409L2148K42801q218N4437l6685q2296j32369j4649J33310j941
4832A072620J24129j345P4933Q7020j51952L8557J41232j98395J14561J83311
$$ plain form
4909 442440 402289 701956 785989 823036 599025 328799 409569 432846 591408 664138 583821
4898 583821 348019 344623 462779 604127 890356 689535 524410 565727 564652 699516 723193
4887 723193 740419 740064 548893 490628 458893 533640 613530 471552 450107 339127 432707
4876 432707 416676 537316 665304 708653 740779 606218 623720 728932 834432 798248 743317
4865 743317 898246 780074 878902 788463 600915 664534 671425 806368 734760 812903 753391
4854 753391 660156 652969 592481 727354 881002 822898 919815 836288 869487 724043 924491
4843 924491 886082 918230 1161031 1152813 1207250 1170565 1088269 955900 941251 1074561 1072620
4832 1072620 1196749 1195404 1270337 1357357 1205405 1243962 1385194 1186799 1301360 1484671
4822A484671J82803P0335j09604k04181l9123J38427K86698J58224j71502j56103
4812A640645k01628J79386J08923m4813M645O5437k4587K42453j00919K050K52650
4801B124242p4629L9870q0049N5684J08008K8260K6924m3450P6585o4617J9945
4790B216773P6358N2150K2429O5543K32127Q6363j62361j37317J72388J26942
4780B751395M6034J27581L26289J66239Q7521m9999J29307K46244m2154L30496
4770D118953k7886J18677o0557P0609K15670J04879K13056K52011K37641J64590
4760E407643p9624K09018K65340L93894K43053J51011J61421L04197N52678K95590
4750G904221L14243L11436K79621K53137Q7822K18791K19242J93999M54661O01828
$$ plain form
4822 1484671 1667474 1737809 1628205 1424024 1384901 1523328 1810026 1968250 1796748 1640645
4812 1640645 1439017 1618403 1727326 1682513 1687158 1752595 1728008 1970461 1869542 1871592 2124242
4801 2124242 2049613 2089483 2009434 2065118 2173126 2201386 2228310 2184860 2261445 2196828 2216773
4790 2216773 2293131 2345281 2367710 2433253 2665380 2751743 2589382 2452065 2624453 2751395
4780 2751395 2797429 2925010 3251299 3417538 3505059 3455060 3584367 3830611 3788457 4118953
4770 4118953 4091067 4209744 4149187 4219796 4435466 4540345 4753401 5005412 5243053 5407643
4760 5407643 5328019 5537037 5802377 6196271 6439324 6590335 6751756 7055953 7608631 7904221
4750 7904221 8218464 8529900 8809521 9062658 9150480 9369271 9588513 9782512 10237173 10839001
4740A0839001M24909M17412L48930M33848O87900P68405Q00791Q66368J052220
4731A6639784J405236J354821J806633K243653K872883L301461L954241M220554
4723C7799266L423813J046016j205785r36645q5611J007479K129655L376542M870806
4714E1425536O465000P516021P035226M900301L058396J615661Q00723J237571
4706H4054435J10634k03566J354314K332077J951994J731652L037175L083086
4698I7451801K284603K757621L650401L149022K855443J298550j036160l058941
4690A09352340m202397l667177k323846q82676j863453k500836j486932j454913
4682I0970110k533237j949090m97766m58721q93318m55726o34676k710972m542910
$$ plain form
4740 10839001 11263910 11681322 12030252 12464100 13152000 13920405 14721196 15587564 16639784
4731 16639784 18045020 19399841 21206474 23450127 26323010 29624471 33578712 37799266
4723 37799266 41223079 42269095 41063310 40126665 40041054 41048533 43178188 46554730 51425536
4714 51425536 57890536 65406557 72441783 77342084 80400480 82016141 82816864 84054435
4706 84054435 84165069 83961503 85315817 87647894 89599888 91331540 94368715 97451801
4698 97451801 99736404 102494025 106144426 109293448 112148891 113447441 112411281 109352340
4690 109352340 105149943 101482766 99158920 98276244 96412791 93911955 92425023 90970110
4682 90970110 88436873 86487783 85990017 85531296 84637978 84182252 83547576 80836604 76293694
4673G6293694o349046p635113o911741n368524l976219k346876j234636k84955
4665D2186584J284669J156123j29658k980173m547140m249438l977350k982132
4657B5761485k441286j862220j522799j162007j231120j166357q53850p91727
4649A4730119r26225n44672n21244m75231o06149l57391n27357m22865l56841
4640I992144l25047m39804k78184q1459k07357k70375k28358l00892n9124k47604
4630G553940j23403n0756j30297k37965m05190k92595l04269j87132k63989j06257
4620E452087M4752k48235k00812j76316j15651o3152j23250k9956m2057k46207
4610D251203j38104O8681L2697n1834k25608k03423L3692J67980j8544J86880
$$ plain form
4673 76293694 69944648 62309535 55397794 50029270 46053051 43706175 42471539 42186584
4665 42186584 43471253 44627376 44497718 41517545 36970405 32720967 28743617 25761485
4657 25761485 23320199 21457979 19935180 18773173 17542053 16375696 15521846 14730119
4649 14730119 13803894 13259222 12737978 12262747 11656598 11299207 10771850 10348985 9992144
4640 9992144 9667097 9227293 8949109 8867650 8660293 8389918 8161560 7860668 7801544 7553940
4630 7553940 7430537 7379781 7249484 7011519 6606329 6313734 6009465 5822333 5558344 5452087
4620 5452087 5496839 5248604 5047792 4871476 4755825 4692673 4569423 4539467 4497410 4251203
4610 4251203 4113099 4181780 4214477 4162643 3937035 3733612 3767304 3935284 3916740 4103620
4600D103620j10601r3803O6408j76414K32265K50876L00782K53995m3836O8443
4590D851735P9929j71734R5286l04561k97805M9813m8582l7900K94957J49099
4580D660237j09460R8791R4438j84029o374K22292O5517m28499r7962m0858j38763
4569D135330R6566j39402P5259k81528J2482k21704J10151K50084n9177j02505
4559C875556j43671k01229J55858J52729Q9554j39164k35242j4330Q6824J81914
4549C808799J98338J38878J95959J96910K13630K67462M16705J89702N1168j31145
4539E546406k73120j53316J8609l8835k0368n2719O6510M1899O0365P5738M65255
4528E736424q911l60089j88252j20536k56332k45463k15900j09554k27536o7947
$$ plain form
4600 4103620 3993019 3899216 3965624 3789210 4021475 4272351 4573133 4827128 4783292 4851735
4590 4851735 4931664 4759930 4855216 4550655 4252850 4302663 4254081 4216181 4511138 4660237
4580 4660237 4550777 4649568 4744006 4559977 4553603 4775895 4841412 4412913 4314951 4274093 4135330
4569 4135330 4231896 4092494 4167753 3886225 3898707 3677003 3787154 4037238 3978061 3875556
4559 3875556 3731885 3530656 3686514 3839243 3928797 3789633 3554391 3540061 3626885 3808799
4549 3808799 4007137 4146015 4341974 4538884 4752514 5019976 5436681 5626383 5677551 5546406
4539 5546406 5273286 5119970 5138579 5099744 5079376 5026657 5093167 5135066 5195431 5271169 5736424
4528 5736424 5727513 5367424 5179172 5058636 4802304 4556841 4340941 4231387 4003851 3935904
4518C935904L5313K26979K12389l34942k53027R1364O022j56130j16914j73123
4508C473835j49140p228r0271M3840m1923l7120r553l0769j09385K8046J05518
4497C175850O9795N4617k17740j45769j91878O3047M0668Q7183J71878L9561j33729
4486C013483M4776j42383J6688Q5129j5950j06150R5818L00359J17845J12713
4476C522328O1562Q7611o5785K54565J68558L81642L37147O4704j41137k07382
4466D463813k96718k37711K08202O9532J86972Q6584J5554K55676J65184K48059
4456E165147M17675M21443L27834K27205M16848K53280Q1634k02438k70306j16073
4446F722249J0332k8238j23156N6770K00057K31835O72885L14264L61999J00125
$$ plain form
4518 3935904 3971217 4198196 4410585 4075643 3822616 3913980 3920002 3763872 3646958 3473835
4508 3473835 3324695 3317467 3227196 3271036 3229113 3191993 3182440 3151671 3042286 3070332 3175850
4497 3175850 3245645 3300262 3082522 2936753 2744875 2807922 2848590 2935773 3107651 3147212 3013483
4486 3013483 3058259 2915876 2932564 3017693 3001743 2895593 2991411 3291770 3409615 3522328
4476 3522328 3583890 3671501 3605716 3860281 4028839 4410481 4747628 4812332 4671195 4463813
4466 4463813 4167095 3929384 4137586 4207118 4394090 4480674 4496228 4751904 4917088 5165147
4456 5165147 5582822 6004265 6332099 6559304 6976152 7229432 7311066 7108628 6838322 6722249
4446 6722249 6732581 6704343 6581187 6637957 6838014 7069849 7742734 8056998 8418997 8519122
4436H519122K27916J81942p7035m3345j05945k93854j89806K0977j42023k28801
4426G869148P7622J45182L09340J73162J61099J91854M73869L30173M59581L67133
4416A0558163J22146J30113L50351M5590J14646p6318r0895J54079J05669L7443
4406A1450987M19721K66846L88217O00097L42386M41526K96452M42921M95348
4397A5144501M15777P94381O74225M17871O84993O81522P50965N66478M23689
4388B0554402L93573P58985Q38786R74006R77972J094402P44558P54122J005999
4379B8096805J198486J293933J494554J811917K162918K321249K824724L442510
4371D4647096M285718N369054O300019P483104Q807082J0827776J3595702J6467344
$$ plain form
4436 8519122 8747038 8928980 8851945 8808600 8702655 8408801 8218995 8239972 8097949 7869148
4426 7869148 7946770 8091952 8401292 8574454 8735553 8927407 9401276 9731449 10191030 10558163
4416 10558163 10680309 10810422 11160773 11206363 11321009 11244691 11153796 11307875 11413544 11450987
4406 11450987 11870708 12137554 12525771 13125868 13468254 13909780 14206232 14649153 15144501
4397 15144501 15560278 16354659 17028884 17446755 18131748 18813270 19564235 20130713 20554402
4388 20554402 20947975 21706960 22545746 23519752 24497724 25592126 26336684 27090806 28096805
4379 28096805 29295291 30589224 32083778 33895695 36058613 38379862 41204586 44647096
4371 44647096 48932814 54301868 60601887 68084991 76892073 87719849 101315551 117782895
4363A17782895J4875673M972435p446633j2730307j1607308q265353m267792j484258
4355I1829352J217784L322631N551138Q226852J1047433J4011365J8162046K2540638
4347A75909239K3997711J8900375J1850964Q124825L488948p039142j5363836
4340B19869084j5772169j1448148o100238q33344L377927N902646P290988P597882
4332B09884628P528758Q409570J0447960J3548473J5493080J1017248k003219
4325B74326498j4244401j7454999j5197552j0813565o273056k392626J183216
4318B09133515M215260O683305Q849243J0490112J2036108J3574032J5694333
4311B80675908J7444347J8005107J6847167J3955736R821569N804859K305414
$$ plain form
4363 117782895 132658568 137631003 130184370 117454063 105846755 97581402 93313610 91829352
4355 91829352 93047136 96369767 101920905 110147757 121195190 135206555 153368601 175909239
4347 175909239 199906950 218807325 230658289 238783114 242272062 235232920 219869084
4340 219869084 204096915 192648767 186548529 185715185 189093112 194995758 202286746 209884628
4332 209884628 217413386 225822956 236270916 249819389 265312469 276329717 274326498
4325 274326498 260082097 242627098 227429546 216615981 210342925 207950299 209133515
4318 209133515 213348775 220032080 228881323 239371435 251407543 264981575 280675908
4311 280675908 298120255 316125362 332972529 346928265 356749834 362554693 364860107
4304C64860107j488940n297227q506564j1174003j2741381j3266831j2789978
4297B99595183j1197108q772211n879978k983628q21577K62749R05178J735094
4289B72843702L307562N532074Q482826J1248039J4259051J6061493J6766825
4282C48501572J5785744J3049628Q771402L847130L7735l291171o135904r815054
4274C70751082j4238842j8074733j9905760j9403166j7308206j5023553j3113812
4267B53683010j1524904j0278044r020570p493694n815776m000195k271283o68227
4259B02610317O40001J354970Q91012k52990j246639j711970k323169l277260
4251A96684272m971605p415533r916684j1205126j1195362j0144095r403861q838433
$$ plain form
4304 364860107 363371167 358073940 349567376 338393373 325651992 312385161 299595183
4297 299595183 288398075 279625864 273745886 270762258 269940681 270203430 271108608 272843702
4289 272843702 276151264 281683338 290166164 301414203 315673254 331734747 348501572
4282 348501572 364287316 377336944 386108346 389955476 389993211 386702040 380566136 370751082
4274 370751082 356512240 338437507 318531747 299128581 281820375 266796822 253683010
4267 253683010 242158106 231880062 222859492 215365798 209550022 205549827 203278544 202610317
4259 202610317 203250318 204605288 205496300 205243310 203996671 202284701 199961532 196684272
4251 196684272 191712667 184297134 174380450 163175324 151979962 141835867 132432006 123593573
4243A23593573q162302p968637p473795o833025n844556n219439m724610m223169
4235G3144040l881484l495105k970458k942236k640775k129787k126390j557485
4227E1400320j503479j695781j761833j474387j367807j385285r39380r45567
4219D0326801r73779r60728j109723j090487p93545j158890r20954p68612o11724
4210C1938359m98320o39523p55390o70327p72754p63522q55906n98857p55089
4201B5628671m48503n22820n63754k75871o71265q24932n74781r9006l07893m26435
4191B0913411n42263n05093m84285k05637m02386l35818n40788l93576n68556
4182A6935009k33605k85653j13093l52783m50495k66050m54877k25216m6776k73069
$$ plain form
4243 123593573 115431271 107462634 99988839 93155814 87311258 82091819 77367209 73144040
4235 73144040 69262556 65767451 62796993 59854757 57213982 55084195 52957805 51400320
4227 51400320 49896841 48201060 46439227 44964840 43597033 42211748 41272368 40326801
4219 40326801 39353022 38392294 37282571 36192084 35398539 34239649 33318695 32550083 31938359
4210 31938359 31440039 30800516 30045126 29374799 28602045 27838523 26982617 26383760 25628671
4201 25628671 25180168 24657348 24093594 23817723 23146458 22321526 21746745 21647739 21339846 20913411
4191 20913411 20371148 19866055 19381770 19176133 18773747 18437929 17897141 17503565 16935009
4182 16935009 16701404 16415751 16302658 15949875 15499380 15233330 14778453 14553237 14506461 14233392
4172A4233392Q1866j81467o6636j90212k67277l40057j81984n7726l25957j61080
4162A2542862q5219j56200q1821k97p8622j84338j30345j58116L7710M8191j74648
4151A1579157J6630j07682o2228m3971j84280J45338m2473p6725K64578p3362
4141A1414982J50515j69810K81678J14178Q4879R1675j10738K87752K7262J55427
4131A2327800J89290J54435M32814Q1245J90382K60091N12826L50345L23950N43010
4121A5366188M87486K69534J74992J15794J71549K45676O31607O46230O27827
4112A8736883O08101O27475Q46505J062061J366058J452978J862478J942230K176992
4103C0681761K527414L121874M140989N069561N678902P166501Q983996J1451179
$$ plain form
4172 14233392 14315258 14133791 14067155 13876943 13609666 13269609 13087625 13029899 12703942 12542862
4162 12542862 12457643 12301443 12219622 12219325 12140703 11956365 11826020 11667904 11705614 11753805 11579157
4151 11579157 11595787 11488105 11425877 11381906 11197626 11342964 11300491 11223766 11488344 11414982
4141 11414982 11565497 11395687 11677365 11791543 11876422 11968097 11857359 12145111 12172373 12327800
4131 12327800 12517090 12671525 13104339 13185584 13375966 13636057 14148883 14499228 14823178 15366188
4121 15366188 15853674 16123208 16298200 16413994 16585543 16831219 17462826 18109056 18736883
4112 18736883 19344984 19972459 20818964 21881025 23247083 24700061 26562539 28504769 30681761
4103 30681761 33209175 36331049 40472038 45541599 51220501 58387002 67370998 78822177
4095G8822177J4637002J7093328J6035986P386525m132088j0474192j0224235
4088A09144503o555844j895307L057539P058867J1240787J3875173J0988118J925910
4080A48839746q524228j1788460r738220m649274J109319O391769R874356P211147
4072A38726155j523942r800284j2633883j0878990p059295k696911J225655M971536
4064A00330041Q393251Q902072L852675o224849j3879965j5582768j3396957j0135802
4056F2257698p853424n875054m591417l655729k951918k718081k167369k262433
4048C0182273j843148j495773j487760j196194j238716q63675p57167p50332p60431
4039A9789077p33603j057558p86532m53575o83877o14338j26485n17974m14296
$$ plain form
4095 78822177 93459179 110552507 126588493 133975018 129842930 119368738 109144503
4088 109144503 102588659 100693352 103750891 110809758 122050545 135925718 146913836 148839746
4080 148839746 140315518 128527058 118788838 114139564 115248883 121640652 131515008 138726155
4072 138726155 137202213 127401929 114768046 103889056 96829761 94132850 95358505 100330041
4064 100330041 108723292 117625364 121478039 115253190 101373225 85790457 72393500 62257698
4056 62257698 54404274 48529220 43937803 40282074 37330156 34612075 32444706 30182273
4048 30182273 28339125 26843352 25355592 24159398 22920682 22057007 21299840 20549508 19789077
4039 19789077 19055474 17997916 17211384 16757809 16073932 15459594 15333109 14815135 14400839
4030A4400839l72187l93102m46414l58327j19737m49692k16239j14086l5699k45245
4020A1650111l25339k37682k80839j66368k38179l06303q703j21099k69593k49513
4010I446493k32205j85596j86001k01459l66992j99018j31457j81547K5538j65933
4000G621823J67621k27210k59114j48244p9524j9683p1431o7756j63051j52530
3990F600901M2850P2629j64073l43133J01050j98634l8472J434O6109j11878j23617
3979E905166n5832k70152j72729l2044p8178k61501l7029p4533J0260P547j32205
3968D808770K23064N73k2818P4313n8972m1217m2283q6547k70897k51735J69260
3957D501511P0521n4282J20977Q1851j19687k99537p5649J3336R9334q6890p1171
$$ plain form
4030 14400839 14028652 13635550 13189136 12830809 12711072 12261380 12045141 11931055 11895356 11650111
4020 11650111 11324772 11087090 10806251 10639883 10401704 10095401 10086698 9965599 9696006 9446493
4010 9446493 9214288 9028692 8842691 8641232 8274240 8075222 7943765 7762218 7787756 7621823
4000 7621823 7789444 7562234 7303120 7154876 7075352 7055669 6984238 6916482 6753431 6600901
3990 6600901 6643751 6716380 6552307 6209174 6310224 6111590 6073118 6074552 6140661 6028783 5905166
3979 5905166 5849334 5579182 5406453 5374409 5296231 5034730 4997701 4923168 4933428 4940975 4808770
3968 4808770 5031834 5032407 5009589 5083902 5024930 4983713 4941430 4854883 4583986 4332251 4501511
3957 4501511 4572032 4517750 4638727 4720578 4600891 4301354 4225705 4239041 4338375 4251485 4180314
3946D180314L5597K15406P898o4397k57811P405Q5893J49690j85787p4162k725
3935D097321k11404J36908k01248l6206p9227J37637J04609Q131J11203k5628
3925D042096j34694o604O8599j1240K4501K03325n3613J3570o1708j11733k9456
3914C943043j67962Q3740p5667k8293K17107P6550j81000P0325n1492j15006o6962
3903C704383q2962J36423J97913J78920J4144p4096q0225r0538j87267J53943
3893C870638j05819L6366R4816K34430K17909j79528j3134k77718m8853J64803
3883C993910J01437j05357Q7018J15520j3408n7809J01450J8533p7395r4006J27538
3872D197431J02428J36151L4469j8148N8298J97857n6824J25207L08772L23923
$$ plain form
3946 4180314 4215911 4431317 4439215 4374818 4117007 4124412 4210305 4359995 4174208 4100046 4097321
3935 4097321 3885917 4022825 3821577 3785371 3706144 3843781 3948390 3956521 4067724 4042096
3925 4042096 3907402 3900798 3969397 3958157 3982658 4185983 4132370 4145940 4084232 3972499 3943043
3914 3943043 3775081 3858821 3783154 3754861 3971968 4048518 3867518 3937843 3886351 3771345 3704383
3903 3704383 3621421 3757844 3955757 4134677 4148821 4074725 3994500 3903962 3716695 3870638
3893 3870638 3764819 3801185 3896001 4130431 4348340 4168812 4155678 3877960 3829107 3993910
3883 3993910 4095347 3989990 4077008 4192528 4179120 4121311 4222761 4241294 4163899 4069893 4197431
3872 4197431 4299859 4436010 4470479 4452331 4510629 4708486 4651662 4776869 5085641 5409564
3862E409564M77817L74520k0034j39223j01356N9593n5380J74165L35773M57683
3852F973122N01010M57652L25777L1795l95588m79117m22372n099m5517r8632
3842F843031j032M678J36541m3518J30188j08256P8001J69718m0690J39517j41792
3831G166386j37505k48175k02286k16971l39513l55002m12438N059l06461j2707
3821D940387j01431l78027j04274K9022L41290O8842l17755j64111j64087K20393
3811D370249p535k8902m4464j48485l7820K93716J23946O4142r9552N5315p5967
3800D464643K43238N7884p0238O8153p2605N3317K46738J28866q8195K19374J19181
3789E370356l0372K50111L21547o1286J07924o4745P9738M3011L36868K15360
$$ plain form
3862 5409564 5887381 6261901 6241867 6102644 6001288 6060881 6005501 6179666 6515439 6973122
3852 6973122 7474132 7931784 8257561 8289356 7893768 7414651 6992279 6987180 6941663 6843031
3842 6843031 6841999 6846677 6983218 6939700 7069888 6961632 7039633 7209351 7168661 7308178 7166386
3831 7166386 7028881 6780706 6578420 6361449 6021936 5666934 5254496 5259555 4953094 4940387
3821 4940387 4838956 4460929 4356655 4385677 4726967 4795809 4478054 4313943 4149856 4370249
3811 4370249 4362714 4333812 4289348 4140863 4103043 4396759 4520705 4584847 4485295 4540610 4464643
3800 4464643 4707881 4765765 4695527 4763680 4691075 4744392 4991130 5119996 5031801 5251175 5370356
3789 5370356 5339984 5590095 5911642 5850356 5958280 5893535 5973273 6016284 6353152 6568512
3779F568512j27061K34968K74394J90138R2891K12429L3044J50915R2572J92070
3769G914872L47217P5504R4501L20489L37296K23363J64618K96804L17152M14824
3759A0506640M75028L20394R5879K91790M52519N14377O76258N34598N47113N47341
3749A4961937P60621P39251R76190P84836J140160J298292J388777J616588J832337
3740B5498989J983078K108724K264911K186583K018144J699169J368938J225456
3732D0353992J062389P69570O39776O52917R68241J515947J803988K381611L039729
3723E3188160L579793M201049L838739L337137K517079J983878J920590J689328
3715G6255753J921675J977510J901842J729702J327606J588645J916109K365157
$$ plain form
3779 6568512 6441451 6676419 6950813 7140951 7233842 7446271 7479315 7630230 7722802 7914872
3769 7914872 8262089 8337593 8432094 8752583 9089879 9313242 9477860 9774664 10091816 10506640
3759 10506640 10981668 11302062 11397941 11689731 12142250 12656627 13332885 13867483 14414596 14961937
3749 14961937 15722558 16461809 17437999 18222835 19362995 20661287 22050064 23666652 25498989
3740 25498989 27482067 29590791 31855702 34042285 36060429 37759598 39128536 40353992
3732 40353992 41416381 42185951 42825727 43478644 44446885 45962832 47766820 50148431 53188160
3723 53188160 56767953 60969002 64807741 68144878 70661957 72645835 74566425 76255753
3715 76255753 78177428 80154938 82056780 83786482 85114088 86702733 88618842 90983999
3707I0983999K586012K750434K416178J733632J536104J879892L049338M404093
3699A11339682N822823P234093P382068N959157K713694O87572K62003Q23619
3691A42224711J595263K026682K302837J728725J524208J101933R40607R73712
3683A54418678O77460K87261j70480q11361n80212k34648J102652K808955M548302
3674A62046607O285354P910177Q781981P875683O334929M994850M427447M842647
3666B13499675N849298N454407L189519J907679J943052K146001J626076k92469
3658B35323238j673816k241465j357307q19441J72630J486646K846539L952108
3650B37689132L929799L474912K569225P61184r46731k437906k878853j853346
$$ plain form
3707 90983999 93570011 96320445 98736623 100470255 102006359 103886251 106935589 111339682
3699 111339682 117162505 124396598 131778666 137737823 140451517 141139089 141401092 142224711
3691 142224711 143819974 145846656 148149493 149878218 151402426 152504359 153444966 154418678
3683 154418678 155096138 155383399 155212919 154401558 153821346 153586698 154689350 157498305 162046607
3674 162046607 168331961 176242138 185024119 192899802 199234731 204229581 208657028 213499675
3666 213499675 219348973 224803380 227992899 229900578 231843630 233989631 235615707 235323238
3658 235323238 233649422 231407957 230050650 229231209 229403839 230890485 233737024 237689132
3650 237689132 241618931 245093843 247663068 248424252 247477521 245039615 242160762 240307416
3642B40307416k89062J241655K020861K934770K591982J799562O15820j312421
3634B49910583k590843k234804j228059n10265j261769l451671m476030l909366
3626B30247776l002598l447473n804522q562941r335251q555604o848259m971137
3618A79719991l164378j211062Q048L76906k5039j19026m68933j104901j605739
3609A72405867j918980k385152k854066l656468l519669k473768j607234n53096
3601A53437434Q2984k85060k368567n222926o991871p416573o409788m918532
3593A19907101l503017k588338j859510j808863k437579l289453l584513l044802
3585I7791026k788642k328966k067666j754286j758953j617453j597672j458943
$$ plain form
3642 240307416 240018354 241260009 243280870 246215640 248807622 250607184 251223004 249910583
3634 249910583 247319740 245084936 243856877 243346612 242084843 238633172 234157142 230247776
3626 230247776 227245178 223797705 217993183 209430242 200094991 191539387 184691128 179719991
3618 179719991 176555613 175344551 175352599 175729505 175704466 175585440 175116507 174011606 172405867
3609 172405867 170486887 168101735 165247669 161591201 158071532 155597764 153990530 153437434
3601 153437434 153520418 153235358 150866791 145643865 138651994 131235421 124825633 119907101
3593 119907101 116404084 113815746 111956236 110147373 107709794 104420341 100835828 97791026
3585 97791026 95002384 92673418 90605752 88851466 87092513 85475060 83877388 82418445
3577H2418445j921420k112875k787041l160669l745288l937646l716781l217197
3569E7819528k181515k000602j574427j509159j221651j477446j491074j353886
3561D5009768j313726j271568j290203j740652k006879k061658j961136j811652
3553C1552294j567548j669777j499550j147558j084652j101535j005332r24907
3545B1551435p15868j011042p77329n44685o07040o87005n33656o60824m35001
3536A5578985l42814m30072l86543m93173m30073j75294m08203m14088k29250
3527A2269475m52071k89186k88572k24353k55624k86461k71816j49203o9780j20568
3517I861841j03419k46957m70707k27348o5556M0868k45419k96400k66361j28210
$$ plain form
3577 82418445 80497025 78384150 75597109 72436440 68691152 64753506 61036725 57819528
3569 57819528 55638013 53637411 52062984 50553825 49332174 47854728 46363654 45009768
3561 45009768 43696042 42424474 41134271 39393619 37386740 35325082 33363946 31552294
3553 31552294 29984746 28314969 26815419 25667861 24583209 23481674 22476342 21551435
3545 21551435 20835567 19824525 19047196 18502511 17895471 17208466 16674810 16013986 15578985
3536 15578985 15236171 14806099 14419556 13926383 13496310 13321016 12912813 12498725 12269475
3527 12269475 11817404 11528218 11239646 11015293 10759669 10473208 10201392 10052189 9982409 9861841
3517 9861841 9758422 9511465 9040758 8813410 8747854 8788722 8543303 8246903 7980542 7852332
3507G852332O5261k67934l54052j0820j41519l0467Q0636k2779k26383k56716
3497F687559l0974Q841m8892j79110p0906j11557k9764J7261r6154k9794j34545
3486E981965j0203j90358M9050m8326l5180k7140p2099j01355j40496M4045q7033
3475E362870j31880L57427J32287j83276K778j98357K1413J31194O2388l0657
3465E526187L5272K17356n2816O4408l464j17362r3203K63067L44044P6138k8869
3454F230758R3830J18920n4148J52681K67044O6385L91419M69116M40233L56608
3444H532846N71010N58234R46256J047519R01667J088807J582112J912109J719187
3435A8859747J606267J611144J083832K33528q22760j328619j686085j788648
$$ plain form
3507 7852332 7917593 7649659 7295607 7284787 7143268 7112801 7193437 7170658 6944275 6687559
3497 6687559 6656585 6665426 6616534 6437424 6366518 6254961 6225197 6242458 6146304 6116510 5981965
3486 5981965 5971762 5781404 5830454 5782128 5746948 5719808 5647709 5546354 5405858 5449903 5362870
3475 5362870 5230990 5588417 5720704 5537428 5540206 5341849 5363262 5494456 5556844 5526187
3465 5526187 5561459 5778815 5725999 5790407 5786943 5669581 5576378 5839445 6183489 6259627 6230758
3454 6230758 6324588 6443508 6389360 6542041 6809085 6875470 7266889 7736005 8176238 8532846
3444 8532846 9103856 9662090 10608346 11655865 12557532 13646339 15228451 17140560 18859747
3435 18859747 20466014 22077158 23160990 23394518 22571758 21243139 19557054 17768406
3427A7768406j622479j739577j312830r33275r04772q22618p43139o56345n64534
3418H468837l68685l26025j96977l26227l17487j77598m77710j8172l20617j75353
3408E763986k74249j31383M6024j02613q6161k9653n0386J50521j98208k68110
3398D819768j48202n0390n0979J17569l8365l05013P2999j27085q6143N4793n4291
3387D204661l3597k08581j13052j39289Q3885l8644j59396J13891n6536p3870
3377C579472L0726l3962k5244n2331J11518m3808j21295q8511l0447l8352r0860
3366C196906N849L2948j11833p1741r0426R1062J16046j9021J658k22169m3873
3355B885406p5978Q0426j8007j57380K51189l8582L6175K0750k44055j90187L9749
$$ plain form
3427 17768406 16145927 14406350 13093520 12160245 11255473 10432855 9689716 9033371 8468837
3418 8468837 8100152 7774127 7577150 7250923 6933436 6755838 6278128 6259956 5939339 5763986
3408 5763986 5489737 5358354 5404378 5301765 5215604 5185951 5135565 5286086 5087878 4819768
3398 4819768 4671566 4621176 4570197 4687766 4649401 4344388 4417387 4290302 4204159 4258952 4204661
3387 4204661 4171064 3962483 3849431 3710142 3794027 3755383 3595987 3709878 3653342 3579472
3377 3579472 3610198 3576236 3550992 3498661 3610179 3566371 3445076 3356565 3326118 3287766 3196906
3366 3196906 3202755 3235703 3123870 3052129 2961703 3052765 3168811 3149790 3151448 2929279 2885406
3355 2885406 2809428 2889854 2871847 2714467 2965656 2927074 2963249 2983999 2739944 2549757 2589506
3344B589506J05045J08558n7308n9905J01590o80o7582q6095N7112k65401o9307
3333B355533J18998O7707L1371O6528l013m32389J15819N3379J26813O9224l5230
3322B534740M7285k31326J93977l33963j41469R5813R7705N8895P2619o7191k76246
3311B050839j75826J59520l5898p2824J88045o3656M0920r6742J49821j39458
3301B004741O3051j5966J09765K63275j45179j744o2121K8080M1396k96719J38933
3290B127512J97837M603M3407L66394L15479L67314K28459j0139k47638k99725
3280C093503j90981l58903j49964l6923o143j57912n5485k03R7601k53966J83411
3269B164035N9660k53031j52361j9842O1010M7192m1664n9790J51916M0446o4108
$$ plain form
3344 2589506 2694551 2803109 2745801 2685896 2787486 2786806 2719224 2633129 2690241 2424840 2355533
3333 2355533 2474531 2542238 2573609 2640137 2637124 2204735 2320554 2373933 2500746 2569970 2534740
3322 2534740 2582025 2350699 2544676 2210713 2069244 2165057 2262762 2321657 2394276 2327085 2050839
3311 2050839 1875013 2034533 1998635 1925811 2113856 2050200 2091120 1994378 2144199 2004741
3301 2004741 2067792 2051826 2161591 2424866 2279687 2277943 2215822 2243902 2285298 1988579 2127512
3290 2127512 2325349 2329952 2373359 2739753 3055232 3422546 3651005 3640866 3393228 3093503
3280 3093503 2902522 2543619 2393655 2356732 2350589 2192677 2137192 2136989 2234590 1980624 2164035
3269 2164035 2223695 1970664 1818303 1798461 1859471 1906663 1864999 1805209 1957125 1997571 1933463
3258A933463r5038O8018N6173K17033l9863L6448r961k36963O7519p737J06364
3247B095456k1205j2197j08809J10546j3505j0128N2787K27849Q135R4448k6686
3236B396691J14530j58341j03139J24314n2324P6858J40497L8990Q720J76480
3226B763276R1687P4841j13991Q5636K48069j143n0965K36508Q7861j33265o3018
3215C225496P997j4885n9470K18010q410J09857j08868M4453J68098J84935J79067
3204C946280J25926Q3927J00347J01809K13903L51918K08848J26527k27587K40186
3194E272084J90154j8692L01860J29916K9647L1988J11859K59442J21618K12987
3184F642863K20618P4395J17838K36190K80747J83952K61897K69224L54825L19487
$$ plain form
3258 1933463 1838425 1906443 1962616 2179649 2139786 2176234 2166273 1929310 1996829 1989092 2095456
3247 2095456 2074251 2062054 1953245 2063791 2050286 2040158 2092945 2320794 2328929 2423377 2396691
3236 2396691 2511221 2352880 2249741 2374055 2321731 2398589 2539086 2578076 2586796 2763276
3226 2763276 2854963 2929804 2815813 2901449 3149518 3148375 3097410 3333918 3421779 3288514 3225496
3215 3225496 3233493 3218608 3159138 3377148 3368738 3478595 3369727 3414180 3582278 3767213 3946280
3204 3946280 4072206 4156133 4256480 4358289 4572192 4924110 5132958 5259485 5031898 5272084
3194 5272084 5462238 5443546 5745406 5875322 5904969 5936957 6048816 6308258 6429876 6642863
3184 6642863 6863481 6937876 7055714 7291904 7572651 7756603 8018500 8287724 8642549 8962036
3174H962036M22329K76584J60828N28084J58969L21310M75628M33462O85727Q05511
3164A3230468Q22590J022481J011642J253394J256251J337441J145767R62223
3156B2042257R89241O20396L68677k80861k81878o78337j066961j013211j086663
3147A9612660q85754j025083n82685p68702p82770p57432q24205p54206o47678
3138A2584145q15084m81676n39967n33086p20615l87243m75731m41147l33386
3129G856210n57545k80605n58295k25413j06748q8154l64571m83624m1524k11071
3119D938660r6752j19511k97998j99137j21895j37913n5418k33519j7626k12755
3109C446136l3183k10936J3160K9290p4492r8645l00660j74482j5715R2787j30048
$$ plain form
3174 8962036 9384365 9660949 9821777 10349861 10508830 10830140 11305768 11739230 12424957 13230468
3164 13230468 14053058 15075539 16087181 17340575 18596826 19934267 21080034 22042257
3156 22042257 23031498 23651894 24020571 23739710 23457832 22779495 21712534 20699323 19612660
3147 19612660 18726906 17701823 17119138 16350436 15567666 14810234 13986029 13231823 12584145
3138 12584145 11769061 11287385 10747418 10214332 9493717 9106474 8630743 8189596 7856210
3129 7856210 7298665 7018060 6459765 6234352 6127604 6039450 5674879 5191255 5149731 4938660
3119 4938660 4841908 4722397 4424399 4225262 4103367 3965454 3910036 3676517 3658891 3446136
3109 3446136 3412953 3202017 3215177 3244467 3169975 3071330 2770670 2596188 2580473 2673260 2543212
3098B543212Q0387n43k33586j32353j1733L9843J05088m0486j94060o0006o3552
3087B032211Q7540l3661j27841o7530j08309j0090n7431L4263J33145k18521j19248
3076A544528P8543Q7438l37981J87445J02727k59247R1750j32156P2357k6832
3066A408572J2090L5836k20842p1680R5669Q7064j23739m8338p638j46877J26846
3055A146963k16263J96230K00597M9882m0820k39638j43193j34410J2506L94742
3045A226596k32408m6892k00356J37817J04198p8668k05812n8082L7856K45547
3035I29796J3211J82791O8224k25816j53683k50595r4976L31526J53414o6854
3025H87038j00957O8305J74q0266q7098Q9100j61091p2042K01437p8798K04561
$$ plain form
3098 2543212 2623599 2623056 2389470 2257117 2245384 2285227 2390315 2349829 2155769 2095763 2032211
3087 2032211 2119751 2086090 1958249 1890719 1782410 1772320 1714889 1749152 1882297 1663776 1544528
3076 1544528 1623071 1710509 1372528 1559973 1662700 1403453 1495203 1363047 1435404 1408572
3066 1408572 1420662 1456498 1235656 1163976 1259645 1346709 1222970 1174632 1166994 1020117 1146963
3055 1146963 930700 1126930 1327527 1377409 1336589 1096951 953758 819348 831854 1226596
3045 1226596 994188 947296 746940 884757 988955 910287 704475 646393 684249 929796
3035 929796 943007 1125798 1194022 968206 814523 563928 468952 800478 953892 887038
3025 887038 786081 854386 854560 774294 687196 776296 615205 543163 744600 665802 870363
3014H70363L7326K19211j79723j36494m7384j60546L0441N436J59749q815o2958
3003G26606j36795J38695K278j12246n8146j42748R1352J72673P8196j61201J33641
2992G32305r4291n4649q1137Q3539Q6391l3876j7868k49512o6625P1665K78089
2981F54031L623J11286m567k7796j83010K0852J37891k1605r8093o7240j29556
2970C95816L7250J24726J92997M6183N8723j28364j06258j44876m9865J83800
2960F10132J49340j17059r2626J55487j33205J91529M0674J21886L5940l4791
2950I27307k2161J28101m7263p852j12422J58206K44692N9733K9042k21332o8816
2939A067235J85838r5473p1270j11403M7622j46284K8351J76030J36793q888j44808
$$ plain form
3014 870363 907689 1126900 947177 810683 763299 602753 633194 638630 798379 789564 726606
3003 726606 589811 728506 730784 618538 560392 417644 508996 681669 759865 598664 732305
2992 732305 638014 583365 502228 585767 672158 638282 620414 370902 304277 375942 654031
2981 654031 657654 768940 764373 736577 553567 574419 712310 690705 592612 525372 395816
2970 395816 433066 557792 750789 796972 855695 727331 621073 476197 426332 610132
2960 610132 759472 642413 549787 705274 572069 763598 804272 926158 962098 927307
2950 927307 905146 1033247 985984 978132 865710 1023916 1268608 1328341 1357383 1136051 1067235
2939 1067235 1253073 1157600 1086330 974927 1022549 876265 904616 1080646 1217439 1208551 1063743
2928A063743R8780R4011J15328J8646j19654K84550M7887J09185J39237r7951
2918A753762O9024l7030J33607K16021k16655Q5691J01811K70852j14275j79367
2908B083441k2762j94763N0780L4620K17830M6567L9930J45452j36732P4041r9774
2897B238630J53424J6516R6496j38100n8083Q3448K8289Q1141N2420K05443J22004
2886B881628j7332K44382J44423K57073J45290N0907L06926K52032K24584M18165
2876D908078L07249L96942L45521M96059N15430K25460N56702J77656J28540K03263
2866H260900J69667P2609j92861R6605j87677L2729O2980O0057j23853k4638J36972
2855H363490R0230K83593K19636k914L27944M44550N20872P41786R23937J163263
$$ plain form
2928 1063743 1162523 1256534 1371862 1390508 1270854 1555404 1603291 1712476 1851713 1753762
2918 1753762 1822786 1785756 1919363 2135384 1918729 2004420 2106231 2377083 2262808 2083441
2908 2083441 2060679 1865916 1916696 1951316 2169146 2215713 2255643 2401095 2264363 2338404 2238630
2897 2238630 2392054 2408570 2505066 2366966 2308883 2392331 2420620 2501761 2554181 2759624 2881628
2886 2881628 2864296 3108678 3253101 3510174 3655464 3706371 4013297 4265329 4489913 4908078
2876 4908078 5215327 5612269 5957790 6453849 6969279 7194739 7751441 7929097 8057637 8260900
2866 8260900 8430567 8503176 8310315 8406920 8219243 8251972 8314952 8375009 8251156 8226518 8363490
2855 8363490 8453720 8737313 8956949 8954035 9281979 9726529 10247401 10989187 11913124 13076387
2845A3076387J296381J487767J477334Q20387j214175j545649j579906j466580
2837A2351946j029402j035934q87750o06707m62092k39176n10763j64153k41312
2828G174657k19761k84945K691k467j70698J09494R3558J09168K81486L01696
2818G394879L15056K4013j8511m0690l3031m67891l55713n20422m34922m36512
2808E426256k65757o44211m02286j80106j95114j57709o3335k80553k26236k40826
2798B770123L9603j94303j10729k45447j97166k04574J71472J12362l10173m7145
2788A784023j59843k6284k37472l0045L411o3395K7393m2253N2781n8643j43690
2777A105983j21574J92866q2444J804o8293k8915o277J15484j09241j01796r6163
$$ plain form
2845 13076387 14372768 15860535 17337869 18158256 16944081 15398432 13818526 12351946
2837 12351946 11322544 10286610 9398860 8792153 8330061 8090885 7580122 7415969 7174657
2828 7174657 6954896 6669951 6672642 6670175 6499477 6608971 6702529 6811697 7093183 7394879
2818 7394879 7709935 7733948 7715437 7674747 7641716 7173825 6818112 6297690 5862768 5426256
2808 5426256 5160499 4516288 4114002 3933896 3738782 3581073 3517738 3237185 3010949 2770123
2798 2770123 2809726 2615423 2504694 2259247 2062081 1857507 2028979 2141341 1831168 1784023
2788 1784023 1624180 1597896 1360424 1330379 1333790 1270395 1297788 1255535 1308316 1249673 1105983
2777 1105983 984409 1177275 1094831 1096635 1028342 999427 993150 1108634 999393 897597 801434
2766H01434O4221Q3835r3833L5657l7459k12803l32432Q3279K73613j67654j7279
2755D80579J10038K2641P3302k10421P1393N7586K7762q9209M9660J15130n4307
2744F54154j29230l2488o3026K37640j58165l1807k59158j86896j2203J42327
2734A61148M7135R6148M434P7554p1111Q2247k0863p20o6664m4947j67695K90458
2722C87124j52250o6710N634o3049J80480j2888N9523j30967P5764K87389j65720
2711D04330j20884j7234N0396q9144K59345l4415j31850J5788k3579j09712R7804
2700C00845r241M3676j76278J0993J64338l0904j96417j22937Q2971Q4930j08293
2689D3683R8417M2838J03061j4539n6019j58200k3048J08089j7820m3311j1375
$$ plain form
2766 801434 865655 949490 855657 891314 853855 641052 308620 391899 665512 497858 480579
2755 480579 590617 613258 686560 476139 547532 605118 632880 543671 593331 708461 654154
2744 654154 524924 492436 429410 667050 508885 477078 217920 31024 18821 161148
2734 161148 208283 304431 308865 386419 315308 397555 376692 375972 309308 264361 96666 387124
2722 387124 234874 168164 173798 110749 291229 278341 337864 206897 282661 570050 404330
2711 404330 283446 266212 316608 227464 486809 452394 320544 336332 312753 203041 300845
2700 300845 291604 335280 159002 169995 334333 303429 107012 -15925 67046 151976 43683
2689 43683 142100 184938 287999 273460 217441 59241 36193 144282 126462 83151 71776
2678G1776J13546J05940n7607r1299j08M282p1444k1114k6728K03377K18592j30775
2666C18438q9873q3023J4999L23060m9119k3822r2483P8246K762l13088Q4242
2655A70339j59673J30952L6680J77294J6136o1235p5771R5034Q6587k70037k7418
2644A18888J40771j08571J23705k7933L9734o5991m7449K6436R9503j04668P9649
2633B74074k9124Q6424Q1569J04147l106q3253k38674j6848J09578J09158m7670
2622C46275j07749J33239J81166r8398J7978j17206K6181j39546J80480N6571
2612D78991r7432J71255J08268j11667m3166l0513J62527k53161M4982J89874
2602F19958n0473N1353j02806K3802p484q2730K14299k6256K6907k20811m3073
$$ plain form
2678 71776 185322 291262 233655 142356 142248 146530 75086 53972 27244 230621 449213 318438
2666 318438 228565 145542 160541 483601 434482 410660 318177 396423 399185 86097 170339
2655 170339 10666 141618 178298 355592 371728 310493 234722 329756 416343 146306 118888
2644 118888 259659 151088 274793 246860 286594 220603 173154 199590 299093 194425 274074
2633 274074 244950 331374 412943 517090 513984 430731 192057 175209 284787 393945 346275
2622 346275 238526 371765 552931 454533 472511 355305 381486 241940 422420 478991
2612 478991 381559 552814 661082 549415 506249 475736 638263 385102 430084 619958
2602 619958 569485 620838 518032 541834 534350 451620 665919 639663 666570 445759 402686
2591D02686J5287K49650P8398j71363J2644r6872J60881K13699r3681j45611J3233
2580F38951J5692j282o8140Q9706O551j1924P003O0226J37980r7400p0704K4122
2568G30781l6202k2844q6615J02250k8093j01875j33363K5205r0919K84667r430
2557F33562j06848J2783p6200K4000N0380J65383K2233j20243J8360k4964k27371
2546C71075J37858N7515L7080k5819r2856Q2650k1513J62618l3400J94842Q0368
2535I50418l12778k05526j6607J04822Q807n6101M4646k45385j0446J31982Q6272
2524D80104j02700J32312n4060q946q1076l4344J44109O4459j98796j9938M6633
2513C67757R8817N6439k69650O168j9319m5675K3694M0981M4117m9920J00560
$$ plain form
2591 402686 417973 667623 746021 574658 587302 490430 651311 865010 771329 625718 638951
2580 638951 654643 653361 585221 674927 681478 669554 676557 736783 874763 777363 706659 730781
2568 730781 694579 671735 585120 687370 659277 557402 424039 449244 358325 642992 633562
2557 633562 526714 539497 463297 487297 537677 703060 725293 605050 623410 598446 371075
2546 371075 508933 566448 603528 577709 484853 567503 545990 708608 675208 870050 950418
2535 950418 637640 432114 415507 520329 529136 473035 517681 272296 261850 393832 480104
2524 480104 377404 509716 455656 446710 365634 331290 475399 539858 341062 321124 367757
2513 367757 466574 523013 253363 259531 240212 194537 218231 259212 303329 253409 353969
2502C53969j28160J3160l8690Q0777P1541j638J28935k88602J62802K5741j45410
2491B34425R2828q6330m41k9648K74680j50397q2542J34160N8237l06033j97417
2480e8478O140J40723O401L4739q9246P0580N4787m8830k3081p0628P5765R4599
2468A93471o9012O1370k6984j5049K6085o4112M3958K30248o7678k88307Q0185
2457A04175j59631J43127K33211j58863j02062R7640m404J16137o0007l3960o9454
2446A05909J28482n0149k2762L2800k4404J93025n7179k61938O9788M3818K5476
2435A82866n1526J03067j47503J7346L6886N2522J24254j18489p9684K5465m224
2424A40980q1741j07179J9958N4519R828L3128O9590l5047O2024j2327M6273r2115
$$ plain form
2502 353969 225809 238969 200279 281056 352597 350959 479894 191292 354094 379835 234425
2491 234425 327253 240923 240482 210834 485514 335117 252575 386735 444972 138939 -58478
2480 -58478 -52338 88385 94786 129525 40279 110859 165646 116816 93735 23107 98872 193471
2468 193471 124459 185829 158845 143796 169881 105769 149727 379975 312297 23990 104175
2457 104175 -55456 87671 320882 162019 59957 157597 153193 269330 209323 175363 105909
2446 105909 234391 184242 161480 194280 169876 362901 305722 43784 113572 157390 182866
2435 182866 131340 234407 86904 104250 141136 193658 317912 199423 119739 145204 140980
2424 140980 59239 -47940 -27982 26537 36365 69493 139083 104036 166060 153733 200006 107891
2412A07891p1698j60664k1057P5453Q1204L0782J71760J23019m0219j32988k43595
2401h0112K83965O7607m6208k0716k25294Q2766J26267o8689j64515q0265K79313
2390A54119J29364j48950n6737o187N5532J67861k5363q7636l08430N5256J63233
2379I2062R2181j38464m7098J10986J15294N9206M3352M0929j38551j09871r165
2368A10861O322J18263j69036p7237J91246n9872K167k80529J27806J53267n7911
2357F5347J6756N3066P7568M8100j76360n768j03275P7112j9255O3434J18821
2346B15546J0713J48896n5074j06906j30951R7978K2547j70651j30702Q9646P6776
2335F7818K8386J14681m2496K3807K908j46431q1419J37516J62215m9368N437
$$ plain form
2412 107891 36193 -124471 -145528 -70075 11129 41911 213671 336690 296471 163483 -80112
2401 -80112 203853 271460 225252 204536 -20758 62008 188275 119586 -44929 -125194 154119
2390 154119 283483 134533 77796 71609 127141 295002 269639 182003 -126427 -71171 92062
2379 92062 184243 45779 -1319 109667 224961 284167 327519 368448 229897 120026 110861
2368 110861 117183 235446 66410 -10827 180419 120547 122714 -157815 -30009 123258 65347
2357 65347 82103 135169 212737 260837 84477 78709 -24566 52546 33291 96725 215546
2346 215546 226259 375155 320081 213175 82224 180202 202749 32098 -98604 -8958 67818
2335 67818 96204 210885 168389 192196 195104 48673 -32746 104770 266985 217617 223054
2324B23054L9549j33105p8212P649J89378j26198j13802O9408k58901Q0743K31836
2313A31399M6298k1071L7743j15815m2162L9167K3726q7473o3689K48651j4071
2302A82703L3816j11525R7048p0947p8607n6220r4854L3540J55144J08682n2432
2291A46348M2662J8164k9649j48789J8545K0763o949l1357Q9640j18291L794R6855
2279A01736j07801N4042j41983J15110Q1969l3140J12342k23624j6199n147J01037
2268C8342j02326L40217l3543q4395q8379j55M8807n4394J80303j86214o1205
2257b942P7066k9330j50724J33451K83428N8158j65922k57764L7537J4488j6971
2246a9525J50518j08338p4154K52606M764J33674l5489j23792n739j13214P5837
$$ plain form
2324 223054 262603 129498 51286 58935 248313 122115 8313 77721 -181180 -100437 131399
2313 131399 177697 156626 194369 78554 36392 75559 99285 11812 -51877 196774 182703
2302 182703 216519 104994 202042 131095 52488 -3732 -98586 -65046 90098 198780 146348
2291 146348 189010 207174 177525 28736 47281 68044 61095 29738 119378 1087 4881 101736
2279 101736 -6065 47977 -94006 21104 103073 69933 182275 -41349 -57548 -62695 38342
2268 38342 -63984 276233 242690 158295 69916 69761 118568 64174 244477 58263 -2942
2257 -2942 74124 44794 -105930 27521 310949 369107 203185 -54579 -17042 -2554 -19525
2246 -19525 130993 22655 -51499 201107 205871 339545 304056 180264 174525 61311 137148
2235A37148O9755K5435P5202j99234p5591J31428J91584J9483j9971o8216P718
2224B94741r2021O484N1054j1645P8958J1083m9404M3979j9212l548J03396p163
2212D06702j1103l08281k0236R5685J34821J32365j5581k1580j71755o2783K04675
2201C62929P74q8732j42162J67447n1114j38010K73450P400j17687j82210P941
2190A00026l287R2733K3255J77025m5208J02389j14497P7211K11689m7897k08601
2179C64838k3750J06341J08101N6786J18608p8258j11107j22133J23495K06280
2169G49201m2797l4420j75815N1862M646m7016P4049K60542j11548P9981q8962
2158G19723K6895M8529O2063N1274n499j93235J74669K1905J92353J59973J01326
$$ plain form
2235 137148 206903 232338 307540 108306 32715 164143 355727 375210 355239 287023 294741
2224 294741 202720 209204 260258 248613 327571 338654 289250 333229 314017 310469 413865 406702
2212 406702 395599 87318 67082 162767 297588 429953 414372 392792 221037 158254 362929
2201 362929 363703 274971 132809 300256 249142 111132 384582 391982 274295 92085 100026
2190 100026 96739 189472 212727 389752 344544 446933 332436 409647 621336 573439 364838
2179 364838 341088 447429 555530 612316 730924 652666 541559 419426 542921 749201
2169 749201 706404 671984 496169 548031 552677 505661 579710 840252 728704 808685 719723
2158 719723 746618 795147 857210 908484 902985 709750 884419 906324 1098677 1258650 1359976
2147A359976L5245l8837J07424J07631J51189L89474K07990K7751K649M41446
2137B791938K23913L13602K51068K01070M37373P12584J131449J316239J262122
2128H641358J584306K239947K932083L965347N664770M193082l310145n337149
2120B0573599m221554l560535k389089j756022j123706r58409o01941q26577k26153
2111D909613m58602l54932o6910l43350m27535m92526k72585m8732k94127M5453
2101B195767j48452m1438k90762j19160J1618j2851J77765l35031q9541p4422
2091A273493J06855Q7714k37232m0799j41924n8619j01878J22975J72866k08542
2081I74909j95511l594k03635P3521J83801J40228j47966j41316j06748r8438
$$ plain form
2147 1359976 1395221 1356384 1463808 1571439 1722628 2112102 2320092 2347843 2350492 2791938
2137 2791938 3015851 3329453 3580521 3781591 4218964 4931548 6062997 7379236 8641358
2128 8641358 10225664 12465611 15397694 19363041 25027811 29220893 25910748 20573599
2120 20573599 16352045 12791510 10402421 8646399 7522693 6564284 5962343 5135766 4909613
2111 4909613 4451011 4096079 4029169 3685819 3258284 2765758 2493173 2444441 2150314 2195767
2101 2195767 2047315 2005877 1715115 1595955 1607573 1594722 1772487 1437456 1347915 1273493
2091 1273493 1380348 1468062 1230830 1190031 1048107 989488 887610 1010585 1183451 974909
2081 974909 779398 775804 572169 645690 829491 969719 821753 680437 573689 475251
2071D75251K50461j05272k2861j37208L3694R45J57578o5585K9646l2104q1724
2060E02821J53616p6284k40217P7771J00360l7699j14434k41891K94419p5351
2050C43111m3568J90155J7374k03387q0773J84496k02713J91255k4822q2853Q322
2039B96597k7068p3940m270Q230J59497k7494j7584j22164Q1785J12887k40620
2028A45856J15915N3035j17363o6831j9842J54043J2935M5108j5135J3026k06248
2017A14499r308J81117j27043K78740k17089k88735K29236R0154j05526j22460
2007B3585R0145j06815J41480J83770P3620k01214k0384o5605K5707m5873P8178
1996A76594N146J90726k6679k28398J09046R3107j37582r1714L0746m711n7039
$$ plain form
2071 475251 725712 620440 597579 460371 494065 495010 652588 587003 616649 584545 502821
2060 502821 656437 580153 339936 417707 518067 480368 365934 124043 418462 343111
2050 343111 299543 489698 507072 303685 222912 407408 204695 395950 371128 288275 296597
2039 296597 269529 195589 191319 199549 359046 331552 313968 191804 273589 386476 145856
2028 145856 261771 314806 197443 130612 110770 264813 277748 322856 307721 320747 114499
2017 114499 105191 286308 159265 438005 220916 -67819 161417 251571 146045 23585
2007 23585 113730 6915 148395 332165 405785 204571 184187 118582 144289 98416 176594
1996 176594 181740 372466 345787 117389 226435 319542 181960 90246 120992 116281 59242
1985E9242J3889N2238m2306j27947j9172J50061m6617l778M1964J0391R1718r3163
1973H6520K17721j58998j9521R3954K2131O7124j18325k2414p6935P6401m9447
1962A18211K6887k5934N1312M7533j61786K85793n9315j82617l5676R9905J48822
1951C13135q1005R8421J0992j77831R9892L1608m01510O50K38171J58314l4369
1940B56468j83801k27551L6773P347k039Q5240m8706m7153J18064J29154J90629
1929C14425j67122N969k47302p9209K7669J56853Q3822J0453m0859M3096p9529
1918B8266l8524j95844J54093L34214j53032P9229k07046J59308J05827r9654
1908A66837K13816j38745K2952j57295J20049j74395O5858n7452n3589J1808o583
$$ plain form
1985 59242 73131 125369 83063 -44884 -64056 86005 39388 35610 77574 87965 179683 86520
1973 86520 304241 145243 125722 219676 241807 308931 190606 168192 91257 167658 118211
1962 118211 145098 119164 170476 218009 56223 342016 282701 100084 64408 164313 313135
1951 313135 232130 330551 341543 163712 263604 295212 -106298 -105648 132523 290837 256468
1940 256468 72667 -154884 -118111 -110764 -112803 -27563 -76269 -123422 -5358 123796 314425
1929 314425 147303 153272 -94030 -173239 -145570 11283 95105 105558 64699 107795 28266
1918 28266 -10258 -206102 -52009 282205 129173 208402 1356 160664 266491 166837
1908 166837 380653 241908 264860 107565 227614 53219 119077 61625 8036 19844 13261
1897A3261n7059K82045o4148q9350k0915L0863o613J76808p6858o4296P7325J02161
1885C03224o1540j21471k0163K22575j7303j77062n2826r2599J65676J00553p9839
1874A69225o6007j41790j08475J80234N408P3705r0786j48855J51820p6461K42000
1863A90018J2736m0568L4273j89102J09120k45687J24882J50115J2301j76579
1853a8491j03625J36947m3767l6784N3019J08777N2978k41047J0797Q1314L100
1842C218L5374J5304q3998Q767K3920J32531p1472J29159p2825R9413j83156R4782
1830A31017K0153L6224p9800k27965K05778m7435K6004l6570j09280J55498r3914
1819b0290Q1928P4948J21368j3608j87807j01493n447J33235P8661M6721n8545
$$ plain form
1897 13261 -43798 238247 174099 84749 63834 94697 88084 264892 188034 123738 201063 303224
1885 303224 241684 120213 100050 322625 305322 128260 75434 -17165 148511 249064 169225
1874 169225 103218 -38572 -147047 33187 38595 112300 21514 -127341 24479 -51982 190018
1863 190018 202754 162186 196459 7357 116477 -129210 -4328 145787 158088 -18491
1853 -18491 -122116 14831 -28936 -65720 -12701 96076 149054 -91993 -81196 118 3218
1842 3218 38592 53896 -30102 -21335 2585 135116 63644 192803 119978 219391 36235 131017
1830 131017 151170 187394 107594 -120371 85407 37972 63976 27406 -81874 73624 -20290
1819 -20290 61638 136586 257954 244346 56539 -44954 -50401 82834 161495 208216 149671
1808A49671q9721j39630j46870P5278J77414J12973j21611J85000l62552J37512
1798b2536j69651L72602k7048k70913p0968J04429J43631j8100J22838r2056j07565
1787c5337m3178L5338L05575q0293p728l505j43572j1914r7064J93012o1292l320
1775D6722R1710j02721J00022j11998l7366J18802j11828J11457k30755o1364
1765a87319J74461K32489N9446q5730p5332n7945J00545K10952Q8659j27829l62628
1754c0231J21073j32r59k3060Q142n354J4939j23774j13632J80332p7011p4362
1742a24029R2204j7946j23415R764J1047N6761l3944R5186J43710j58730K37696
1731A88304Q6099j4982j81841p6880q2566O080K81816J02519j55383j87407p063
$$ plain form
1808 149671 59950 -79680 -226550 -151272 26142 139115 17504 202504 -160048 -22536
1798 -22536 -192187 180415 153367 -117546 -188514 -84085 59546 41446 164284 72228 -35337
1787 -35337 -78515 -43177 262398 182105 174377 170872 27300 15386 -81678 111334 50042 46722
1775 46722 138432 35711 135733 23735 -13631 105171 -6657 104800 -125955 -187319
1765 -187319 -12858 219631 279077 193347 118015 60070 160615 371567 460226 332397 -30231
1754 -30231 90842 90710 89751 66691 74833 69479 84418 -39356 -152988 27344 -49667 -124029
1742 -124029 -31825 -49771 -173186 -163422 -152375 -95614 -129558 -34372 109338 -49392 188304
1731 188304 274403 259421 77580 700 -81866 -75786 206030 308549 153166 -34241 -41304
1720d1304J79483Q1936R6256k58374K8525N1550J9135o9865o1961m2491j54790
1709a71900J8427K63431k347P4874o0000J30365k00563p2254r6774k1636Q4329
1698e4048K1214Q7353j25906J36823L7021k18345J17125O642J42940k6280j54780
1687c0241P4316l2259J18388o5170j79418j17562J06517J85122J28539j90553
1677b321j94203O0370q4662O2521l3196J48022O0710K7263R650l1059m548L1888
1665E0435o2099m0521K9319m1837l9818J24691J60898N925k17963j02406m2194
1654a75570M4027J6792J34692m1849j77605L3331k3645J66812l8536R1142q4313
1643e4722J27044R420j42712k5786R0316k9297j10942j56642J9165K22779M4705
$$ plain form
1720 -41304 138179 220115 316371 57997 86522 138072 157207 87342 25381 -17110 -171900
1709 -171900 -153473 109958 107611 182485 122485 252850 52287 -19967 -116741 -138377 -54048
1698 -54048 -32834 54519 -71387 65436 102457 -115888 1237 7879 150819 124539 -30241
1687 -30241 44075 11816 130204 65034 -114384 -231946 -125429 59693 188232 -2321
1677 -2321 -196524 -136154 -220816 -158295 -191491 -43469 17241 44504 54154 23095 18547 50435
1665 50435 -11664 -52185 -22866 -64703 -104521 20170 181068 186993 -30970 -133376 -175570
1654 -175570 -131543 -114751 19941 -21908 -199513 -166182 -189827 -23015 -61551 29591 -54722
1643 -54722 72322 81742 -60970 -86756 3560 -25737 -136679 -293321 -274156 -51377 -6672
1632f672j267k8325n0804r9962j20780K21918K4440J55503j59981j2099P9239
1621A210k1052P3506p682n960M335J09225m3131j62881m3438J9042K12933r1661
1609D4446j1112J11190K1671p9463k8830r4245r4225j08590L03098j424O5551
1598A28067k3686k2112q8275O3779P9318M8902J80139j27839j11238j34651o4270
1587g1866O4539q1482O0530J96530m9944Q1796J36941k35576k41986J17848K0406
1576b264J2374j8456O4187M56J2610j87599N8496o384j37878L3083K17335L07812
1564C53772k89738j91435l2179N0964N2284l2641m0334l7928R5231k7482K9415
1553g0071p4891j17700J90026K6157L1422K9028n8630n961N1768k6664J13323
$$ plain form
1632 -6672 -7939 -36264 -87068 -187030 -307810 -85892 -61452 94051 -65930 -78029 1210
1621 1210 -19842 53664 45982 40022 44357 153582 110451 -52430 -95868 -76826 136107 44446
1609 44446 33334 144524 166195 86732 57902 -36343 -130568 -239158 63940 62516 128067
1598 128067 104381 82269 -6006 57773 137091 185993 366132 238293 127055 -7596 -71866
1587 -71866 -7327 -88809 -28279 168251 118307 200103 337044 101468 -140518 -22670 -2264
1576 -2264 10110 -8346 55841 56297 68907 -118692 -60196 -66580 -204458 -171375 45960 353772
1564 353772 64034 -127401 -159580 -108616 -56332 -88973 -129307 -167235 -72004 -99486 -70071
1553 -70071 -144962 -262662 -72636 -46479 -15057 13971 -44659 -50620 1148 -25516 87807
1542H7807k37751J34410J23884j9917j4178j9675q274k53073o2017R729J29147
1531a29908k1876j7614k3376N4361Q0329j62327o6875j17934J81271K87168J9818
1520H3037l85N1241M1176k32324l786J44559r2180P2728k6415R534j20105j66391
1508b39311K6730n0405K16358O953n4326l8205R28P0883J64088l0173j06719n3011
1496h6210O5985M2770K08989k5590j19493p4459L1116q2550O3011l3858J6125
1485E836o3102N6341j23306J47101j1365K60483j96826m3060N005n3029m206l7243
1473e7371j79191K65223p6285p7384K10815j25007O7451j30744J04064p2065J28291
1462E7797Q8234R8175m7002j03686j79085q836n6229q2832J24485J14007M672
$$ plain form
1542 87807 -149944 -15534 108350 88433 74255 54580 46306 -206767 -268784 -259055 -129908
1531 -129908 -151784 -169398 -192774 -138413 -58084 -220411 -287286 -405220 -223949 63219 83037
1520 83037 82652 133893 175069 -57255 -61041 83518 -8662 64066 37651 47185 -72920 -239311
1508 -239311 -212581 -262986 -46628 -39675 -94001 -132206 -131278 -60395 103693 73520 -33199 -86210
1496 -86210 -20225 22545 231534 205944 86451 11992 43108 -39442 23569 -10289 5836
1485 5836 -57266 -925 -124231 22870 11505 271988 75162 32102 37107 -15922 -20128 -57371
1473 -57371 -236562 28661 -47624 -125008 85807 -39200 28251 -102493 1571 -70494 57797
1462 57797 146031 244206 197204 93518 -85567 -94403 -150632 -233464 -108979 5028 9700
1451I700j21397K04548J20997k57499j37769L3002N5210M1061K21570m8655p1856
1440D8912j57009O3534J1211l7146J69192J4722k38117m1267N2796j7664K46333
1429A15497j9927K7826n1162J6089J5566J15206j48416k7980M2196j58744l1538
1418a05387k9459J10612l228J51652r4875j75522O573j8400j8994L0918l4850
1407a80960l0684O1807J43587N8129j47494K2783j40428m1464Q3044M3983L31245
1396B03548Q2677j11560r4570o748j07193l0000J40156r2869n3966Q5051j0613
1385C913o4326P635l6802j99327N3251K19965K1579r9930K67398j44719M1324
1374F9961k00120q4521J69472j02187j2940J66027J18835j6911l5975j0069r5028
$$ plain form
1451 9700 -111697 92851 213848 -43651 -181420 -148418 -93208 -52147 169423 120768 48912
1440 48912 -108097 -44563 -33352 -70498 98694 113416 -124701 -165968 -113172 -130836 115497
1429 115497 95570 123396 72234 88323 103889 219095 70679 42699 84895 -73849 -105387
1418 -105387 -134846 -24234 -27462 124190 29315 -146207 -139634 -158034 -177028 -146110 -180960
1407 -180960 -211644 -149837 -6250 51879 -95615 -72832 -213260 -254724 -171680 -127697 203548
1396 203548 286225 174665 80095 73347 -33846 -63846 76310 -16559 -70525 14526 3913
1385 3913 -60413 -52778 -89580 -288907 -235656 -15691 5888 -94042 173356 28637 69961
1374 69961 -130159 -214680 -45208 -147395 -160335 5692 124527 107616 71641 61572 -33456
1363c3456K6015R3786K4348R431j4752l3864J31948j29635M1829j22341q8076
1352i4767J7757l1236J09536l12p2827N3310r2208o3968O7378J4889l4753J37580
1340A0379L6365J37817n5217j08000j44186j20417O8239J49787j66348J23548
1330f8033J89049P3836k44521n3505k7088j28848J59279p3491J66325m5599J46765
1319I4169j2847l2601j72692j57757K61497J38066j52985O3145J02751l437q0177
1308D7132m1361Q1026j43399o2560R4643P278O0955k8425N2403j23363k867J20653
1296F2115M8034p1132K3421l4239q0117k1394J30505J0278K1237k05073J95222
1285G8857l4346K3908j85936O6758r1684j57790J80143K9276J8059P0182K1601
$$ plain form
1363 -33456 -7441 86345 110693 120124 105372 71508 203456 73821 115650 -6691 -94767
1352 -94767 -77010 -108246 1290 978 -71849 -18539 -110747 -174715 -107337 -92448 -127201 10379
1340 10379 46744 184561 129344 21344 -122842 -243259 -175020 -25233 -191581 -68033
1330 -68033 121016 194852 -49669 -103174 -130262 -259110 -99831 -173322 -6997 -52596 94169
1319 94169 81322 48721 -123971 -281728 -20231 117835 -35150 27995 130746 127309 47132
1308 47132 5771 86797 -56602 -119162 -24519 -17241 43714 15289 67692 -55671 -58538 62115
1296 62115 110149 39017 62438 28199 -51918 -73312 57193 67471 88708 -116365 78857
1285 78857 44511 68419 -117517 -50759 -142443 -300233 -120090 -90814 -72755 -2573 19028
1274A9028k0064p6596j64207L1257l4869J61290J02184R4794m01q7580R6905j92715
1262g0974n0363o6541l9319K50749L8814Q6322q6328j09206j89079j29205J59045
$$ plain form
1274 19028 -1036 -77632 -241839 -210582 -245451 -84161 18023 112817 112416 24836 121741 -70974
1262 -70974 -121337 -187878 -227197 23552 62366 148688 62360 -46846 -235925 -365130 -206085
$$ [...]
##END NTUPLES=NMR SPECTRUM
##END=
