##TITLE=1H_EC-3059(XII)
 CDCl3, 8 sc, 
 23.9.2019
##JCAMPDX= 6.0         $$ Bruker NMR JCAMP-DX V2.0
##DATA TYPE= NMR FID
##DATA CLASS= NTUPLES
##ORIGIN= UXNMR, Bruker Analytische Messtechnik GmbH
##OWNER= root
$$ XWIN-NMR		Version 3.5
$$ Mon Sep 23 14:19:46 2019 Russian Standard Time (UT+4h)  she@DPX200
##.OBSERVE FREQUENCY= 200.1315
##.OBSERVE NUCLEUS= ^1H
##.DELAY= (6, 6)
##.ACQUISITION MODE= SIMULTANEOUS
##.ACQUISITION SCHEME= undefined
##.AVERAGES= 8
##.DIGITISER RES= 18
##SPECTROMETER/DATA SYSTEM= spect
##.PULSE SEQUENCE= zg30
##.SOLVENT NAME= CDCl3
##.SHIFT REFERENCE= (INTERNAL, CDCl3, 0, 15.7039)
##AUDIT TRAIL= $$ (NUMBER, WHEN, WHO, WHERE, WHAT)
$$ ##TITLE= Audit trail, XWIN-NMR		Version 3.5
$$ ##JCAMPDX= 5.01
$$ ##ORIGIN= Bruker BioSpin GmbH
$$ ##OWNER= she
$$ F:/spectra/data/she/nmr/H-F/1/audita.txt
$$ ##AUDIT TRAIL=  $$ (NUMBER, WHEN, WHO, WHERE, WHAT)
(   1,<2019-09-23 14:18:35.46 +0400>,<she>,<DPX200>,
      <created by zg, POWCHK disabled, PULCHK disabled
       configuration hash MD5:
       00 E9 B6 7A A2 85 ED C7 34 08 36 98 17 FE 4E 26
       data hash MD5: 16K
       85 AA 93 75 08 0B 64 FF 3B 64 BC 4B 62 82 E8 AC>)
$$ ##END=
$$ 
$$ hash MD5
$$ 5A 1E B7 38 C8 ED 17 4C 32 F0 C9 21 81 05 22 DA
##$RELAX= 
##$RELAX= 
##$RELAX= 
##$RELAX= 
##$RELAX= 
##$RELAX= 
$$ Bruker specific parameters
$$ --------------------------
##$DU= <F:/spectra>
##$EXPNO= 1
##$NAME= <H-F>
##$PROCNO= 1
##$TYPE= <nmr>
##$USER= <she>
##$AMP= (0..31)
100 100 100 100 100 100 100 100 100 100 100 100 100 100 100 100 100 100 
100 100 100 100 100 100 100 100 100 100 100 100 100 100 
##$AQSEQ= 0
##$AQ_mod= 1
##$AUNM= <au_zg>
##$AUTOPOS= <>
##$BF1= 200.13
##$BF2= 200.13
##$BF3= 200.13
##$BF4= 200.13
##$BF5= 200.13
##$BF6= 200.13
##$BF7= 200.13
##$BF8= 200.13
##$BYTORDA= 1
##$CFDGTYP= 0
##$CFRGTYP= 5
##$CHEMSTR= <none>
##$CNST= (0..31)
1 1 145 1 1 1 1 1 1 1 1 1 1 1 1 1 1 1 1 1 1 1 1 1 1 1 1 1 1 1 1 1 
##$CPDPRG= <>
##$CPDPRG1= <>
##$CPDPRG2= <>
##$CPDPRG3= <>
##$CPDPRG4= <mlev>
##$CPDPRG5= <mlev>
##$CPDPRG6= <mlev>
##$CPDPRG7= <mlev>
##$CPDPRG8= <mlev>
##$CPDPRGB= <>
##$CPDPRGT= <>
##$D= (0..31)
0 1.2 0 0 0 0 0 0 0 0.06 0 0.03 0 0 0 0 0.0002 0 0 0 0 0 0 0 0 0 0 0 0 
0 0 0 
##$DATE= 1569233914
##$DBL= (0..7)
120 120 120 120 120 120 120 120 
##$DBP= (0..7)
150 150 150 150 150 150 150 150 
##$DBP07= 0
##$DBPNAM0= <>
##$DBPNAM1= <>
##$DBPNAM2= <>
##$DBPNAM3= <>
##$DBPNAM4= <>
##$DBPNAM5= <>
##$DBPNAM6= <>
##$DBPNAM7= <>
##$DBPOAL= (0..7)
0.5 0.5 0.5 0.5 0.5 0.5 0.5 0.5 
##$DBPOFFS= (0..7)
0 0 0 0 0 0 0 0 
##$DE= 6
##$DECBNUC= <off>
##$DECIM= 24
##$DECNUC= <off>
##$DECSTAT= 4
##$DIGMOD= 1
##$DIGTYP= 9
##$DL= (0..7)
0 120 120 120 120 120 120 120 
##$DP= (0..7)
150 150 150 150 150 150 150 150 
##$DP07= 0
##$DPNAME0= <>
##$DPNAME1= <>
##$DPNAME2= <>
##$DPNAME3= <>
##$DPNAME4= <>
##$DPNAME5= <>
##$DPNAME6= <>
##$DPNAME7= <>
##$DPOAL= (0..7)
0.5 0.5 0.5 0.5 0.5 0.5 0.5 0.5 
##$DPOFFS= (0..7)
0 0 0 0 0 0 0 0 
##$DQDMODE= 0
##$DR= 18
##$DS= 0
##$DSLIST= <SSSSSSSSSSSSSSS>
$$ [...]
##$SUBNAM2= <"">
##$SUBNAM3= <"">
##$SUBNAM4= <"">
##$SUBNAM5= <"">
##$SUBNAM6= <"">
##$SUBNAM7= <"">
##$SUBNAM8= <"">
##$SUBNAM9= <"">
##$SW= 24.0689530833862
##$SWIBOX= (0..15)
0 0 2 0 0 0 0 0 0 0 0 0 0 0 0 0 
##$SW_h= 4816.95568400771
##$TD= 16384
##$TD0= 1
##$TE= 0
##$TE2= 300
##$TE3= 300
##$TEG= 300
##$TL= (0..7)
0 120 120 120 120 120 120 120 
##$TP= (0..7)
150 150 150 150 150 150 150 150 
##$TP07= 0
##$TPNAME0= <>
##$TPNAME1= <>
##$TPNAME2= <>
##$TPNAME3= <>
##$TPNAME4= <>
##$TPNAME5= <>
##$TPNAME6= <>
##$TPNAME7= <>
##$TPOAL= (0..7)
0.5 0.5 0.5 0.5 0.5 0.5 0.5 0.5 
##$TPOFFS= (0..7)
0 0 0 0 0 0 0 0 
##$TUNHIN= 0
##$TUNHOUT= 0
##$TUNXOUT= 0
##$USERA1= <user>
##$USERA2= <user>
##$USERA3= <user>
##$USERA4= <user>
##$USERA5= <user>
##$V9= 5
##$VALIST= <valist>
##$VCLIST= <CCCCCCCCCCCCCCC>
##$VD= 0
##$VDLIST= <DDDDDDDDDDDDDDD>
##$VPLIST= <PPPPPPPPPPPPPPP>
##$VTLIST= <TTTTTTTTTTTTTTT>
##$WBST= 1024
##$WBSW= 4
##$XGAIN= (0..3)
0 0 0 0 
##$XL= 0
##$YL= 0
##$YMAX_a= 120854
##$YMIN_a= -202267
##$ZGOPTNS= <>
##$ZL1= 120
##$ZL2= 120
##$ZL3= 120
##$ZL4= 120
##$ABSF1= 10
##$ABSF2= 0
##$ABSG= 5
##$ABSL= 3
##$ALPHA= 0
##$AQORDER= 0
##$ASSFAC= 0
##$ASSFACI= 0
##$ASSFACX= 0
##$ASSWID= 0
##$AUNMP= <proc_1d>
##$AZFE= 0.1
##$AZFW= 0.1
##$BCFW= 1
##$BC_mod= 2
##$BYTORDP= 1
##$COROFFS= 0
##$CY= 11.3945322036743
##$DATMOD= 1
##$DC= 2
##$DFILT= <>
##$DTYPP= 0
##$F1P= 20.1720416913024
##$F2P= 0.152960286110954
##$FCOR= 0.5
##$FTSIZE= 0
##$FT_mod= 4
##$GAMMA= 1
##$GB= 0.15
##$INTBC= 1
##$INTSCL= 1
##$ISEN= 128
##$LB= 0.24
##$LEV0= 0
##$LPBIN= 0
##$MAXI= 10000
##$MC2= 0
##$MEAN= 0
##$ME_mod= 0
##$MI= 1.114404
##$NCOEF= 0
##$NC_proc= 0
##$NLEV= 6
##$NOISF1= 3.799351
##$NOISF2= 2.8
##$NSP= 1
##$NTH_PI= 0
##$NZP= 0
##$OFFSET= 15.70392
##$PC= 1
##$PHC0= -9565.236
##$PHC1= 15.00096
##$PH_mod= 1
##$PKNL= yes
##$PPARMOD= 0
##$PSCAL= 0
##$PSIGN= 0
##$REVERSE= no
##$SF= 200.130013532006
##$SI= 16384
##$SIGF1= 3
##$SIGF2= 2
##$SINO= 400
##$SIOLD= 16384
##$SREGLST= <1H.CDCl3>
##$SSB= 0
##$STSI= 0
##$STSR= 0
##$SW_p= 3612.71676300578
##$SYMM= 0
##$S_DEV= 0
##$TDeff= 0
##$TDoff= 0
##$TI= <>
##$TILT= no
##$TM1= 0
##$TM2= 0
##$TOPLEV= 0
##$USERP1= <user>
##$USERP2= <user>
##$USERP3= <user>
##$USERP4= <user>
##$USERP5= <user>
##$WDW= 1
##$XDIM= 8192
##$YMAX_p= 0
##$YMIN_p= 0
$$ End of Bruker specific parameters
$$ ---------------------------------
##NTUPLES= NMR FID
##VAR_NAME=  TIME,          FID/REAL,        FID/IMAG
##SYMBOL=    X,             R,               I
##VAR_TYPE=  INDEPENDENT,   DEPENDENT,       DEPENDENT
##VAR_FORM=  AFFN,          ASDF,            ASDF
##VAR_DIM=   8192,          8192,            8192
##UNITS=     SECONDS,       ARBITRARY UNITS, ARBITRARY UNITS
##FACTOR=    0.0002076,     1,               1
##FIRST=     0,             0,               0
##LAST=      1.7004516,     0,               0
##MIN=       0,             -202267,         0
##MAX=       1.7004516,     120854,          0
$$ Real data points
##PAGE= N=1
##DATA TABLE= (X++(R..R)), XYDATA
0 0 0 0 0 0 0 0 0 -8 8 -8 9 -16 16 -24 25 -32 40 -48 56 -64 73 -89 97 -113 134 -153 176 -199 225 -253
30 -253 285 -322 359 -403 451 -500 556 -620 687 -760 841 -932 1034 -1143 1268 -1405 1561
47 1561 -1739 1943 -2180 2458 -2793 3203 -3720 4391 -5308 6638 -8759 12672 -22334 94102
61 94102 83295 -129681 -35876 95114 120854 22744 -30706 2738 84008 49576 -36680 -42451
73 -42451 14420 21890 29739 31655 -19767 -72632 -41943 10201 33631 6271 -58415 -66764 22500
86 22500 37615 -70750 -101391 11232 74374 7742 -83842 -91552 -532 73252 6801 -86628
98 -86628 -43355 40149 18680 -34128 -34807 -18246 -2311 10440 -994 -12565 -18248 -43357 -28038
111 -28038 44006 34604 -66072 -79052 13353 52801 3334 -56707 -67470 -2482 58986 6885
123 6885 -70697 -33656 35154 18102 -25565 -27153 -4434 22673 22658 -9713 -11019 12557 -2026
136 -2026 -5161 40705 35201 -24781 -12810 45527 34449 -15025 -22262 14566 62561 51876 -35868
149 -35868 -66293 23053 77494 18793 -35109 -21500 12153 32502 10163 -38837 -28431 27870
161 27870 29225 -7114 -16064 -21784 -23296 11924 27832 -4450 -17094 -5157 -8364 737 14794
174 14794 -7542 -13689 26178 25687 -19432 -18669 15189 22407 14984 3437 -6058 16155 31509 -4984
188 -4984 -22000 18385 35106 13177 4508 -4418 -13817 12599 29129 1086 -6089 12697 -146
201 -146 -12170 9117 9349 -10157 -1682 7245 -1511 1301 -3813 -22255 -4546 21462 1265 -15211
215 -15211 85 -6793 -18722 4089 13514 -5496 -6622 -4032 -13570 -1081 9432 -12607 -12014
228 -12014 14543 1706 -21104 -4746 3147 -12089 -3843 6909 -4364 -4325 -3345 -22316 -15045 14821
242 14821 9229 -10475 -8914 -14593 -15679 10087 9684 -19681 -11217 13018 -989 -13681 -5625 -10037
256 -10037 -4523 19121 8324 -19317 -9909 3953 -3865 1607 7318 -4046 2085 10415 -13235
269 -13235 -19120 11211 16640 -348 -129 -5481 -13435 8723 16918 -12387 -14520 12794 12642 -699
283 -699 -4505 -15699 -8390 23131 17048 -15891 -10598 7081 648 3199 9217 -7260 -7221 14360
297 14360 8680 -5650 2808 2478 -3137 11371 10123 -8161 5369 20661 -2461 -10115 11610
310 11610 10346 736 10855 7251 -2613 9683 9779 -7774 1420 17515 7840 5592 10503 -6564
324 -6564 -10379 12020 11678 1028 13139 10046 -13625 -7739 7824 2046 5600 14172 -2486 -9673
338 -9673 4607 -3263 -14555 4280 13606 1848 1474 -4727 -23368 -11154 13515 6038 -2455 3455
352 3455 -9555 -19736 -2294 1522 -8757 3910 10366 -8673 -13253 -7059 -13501 -3354 14917
365 14917 160 -13533 1015 -2812 -20781 -7414 9107 2733 1477 -844 -16956 -12002 5470
378 5470 -2129 -6181 8859 1292 -14055 -2070 852 -13047 -1071 12956 -1825 -7001 2159
391 2159 -6169 -9158 5021 1653 -4309 8260 3449 -15405 -5156 8065 -2049 -1337 6336 -5974
405 -5974 -6494 9155 -373 -14203 -110 6743 -1291 3457 1225 -13710 -3480 12004 -2299 -8310
419 -8310 6237 3695 -3467 4685 -809 -9337 6752 13417 -2421 843 11115 -76 -1708 10362
433 10362 4770 2055 16624 11913 -2161 5839 9159 1098 12700 19654 1706 1002 16289 5892
447 5892 -4006 9288 11743 4726 10680 5620 -7878 1580 9095 -2448 2178 11957 -3759 -11191
461 -11191 2836 -814 -9649 3383 4523 -9155 -4265 -288 -12350 -7324 4389 -4648 -6111 3804
475 3804 -6878 -15313 594 2839 -8460 -647 3885 -8910 -5812 2537 -7467 -5507 7626 -838
489 -838 -9325 669 -2155 -10414 1838 4347 -9892 -4761 4568 -7232 -9017 1315 -5055 -7276
503 -7276 5153 -1717 -13930 -2335 3018 -7547 -2891 3790 -5690 -3409 5118 -4628 -5833 7917
517 7917 2960 -5172 6600 6112 -7148 2155 11525 -188 109 9388 1096 -1815 7105 1370 -3093
532 -3093 8695 4934 -7905 959 5129 -7728 -3779 6235 -4364 -8466 1550 -4205 -10568 -514
546 -514 -2659 -9791 245 759 -12980 -6389 4267 -6161 -6140 6107 -1106 -7252 4353 3371 -4157
561 -4157 5819 8562 -218 6582 11260 -414 2469 15212 8150 3631 13584 8983 1675 11917
575 11917 11387 399 9032 15679 3243 2628 10425 1306 -741 11324 6425 -2894 4804 4307 -5105
590 -5105 1241 4418 -5320 91 8286 -3501 -8141 2007 -2139 -5733 5924 2704 -9460 -1391
604 -1391 3681 -6614 -4241 3111 -3397 -1058 6058 -6989 -13268 2177 3492 -7534 -1846 729
618 729 -9628 -6219 -195 -9301 -8262 988 -5345 -8748 -2444 -10943 -16629 113 3179 -12990 -11045
633 -11045 -2145 -8175 -7214 -1564 -9805 -8262 5419 -431 -12144 -3318 1727 -3980 2600 4835 -6021
648 -6021 -1592 8959 1249 -1860 6726 2688 -188 10405 6748 -5010 3987 10950 1102 1690 6866
663 6866 -692 1330 11584 1900 -7056 3501 5730 -1926 2983 3684 -5741 -315 5897 -4763 -4845
678 -4845 6353 1844 -3080 3550 -1400 -7642 2962 6321 -1870 3122 5481 -6359 -2772 10009
692 10009 2063 -3875 8081 7990 -1841 864 1676 -1032 9088 11496 -1861 -1168 7110 -318 -1702
707 -1702 9569 5298 -2023 5988 4727 -5530 397 5802 19 5024 8360 -5981 -7871 7045
721 7045 4859 -3489 3230 3167 -3475 2099 1667 -7680 259 10231 228 -5141 345 -3459 -2982 6787
737 6787 1330 -7814 1028 3612 -7379 -3937 2602 -4288 -2510 4697 -5491 -11599 -112 667 -6234
752 -6234 -833 -1697 -10478 -4264 1490 -7818 -7305 1073 -3812 -6713 -2042 -7466 -9233 3266 1425
767 1425 -11654 -5277 1922 -7123 -6285 2183 -3046 -4903 1558 -3885 -8104 1727 1545 -6052 1189
782 1189 4210 -6356 -4125 4543 -985 -1508 5194 -455 -4021 4281 1627 -4127 4866 6683 -3700
797 -3700 636 7347 -1563 -1709 8075 3873 -727 6330 3292 -3172 5516 8052 -412 3312 7640
812 7640 699 1717 7909 1259 356 10142 5642 -2299 4786 5894 -838 5507 8548 -1248 910
827 910 9344 1265 -2502 6758 4725 -1143 5046 4600 -2838 2007 4903 -1739 1913 6990 -2096 -3334
843 -3334 5251 565 -4442 3588 2618 -4411 1287 2443 -6707 -2526 4882 -2326 -3210 2659 -4504 -8062
859 -8062 2638 1556 -7002 -1432 1186 -5949 -3404 -210 -6935 -4012 4374 -2611 -8070 -2206 -4602
874 -4602 -5966 3943 922 -11356 -4778 3732 -4430 -6981 -1057 -3100 -1899 3826 -5354 -11972 69
889 69 4950 -3078 -1655 -608 -7357 -2358 4742 -2491 -4876 2505 -248 -3373 1978 -2706 -7966 4968
905 4968 10093 -3995 -7899 -551 -126 2624 6683 -2987 -6359 4945 3828 -6144 -961 4374 978
920 978 3902 4035 -7486 -6211 5946 5728 2132 3892 -2843 -6781 4832 6596 -3764 61 7152
935 7152 1778 324 1117 -6470 -2130 14240 10424 -4811 -4279 184 1251 7491 6662 -2851 1825
950 1825 9562 205 -4887 3072 3948 4323 11608 5007 -9038 -3096 7242 6073 6811 5326 -4572
965 -4572 -1291 10022 2374 -6857 3275 10149 4628 2170 -3348 -8508 3320 13128 2665 -3805
979 -3805 545 -2123 -1943 5740 1019 -6314 2154 6030 -3303 -4589 -2181 -4776 2547 8985 -4679
994 -4679 -13236 -2166 3120 -1400 -648 -3889 -8764 -890 3352 -7538 -8574 266 -1205 -3103 -1554
1009 -1554 -9373 -11357 2284 4492 -7279 -7660 -4809 -8012 -2069 3347 -6082 -9175 -42 -1647 -7623
1024 -7623 -4257 -4094 -4613 4604 3075 -11744 -10561 927 837 -31 2388 -4499 -6777 1734 15 -6037
1040 -6037 1694 5633 -1137 576 1756 -6968 -3661 9560 6970 134 2114 -747 -3091 6040 7104
1055 7104 -277 4488 9133 929 -834 4871 2023 3467 12199 7320 -1220 3081 4135 923 8499
1070 8499 11447 1378 1129 8007 2947 258 7000 5400 2916 9002 5562 -3657 1551 7206 3006
1085 3006 4819 6719 -1599 -1559 6576 2381 -2448 4642 4481 -1933 1646 2385 -4941 -799 5441 -898
1101 -898 -2809 1410 -4100 -5899 2714 -40 -7990 -2221 945 -6104 -5603 -2473 -7061 -4555 729
1116 729 -6130 -9314 -2646 -5261 -9544 -1455 -979 -10059 -7140 -1424 -6139 -5425 -1948 -7119 -6263 2655
1132 2655 -2100 -9963 -3282 314 -3421 449 803 -6858 -3204 4150 -884 -2938 2374 -635 -2271
1147 -2271 5136 1877 -6000 571 6925 1155 566 2215 -2630 561 8029 1446 -4406 4016 5507
1162 5507 -32 1672 1512 -2205 5055 8733 -1470 -3433 4645 3557 1282 5310 1410 -2698 4974
1177 4974 6531 -649 1482 4438 -904 2508 8557 69 -4245 4568 5927 895 2573 236 -3347
1192 -3347 4303 7254 -1961 -2123 2911 -1682 -1857 5037 771 -4549 1798 2131 -4125 -1262 23 -3886
1208 -3886 2220 6213 -4495 -8205 664 1144 -1602 2357 -191 -4537 1682 1504 -6841 -2705 5703
1223 5703 2624 615 938 -6618 -6205 5728 6056 -1599 361 1091 -3579 179 1915 -4571 -774 8825
1239 8825 2876 -5154 -3505 -4251 -2466 7550 5778 -5223 -3689 310 -3598 -2429 2751 -806 -566
1254 -566 4152 -2773 -8620 -960 1886 -1724 3261 3946 -5789 -5573 1132 -1469 -1134 4318 291 -3395
1270 -3395 1771 -1501 -7117 567 5673 -436 -810 440 -5378 -3454 4435 383 -4179 1050 133
1285 133 -3252 1413 -499 -7633 -876 6458 -694 -4711 -1217 -3153 -1121 5079 -810 -7764 -190
1300 -190 4272 -521 -198 -622 -5524 -390 6594 81 -3994 2180 1369 -2239 1991 815 -2957 4350
1316 4350 6987 -2015 -2677 2933 151 376 6580 2671 -1135 3742 2526 -3458 1565 5663 2581
1331 2581 4743 5126 -3224 -3024 5861 4056 1205 6100 3275 -2544 1951 3622 -1711 2209 6789
1346 6789 1354 721 4116 -2993 -4920 4881 6150 510 1752 -562 -5625 268 4748 -1774 -1472
1361 -1472 3415 -1082 -3120 834 -3196 -5441 3675 4105 -4445 -3526 -871 -4552 -1749 2738 -2945
1376 -2945 -3731 2295 -1790 -6923 -1747 -257 -3116 1014 678 -6967 -4355 1641 -2252 -3589 655
1391 655 -2468 -3386 2155 -1672 -8100 -1054 3391 -2445 -1844 486 -4646 -3263 2866 -783 -3525 1486
1407 1486 -203 -4146 1123 1634 -4439 -1105 3284 -1411 -1167 2625 -2701 -3427 3485 1811 -2589 1639
1423 1639 1197 -3609 1487 4130 -2737 -1270 4512 271 -2147 2882 478 -1964 3616 3065 -2597
1438 -2597 1343 3903 -1220 664 4059 -747 371 5963 823 -3525 3372 4508 63 2796 2537
1453 2537 -2127 2401 6339 -522 -1530 5180 2988 -301 3965 1757 -2238 3411 5340 -71 1635
1468 1635 3581 -1253 608 5441 666 -1512 4909 2652 -2083 2026 2164 -2241 1797 4361 -1862
1483 -1862 -986 3282 -2052 -3664 2651 1074 -2825 1139 51 -4916 -1672 509 -3984 -1683 1916
1498 1916 -3772 -5187 -390 -3503 -5647 470 -730 -5420 -1730 -429 -6980 -4545 980 -2447 -2713
1513 -2713 1105 -3484 -6193 -62 -228 -3634 1231 1990 -3677 -1524 1365 -3478 -1796 4455 1199
1528 1199 -1449 2123 -873 -3933 2168 3256 -1751 1558 4178 -2764 -3026 2038 -722 -1251 4113
1543 4113 1164 -3652 346 45 -3865 549 3356 -1925 -442 2751 -3095 -4380 1816 1092 -1031
1558 -1031 3095 1171 -3683 427 2047 -3014 839 6024 809 -1411 2691 -277 -2488 3026 3465
1573 3465 175 3212 2433 -3067 68 3926 -974 292 5915 1917 -2470 749 -230 -2095 4051
1588 4051 4051 -1675 1108 3539 -2867 -2124 4421 2330 925 4640 1691 -2344 2115 2829 -620 4514
1604 4514 7053 721 153 3611 201 449 5961 3544 659 4387 1489 -3794 1715 4794 -789
1619 -789 22 3622 -1183 -3637 -440 -2775 -3229 2062 -634 -6298 -2851 -1637 -7371 -5234 -374 -3540
1635 -3540 -4763 -2849 -6961 -6953 -679 -3347 -7864 -1657 531 -5707 -5231 -1580 -4163 -2786 1445 -2030
1651 -2030 -3176 1104 -1506 -4492 1142 2126 -2764 196 3363 -1123 -1511 1144 -989 -164 4052 -79
1667 -79 -3290 2861 2371 -4192 -1041 3383 651 962 1969 -2759 -1867 3854 816 -2278 3111 3639
1683 3639 -1287 1009 2311 -918 2295 5240 874 1425 5317 558 -1683 5030 5106 1030 3833 3913
1699 3913 -715 1727 4646 534 1489 5577 993 -1752 2988 1396 -2586 1647 3303 -699 -2
1714 -2 -140 -3875 -684 3669 -1693 -3481 2526 552 -4185 -1196 508 -1433 1894 1836 -3794 -954
1730 -954 3939 -426 -2257 2690 1845 -628 2608 999 -3133 1463 4412 603 825 1612 -2215 -603
1746 -603 4397 276 -3295 1531 1647 -2534 -614 -456 -3872 -19 2649 -3560 -4725 -11 -1851 -4096
1762 -4096 -344 -1420 -3944 -449 -1578 -6302 -2517 1572 -2656 -3036 154 -2872 -3796 560 -1594
1777 -1594 -3858 1520 1267 -4111 -1796 498 -2845 -1200 2702 -1091 -2609 1297 -1172 -3802 971
1792 971 1602 -1684 844 945 -4104 -1337 3266 -671 -2034 2003 282 -1725 1499 -582 -3051 2713
1808 2713 4550 -1688 -1452 2176 -290 268 3816 717 -670 4046 2623 -1660 1362 3372 803
1823 803 2814 3583 -1118 684 5602 1567 -1411 3199 3304 498 3110 2043 -1463 2596 4883 -568
1839 -568 -608 3730 2121 688 3163 142 -1803 3376 3325 -1201 970 3065 -525 -175 1733 -1266
1855 -1266 153 5177 1053 -3596 185 1220 -1726 1002 1813 -1646 259 1977 -4092 -4489 1563
1870 1563 1429 -915 700 -2048 -5461 -857 712 -3165 -993 1846 -2411 -3805 -1936 -4299 -2969
1885 -2969 3118 544 -4813 -2360 -1678 -4890 -1930 1027 -1792 -1078 655 -4385 -5998 -359 356 -1408
1901 -1408 843 -835 -4609 -1767 157 -3490 -854 3820 141 -3078 -1144 -2345 -1730 3584 1830
1916 1830 -2932 512 2413 -2280 -1581 2377 955 1432 3535 -792 -2983 2734 3462 -240 1651 2454
1932 2454 -624 2116 3143 -1472 -372 5054 2236 -1410 1088 1230 134 3451 2106 -3087 290
1947 290 4208 -12 -1036 1998 295 -511 2302 -272 -2582 2437 3097 -1438 -271 899 -1572 335
1963 335 3143 -788 -1209 3221 593 -3153 635 2436 289 2329 1635 -3180 -650 3996 591 -740
1979 -740 2779 1687 -213 1919 -48 -2403 3198 5320 -315 -1000 1361 -404 345 3111 -63 -740
1995 -740 3954 1468 -3711 -811 1996 85 1299 1484 -3425 -2037 2274 -963 -3308 586 165 -2473
2011 -2473 -613 -2069 -5217 -1125 2140 -2727 -3971 -1273 -3386 -3343 -352 -2556 -4179 14 -784 -5877
2027 -5877 -3289 112 -2549 -2583 -591 -3224 -2429 578 -2444 -4653 793 1351 -2448 -1552 -700 -2952
2043 -2952 10 2385 -2005 -2356 2133 639 -1780 758 -96 -1148 2990 2587 -2847 -1129 3247 841
2059 841 42 1934 435 386 4150 1482 -2511 2265 5209 2302 1985 1938 -333 2941 6347 1658 -556
2076 -556 4023 4457 1490 2467 2102 549 4427 5611 -169 -518 3320 1358 578 3258 1031 -1062
2092 -1062 2035 905 -2681 209 2315 -1018 -1044 458 -2587 -2171 1646 -1398 -3106 1078 285 -3732
2108 -3732 -1809 17 -1838 27 1128 -2639 -2132 2266 -529 -2864 1304 1578 -921 574 -111 -2755
2124 -2755 1220 3798 -1012 -2394 566 -62 -331 1945 -1379 -3465 1481 2225 -3418 -3329 -200 -988
2140 -988 227 40 -4830 -4860 791 323 -3229 -1677 -1281 -3206 -826 -612 -4455 -1584 2638 -981 -3098
2157 -3098 -1107 -1493 -1508 2592 1121 -2987 255 1983 -1830 -866 2206 614 793 2642 -1175 -2706
2173 -2706 1746 2158 -220 1720 1606 -2111 -819 1365 -1077 417 3266 -435 -2827 948 708 -1737
2189 -1737 1180 1863 -357 1805 1870 -2745 -1118 4387 3108 585 1536 53 -55 3895 3020 -442
2205 -442 2141 4228 1057 744 2071 -265 1686 5575 1812 -2413 402 2077 198 1735 1104 -2146
2221 -2146 445 2568 -2141 -3499 1242 826 -972 -357 -2407 -3981 481 1595 -2475 -1706 77 -2127
2237 -2127 -1492 979 -1627 -1874 2133 457 -2919 -93 1043 -1377 941 2767 -951 -1171 1678 -496
2253 -496 -801 2974 1239 -1706 578 745 -1665 818 1503 -1807 -187 2071 -1471 -2763 491 -9
2269 -9 -721 1511 -765 -4325 -448 2191 -1439 -2126 252 -964 -900 913 -2376 -2806 2032 1919 -2325
2286 -2325 -1436 -366 -1861 944 2082 -2269 -2151 1840 -39 -2027 -13 -522 -1345 1846 897 -3811
2302 -3811 -1615 1750 -390 -1055 626 -1750 -2007 1453 -175 -2763 427 893 -1706 -104 730 -2364
2318 -2364 -658 2593 -219 -1367 1533 -158 -1523 1830 1673 -1083 1023 2127 -846 719 3069
2333 3069 -58 -485 3255 1927 -411 1595 1271 176 3363 2850 -1327 284 3579 1166 416 2212
2349 2212 427 85 3769 1730 -1884 1184 3006 548 1095 1786 -998 257 3517 822 -1529 1629
2365 1629 1454 -128 1710 518 -2224 1060 3171 -819 -1458 895 -173 -189 1612 -1134 -2954 1430
2381 1430 1389 -2722 -1286 749 -1464 -955 755 -2215 -2545 344 -1298 -2706 275 -684 -3612 -886
2397 -886 335 -2793 -1945 -119 -2393 -1945 71 -2667 -3617 426 -481 -3249 -659 -228 -3434 -2004
2413 -2004 445 -2012 -1970 261 -2064 -2560 587 -1213 -3317 257 1335 -2011 -1348 22 -1597 227
2429 227 1968 -1101 -1812 2325 645 -1880 986 1771 -413 1721 2136 -1085 344 3013 853 417
2445 417 3199 1179 -438 2574 2658 -56 1927 3112 637 1750 2816 -396 358 3794 1529 -450
2461 -450 2291 2004 -275 1745 2084 -416 1242 2832 -528 -186 2774 349 -1276 1870 1299 -878
2477 -878 892 1208 -1044 752 1707 -1679 -668 2395 -438 -1645 1036 -14 -1943 910 707 -2061
2493 -2061 -8 1128 -1789 -1172 1053 -1426 -1470 1561 -161 -2492 40 -148 -1960 412 684 -2168
2509 -2168 -809 1204 -1711 -2185 824 -411 -1603 899 -375 -2854 -256 1069 -1880 -678 901
2524 901 -1611 -1782 874 -1315 -2333 1250 110 -2226 -356 53 -2787 -481 1181 -1698 -1405 1169
2540 1169 -1368 -2401 580 -583 -2284 731 675 -2484 -903 481 -1939 -881 1338 -1236 -1630 1117
2556 1117 -335 -2192 448 530 -1524 728 1343 -2181 -635 1872 -778 -810 2048 446 -991 1604
2572 1604 794 -1352 1241 2356 -509 1185 2814 -534 -304 2791 1368 -117 2486 2085 153 2148
2588 2148 2083 -523 2034 3701 184 286 3011 1083 -183 2778 1803 65 2163 2025 -933 772
2604 772 2232 -548 392 2673 -281 -1225 1534 678 -952 1281 634 -1772 781 1309 -2138 -1184 1485
2621 1485 -473 -1244 834 -1055 -2078 1067 289 -2608 -52 916 -1879 -1178 510 -1838 -1746 852
2637 852 -979 -2295 83 -923 -2529 66 170 -3065 -1312 796 -1967 -2208 15 -1776 -1992 991
2653 991 -1239 -3419 -469 391 -2485 -1218 254 -2124 -1577 757 -1672 -2056 744 -395 -1880 881
2669 881 243 -2576 -163 1730 -1223 -397 1276 -927 -833 1729 -60 -1595 1662 1291 -1384 470
2685 470 1301 -1116 134 2109 -505 -594 1979 32 -986 1781 994 -1076 1339 1729 -891 554
2701 554 2158 -148 350 2799 279 -704 2069 1630 -538 1865 2044 -384 1423 2761 -189 259
2717 259 2832 934 140 2345 906 -796 2035 1909 -856 1040 2097 -410 522 2365 -552 -1305
2733 -1305 2043 808 -1213 1283 848 -1555 506 1104 -1694 -531 1883 -902 -1252 902 -1065 -2373
2749 -2373 885 670 -1640 302 418 -2633 -1010 1127 -1671 -1117 1357 -902 -2549 -84 -941 -2425
2765 -2425 928 1106 -2165 -1454 -122 -2421 -1382 1170 -975 -1839 737 -828 -3054 -731 107 -1605
2781 -1605 523 1125 -2785 -2669 277 -1106 -1254 1251 -500 -2358 260 -279 -2833 -436 1447 -739
2797 -739 -448 685 -2017 -1840 1646 534 -1014 1148 340 -1729 734 1061 -1468 292 2497 -377
2813 -377 -936 1030 -375 -933 2301 1122 -1359 987 1734 -1030 685 1801 -727 -121 2645 440
2829 440 -1002 1559 1101 -280 2088 1466 -1210 1210 2804 -79 -147 1821 -73 7 2975 1266 -962
2846 -962 1423 1846 -637 869 2004 -171 749 2539 -464 -1464 1451 881 61 2166 1042 -2026
2862 -2026 366 1639 -891 178 1939 -353 -506 1284 -1114 -2215 1447 1451 -968 442 -39 -2468
2878 -2468 -473 1625 -949 -777 1319 -1018 -2229 113 -926 -2039 965 1220 -2113 -1483 -357 -2096
2894 -2096 -676 1463 -1342 -2247 527 -867 -2830 -126 70 -1740 -74 623 -2782 -2150 344 -1145
2910 -1145 -1082 779 -1203 -2452 281 -9 -2461 -374 1087 -1371 -730 667 -1888 -1463 1588 60
2926 60 -1537 620 98 -1758 653 1171 -1381 -270 1776 -637 -695 1456 -99 -1009 1780 980 -1258
2943 -1258 1084 1360 -820 731 2132 -816 -192 2479 496 -688 1846 958 -339 1779 1639 -806
2959 -806 811 2318 -66 311 2282 -43 -263 2565 1135 -1014 1561 1597 -375 1425 1519 -1141 607
2976 607 2784 82 -573 1613 684 -412 1689 838 -1464 942 1911 -797 -119 1336 -527 -641 1778
2993 1778 -321 -1376 1125 704 -1469 577 800 -1655 13 1263 -1494 -1192 1243 -577 -1573 774
3009 774 -45 -2004 548 639 -2083 -476 882 -1606 -1294 762 -912 -1646 534 -921 -2199 560
3025 560 92 -2216 -471 868 -2074 -1516 459 -1294 -1129 958 -1021 -2538 27 106 -2055 -233
3041 -233 553 -2045 -964 518 -1871 -1747 1321 -70 -1049 374 -666 -2526 448 1245 -1332 89
3057 89 1233 -1279 -1406 870 -778 -169 2280 820 -1721 206 745 -835 803 2028 -19 -19 1609
3074 1609 -425 -1005 2113 1676 116 1871 1080 -1292 758 2144 -16 842 3015 255 -786 1561
3090 1561 568 -181 2540 2019 -786 683 1690 -613 469 2501 335 212 2050 73 -1334 1711
3106 1711 1527 -543 1167 1296 -1024 221 1562 -810 -331 2050 317 -1183 889 293 -1238 987
3122 987 1121 -1755 -216 1356 -1142 -1028 852 -827 -1278 667 -567 -2015 592 557 -2187 -974
3138 -974 335 -1563 -634 865 -1727 -1500 460 -818 -2513 63 399 -1518 -392 -57 -2506 -1293
3154 -1293 1094 -715 -1104 617 -1002 -2166 243 -406 -1968 645 1338 -1605 -1260 97 -1437 -517
3170 -517 1613 -373 -1624 685 -153 -2195 -113 1140 -676 163 499 -2023 -1250 1231 -69 -665
3186 -665 1414 -21 -1548 386 427 -1232 803 1783 -602 -256 1299 -594 -746 1982 1190 -376 1323
3203 1323 817 -1202 758 2147 208 702 1885 -79 -119 2241 624 -786 1972 1831 -262 750
3219 750 850 -801 1219 2406 -548 -978 1986 698 -937 808 426 -455 1385 1164 -1668 47
3235 47 2006 -300 -553 1118 -338 -507 1714 451 -1466 390 1279 -614 601 843 -1453 -204
3251 -204 2255 -236 -1647 758 414 -503 828 -83 -1890 356 1375 -1152 -987 964 -629 -1154
3267 -1154 624 -873 -1778 413 -267 -2073 -94 509 -1765 -1079 684 -1099 -1265 759 -804 -1591
3283 -1591 343 96 -2082 67 818 -1571 -765 805 -1018 -957 882 -838 -1393 365 6 -1804 575
3300 575 162 -2049 -164 1224 -1262 -1492 429 -550 -534 802 -865 -2144 707 855 -1560 -394 877
3317 877 -862 -328 895 -981 -838 1441 203 -1083 849 522 -1255 719 1415 -669 135 1958
3333 1958 -193 -495 1664 645 -66 2022 1078 -950 981 1679 -199 526 1937 376 437 1790 -141
3350 -141 -464 2126 1579 -368 1237 1418 -770 504 1564 -130 680 2319 -176 -1090 1332 979 -311
3367 -311 1113 1136 -598 670 1418 -898 -365 1661 208 -313 1252 -504 -1521 1120 995 -1028 65
3384 65 451 -1388 -472 824 -1149 -982 1194 -404 -1931 -150 -232 -1623 -186 166 -1588 -733 223
3401 223 -1900 -1639 388 -732 -1664 318 -698 -2262 -324 -57 -1867 -926 250 -1786 -1591 513
3417 513 -1125 -1780 165 -559 -2051 177 118 -2014 -684 536 -1310 -809 485 -1297 -1312 968 61
3434 61 -1720 288 349 -936 720 964 -1636 -396 1675 -69 -483 1081 126 -737 1444 680 -983
3451 -983 744 2098 -12 442 1340 -317 144 2092 469 -346 2044 1452 -417 852 1276 -165 1204
3468 1204 2312 161 -192 1839 666 63 1737 993 -281 1779 1666 -664 721 1864 135 542
3484 542 1937 200 -475 1604 719 -420 1220 993 -981 421 1142 -737 -100 1136 -466 -867 811
3501 811 -471 -1699 400 331 -1506 102 126 -1694 -746 509 -1327 -1476 629 -667 -1669 207 -290
3518 -290 -1658 39 317 -1589 -860 629 -1091 -1062 410 -776 -1438 588 -81 -1881 -73 385 -1376
3535 -1376 -453 605 -1418 -943 626 -790 -1328 517 -351 -1232 324 231 -1768 -269 702 -1322 -648
3552 -648 763 -748 -1106 899 -291 -1321 531 442 -1133 75 814 -1015 -222 1084 -477 -635 1080
3569 1080 47 -889 937 555 -871 801 1007 -749 24 1464 -326 -256 1515 113 -640 1290 1012
3586 1012 -547 992 1282 -445 633 1563 -154 109 1722 274 -150 1621 676 -375 1169 1146 -347
3603 -347 958 1532 -250 316 1807 140 -237 1603 650 -347 1138 1117 -612 703 1466 -284 182
3620 182 1598 -357 -347 1249 222 -829 917 527 -1117 439 756 -1067 76 1156 -837 -896 748
3637 748 -394 -1665 364 -187 -1422 54 116 -1847 -777 409 -1281 -1184 428 -1355 -1599 397 -728
3654 -728 -2063 -227 -87 -1629 -740 178 -1481 -808 666 -1065 -1735 376 -172 -1398 97 -6 -1404
3671 -1404 -62 719 -1041 -682 886 -488 -807 768 -407 -1170 862 479 -1093 169 754 -919
3687 -919 -105 854 -798 -480 1299 -155 -1174 693 449 -795 736 737 -978 15 1099 -260 77
3704 77 1660 155 -580 1113 573 -658 1080 975 -359 843 1752 -303 80 1821 756 228 1532
3721 1532 443 -308 1754 1480 -657 690 1458 -116 374 1133 -208 -15 1773 630 -1077 390
3737 390 736 -504 1019 830 -1042 169 1428 -179 -870 889 -16 -248 1112 103 -1477 511
3753 511 1326 -448 -126 786 -840 -298 1187 -430 -960 936 486 -1286 150 363 -1294 -57 836
3770 836 -1277 -987 283 -852 -1154 238 -537 -1743 -15 -168 -1895 -784 82 -1483 -912 133 -1185
3787 -1185 -1585 0 -471 -1311 427 -261 -2135 -412 660 -1063 -581 262 -861 -477 840 -567 -1521
3804 -1521 794 877 -848 -241 187 -954 251 1166 -828 -882 937 -20 -621 523 -116 -856 830 849
3822 849 -1101 -470 1141 -510 -101 928 -635 -629 1397 670 -909 613 1197 51 745 768 -473 296
3840 296 2019 549 -257 1231 658 -120 1205 1146 -182 1052 1346 -201 180 1612 31 -272 1630
3857 1630 814 -421 909 680 -610 1139 1230 -625 -71 1213 -125 -73 1262 -90 -563 1025 750
3874 750 -894 44 588 -466 550 858 -1088 -383 1445 -66 -1191 305 262 -743 560 -108 -1476
3891 -1476 10 996 -816 -997 122 -766 -619 698 -641 -1894 -19 179 -1257 -504 -66 -1277 -327
3908 -327 771 -1165 -1543 79 -304 -933 124 -279 -1635 -65 243 -1333 -660 540 -1075 -975 479
3925 479 -574 -1245 424 -102 -1229 308 395 -1419 -475 758 -430 -336 649 -676 -830 991 149 -1029
3943 -1029 585 906 -571 -153 545 -568 204 1673 -217 -861 674 666 -277 814 415 -589 1132
3960 1132 1811 -894 -509 1180 516 505 1221 -13 -621 1308 1176 -353 309 1116 -100 526 1047 -190
3978 -190 -137 1734 625 -317 1035 521 -400 888 1235 -417 582 1535 -391 -275 1466 389 -87 1396
3996 1396 464 -735 622 957 -510 537 1108 -689 -529 883 -193 -682 799 -189 -1083 739 381
4013 381 -1520 -497 488 -717 -416 352 -1407 -1412 969 -109 -1389 -486 -697 -1080 252 341 -1699 -963
4031 -963 612 -657 -1351 -141 -756 -856 927 -458 -1983 -349 404 -1201 -401 206 -1026 -700 465
4048 465 -991 -1629 695 296 -1042 -262 -274 -1376 72 935 -948 -677 493 -616 -988 534 -189
4065 -189 -1038 949 733 -942 -3 767 -544 143 1418 53 -758 757 16 -403 1231 814 -733
4082 -733 538 1235 -137 188 1097 74 300 1638 338 -727 696 1081 -69 989 919 -855 246
4099 246 1457 -238 -138 1347 245 -192 905 298 -611 1180 1231 -637 30 910 -36 339 1060 -241
4117 -241 -358 1408 657 -791 472 694 -203 682 853 -870 -320 1305 -24 -596 868 122 -837 793
4135 793 422 -987 173 568 -749 -447 822 -847 -753 565 -440 -1162 548 -83 -1554 -69 468
4152 468 -1016 -502 225 -1239 -745 598 -791 -1398 375 -258 -1565 -413 24 -1248 -442 265 -1351
4169 -1351 -1087 542 -542 -1315 10 -288 -1011 318 -10 -1667 -278 613 -469 -676 275 -703 -650 1049
4187 1049 -60 -1485 236 510 -718 128 463 -855 228 1138 -350 -696 1036 171 -630 775 549
4204 549 -616 592 795 -724 268 1286 -82 -88 1213 258 -308 1059 484 -517 911 1249 -269
4221 -269 392 1380 -235 262 1412 230 -132 1371 668 -551 927 1023 -429 561 1116 -545 -56 1663
4239 1663 236 -580 1045 408 -285 834 464 -766 445 1114 -597 -191 731 -334 -100 995 -274
4256 -274 -1101 550 407 -1184 160 521 -650 -161 791 -781 -766 949 -157 -885 598 210 -993
4273 -993 88 182 -1072 -189 829 -737 -931 307 -869 -1184 640 -258 -1488 -83 303 -1557 -556
4290 -556 333 -941 -701 295 -926 -1168 295 -436 -1440 -39 268 -1099 -209 279 -1052 -612 871
4307 871 -873 -1094 592 -2 -962 601 216 -1003 242 557 -915 -305 906 -294 -474 897 -137
4324 -137 -686 857 526 -936 544 814 -845 258 1062 -444 -110 1194 138 -619 1059 689 -451
4341 -451 790 849 -751 323 1408 -314 287 1545 480 -183 1041 549 -203 999 1070 -186 631
4358 631 1111 -354 144 1594 475 85 1349 429 -621 821 716 -326 552 1004 -508 -2 1209
4375 1209 -430 -461 1046 234 -602 511 206 -934 466 770 -738 -146 999 -616 -599 636 -298
4392 -298 -747 695 21 -1216 104 278 -1073 -397 613 -758 -614 480 -628 -1093 61 -144 -1460
4409 -1460 -1 -103 -1421 -430 352 -1156 -850 363 -741 -1121 277 -329 -1214 94 -69 -1422 -429
4426 -429 336 -1324 -718 344 -495 -923 358 -454 -1139 339 223 -1257 173 610 -773 -361 607 -492
4444 -492 -574 739 -121 -457 707 391 -731 308 700 -666 165 1010 -232 -172 969 -16 -470 1122
4462 1122 465 -418 889 944 -402 430 1182 -322 8 1196 93 -111 1049 597 -461 1021 1047 -492
4480 -492 552 967 -177 329 1249 -77 -144 1144 284 -593 689 698 -347 475 1077 -577 149 938 -184
4499 -184 -517 1047 149 -576 925 543 -651 495 851 -572 -78 659 -575 -450 768 -96 -935 608
4517 608 100 -935 321 166 -925 -180 610 -664 -500 491 -633 -949 177 -181 -1229 52 -7 -1290
4535 -1290 -308 294 -974 -506 530 -770 -1018 271 -460 -1096 58 -61 -1109 -80 379 -1125 -405
4552 -405 305 -563 -809 521 -509 -1114 388 44 -1131 149 300 -898 -474 608 -678 -754 704
4569 704 -186 -834 393 88 -947 331 616 -453 66 884 -425 -395 911 -202 -425 954 339 -612
4587 -612 638 572 -380 386 1126 -309 28 1235 213 -303 1400 565 -368 832 803 -317 632 1183
4605 1183 -281 295 1259 -139 -305 1130 227 -375 973 862 -569 496 812 -456 240 1225 -75
4622 -75 -58 959 294 -609 764 401 -591 405 712 -524 13 869 -376 -294 974 -66 -725 774 102
4641 102 -923 128 469 -733 -235 545 -682 -628 585 -471 -794 313 -230 -1007 149 150 -1324 -330
4659 -330 385 -1008 -554 398 -557 -832 420 -173 -1101 47 163 -1148 -283 219 -1075 -577 543 -456
4677 -456 -908 228 -306 -1095 266 -13 -837 -19 376 -950 -563 260 -633 -491 528 -185 -870 363
4695 363 107 -642 395 525 -720 -57 747 -360 -285 620 20 -552 841 167 -707 378 689 -344
4713 -344 292 888 -380 -240 950 32 -419 902 583 -415 859 777 -551 422 1001 -97 159 1150
4731 1150 190 -182 997 397 -317 923 825 -205 528 850 -240 368 972 -82 -219 910 316 -433
4749 -433 896 600 -467 698 873 -419 -13 814 -36 -212 721 -2 -621 749 392 -770 333 400
4767 400 -681 -63 616 -697 -497 796 -155 -810 228 -189 -829 138 116 -1098 -538 434 -681 -385
4785 -385 340 -696 -718 314 -210 -1221 -78 -81 -990 -124 131 -994 -581 334 -580 -758 94 -353 -1060
4804 -1060 301 48 -992 -205 342 -841 -383 284 -666 -496 678 -383 -923 112 135 -868 -150 609
4822 609 -1093 -136 571 -457 -376 542 -291 -331 686 265 -728 191 757 -340 67 670 -491 109 968
4841 968 -59 -520 764 480 -125 830 712 -507 414 907 -293 293 798 39 -56 1013 167 -245 969
4860 969 1043 -315 560 698 -256 436 1181 76 -154 984 423 -211 696 446 -474 452 654 -446 76
4879 76 671 -27 -116 986 -115 -451 659 510 -366 229 241 -545 132 788 -635 -529 729 17 -463
4898 -463 566 -195 -1019 246 301 -634 -42 221 -595 -391 311 -635 -855 447 -140 -969 -86 128 -955
4917 -955 21 96 -1094 -593 202 -533 -659 251 -255 -914 204 -128 -1263 -261 325 -712 -288 194 -837
4936 -837 -608 513 -452 -810 262 -299 -682 25 154 -866 -280 346 -538 -460 511 -386 -666 627 170
4955 170 -636 282 239 -574 339 713 -504 -107 833 -243 -223 693 300 -328 908 680 -494 240 933
4974 933 -81 151 755 2 -51 957 333 -303 884 803 -170 297 425 -373 455 1323 148 -463 722
4993 722 346 137 849 481 -359 638 901 -378 13 600 -142 133 899 -109 -638 370 259 -378 548
5012 548 301 -796 202 631 -507 -349 522 -329 -466 586 -104 -818 217 377 -736 -203 230 -793
5030 -793 -355 339 -550 -725 313 8 -582 128 -191 -884 112 346 -870 -557 231 -494 -335 184 -760
5049 -760 -898 191 128 -782 -263 -37 -904 -206 16 -1101 -837 320 36 -563 85 -342 -873 312 248
5068 248 -813 -176 405 -538 -271 393 -349 -550 508 -79 -694 346 347 -646 -44 508 -388 -151 638 -144
5088 -144 -404 659 279 -205 503 444 -479 307 872 -93 298 664 -397 34 792 431 -272 621 437 -32
5108 -32 726 724 -395 62 1105 -71 176 760 43 -155 1089 676 -278 228 623 -17 450 763 -304
5127 -304 79 1195 138 -186 644 339 -136 494 516 -817 92 750 -328 -532 532 -48 -300 564 -248
5146 -248 -677 307 403 -576 62 221 -797 -250 592 -480 -618 222 -233 -571 289 -104 -969 -32 273 -755
5166 -755 -251 -98 -546 -445 399 -371 -948 106 -23 -732 22 -3 -974 -354 424 -712 -746 293 -428 -485
5186 -485 233 -120 -987 24 380 -774 -176 415 -544 -453 274 -544 -631 496 150 -682 174 126 -633 187
5206 187 779 -614 -134 695 24 -389 481 1 -375 627 601 -619 205 810 -198 243 570 -82 -114
5225 -114 787 138 -192 764 527 -344 510 771 -170 176 925 -30 122 805 -119 -102 701 409 -289 636
5245 636 539 -322 303 869 -251 72 911 147 -190 564 276 -266 824 537 -505 -101 685 -205 172
5264 172 518 -386 -402 737 18 -712 251 360 -395 275 89 -554 -217 394 -352 -659 274 -337 -616 91
5284 91 -17 -905 -159 322 -735 -334 139 -592 -541 374 -389 -881 13 12 -839 -200 -70 -702 -360 203 -621
5305 -621 -650 323 -339 -797 192 -158 -721 58 95 -826 -222 280 -659 -568 318 -248 -878 425 -4 -567 315
5326 315 169 -693 179 525 -403 -33 561 -181 -330 599 211 -510 514 463 -560 462 428 -343 143 960
5346 960 -224 -174 830 217 -174 710 415 -354 477 638 -38 290 980 68 102 736 58 -129 889 561
5366 561 -224 387 603 -21 397 662 -273 183 770 85 -85 645 240 -347 696 456 -466 485 718 -469
5386 -469 33 849 23 16 476 60 -414 177 65 -462 213 425 -385 -137 451 -241 -301 334 -272 -596 245
5407 245 98 -740 -254 159 -666 -190 317 -722 -521 293 -225 -708 346 -59 -647 78 114 -854 -296 251
5427 251 -661 -399 105 -412 -565 392 -138 -787 143 214 -559 -117 346 -476 -199 432 -390 -604 278 -123
5447 -123 -508 249 39 -693 -31 253 -559 -2 397 -303 -213 490 -17 -431 270 148 -374 100 490 -405
5467 -405 -9 477 -102 -99 619 84 -240 371 329 -398 263 436 -311 106 739 -198 102 815 152 -177 712
5488 712 269 -309 521 570 -334 329 648 -155 154 910 15 -206 808 398 -45 502 714 -277 395 774
5508 774 -173 271 650 -79 10 762 282 -202 493 405 -294 218 356 -420 44 449 -306 -140 443 -226 -677
5529 -677 435 -55 -520 53 176 -633 -331 355 -610 -456 365 -272 -682 222 -370 -844 44 81 -609 -267
5549 -267 213 -657 -473 294 -361 -603 281 -222 -621 67 -7 -699 -147 69 -660 -500 79 -530 -543 111 -467
5570 -467 -897 170 72 -697 19 141 -554 -360 268 -428 -440 372 -60 -324 387 98 -518 326 449 -264
5590 -264 63 411 -163 -60 711 146 -322 551 90 -449 661 627 -285 176 547 -242 84 690 5 -57
5610 -57 699 317 -267 495 475 -245 406 471 -176 106 845 127 26 851 455 94 663 477 -190 492 569
5631 569 -76 294 723 -27 -178 686 61 -393 615 314 -231 416 345 -382 51 590 -339 -68 490 -1
5651 -1 -299 453 26 -660 14 44 -491 -115 264 -578 -303 310 -374 -768 102 -228 -676 63 -60 -854 -154
5672 -154 130 -830 -627 117 -498 -425 156 -254 -747 22 15 -817 87 286 -760 -253 172 -559 -540 231 -317
5693 -317 -557 310 -25 -841 27 1 -743 -334 492 -473 -572 545 -115 -411 448 -96 -595 141 402 -484
5713 -484 212 582 -125 36 554 103 -238 636 176 -221 466 330 -235 229 546 -122 27 765 -61 -185
5733 -185 899 333 -141 570 494 -320 152 675 -91 127 577 -98 -147 731 35 -108 384 569 -365 226
5753 226 398 -288 269 729 -125 -189 469 166 -182 532 196 -352 219 242 -267 71 623 -454 -222 447
5773 447 -64 -360 484 8 -418 172 378 -558 -18 225 -579 -281 341 -472 -433 284 -193 -612 -33 -98 -688
5794 -688 57 115 -619 -390 174 -481 -628 222 -385 -468 21 -210 -602 170 104 -735 -362 249 -286 -487 246
5815 246 -458 -854 75 69 -613 -66 26 -500 -287 245 -459 -389 432 -160 -440 347 31 -358 187 250 -534 -17
5837 -17 313 -403 -359 374 -104 -346 538 76 -430 273 497 -420 313 504 -351 310 629 -84 -258 643 128
5858 128 -144 682 454 -219 523 657 63 221 710 -247 54 737 279 -54 321 424 -207 631 612 -217
5878 -217 284 681 -42 328 630 23 -118 703 423 -383 322 347 -220 261 640 -231 -109 464 -136 -300
5898 -300 577 73 -465 279 186 -451 76 351 -490 -182 262 -212 -385 260 -289 -641 132 103 -542 -208 78
5919 78 -609 -259 410 -454 -687 -44 -246 -710 142 -233 -960 -286 86 -728 -417 136 -400 -308 303 -310 -720
5940 -720 238 -273 -539 142 130 -801 -68 398 -313 -236 451 -152 -427 248 -16 -485 296 370 -463 -6 350
5961 350 -212 16 246 -337 -257 419 173 -569 178 155 -149 407 707 -428 105 775 -17 -107 568 -190 -175
5982 -175 527 543 -194 214 675 -35 427 693 -26 -31 641 -5 -15 638 429 -353 378 649 -335 199 469
6003 469 -258 218 653 47 -179 470 129 -380 300 401 -422 -131 382 -191 132 667 -116 -371 478 29
6023 29 -253 603 145 -599 181 369 -173 -153 283 -524 -238 509 -55 -592 38 99 -257 19 27 -609 -139 391
6045 391 -276 -371 199 -370 -488 331 -13 -602 -173 8 -558 -153 108 -518 -503 135 -413 -647 181 -216 -679
6066 -679 -69 38 -626 62 415 -530 -529 222 -93 -641 12 65 -239 181 29 -434 -203 271 -580 -96 416
6087 416 -438 -445 363 44 -172 496 75 -580 267 503 -203 -29 157 -74 117 525 57 -336 496 423 11
6108 11 381 259 -309 161 630 -184 -44 487 64 76 474 247 -103 446 436 -366 185 637 -95 142 488
6129 488 -101 34 657 425 -222 271 523 -122 492 522 -232 98 490 93 -56 457 108 -73 333 322 -318
6150 -318 -11 207 -324 -18 373 -346 -534 326 -153 -484 261 -11 -424 138 209 -538 -404 277 -368 -358 102
6171 102 -231 -402 11 -190 -446 5 19 -494 -67 193 -542 -124 411 -340 -582 0 -62 -504 -119 42 -632
6192 -632 -192 55 -579 -394 124 -266 -406 252 -224 -523 29 182 -602 -108 -21 -634 41 498 -345 -294 229
6213 229 -121 -297 290 107 -570 102 287 -574 267 230 -125 -168 425 -8 -214 476 186 -155 313 414 34
6234 34 128 540 90 49 476 77 -29 613 204 -356 407 482 -187 222 505 122 171 611 -175 -340 515 405
6256 405 -228 338 349 -304 322 488 -244 23 425 -92 41 452 213 -308 434 279 -186 183 300 -297
6276 -297 1 507 -236 -215 307 -70 -312 150 -142 -494 60 206 -364 -176 282 -253 -289 148 -310 -337 159
6297 159 31 -597 85 -96 -560 -123 77 -480 -243 238 -515 -600 112 -56 -477 88 -45 -611 -248 11
6317 11 -529 -137 142 -453 -509 427 -291 -510 120 -93 -478 61 75 -596 -179 531 -358 -187 220 -99 -449
6338 -449 261 152 -577 127 260 -445 90 302 -71 -170 526 52 -320 324 394 -287 240 236 -236 311 439
6359 439 -97 -194 620 88 -272 556 238 -253 455 626 -163 136 478 -183 172 736 162 -142 428 359 -106
6380 -106 438 410 -182 217 530 -238 47 572 -185 -101 456 136 46 507 369 -253 316 295 -218 -30 464
6401 464 -76 -291 452 -132 -202 307 23 -529 240 290 -425 -75 392 -413 -406 323 -316 -517 123 78 -520 -51
6423 -51 -28 -338 -203 67 -438 -343 47 -275 -488 162 -155 -574 -86 -60 -565 -117 88 -561 -167 264 -321
6444 -321 -504 143 -185 -502 -63 -165 -539 -223 101 -356 -312 187 -285 -318 124 -175 -321 233 -155 -291 -196
6465 -196 423 -296 -44 212 -291 -60 416 -21 -532 503 233 -273 335 164 -197 115 410 -78 -66 478
6485 478 -20 -135 405 173 -254 489 397 -91 112 463 -55 12 653 149 -137 730 163 -103 473 305 -26
6506 -26 117 595 -3 99 493 117 48 348 368 -108 413 193 -143 276 404 -137 -41 482 -9 -80 459 -47
6528 -47 -91 287 138 -451 110 187 -254 -35 343 -309 -170 498 -126 -232 212 60 -338 105 60 -421 -86
6549 -86 168 -421 -270 182 -434 -412 278 -33 -585 185 47 -540 -141 137 -496 -351 28 -285 -298 190 -290
6570 -290 -428 -139 -108 -465 -153 70 -574 -205 101 -393 -453 30 -415 -598 -81 192 -350 -190 194 -467 -65
6591 -65 206 -340 -332 99 -242 -184 372 10 -283 218 173 -300 134 278 19 122 332 7 -143 529 262 -278
6613 -278 322 308 -9 344 409 -44 173 486 129 65 399 183 -81 409 419 -40 489 378 -188 28 503
6634 503 57 138 517 184 -207 496 255 -7 129 455 -14 119 489 -122 -97 310 265 -82 443 70 -413
6655 -413 116 222 -375 103 169 -300 -182 278 -125 -425 247 -74 -367 74 77 -520 -245 146 -328 -198 282
6676 282 -511 -349 205 -166 -540 -12 -167 -549 -151 75 -415 -284 106 -230 -336 122 -184 -361 114 55
6696 55 -308 -116 140 -330 -201 67 -320 -107 96 -141 -329 17 0 -464 -71 204 -430 -77 95 -204 -132
6717 -132 351 -181 -227 336 75 -304 148 125 -303 93 290 -145 22 375 13 -115 345 120 -139 363 166
6738 166 -132 129 294 -124 85 663 83 -53 449 52 -74 329 298 -92 445 423 -188 127 580 112 -120
6759 -120 329 34 107 207 259 -247 55 316 -184 38 252 -204 35 397 -117 -261 248 -99 -122 314 258
6780 258 -196 274 247 -109 111 210 -242 -404 64 -58 -255 88 -10 -255 124 44 -326 -315 295 -201 -498 274
6802 274 -119 -399 71 105 -431 47 33 -388 -64 67 -474 -249 100 -118 -465 -23 -178 -491 -46 -44 -571
6823 -571 -219 242 -229 -211 35 -240 -178 133 -76 -459 107 104 -500 -53 306 -251 -119 239 -164 -175 350 130
6845 130 -441 81 222 -260 116 324 -79 -70 320 -154 -201 391 51 -243 206 244 -266 271 259 4 118 467
6867 467 76 47 540 86 -226 388 205 -175 239 189 -132 117 492 -2 -35 556 95 17 74 208 -59 392
6889 392 289 -88 94 93 -187 -32 399 28 5 224 131 -380 151 219 -249 69 204 -179 -14 164 -48 -313
6911 -313 173 -111 -135 221 114 -256 -78 255 -390 -60 265 -315 -201 188 -48 -491 190 -63 -349 -108
6931 -108 -2 -450 -200 490 -484 -302 133 -312 -542 197 -127 -526 0 11 -371 -145 86 -317 -259 107 -312
6952 -312 -247 40 6 -334 -49 115 -424 -250 146 -275 -237 134 -119 -134 239 -100 -330 96 76 -296 12 277
6974 277 -242 -85 327 -176 6 234 66 -210 326 5 -56 232 384 -18 29 303 30 -22 494 79 -7
6995 -7 486 379 -221 275 445 -126 134 438 -192 -47 513 183 -107 399 180 -97 185 238 -130 -8 358
7016 358 -322 34 562 -46 29 372 109 -349 260 240 -368 105 318 17 90 417 9 -118 425 74 -251
7037 -251 310 158 -437 67 43 -86 -140 329 -356 -368 384 -136 -274 224 9 -364 -93 125 -327 -152 186
7058 186 -308 -382 58 -219 -359 164 -38 -341 196 130 -414 -39 154 -423 -161 197 -470 -340 -69 -215 -467
7079 -467 -116 -187 -542 -38 150 -388 -415 276 -311 -293 221 31 -490 190 -118 -339 187 219 -297 -144 432
7100 432 -184 -127 357 0 -98 329 181 -307 296 480 -251 79 340 -24 16 542 70 -96 295 215 -12
7121 -12 539 277 -220 334 366 19 32 495 -36 -32 452 190 -171 475 352 -193 210 542 -180 -116 440 48
7143 48 -232 270 232 -254 459 254 -126 319 393 -97 21 458 -16 -171 403 -109 -206 372 83 -117 297
7164 297 65 -353 71 273 -256 64 227 -225 -336 56 -241 -409 75 -8 -404 53 39 -362 -211 149 -268
7185 -268 -374 194 -52 -454 -20 146 -448 22 294 -411 -212 53 -209 -283 327 -130 -533 -59 97 -513
7205 -513 -172 103 -267 -182 21 -463 -511 220 -110 -180 35 -136 -358 170 209 -278 -161 108 -203 32 386
7226 386 -249 -256 247 258 -321 -49 275 -192 238 449 -216 139 419 0 -224 383 233 -181 244 353 -226
7247 -226 321 370 -109 235 439 111 -129 313 123 -185 334 435 -105 185 287 -77 135 564 184 45
7267 45 542 229 -16 348 218 -210 144 476 -78 -8 393 -11 -88 325 56 -133 156 125 -130 244 78
7288 78 -126 -47 291 -176 -154 351 -97 -262 -40 84 -372 -35 44 -443 -182 67 -302 -165 275 -135 -175 82
7310 82 65 -264 -85 140 -246 -189 84 -403 -186 -81 -172 -274 85 -222 -613 -157 36 -200 -127 -145 -550 -82
7332 -82 99 -493 -444 -4 -254 -350 144 -50 -375 133 233 -328 -150 186 -214 -232 233 187 -365 211 34 -174
7354 -174 334 267 -323 -42 340 -191 -80 525 -70 -86 207 135 -91 276 142 -298 75 435 93 70 361
7375 361 -79 93 435 133 -70 299 85 -175 195 217 -91 45 320 -59 -127 548 19 -16 562 309 -87
7396 -87 264 455 -192 123 512 -33 -46 363 -11 -256 335 133 -147 124 359 -380 -51 465 -181 67 334
7417 334 -46 -316 217 72 -307 211 154 -373 -96 116 -314 -238 245 -193 -178 37 -27 -475 -21 -4 -453 -15
7439 -15 182 -320 0 132 -75 -190 62 -63 -528 -133 164 -359 -15 31 -340 -59 137 -207 -226 133 -243
7460 -243 -249 -68 -2 -182 -6 249 -509 -104 457 -358 -185 307 -57 -484 277 41 -485 76 38 -238 0
7481 0 430 -190 -134 252 12 -348 344 65 -291 164 107 -51 -48 245 -22 112 453 19 -5 341 187 -47
7503 -47 433 156 -239 341 293 -34 173 457 297 -16 482 179 -71 456 109 -19 375 318 21 116 212 -36
7525 -36 -118 355 -35 28 174 150 -283 259 225 -278 117 281 -84 -301 403 -51 -137 246 13 -237 60 37
7547 37 -279 183 27 -22 29 191 -155 -115 99 6 -516 171 44 -210 -7 -33 -381 -214 52 -235 -96 91
7569 91 -136 -412 -12 37 -457 -121 209 -435 -199 118 -404 -303 -214 -88 -348 24 -237 -152 159 133 -328 27
7591 27 147 -194 -303 176 26 -316 213 65 -340 59 186 -287 -72 209 -323 -132 259 -129 -72 285 130
7612 130 -161 260 58 -254 75 434 -201 -65 439 -3 -33 435 117 -305 253 265 -145 -2 414 27 191
7633 191 440 123 36 315 33 -117 605 339 -64 301 564 -95 193 341 -18 113 357 -12 -164 347
7653 347 203 -111 297 294 -22 139 274 -66 -40 151 19 -186 297 61 -137 193 152 -350 42 77 -177 -177
7675 -177 115 -206 -345 181 -163 -435 65 -9 -420 87 167 -337 -304 182 -401 -211 192 -223 -535 -12 -128
7696 -128 -389 -4 -72 -458 -60 -136 -407 -345 64 -262 -347 125 -104 -383 62 97 -285 112 170 -184 -369 140
7718 140 -225 -409 54 -47 -88 123 144 -207 -26 93 -163 -2 247 51 -95 281 -22 -322 520 194 -104
7739 -104 217 145 -285 47 402 -227 -75 278 136 -316 169 19 -22 289 442 20 216 392 -77 -91 363
7760 363 -36 -212 282 104 75 204 276 -70 203 401 -183 -100 468 7 -124 226 -16 -303 406 251 -54
7781 -54 79 408 -87 -20 304 -14 -206 332 4 -239 167 145 -213 -160 199 -133 -7 193 -389 -386 74 -73
7803 -73 -261 -74 145 -431 -64 64 -378 -99 107 -229 -227 121 -75 -337 -48 72 -294 29 -42 -452 -255
7824 -255 109 -181 -151 59 -187 -380 -50 -17 -401 181 -188 -287 -287 115 -339 -85 172 -165 -131 123 -24 -254
7846 -254 82 36 -354 201 100 -227 -169 195 -55 -162 305 -36 -244 253 39 -127 177 231 -27 -88 158
7867 158 -102 9 284 149 -237 158 184 -31 322 337 -214 215 321 -109 -79 288 -153 -64 427 171 -94
7888 -94 169 298 -112 316 320 38 9 434 -70 -51 307 145 -111 301 473 -131 168 153 188 79 278 -124
7910 -124 -83 222 -18 -253 208 221 -212 202 271 -173 -42 410 -156 -113 314 -117 -48 70 -89 -166 80 130
7932 130 -413 -155 152 -174 -220 87 -252 -267 203 -110 -386 -82 -59 -300 -164 35 -293 -175 88 -236 -311
7953 -311 22 -205 -211 -56 257 -243 -254 51 -348 -239 170 -129 -333 84 -50 -399 61 -21 -364 -152 -17
7974 -17 -322 -26 155 -143 -118 170 98 -198 173 108 -204 94 101 -307 17 202 -85 -93 146 -46 -147 132 150
7997 150 -175 108 216 83 252 253 33 100 224 23 -210 469 219 -244 130 245 -142 190 306 38 46 306
8019 306 -30 -115 349 45 -195 424 149 -97 8 453 -40 266 450 -8 47 351 56 -81 198 82 -269
8040 -269 189 371 -271 143 158 -228 -204 297 63 -73 26 81 -332 18 222 -364 68 319 -170 -174 131 -99
8062 -99 -337 216 -24 -305 17 94 -281 -47 178 -199 -177 -1 -242 -144 44 -253 -383 18 31 -107 33 0
8084 0 -372 -5 155 -207 -242 -56 -97 -375 32 79 -102 106 162 -247 144 135 -345 -156 194 -206 -238 341 -235
8107 -235 -223 52 104 -161 -180 191 62 -74 283 -15 -159 201 134 -84 26 135 -121 -31 198 -187 -29 218
8129 218 -71 -65 162 131 -121 191 448 -120 197 329 53 49 222 -114 55 414 81 48 83 302 49 147 217
8152 217 90 120 350 119 -59 263 35 -191 75 109 2 180 159 -139 88 376 -72 150 265 94 -150
8173 -150 -12 -82 -173 24 102 -391 -42 104 -141 -302 195 -172 -179 163 -14 -379 -64 117
8191A17
$$ Imaginary data points
##PAGE= N=2
##DATA TABLE= (X++(I..I)), XYDATA
0 0 0 0 0 0 0 0 0 0 0 0 0 0 -6 8 -8 8 -8 8 -16 16 -16 20 -24 26 -32 34 -40 44 -50 58 -66 73 -81 90 -100 110
36 110 -125 136 -150 166 -188 205 -227 254 -280 312 -346 386 -435 491 -559 641 -746 881 -1065
55 -1065 1330 -1740 2453 -3936 8238 -43427 -202267 -75732 89732 65267 -56224 -99932
67 -99932 -43472 25353 -10887 -96990 -83663 -5239 4043 -20833 -28609 -63516 -91238 -40347 19284
80 19284 17149 -24126 -68795 -60165 20234 35297 -61788 -80617 36442 83183 -11127 -90210
92 -90210 -57702 38620 84503 5469 -82869 -28074 63706 31357 -37894 -27725 7386 17624
104 17624 18818 2086 -14637 -11201 -14294 -1421 47869 33717 -55869 -55633 46314 73471 -318
117 -318 -50641 -29930 35943 76248 17341 -55547 -10226 66387 39581 -16301 -7428 25835 40912
130 40912 30756 -1922 -5810 23652 19204 5027 34901 31840 -24894 -17044 42634 28642 -26601
143 -26601 -22978 20259 44689 17306 -54165 -64674 28422 73474 -4333 -62109 -26667 17332
155 17332 21965 -4882 -40490 -23760 32398 28458 -21263 -27382 -10366 -4013 20461 31044 -5844
168 -5844 -21956 1591 7226 7155 18513 2852 -8501 22892 24906 -19961 -18530 23155 26101 4426
182 4426 -5353 -8952 6124 19017 -11296 -28124 12076 28764 -5882 -20851 -15049 -15798 3775
195 3775 18267 -11059 -25457 -1940 -5225 -20702 -2033 4628 -16872 -12064 2739 -7348 -10631
208 -10631 -7604 -17921 -5053 18749 -1125 -24413 -6476 -798 -13558 3585 14882 -8316
220 -8316 -14364 -2572 -7204 -1345 10462 -7221 -13229 11888 4705 -21400 -5815 10782 -5382
233 -5382 -3735 9836 -2003 -8252 -1142 -10182 -5649 21221 14086 -13451 -9998 -1931 -2682 15263
247 15263 16602 -12681 -8557 19431 7085 -11700 733 5824 4954 19796 10373 -17861 -7342
260 -7342 15052 7097 3403 10628 593 -747 9093 -5941 -12792 16766 22707 -3198 -6487 -972
274 -972 -5347 9331 18735 -7899 -13459 16058 16272 -5588 -7143 -5480 761 23968 17064 -17872
288 -17872 -12671 14167 8524 1562 8588 -2387 -5575 14998 11490 -7798 -479 7165 -169 7923
302 7923 10475 -7607 -315 16609 -2668 -14603 8969 12237 -4262 1333 3812 -7586 87
315 87 5427 -10159 -4995 12838 1945 -8838 -1723 -10362 -14503 7417 9577 -8530 -3510 -769
329 -769 -20152 -14824 7265 1761 -4675 2031 -10121 -19330 -2963 -2081 -14338 741 11599 -6128
343 -6128 -12568 -9940 -18962 -7402 17495 7165 -11401 -5605 -9028 -17033 881 9762 -4005 499
357 499 8320 -10011 -15909 -1073 -909 2495 16034 2397 -15824 -1243 3896 -11610 -886 18438
371 18438 7037 -3306 -1840 -10445 -6177 13561 8323 -3235 7976 5107 -11373 -944 9583
384 9583 -3091 2281 16910 2043 -8920 3570 1721 -4291 8858 9276 -2194 5522 5486 -11291
398 -11291 -2956 14626 4152 -2190 7053 -588 -5363 9623 5027 -10296 2918 14153 2123
411 2123 819 3934 -6534 325 17022 4689 -6666 8830 10444 -1377 4524 5943 -2899 9019
425 9019 17429 254 -1958 11112 3284 -2930 10001 7783 -506 9804 7583 -8511 -2254 7193
439 7193 -1533 2610 9850 -6806 -12009 4607 -846 -14091 -1274 4357 -6977 -6144 -5635 -16830
453 -16830 -8937 2983 -8137 -9872 1022 -10448 -19849 -3519 -896 -12165 -2975 2274 -11867
466 -11867 -10043 -317 -8649 -7201 6226 -815 -8187 1875 -2736 -12239 2779 8900 -5367 -2243
480 -2243 5833 -5490 -5857 5758 -958 -4397 7960 2167 -10040 -228 3150 -6387 2033 7927
494 7927 -6360 -5053 7289 -1629 -7220 5499 3453 -3394 6533 4540 -8486 1659 11629 80
508 80 231 9467 1749 -373 9444 3000 -2119 10904 8757 -3580 5358 8904 -4476 678 12267
523 12267 565 -4600 6183 1063 -6060 3131 1312 -6546 2683 2658 -10771 -4435 4846 -6604
537 -6604 -6751 5634 -2193 -9724 1768 1122 -6954 2341 5070 -3695 3150 7832 -4334 -146 13437
552 13437 4929 -194 11962 8396 -1280 9067 12257 2181 7928 13275 3017 4385 11445 1190
566 1190 -265 12666 6636 -3640 4853 3827 -6046 1192 4532 -7063 -3211 5358 -6430 -10755
580 -10755 -683 -5670 -10826 635 -1200 -13100 -6619 -2255 -11279 -7275 -341 -8340 -7139 2142
594 2142 -7229 -13964 -1663 -940 -7830 691 730 -11859 -6232 3198 -6480 -7497 2121 -2600 -5734
609 -5734 895 -6869 -14032 1526 5720 -8272 -5913 766 -8051 -7173 1905 -4260 -6560 3432 -241
624 -241 -7473 -10 -1862 -7924 6436 11497 -5528 -5744 7611 3867 509 7665 3354 1028 12965
639 12965 9252 -4189 4236 13465 5856 6895 10943 1365 2329 13612 6779 -671 7814 6923 342
654 342 7732 6879 -5466 821 10505 60 -3689 4251 -572 -2963 6395 -26 -10412 563 6244
669 6244 -3408 -1568 2426 -5513 -2662 5566 -2314 -5435 6304 3921 -4492 1337 1575 -5082 3825
684 3825 9551 -1103 -644 4969 -3887 -3088 10518 4438 -5537 4682 7154 -4963 -3373 2692 -252
699 -252 4303 6607 -6351 -7917 3603 -434 -5623 4392 2437 -7658 -1515 1125 -8544 -4157
713 -4157 4578 -2007 -2776 1859 -8574 -11415 4454 4482 -7499 -2969 786 -6428 -3604 -10 -7505
728 -7505 -3063 7231 -2633 -11254 -2888 -1890 -4578 2912 -82 -10457 -3146 2775 -7554 -7067 2659
743 2659 -2605 -5434 1957 -4515 -11334 620 4156 -5157 -2420 455 -6789 -2881 5168 -2545 -5011
758 -5011 4383 1650 -4321 1213 238 -2761 7137 7248 -6265 -1787 8729 995 -1712 7765 4503
773 4503 -1044 5418 4046 -1920 6564 8872 -478 3324 8831 -447 -850 9459 5472 418 7067
788 7067 4117 -1619 5998 6874 -821 5291 9449 -1283 -433 8829 1976 -1950 8208 5800 -2384
803 -2384 3572 4110 -2837 3417 8047 -1394 -1103 5511 -338 -2516 4875 619 -3459 5119 3049 -6723
819 -6723 -877 3829 -3735 -887 3934 -4968 -5644 4003 -1889 -8260 1026 1895 -6530 -2256 211 -7184
835 -7184 -4278 1505 -4850 -4835 1493 -5433 -8934 347 -1120 -8354 -1633 503 -7846 -4151 158 -7477
851 -7477 -5662 3313 -2740 -7282 -436 -3747 -8470 1308 2901 -7371 -3715 2277 -4453 -4632 1529
866 1529 -3386 -3284 4915 -466 -7920 -777 1293 -2550 4397 3821 -8098 -3129 8040 443 -5093
881 -5093 2902 2965 394 4555 -885 -7221 4298 10930 135 -2203 2744 -1438 697 8474 2229
896 2229 -3097 4681 4301 -1390 3003 2474 -2876 6375 11654 -3099 -7708 3858 6037 3974 5880
911 5880 -1022 -5268 5745 6788 -3979 -619 7827 2887 1362 3098 -4884 -3895 9298 8256 -375
926 -375 553 -1382 -4600 5627 9141 -2537 -1354 7154 1779 -3170 775 -1751 -17 12627 7985
941 7985 -9473 -7291 3263 3781 5342 4627 -4550 -2355 6354 -842 -7592 2243 5558 1039 3942
956 3942 -665 -12240 -5222 8158 4535 -677 -1448 -7930 -5642 5610 -46 -10473 -788 6879
970 6879 -1972 -7334 -7246 -8394 1033 9284 -2843 -12016 -4843 -2833 -4612 1182 -1248 -9567 -2424
985 -2424 3048 -6831 -9330 -2645 -2921 -338 4182 -7433 -15086 -1752 5794 -2178 -4375 -3729 -7210
1000 -7210 -976 4219 -5347 -7894 2734 2341 -3413 -1593 -4500 -5774 6034 8337 -5248 -6541
1014 -6541 1186 26 2239 7446 -543 -5185 4737 5284 -2379 1179 4725 2546 7210 6846 -6127
1029 -6127 -4435 10374 9974 3447 4719 1252 -1537 6937 7716 365 5908 10891 2721 1070 5241
1044 5241 68 1617 13698 10059 -1092 931 2684 584 7344 9625 758 1903 7689 518
1058 518 -3269 4485 4098 1966 7444 3369 -6600 -1713 3497 -149 3070 6112 -4118 -6296 2539
1073 2539 -420 -5138 1262 1561 -4008 -506 -1122 -9322 -5022 3269 -1706 -4258 -1398 -7017 -8449
1088 -8449 359 -1579 -8531 -2734 -587 -8156 -6298 -2407 -8037 -6005 977 -4589 -9283 -3686 -5446
1103 -5446 -8431 -868 -1277 -9891 -5274 688 -6139 -7028 -1208 -3826 -3850 1607 -3282 -7632 -55 830
1119 830 -4540 1596 4069 -4572 -2808 5350 1463 -660 4038 1071 128 7635 4675 -3993 2611
1134 2611 8736 3318 3759 5671 -323 1428 9531 4938 -136 5505 4936 930 6421 5475 -2740 2407
1150 2407 10182 3053 -712 3089 498 1413 8122 2707 -4742 3120 6987 -478 -329 2516 -468
1165 -468 3288 7050 -2305 -5596 4143 4592 -1065 1714 697 -4082 2271 5144 -3024 -2714 2754 -1550
1181 -1550 -1520 4434 -2055 -7494 1461 4286 -3269 -3154 -1789 -4613 844 4049 -5051 -6995 797 -1698
1197 -1698 -4351 1911 -398 -6926 -1350 1809 -4880 -3298 1109 -2338 -79 4107 -4956 -8844 1983
1212 1983 4449 -1133 659 465 -4018 222 2793 -4335 -1782 7275 2934 -3012 -1240 -4254 -4016
1227 -4016 6908 6707 -3860 -3358 594 -3125 -1019 2794 -2697 -1443 6811 1059 -8835 -4847 -446
1242 -446 340 6000 4167 -7576 -6564 1633 -1113 -1769 3769 930 -2180 2019 -1943 -7729 911
1257 911 6041 188 1420 2747 -5398 -5525 3389 2465 -695 3849 782 -4436 286 868 -4396 1470
1273 1470 7268 -171 -3458 255 -2827 -2073 5757 2320 -4157 525 2290 -2263 667 1845 -4277
1288 -4277 310 8119 814 -5153 403 1667 991 5395 1498 -5542 1517 7754 1292 -1018 1560
1303 1560 -1392 1681 8489 2106 -3813 2906 4194 -997 2129 3445 -726 3670 6852 -2227 -4085
1318 -4085 3855 2816 437 4943 2602 -3270 1342 2542 -3269 415 6035 1155 -69 1313 -4623
1333 -4623 -4651 4780 3952 -2231 663 64 -5812 -2169 2208 -2702 -1720 3525 -1813 -5153 -890 -4204
1349 -4204 -6576 2444 4227 -4105 -4639 -3358 -6572 -1941 3363 -2983 -5334 20 -2431 -6079 -1275
1364 -1275 -2149 -5096 2343 3455 -6282 -6192 -22 -2388 -1765 3227 -1608 -4469 1372 -118 -5904 -598
1380 -598 3510 -1141 416 1792 -4600 -2838 4579 1128 -2413 2260 1257 -2064 2660 1403 -4707
1395 -4707 1303 7075 352 -1820 2516 -653 -1046 5267 2630 -2185 2537 3013 -1661 2021 4519
1410 4519 -1525 106 5599 1122 -882 3422 682 -1558 4776 4416 -1951 1336 3311 -1303 1866
1425 1866 5507 -787 -1566 5296 2104 -2060 2665 2764 -1498 2989 3908 -2197 249 4576 -543 -527
1441 -527 4280 244 -1095 4490 940 -4403 2131 5170 -1062 -492 1765 -2454 143 4723 -1425
1456 -1425 -4095 3047 2088 -3112 175 626 -3708 645 3380 -2540 -2988 840 -2849 -2943 2419 -1271
1472 -1271 -5246 613 585 -5422 -2554 393 -4087 -2147 1387 -4407 -5368 252 -3286 -6148 187 130
1488 130 -5312 -2627 -803 -5922 -3316 876 -3056 -2943 1233 -2948 -5722 123 -202 -3766 1454 2256
1504 2256 -3753 -1210 2480 -2695 -1946 4862 2068 -942 2775 232 -2966 3142 4933 -112 2493
1519 2493 4730 -1151 -545 4078 454 270 5971 3157 -1818 1489 1219 -2435 2931 5109 -831 -5
1535 -5 3704 -1898 -3461 3160 1972 -917 3356 1654 -3907 -274 2156 -1902 1148 4779 -444 -1354
1551 -1354 2846 -987 -2872 3743 4142 -354 2320 2264 -2749 590 4192 -460 637 6102 1176 -3130
1567 -3130 1618 1351 -1749 2870 4314 -912 391 1266 -3193 -1260 3873 -317 -1537 3907 710
1582 710 -4730 -805 1213 -1351 2545 3535 -2625 -1570 2621 -2249 -2541 4160 2930 -1314 1694 268
1598 268 -3957 6 2811 -1289 867 3658 -2757 -4955 271 -1396 -3176 1807 232 -4861 -2418
1613 -2418 -2519 -7399 -3137 1524 -4129 -5736 -1460 -4912 -8062 -3218 -3212 -4939 -748 -1758 -7794 -4613
1629 -4613 -509 -4894 -3923 2254 -369 -3619 -741 -1980 -2546 2950 2506 -2798 2073 5570 -877 -1528
1645 -1528 4063 2692 1869 5347 2763 -131 4086 3267 -747 4064 6324 226 1221 5305 993 -880
1661 -880 3160 2476 1097 4556 1966 -2448 2763 4243 -2107 87 5605 2405 258 2208 -456
1676 -456 -719 5150 3342 -1300 3066 4526 -1121 162 3557 651 1644 4938 886 -1100 2885 100
1692 100 -2822 2878 4129 -1834 -916 999 -2998 -1774 2078 -1707 -2583 1506 -1918 -5607 -812 -319
1708 -319 -4777 -1455 1448 -3125 -3554 -1300 -3710 -1769 2907 -1439 -4642 1279 1160 -4171 -1222 2297
1724 2297 -131 631 1620 -3230 -1661 4049 375 -3102 1824 2027 -2030 142 200 -3674 -468 3637
1740 3637 -1640 -3240 -613 -2936 -2786 2147 -946 -5923 -1176 779 -4045 -3179 -664 -3464 -1394
1755 -1394 1787 -3327 -5541 436 -11 -3199 220 963 -2640 -84 766 -3616 -373 4457 371 -1972
1771 -1972 2107 472 -1202 2742 2289 -1007 2707 3808 -1838 -771 3532 637 392 4220 1285
1786 1285 -1630 2247 1574 -1632 2393 4197 -63 831 2299 -1381 4 5271 2042 -1302 2739
1801 2739 2557 -664 1937 2211 -732 3422 5894 -704 -1739 3362 1982 526 3895 1760 -1135
1816 -1135 2881 2857 -2115 317 3762 522 385 2167 -1555 -1311 4085 680 -3465 1088 2337 -1793
1832 -1793 -408 518 -2914 -182 2759 -2245 -3550 1713 513 -2736 -557 -1228 -3708 614 1873
1847 1873 -3607 -2527 940 -2666 -3246 -3 -2005 -2168 2154 -1380 -6629 -2346 715 -2766 -1494
1862 -1494 402 -3218 -2833 41 -4253 -5210 1605 1720 -2727 -2139 -2460 -5197 -769 2200 -2300 -1673
1878 -1673 1691 -2156 -4480 -485 -876 -728 3820 1671 -4648 -2107 1393 -1307 78 3862 699
1893 699 -635 1517 -1708 -2915 3156 4553 515 1509 1410 -2111 495 3873 589 1063 5557 1945
1909 1945 -2558 690 2085 1491 4762 3667 -1749 624 4182 119 -433 4314 2926 924 2736
1924 2736 -6 -2355 2943 4612 -204 67 2100 -507 281 2783 -1202 -1427 3937 1746 -3310 -677
1940 -677 1134 -648 1407 873 -3591 -1347 3553 -376 -2982 689 293 -1863 605 -169 -2949 1171
1956 1171 2829 -2362 -2233 1126 -765 -276 2448 -544 -2474 1808 691 -3302 215 3107 8
1971 8 -47 350 -3172 -1349 3701 716 -2690 835 944 -2109 -460 -250 -2562 1299 3475 -2761 -4181
1988 -4181 -135 -890 -1478 952 -1351 -3336 352 -445 -5815 -2551 1464 -1195 -2160 -1139 -4476 -3717
2004 -3717 1039 -1107 -4383 -769 117 -3496 -2102 -1522 -3918 -638 2775 -2011 -4155 -381 -639 -1867
2020 -1867 1358 126 -2261 1714 1783 -2775 -777 3696 1058 -494 2214 926 -145 3185 1434
2035 1434 -1184 3246 5072 194 93 2709 1045 2452 4937 932 -634 4088 3503 -72 2162
2050 2162 2993 1120 3681 4097 -1325 -144 5156 3092 161 2377 1990 951 3667 2063 -1813 2049
2066 2049 5386 1226 -496 753 -348 1610 4184 -79 -3351 1469 2467 -1986 -1275 -193 -1975
2081 -1975 416 1619 -3967 -4775 98 -588 -3152 -939 -1675 -4368 -1836 -1098 -4523 -2243 767 -2582
2097 -2582 -3590 -1180 -2814 -3058 819 -794 -3670 138 894 -3545 -1757 1628 -472 -117 1279 -1767
2113 -1767 -1965 2227 832 -2372 1066 2181 -1370 -1109 -9 -1866 542 3139 -1841 -4021 -1
2128 -1 446 -1285 327 -1504 -3629 454 1971 -3739 -3719 1125 767 -485 -8 -3123 -3212 2703 2772 -2049
2146 -2049 -993 1057 -412 952 2107 -900 640 5084 1629 -1818 1039 2056 1143 3925 2888
2161 2888 -1428 559 3726 301 -8 3417 2125 436 2082 -321 -2335 1990 3405 -285 494
2176 494 1367 -1967 -999 2351 317 259 3035 33 -2755 1371 2277 -742 1543 2963 3 735 2019
2193 2019 -1459 -538 4831 3392 -1324 -39 164 -505 2424 2534 -1797 -349 2448 -925 -2292 7
2209 7 -997 -902 2177 -1141 -5864 -2028 800 -1651 -1442 -1063 -3651 -2085 704 -3052 -4642 531 1140
2226 1140 -2250 -1709 -1930 -2866 1022 2544 -1862 -2023 1205 -441 -1175 1699 68 -1309 2195 1557
2242 1557 -2312 -115 2347 -321 469 2554 -1094 -1856 1269 268 -1207 1893 847 -2792 -755
2257 -755 1143 -1483 -433 1501 -1921 -1827 1414 -1320 -3143 610 1051 -1136 344 -476 -3650 -15
2273 -15 3345 -815 -2321 1282 446 -895 872 -604 -1780 2527 2922 -2257 -1703 1198 94 863
2289 863 2302 -1467 -1901 2306 1461 -1950 244 1119 -761 1289 1717 -2745 -1271 3368 1100 -886
2305 -886 910 -60 -993 2274 1606 -1332 972 2594 -218 326 2237 -209 259 3737 1405 -1046
2321 -1046 1929 1846 -361 2207 2985 -519 904 2830 -35 159 2867 546 -976 2874 1986 -1344
2337 -1344 196 1419 -260 1417 1584 -2302 -1301 2647 416 -1899 539 -227 -1525 1333 295
2352 295 -3461 -848 2034 -1145 -1726 206 -1893 -1736 1628 -559 -3710 -603 421 -1962 -859 -706
2368 -706 -3370 -877 1518 -2332 -3816 -478 -657 -2024 -304 -1838 -3816 -26 756 -3542 -2732 298
2384 298 -1507 -1881 284 -1880 -2825 509 -244 -2327 77 274 -2781 -683 1669 -1480 -1581 1350
2400 1350 -304 -1136 1281 -154 -1766 1748 1972 -1583 292 2141 -853 -151 2912 765 -295 1933
2416 1933 836 -308 2553 1960 -682 2185 3882 45 -118 2694 1324 1553 3742 1070 -368 3448
2432 3448 2880 -429 1824 3486 1077 1438 2920 -83 166 3309 1575 -52 2331 1422 -987 1512
2448 1512 2401 -724 163 1932 -281 -407 1249 -1188 -1494 1978 339 -2709 -174 942 -2107 -699
2464 -699 851 -1758 -1315 842 -1705 -2687 804 -547 -2995 -424 133 -2336 -1192 240 -2441 -1371
2480 -1371 355 -2250 -2239 1079 -829 -3138 -531 -64 -2479 -467 595 -2349 -1376 663 -1767 -1991
2496 -1991 872 -719 -2177 1153 247 -2830 -650 839 -1354 -37 1183 -1755 -1302 1416 -773
2511 -773 -1936 1297 516 -1600 477 417 -2508 -35 2098 -931 -1035 1667 -594 -1669 1234 213
2527 213 -1728 1256 1429 -1478 -19 1174 -1174 -70 2540 -347 -1174 1850 276 -1439 1420 1534
2543 1534 -886 1279 2182 -1318 -329 2243 184 -76 2569 740 -717 2051 1464 -787 1264 2662
2559 2662 -109 1005 2300 -555 132 3035 1084 -474 2636 1810 -588 1772 2029 -638 1271 3083
2575 3083 207 318 2426 -111 -699 2412 1775 -750 1260 1515 -1081 424 1214 -1172 87 2256
2591 2256 -1064 -2022 949 -178 -2284 516 627 -2108 -583 208 -3024 -1645 855 -1762 -1827 593
2607 593 -1511 -3387 -563 -418 -2526 -676 -15 -2558 -1085 271 -2817 -2360 985 -546 -2462 -233
2623 -233 -825 -2685 55 459 -2797 -1060 1113 -1663 -1850 626 -1149 -2127 1076 -11 -2307 65
2639 65 156 -1894 124 1117 -1939 -1097 1822 -470 -1635 1154 222 -937 1548 625 -1975 746 2634
2656 2634 -422 -154 2089 87 -162 2290 832 -717 2159 1859 -428 1598 2089 -770 956 3134
2672 3134 434 -168 2149 881 -218 2497 1351 -918 1869 2358 -864 439 2483 -275 135 2626
2688 2626 415 -829 1689 1055 -857 1718 1986 -673 881 2194 -757 -99 2263 39 -352 2252
2704 2252 423 -1512 1258 1794 -1367 248 1561 -1017 -187 1769 -931 -1617 1556 347 -1742 453
2720 453 177 -2173 -229 733 -2187 -1477 774 -1586 -1788 583 -1580 -2845 433 83 -2481 -568
2736 -568 -119 -2523 -1369 563 -2065 -1989 739 -1072 -2582 29 -740 -2613 320 948 -1969 -972 301
2753 301 -2223 -1260 1180 -701 -1657 1149 -573 -2672 -294 408 -1354 622 1659 -2028 -1751 732
2769 732 -651 -714 1757 273 -1673 809 397 -2293 216 2177 -166 717 1765 -1541 -1736 2295
2785 2295 1352 -142 1817 720 -1358 936 1867 -1082 840 3241 584 -311 1403 -296 -634 2872
2801 2872 2165 -591 1052 1465 -979 995 2389 -68 513 2972 350 -1268 1471 1075 -426 2201
2817 2201 1909 -1475 472 2211 -444 25 2111 28 -455 2425 604 -1640 736 1380 -724 750
2833 750 1256 -1367 90 2294 -590 -1563 1124 155 -1030 1509 676 -2344 -103 1085 -1511 -599
2849 -599 1091 -873 -1337 853 -1243 -2783 380 717 -1340 -50 -290 -2987 -1108 1174 -1509 -1256
2865 -1256 926 -880 -2339 -300 -1165 -2515 744 1243 -2079 -1509 -322 -2400 -1219 1549 -682 -1903
2881 -1903 324 -869 -2507 -151 95 -1701 584 1461 -2312 -2299 439 -639 -385 1699 -584 -2342
2897 -2342 690 361 -1863 341 1777 -798 39 1426 -1241 -1427 1925 1065 -320 1430 404 -1515
2913 -1515 1174 1718 -775 413 2575 -114 -64 1642 -58 -337 2844 1658 -829 1122 1607 -454
2929 -454 1027 2463 -196 221 2584 422 -549 1856 1033 -399 1686 1759 -791 723 1931 -222
2945 -222 583 2177 -256 -656 2220 830 -1194 1225 1261 -746 1011 1391 -1330 -217 2130 -296
2961 -296 -833 1461 -135 -1149 1267 694 -1882 -5 1006 -1152 -564 813 -1756 -1025 1715 -594
2977 -594 -2377 456 183 -1757 41 123 -2178 -576 1036 -1763 -1786 483 -995 -1642 654 -646 -2434
2994 -2434 -9 411 -2142 -650 453 -1852 -996 750 -1283 -2111 903 -215 -2048 134 469 -2013
3010 -2013 -327 659 -1869 -1018 1135 -790 -1283 1015 -233 -1717 552 132 -1501 535 1063 -1489
3026 -1489 -309 1405 -1078 -1147 1277 301 -556 1523 367 -1922 935 1672 -760 387 1794 -612
3042 -612 -567 1630 2 -582 2207 1474 -480 694 853 -800 1383 2665 -95 108 2136 -20 -866
3059 -866 1697 1375 122 2317 1444 -1508 534 2060 251 1097 2673 227 -752 1426 -52 -958
3075 -958 2197 2267 -348 559 771 -1240 301 2223 -69 -337 1808 -337 -1880 683 726 -654 1181
3092 1181 1039 -1898 -999 1055 -1058 -850 1277 -433 -1532 329 -781 -2247 203 1054 -1504 -720
3108 -720 192 -1965 -1342 506 -1270 -1793 811 -518 -2712 -361 -24 -1958 -506 337 -2484 -1602 779
3125 779 -1216 -1873 317 -703 -1877 165 -275 -2055 42 765 -2055 -1205 793 -665 -737 1177 -740
3142 -740 -1741 989 403 -1797 686 1662 -744 -547 898 -1173 -446 2149 518 -880 1064 67
3158 67 -1269 1037 1395 -707 878 1970 -885 -1200 1182 354 298 2271 594 -1388 1091 1235 -1132
3175 -1132 687 2376 346 -114 944 -820 -425 2330 1270 -439 1669 1211 -1083 566 1764 -47
3191 -47 999 2322 -148 -650 1557 490 -658 2118 1797 -733 350 942 -948 422 2223 -235
3207 -235 -623 1320 -408 -1101 1136 514 -1278 698 1319 -1285 -574 325 -860 -124 1468 -1320 -2172
3224 -2172 885 439 -2052 -236 665 -914 0 188 -1902 -966 1456 -466 -1655 247 -224 -1096 767
3241 767 231 -2041 -320 1000 -1198 -824 68 -1570 -1121 1533 -706 -2458 -229 535 -1184 -360 -143
3258 -143 -2208 -405 1164 -1346 -1757 710 -391 -1569 242 -191 -1541 188 408 -1654 -257 1345
3274 1345 -1054 -1049 1213 -275 -1090 975 191 -1205 663 1082 -1154 150 1419 -744 -645 1492 -54
3291 -54 -800 1159 220 -1044 971 850 -956 414 1211 -1069 -74 2078 -322 -1283 1187 932 -225
3308 -225 1023 406 -1071 1472 2115 -713 -360 1742 454 76 1616 430 -199 1840 1309 -621 1063
3325 1063 1571 -319 778 2122 84 175 1838 337 -959 1602 1233 -559 1006 867 -1379 212
3341 212 1871 -246 -497 1396 9 -742 841 -153 -1325 1037 1078 -1517 -380 699 -1160 -788 1197
3358 1197 -790 -834 988 -766 -2466 343 768 -1402 -314 158 -1518 -731 607 -1515 -1500 864 -250
3375 -250 -1803 -285 -939 -2325 -77 696 -1829 -1335 -66 -1593 -1559 461 -991 -1882 639 -324 -2344
3392 -2344 -585 333 -1484 -458 606 -1253 -1244 598 -1131 -1534 715 298 -1366 -68 250 -1367 41
3409 41 1235 -893 -358 1404 -271 -842 1380 271 -1156 1163 1100 -671 900 1491 -568 93 1856
3426 1856 418 67 1620 615 -146 1964 1465 -545 944 1956 225 1072 1888 -361 83 2342
3442 2342 1392 -149 1640 1291 -91 1378 1265 -424 789 2262 163 -299 1515 227 -291 1744
3458 1744 923 -675 1122 1131 -899 -97 1151 -411 207 1465 -725 -1453 1026 335 -1096 397 567
3475 567 -1321 58 758 -1558 -893 941 -646 -1176 365 -904 -2063 -90 -131 -1719 -451 -45 -1992
3492 -1992 -1153 116 -1482 -1554 242 -1215 -2010 -42 -704 -2237 -322 185 -1659 -943 167 -1302 -1013
3509 -1013 538 -767 -1394 504 -40 -1585 67 602 -1104 -55 1135 -1324 -700 1198 -482 -904
3525 -904 877 89 -994 867 868 -1143 -135 1143 -616 -172 1087 -551 -752 1129 145 -982 867
3542 867 684 -829 548 1157 -839 -109 1557 -93 -387 1471 162 -565 1168 1007 -674 1192 1592
3559 1592 -500 477 1719 -8 -6 1528 372 -476 1543 868 -482 1157 1355 -560 763 1494 -371
3576 -371 -230 1700 168 -351 1547 827 -731 1043 1124 -691 597 1311 -521 121 1218 -203 -617
3593 -617 1192 513 -1050 911 696 -923 347 967 -891 -215 967 -713 -1005 946 -88 -1434
3609 -1434 432 114 -1406 -202 436 -1478 -565 671 -1081 -1193 420 -893 -1512 261 -455 -1838
3625 -1838 -228 219 -2163 -893 254 -1611 -1040 77 -1209 -1798 231 -352 -1969 -278 115 -1668
3641 -1668 -647 244 -1527 -696 729 -722 -1430 307 -254 -1161 625 265 -1371 241 1019 -755 -357
3658 -357 986 -225 -307 1535 277 -1030 1354 1098 -582 741 1195 -437 465 1514 -230 -408 1735
3675 1735 692 -203 1135 595 -348 1052 1393 -787 532 1427 -16 239 1387 162 -421 1589 782
3692 782 -588 1237 1255 -164 562 1602 -240 191 1576 424 7 1240 588 -842 945 1063 -368
3709 -368 816 1342 -399 268 1468 -246 -781 1301 611 -450 355 308 -1055 374 813 -1388 -678
3726 -678 949 -634 -1041 404 -600 -1228 804 6 -1868 -325 362 -994 -241 298 -1481 -1112 944
3743 944 -497 -1596 302 -33 -1015 115 -25 -1763 -46 1179 -1013 -1222 205 -870 -1013 396
3759 396 -590 -1726 182 286 -1669 -734 261 -1194 -772 368 -1250 -1346 473 -413 -1498 176 -33
3776 -33 -1374 -171 576 -1149 -464 853 -447 -624 982 -250 -983 1023 850 -411 767 809 -756
3793 -756 222 1709 65 -367 1247 338 77 1303 528 -778 919 1670 -446 -107 1120 19 483
3810 483 1555 -179 -655 1226 861 -510 724 785 -342 985 1311 -866 -210 1724 885 64 1171
3827 1171 207 -333 1606 1229 -825 301 1696 236 161 958 -342 -46 1828 310 -960 593 701
3844 701 -696 463 814 -854 -103 867 -501 -651 726 -565 -1512 628 339 -1248 -434 49 -1107
3861 -1107 -67 635 -1415 -1236 658 -309 -945 279 -412 -1484 147 412 -1569 -613 471 -840 -719
3878 -719 67 -1300 -1403 674 -197 -1750 -365 179 -1007 -416 -147 -1727 -402 976 -866 -1738 -1
3895 -1 -311 -930 339 -421 -1735 237 877 -1057 -651 650 -619 -264 1185 -376 -1332 644 677 -611
3913 -611 333 575 -766 254 1170 -450 -249 1164 129 -613 1065 660 -379 1017 841 -425 711
3930 711 1261 -587 -307 1641 481 -259 1191 499 -259 1156 1152 -319 840 1554 -199 -3 1298 412
3948 412 234 1746 181 -917 1134 1301 -221 414 800 -386 692 1462 -724 -934 1229 951 -20
3965 -20 644 -111 -887 826 1026 -811 -333 918 -271 -183 797 -486 -684 1297 400 -1160 56 353
3983 353 -815 21 644 -977 -508 761 -776 -1246 500 -30 -1338 235 -31 -1507 -406 340 -1190
4000 -1190 -690 339 -1214 -1542 115 -493 -1468 -106 -309 -1706 -22 198 -1661 -919 592 -679 -1053
4017 -1053 75 -1135 -1144 837 358 -1694 -404 371 -603 123 555 -1376 -701 1125 1 -913 238
4034 238 48 -556 931 341 -1272 13 1426 -219 -213 969 -97 -406 921 150 -738 1291 1373 -689
4052 -689 88 648 -240 483 1630 -174 -384 1361 648 -216 1296 847 -496 1139 1392 -532 187 1480
4070 1480 235 314 1728 316 -656 988 772 -92 1194 1101 -816 239 1364 -183 -301 1119 -65
4087 -65 -181 1175 117 -1274 342 1044 -368 4 359 -952 -438 1044 -433 -966 902 283 -787
4104 -787 122 17 -1114 520 914 -1344 -862 658 -263 -709 304 -530 -950 808 109 -1569 -323
4121 -323 434 -508 -382 205 -1191 -1064 835 -226 -1429 -41 -84 -1368 -157 178 -1323 -622 324 -1210
4139 -1210 -1001 442 -688 -1292 236 -145 -1361 180 138 -1431 -296 779 -745 -1105 347 -609 -802
4156 -802 629 -228 -1208 448 567 -1084 -91 923 -418 -211 791 -546 -514 1176 390 -810 781
4173 781 850 -377 670 858 -676 155 1690 34 -423 925 217 -128 1344 900 -850 662 1432
4190 1432 -185 237 1082 97 326 1535 179 -469 1111 922 -241 834 1113 -227 382 1374 -427
4207 -427 -77 1451 230 -529 970 638 -360 718 967 -591 401 1140 -577 -357 1065 -204 -576
4224 -576 826 65 -794 517 394 -1317 2 820 -849 -436 497 -811 -743 763 -234 -1352 169
4241 169 37 -1222 -263 -46 -1209 -233 744 -815 -1278 256 -374 -951 420 -231 -1301 64 355 -1339
4259 -1339 -559 522 -769 -768 594 -686 -1257 450 135 -1095 -28 254 -1279 -217 323 -893 -765
4276 -765 759 -750 -1179 325 -178 -1066 410 181 -1210 54 634 -927 -445 958 -421 -584 753
4293 753 -61 -694 901 695 -546 596 1017 -447 -21 1164 -75 -68 1263 281 -569 1295 851 -435
4311 -435 718 818 -272 311 1177 -398 -199 1217 245 -448 1245 607 -580 1037 1018 -678 314 1172
4329 1172 -76 -52 1270 71 -148 1133 332 -712 1052 991 -276 334 1025 -453 -18 1119 -147
4346 -147 -288 1315 316 -799 424 622 -683 463 810 -850 -252 749 -759 -792 720 -144 -916
4363 -916 306 -94 -1615 119 237 -1012 -414 347 -1170 -1015 415 -415 -1306 325 100 -1361 -366
4380 -366 -3 -1280 -352 282 -1028 -680 483 -806 -1243 197 -160 -1089 20 69 -1370 -418 265 -936
4398 -936 -659 488 -569 -1144 470 -312 -1098 273 95 -907 -132 487 -745 -278 713 -412 -480 679
4416 679 -82 -776 598 309 -795 550 923 -594 187 1105 -196 -371 1048 380 -327 1006 583 -474
4434 -474 797 997 -511 337 1311 16 -34 1137 148 -422 1247 612 -334 1065 983 -351 593 1137
4452 1137 34 39 1315 330 -308 1096 467 -389 850 811 -543 401 954 -464 -41 827 4 -395 977
4471 977 98 -710 494 447 -753 298 640 -680 -419 843 -442 -575 598 -95 -816 557 33 -925
4489 -925 -13 560 -849 -479 485 -887 -658 529 -429 -1212 273 -146 -1132 35 206 -1238 -365 577
4507 577 -869 -875 240 -671 -866 504 -306 -1460 -47 104 -1228 -306 138 -835 -565 386 -753 -848 392
4526 392 -135 -800 179 74 -1011 0 461 -952 -364 708 -345 -497 822 -89 -935 633 426 -782
4544 -782 358 629 -628 28 809 -242 -147 963 45 -756 543 453 -504 571 1091 -449 321 1031
4562 1031 -64 -48 1210 343 -327 985 431 -502 766 1016 -347 338 1240 117 -52 1158 164 -325
4580 -325 1411 681 -328 1086 753 -315 490 871 -377 188 1163 -138 -299 909 335 -555 738
4597 738 546 -601 357 620 -695 -43 830 -377 -239 801 -193 -854 420 99 -812 164 418 -1183
4615 -1183 -320 577 -620 -673 491 -457 -917 225 -164 -1170 -149 238 -961 -178 339 -1096 -947 374
4633 374 -631 -1105 273 -357 -1129 34 -12 -997 -266 547 -994 -604 253 -779 -949 314 -141 -1139
4651 -1139 247 174 -1016 -153 334 -955 -439 475 -413 -771 499 -278 -794 510 48 -882 129 544
4669 544 -672 -258 703 -635 -403 925 188 -613 639 422 -609 520 926 -219 235 939 -123
4686 -123 -194 880 249 -215 1012 534 -469 704 1012 -337 451 1067 -30 -112 1107 169 -441 976
4704 976 661 -154 773 761 -248 248 1238 -112 110 1049 84 -51 916 339 -388 733 771 -564 274
4723 274 746 -407 68 889 -95 -452 839 130 -677 350 349 -783 155 589 -755 -156 605 -553 -567
4742 -567 670 -81 -876 359 33 -829 13 198 -820 -218 444 -825 -907 416 -510 -882 143 -408
4760 -408 -1215 -50 -2 -1299 -369 134 -731 -761 162 -561 -1027 243 -172 -979 -42 15 -1040 -12 292
4779 292 -1099 -693 503 -477 -730 310 -223 -671 353 75 -1033 -62 395 -473 -239 444 -476 -304
4797 -304 647 70 -644 458 86 -748 572 619 -560 124 1013 -94 -93 929 108 -97 887 474 -465
4816 -465 568 739 -128 335 770 -346 110 1122 213 -129 851 513 -38 862 587 -527 381 1157 61
4835 61 9 747 -48 -31 1032 415 -472 707 615 -287 539 881 -68 164 1091 -196 -309 854 146 -423
4855 -423 559 276 -564 313 585 -475 -127 238 -232 -232 585 -453 -793 380 159 -830 -51 203 -800
4874 -800 -182 423 -773 -583 445 -305 -538 342 -255 -1202 39 177 -838 -713 200 -869 -503 224
4892 224 -665 -1024 362 -52 -1039 -196 -309 -958 -68 443 -822 -609 244 -585 -622 424 -289 -951 401
4911 401 -12 -1073 -159 370 -593 -51 312 -582 -462 721 -73 -607 217 266 -583 250 445 -715 29
4930 29 863 -99 -76 754 -127 -299 926 393 -435 760 348 -391 426 828 -285 -40 1149 264 -193
4949 -193 677 324 -362 900 861 -340 467 967 250 436 1058 -44 -323 1037 352 -134 567 496 -397
4968 -397 532 621 -382 171 1163 44 -104 770 22 -364 827 291 -440 306 634 -326 7 598 -216
4987 -216 46 874 -192 -793 267 283 -561 55 239 -822 -166 467 -503 -588 259 -330 -594 288 -217 -1102
5007 -1102 30 -63 -707 -120 -62 -967 -293 483 -496 -830 186 -286 -821 21 -117 -1113 -95 220 -628
5026 -628 -788 232 -760 -662 406 -364 -886 35 81 -691 -12 231 -658 38 455 -636 -663 195 61 -528
5046 -528 370 -251 -748 540 637 -655 -311 611 -226 -34 679 -315 -425 779 581 -331 227 352 -160
5065 -160 447 789 -230 -37 928 15 -89 964 251 -219 733 632 -271 504 873 -95 232 675 88
5084 88 -55 955 320 -150 865 460 -333 542 597 -323 135 949 89 -196 748 -51 -131 727 528 -585
5104 -585 501 575 -148 258 597 -637 -389 831 137 -338 240 58 -509 594 277 -927 -165 587 -251
5123 -251 -307 115 -493 -432 414 -236 -930 -225 31 -733 -144 -78 -827 -464 306 -709 -919 223 -139 -851
5143 -851 -95 -196 -923 -71 158 -769 -548 1 -538 -594 268 -311 -704 10 55 -842 90 60 -781 -97 433
5164 433 -753 -374 466 -169 -509 534 -19 -648 248 361 -633 65 534 -437 -10 768 -160 -377 416
5183 416 287 -235 494 265 -469 446 641 64 61 749 112 45 796 158 -427 731 638 -224 299 640 -171
5204 -171 295 896 -157 -2 959 302 -66 676 427 11 423 674 -332 75 921 171 21 682 -6
5223 -6 -267 791 275 -532 138 586 -333 359 511 -263 -7 813 -62 -252 387 47 -548 279 278 -482 -36
5244 -36 383 -354 -324 500 -249 -404 330 -59 -720 112 -113 -794 159 261 -664 -477 373 -501 -685 171 -514
5265 -514 -713 -4 -225 -1096 -313 212 -683 -432 128 -883 -499 384 -419 -815 -34 -115 -765 -125 -15 -826
5285 -826 -322 244 -596 -658 345 -329 -628 397 -109 -883 242 437 -593 -123 561 -281 -275 619 -256 -294
5305 -294 808 -29 -415 525 439 -399 329 746 -249 130 600 -196 -166 739 183 -300 624 548 -282 466 535
5326 535 -163 314 921 -167 9 1062 250 144 748 625 -195 456 899 -260 228 800 -247 126 862
5345 862 -205 -281 741 466 -269 471 456 -302 428 579 -360 -85 648 56 -493 380 50 -494 341 245
5365 245 -631 5 242 -544 -127 455 -310 -644 345 -377 -706 98 72 -728 113 118 -728 -461 280 -375 -510
5386 -510 306 -231 -608 185 -151 -758 102 3 -796 -283 372 -755 -696 304 -394 -743 131 -177 -731 139
5406 139 159 -884 -360 288 -374 -301 220 -572 -629 312 -138 -572 76 209 -442 -95 424 -497 -213 609 -218
5427 -218 -349 463 47 -388 476 187 -525 71 400 -419 -47 711 68 -205 714 181 -362 624 366 -221
5447 -221 402 664 -90 134 762 -181 163 744 216 -150 683 426 -258 530 472 -231 105 657 49 102 836
5468 836 35 -211 649 270 -216 537 396 -349 136 731 -372 78 680 108 -58 590 64 -515 424 297
5488 297 -512 141 429 -417 -64 697 -325 -281 568 -101 -441 193 208 -676 40 90 -419 -316 531 -499
5508 -499 -461 358 -313 -547 116 -173 -793 -81 105 -808 -311 99 -690 -702 300 -381 -609 129 -95 -825
5528 -825 -265 97 -759 -168 208 -491 -333 338 -454 -688 139 -317 -580 89 85 -604 1 254 -397 -147 526
5549 526 -300 -469 455 -24 -489 408 140 -611 137 472 -241 52 680 -41 -199 463 -274 -200 660 291
5569 291 -512 317 545 -551 160 828 -58 23 746 244 71 638 478 -127 590 649 -107 426 701 43
5589 43 -28 891 242 -96 813 228 -406 484 577 -249 476 730 -418 24 647 -205 -122 649 36 -324 414
5610 414 289 -335 128 447 -449 33 457 -265 -264 583 -84 -539 358 67 -656 307 246 -669 -264 261 -458
5631 -458 -467 302 -359 -716 249 -178 -787 43 55 -871 -280 45 -866 -509 225 -545 -866 73 -289 -574 -168
5652 -168 70 -768 -432 -4 -764 -231 248 -565 -708 418 -204 -525 180 -43 -760 70 281 -631 -370 283
5672 283 -308 -439 316 -62 -308 352 249 -428 415 493 -330 7 510 -127 -289 680 11 -338 456 384 -396
5693 -396 623 607 -371 231 869 -340 -52 787 241 -188 746 385 -223 738 628 -152 399 822 -217
5712 -217 -9 865 178 106 549 229 -265 462 380 -151 367 596 -107 152 747 -53 -296 572 97 -275 445
5733 445 293 -370 187 373 -545 19 548 -279 -341 367 -40 -406 405 -32 -585 79 236 -461 -346 190
5753 190 -334 -270 343 -332 -632 283 -212 -777 80 -8 -646 -119 397 -690 -383 265 -477 -581 282 13
5773 13 -811 28 -5 -719 -43 280 -525 -321 446 -714 -586 117 -126 -697 237 164 -488 32 138 -546 5
5794 5 392 -317 -486 239 -217 -613 357 -25 -476 103 246 -441 163 529 -371 -363 395 267 -64 468 2
5815 2 -563 542 548 -319 64 491 -118 38 654 -110 -143 761 370 -107 654 417 -198 288 680 58 163
5836 163 843 6 -202 714 210 -125 592 503 -355 478 606 -183 87 453 -49 0 562 137 -274 384 262
5857 262 -267 160 494 -402 216 602 -240 -41 516 -310 -222 704 62 -450 162 168 -426 -30 579 -463 -399
5878 -399 283 -234 -532 19 -255 -805 -17 -108 -618 -244 -22 -564 -299 206 -533 -635 410 -125 -630 -46
5898 -46 -22 -765 -91 181 -513 -464 178 -590 -568 171 -199 -533 -105 -283 -610 38 256 -498 -288 55 -430
5919 -430 -356 229 -414 -571 286 154 -410 167 146 -505 277 634 -294 -142 391 -140 -226 503 217 -425 369
5940 369 402 -111 257 707 -346 -84 573 34 -182 350 153 -96 666 560 -343 388 628 -87 103 561
5960 561 -22 -144 604 39 -346 676 362 -426 368 494 22 355 561 -301 -106 830 133 -114 307 230
5980 230 -176 496 488 -505 175 482 -40 -146 588 -124 -388 438 156 -184 -15 166 -569 32 547 -305 -283
6001 -283 167 -193 -391 223 -138 -606 206 82 -578 127 298 -305 -297 340 -217 -312 321 -187 -523 90 -20
6022 -20 -530 -111 51 -840 -220 303 -331 -488 27 -325 -370 263 -168 -743 -124 176 -346 -282 147 -522 -412
6043 -412 261 -141 -642 -20 -58 -550 208 265 -517 -28 352 -235 -325 325 -110 -424 398 -28 -277 248 213
6064 213 -427 146 332 -149 -47 526 -291 0 545 161 -385 329 374 -303 365 477 -172 83 627 0
6084 0 136 803 -18 -347 470 479 -25 337 396 -244 346 712 99 -159 497 90 -136 718 75 -327 403 483
6106 483 -218 155 281 -337 294 608 -230 -323 559 11 -428 202 285 -372 45 241 -344 -42 191 -251 -347
6127 -347 202 -14 -392 233 42 -635 -167 219 -268 -393 321 -492 -262 372 -201 -662 47 47 -447 118 136
6148 136 -699 -365 184 -417 -519 -37 -394 -760 9 -200 -692 -403 -130 -731 -119 132 -516 -610 76 -177
6168 -177 -553 270 -62 -644 105 64 -373 -120 172 -252 -475 383 -322 -288 485 -80 -339 270 352 -255 18
6189 18 316 -236 -219 506 -185 -327 243 -28 -314 375 142 -204 338 632 -25 -50 470 -25 36 517 79
6210 79 -76 471 428 -279 290 506 -263 250 654 -126 0 813 358 -113 702 367 -90 487 437 -146 157
6231 157 590 -113 -38 478 56 -132 632 42 -188 345 395 -368 121 336 -327 -270 500 -359 -197 351 -164
6252 -164 -551 81 211 -591 -83 156 -354 -180 299 -482 -471 399 -30 -377 146 -139 -584 15 197 -676
6272 -676 -332 235 -248 -401 208 -264 -623 189 -239 -636 25 -3 -667 -232 265 -473 -430 186 -264 -448 149
6293 149 -155 -240 30 -29 -500 -136 340 -373 -309 213 -316 -328 433 -162 -458 42 65 -182 44 316 -352 -8
6315 -8 406 -75 -141 277 63 -262 467 305 -320 95 362 -166 156 555 -97 -65 655 251 -284 455 320
6336 320 -155 343 480 -140 270 710 -203 136 438 78 -124 611 290 -161 589 419 -47 298 504 -378
6356 -378 59 650 -40 -123 304 83 -213 508 77 -223 30 419 -226 32 312 -17 -171 475 -32 -473
6376 -473 336 134 -318 -37 171 -681 -158 331 -240 -378 91 -184 -347 153 -239 -461 19 62 -146 -198 162
6397 162 -359 -325 124 -349 -477 51 -146 -611 -283 -82 -553 -116 117 -283 -231 119 -312 -218 96 -28 -466
6418 -466 65 -6 -605 -30 336 -385 -216 172 -254 -416 253 60 -441 183 -50 -435 57 262 -404 -9
6438 -9 327 -113 -94 316 -80 -374 443 201 -325 300 324 -129 212 446 -246 -60 633 267 -132 450 113
6459 113 -68 298 358 -11 183 410 -124 50 414 98 -244 572 144 -125 300 508 -142 -130 454 16 123
6480 123 645 47 -154 406 63 -236 483 216 -304 214 303 -128 114 407 -93 -67 306 74 -193 176 66
6501 66 -334 111 271 -488 -136 384 -154 -160 209 -115 -358 50 123 -510 163 120 -421 -248 350 -366 -141 163
6523 163 -182 -379 74 -145 -412 -3 -135 -616 -218 101 -413 -425 71 -383 -681 3 -148 -400 -112 -17 -592
6544 -592 6 70 -547 -297 189 -251 -454 262 -141 -374 177 90 -455 -108 172 -346 -67 264 -58 -38 284
6565 284 -144 -383 128 82 -413 296 331 -422 -54 526 -173 132 541 -134 -101 450 186 -97 348 284 10
6586 10 58 622 54 212 606 131 13 535 113 -294 473 489 -30 153 616 -82 158 688 165 141 501
6607 501 10 -4 382 282 -102 244 381 -69 -23 365 -36 61 354 -29 -201 470 239 -338 -5 249 -485
6628 -485 -190 334 -244 -298 239 -254 -449 289 24 -306 181 117 -420 -97 -124 -193 -308 205 -266 -577 56
6649 56 -84 -355 -22 56 -385 -164 -58 -559 -394 -9 -395 -382 37 -403 -405 175 -130 -439 -96 100 -446 -238
6671 -238 188 -425 -221 197 -273 -441 -93 4 -273 -61 211 -511 -42 161 -319 -236 195 -176 -490 467 262
6692 262 -527 121 334 -263 8 540 59 -153 396 -72 47 387 383 -45 343 317 -99 406 573 -85 143
6713 143 381 -50 9 408 268 -274 449 435 -107 329 403 -199 113 410 28 18 492 275 -99 441 266
6734 266 -300 269 353 36 147 528 -37 -108 323 -88 -221 306 36 -410 223 111 -306 29 373 -123 -102
6755 -102 210 -78 -372 192 108 -367 82 80 -239 -34 106 -432 -381 113 -317 -581 154 -79 -426 35 100 -385
6777 -385 -69 -24 -273 -347 35 -384 -343 126 -5 -480 93 -55 -486 107 -32 -408 -215 271 -511 -405 190
6798 190 -82 -298 106 -89 -528 63 151 -437 -36 170 -258 -225 100 -248 -451 24 62 -323 131 204 -443
6819 -443 199 319 -212 -155 336 -163 -259 435 102 -238 263 231 -232 199 309 -165 102 523 29 -152 381
6840 381 127 88 325 392 -178 266 281 -159 282 432 134 -60 517 289 -167 483 217 -317 169 345 -80
6861 -80 181 505 11 -224 345 133 -54 411 -16 -177 254 301 -249 -20 308 -281 -73 234 -213 -288 139
6882 139 -52 -110 329 247 -467 -167 135 -313 -189 339 -242 -241 203 7 -616 -49 21 -438 67 -4 -398 -254
6904 -254 202 -342 -393 201 -232 -501 86 -26 -599 -139 176 -466 -382 242 -277 -251 -21 -387 -417 64 -156
6925 -156 -236 19 155 -517 19 234 -246 -362 358 -172 -310 217 19 -364 228 345 -330 41 377 -167
6945 -167 -93 391 -22 -131 267 112 -276 254 322 -404 162 463 -241 -109 539 84 -136 542 115 -293 379
6966 379 463 -95 348 565 -73 30 361 -123 128 339 202 -155 494 106 -240 220 311 -136 36 717 -10
6987 -10 61 346 80 -285 189 89 -97 228 -68 -214 288 298 -257 50 476 -138 -205 276 119 -324 163
7008 163 116 -347 214 72 -357 -66 213 -159 -346 108 -144 -250 254 -62 -511 -121 182 -408 -60 139
7028 139 -126 -294 237 -235 -508 31 -75 -314 127 107 -230 -196 179 -392 -362 98 -471 -521 184 73 -450
7049 -450 -80 -63 -454 -254 305 -347 -337 74 -156 -220 259 -155 -351 97 60 -275 -21 341 -391 -162 340
7070 340 5 -18 303 127 -472 247 34 -347 161 239 -268 -125 419 -100 100 374 104 -327 145 211 -221
7091 -221 376 521 -49 -40 212 -29 -2 498 29 -173 320 230 -287 433 268 -212 289 525 129 25 267
7112 267 132 173 429 208 -300 419 250 -146 8 253 -117 101 434 -244 -373 375 61 -342 24 172
7132 172 -460 111 179 -233 -93 200 -257 -322 194 -168 -558 240 87 -518 -17 165 -508 -77 239 -396 -246
7153 -246 262 -290 -499 84 -139 -401 -155 64 -351 -255 -8 -477 -259 221 -234 -328 95 -187 -350 59 -43
7174 -43 -503 -202 331 -450 -157 178 -169 -244 48 58 -392 175 66 -497 115 129 -416 -211 146 -219 -160 409
7196 409 54 -330 109 78 -304 106 132 -412 -84 342 29 -210 352 -153 -156 456 143 -223 91 235 -133
7217 -133 199 489 -159 120 325 -86 -234 546 143 -93 344 416 -188 383 472 -191 266 252 59 -80 416
7238 416 52 -106 289 393 -274 266 360 -119 -12 366 -76 -202 388 35 -306 203 119 -398 221 305 -249
7259 -249 -122 112 -305 -218 144 14 -411 13 122 -340 28 94 -628 -161 66 -115 -406 78 -157 -439 145
7280 145 -127 -539 -88 9 -429 -137 103 -387 -380 25 -304 -323 -98 -104 -409 66 41 -307 103 75 -385 -115 222
7303 222 -394 -323 102 -36 -319 -84 196 -390 25 196 -305 -136 286 -159 -142 189 3 -109 280 93 -454
7324 -454 -68 382 -194 95 462 -259 17 394 -143 -169 254 230 -109 259 262 -105 119 339 -101 -75 423 80
7346 80 -123 235 226 -239 305 322 -248 -3 506 3 97 348 60 -185 692 237 -198 276 244 -263 301 434
7368 434 -221 2 451 -69 -45 314 85 -168 321 298 -379 26 162 -278 45 338 -295 50 192 -54 -356
7389 -356 125 62 -287 -37 197 -387 71 158 -210 -145 322 -368 -381 274 114 -305 12 -63 -531 -158 120 -467
7411 -467 -155 113 -208 -353 -139 -236 -521 8 64 -371 121 134 -448 -347 137 -334 -183 364 -408 -449 248
7432 248 -242 -469 -18 183 -144 -63 219 -212 -188 185 85 -175 122 -33 -417 -60 366 -192 10 291 -175
7453 -175 -4 46 -123 -337 129 111 -209 255 126 -310 148 158 -301 -46 356 141 -151 405 234 -30 404
7474 404 237 -301 142 514 -54 132 529 -114 44 539 79 -174 333 244 -234 320 314 93 197 157 76 167
7496 167 400 55 -254 327 101 -255 117 269 -153 55 255 -197 -56 237 4 -149 333 -9 -266 124
7516 124 142 -146 -124 136 -463 123 225 -78 -319 147 6 -521 176 134 -346 -296 274 -386 -269 191 -395
7537 -395 -367 -57 -73 -520 100 26 -340 78 104 -288 -144 71 -294 -339 75 15 -394 125 -176 -411 -101 131
7559 131 -391 96 310 -289 -358 176 -136 -193 187 183 -253 -33 83 -289 183 361 -36 -103 394 -86 -219 348
7581 348 226 -349 263 -8 -161 54 270 -22 -171 409 10 100 282 34 -179 355 299 -89 223 213 -100
7602 -100 149 241 36 -43 411 10 -265 201 351 147 270 375 8 27 417 -18 -52 388 124 -111 333
7623 333 111 -142 323 391 -61 -10 456 -82 -86 333 80 -185 205 33 -276 25 237 -167 79 351 -113
7644 -113 -33 223 -79 -355 186 -69 -498 34 0 -522 -171 113 -282 -402 61 -489 -392 37 -213 -284 62
7665 62 -88 -467 -203 93 -468 -152 39 -253 -332 32 -352 -356 64 74 -530 -74 37 -237 -16 171 -196 -279
7687 -279 296 -180 -387 170 9 -279 119 31 -406 -78 275 8 -168 294 89 -270 196 207 -403 306 111
7708 111 -176 183 351 -61 -41 455 -70 25 352 166 -26 319 309 -123 225 276 259 135 533 -141 -66 424
7730 424 346 -107 294 302 -264 368 136 -75 -23 361 41 -40 345 70 -322 301 2 -117 208 94 -239 108
7752 108 259 -143 -66 67 -5 -328 178 -36 -193 41 143 -274 44 344 -103 -159 166 -53 -155 319 -6
7773 -6 -238 129 127 -458 197 -17 -396 -102 211 -218 -271 106 87 -477 83 -275 -347 -137 112 -295 -16 -5 -411
7796 -411 -368 118 -331 -159 63 73 -286 51 320 -259 -51 86 -210 99 343 -230 -343 -23 78 -214 13
7817 13 107 -401 -173 508 -215 -116 164 -77 -228 70 144 -426 162 181 -170 124 269 14 -19 305 18 -14
7839 -14 21 -84 -254 298 287 -311 247 235 -173 203 435 -210 235 242 24 -209 422 338 -286 125 77 182 170
7862 170 541 -72 -280 292 -122 95 148 159 -164 162 153 -164 43 159 -170 -115 285 0 -183 410 90 -353
7884 -353 145 -49 -234 -76 179 82 -42 240 -153 -142 11 -29 -180 0 346 -189 55 -56 -97 -265 181
7905 181 -197 -166 197 -120 -362 -18 -89 -252 128 -187 -263 -60 -87 -352 -170 50 -192 -420 99 -50 -496
7926 -496 126 144 -195 -137 -62 -86 -281 162 -77 -186 45 -102 -168 44 259 -401 -143 231 -326 -252 146 -33
7948 -33 -169 226 -3 -207 185 83 -367 88 123 -101 -21 293 -30 162 246 51 -336 185 62 -33 240 385
7970 385 -38 137 317 38 -99 284 12 32 366 158 -41 60 324 -55 172 433 80 -116 439 -82
7990 -82 217 293 351 -164 179 150 -161 450 112 -48 -180 407 35 -9 152 -155 -254 203 -111 -228 -43 259
8012 259 -56 -220 291 -183 -88 295 -13 -232 36 107 -270 -137 7 -379 -195 118 -297 -331 292 -171 -117
8033 -117 -219 -144 -367 58 128 -274 -6 325 -280 -154 150 -235 -165 -47 70 -279 -11 -98 -347 15 1 -266
8055 -266 -109 -24 -219 -377 128 111 -269 178 -13 -372 -57 333 -352 -125 266 -254 -264 173 -43 -164 143
8076 143 64 -249 -37 70 -117 -53 210 -3 -62 188 27 -181 23 153 -228 61 189 -232 -23 378 8
8097 8 -45 132 62 -142 216 226 17 187 279 -204 57 448 -86 -28 325 -52 -187 274 -20 -44 261 239 -46
8120 -46 189 296 -91 0 330 -71 -49 387 41 -294 222 118 -2 159 186 -354 41 123 -127 -242 58 -26
8142 -26 -195 113 60 -146 163 78 -48 -141 195 -159 -145 282 -115 -85 -4 -108 -255 97 70 -206 -160 55 -352
8165 -352 -196 109 -190 -379 -41 -113 -361 122 -154 -355 -68 90 -80 -262 -92 -203 -282 61 -189 -302 -66
8186 -66 4 -465 -124 150 -264
8191b64
##END NTUPLES=NMR FID
##END=
