##TITLE=1H_EC-3059(XI)
 CDCl3, 8 sc, 
 18.9.2019
##JCAMPDX= 6.0         $$ Bruker NMR JCAMP-DX V2.0
##DATA TYPE= NMR FID
##DATA CLASS= NTUPLES
##ORIGIN= UXNMR, Bruker Analytische Messtechnik GmbH
##OWNER= root
$$ XWIN-NMR		Version 3.5
$$ Wed Sep 18 14:04:27 2019 Russian Standard Time (UT+4h)  she@DPX200
##.OBSERVE FREQUENCY= 200.1315
##.OBSERVE NUCLEUS= ^1H
##.DELAY= (6, 6)
##.ACQUISITION MODE= SIMULTANEOUS
##.ACQUISITION SCHEME= undefined
##.AVERAGES= 8
##.DIGITISER RES= 18
##SPECTROMETER/DATA SYSTEM= spect
##.PULSE SEQUENCE= zg30
##.SOLVENT NAME= CDCl3
##.SHIFT REFERENCE= (INTERNAL, CDCl3, 0, 15.7039)
##AUDIT TRAIL= $$ (NUMBER, WHEN, WHO, WHERE, WHAT)
$$ ##TITLE= Audit trail, XWIN-NMR		Version 3.5
$$ ##JCAMPDX= 5.01
$$ ##ORIGIN= Bruker BioSpin GmbH
$$ ##OWNER= she
$$ F:/spectra/data/she/nmr/H-F/1/audita.txt
$$ ##AUDIT TRAIL=  $$ (NUMBER, WHEN, WHO, WHERE, WHAT)
(   1,<2019-09-18 14:03:11.92 +0400>,<she>,<DPX200>,
      <created by zg, POWCHK disabled, PULCHK disabled
       configuration hash MD5:
       00 E9 B6 7A A2 85 ED C7 34 08 36 98 17 FE 4E 26
       data hash MD5: 16K
       1F 32 85 98 C5 20 3D 19 6E 8F 16 EB 04 2A 27 38>)
$$ ##END=
$$ 
$$ hash MD5
$$ 38 28 40 14 18 1C 08 63 B4 B0 69 21 D9 53 B9 F5
##$RELAX= 
##$RELAX= 
##$RELAX= 
##$RELAX= 
##$RELAX= 
##$RELAX= 
$$ Bruker specific parameters
$$ --------------------------
##$DU= <F:/spectra>
##$EXPNO= 1
##$NAME= <H-F>
##$PROCNO= 1
##$TYPE= <nmr>
##$USER= <she>
##$AMP= (0..31)
100 100 100 100 100 100 100 100 100 100 100 100 100 100 100 100 100 100 
100 100 100 100 100 100 100 100 100 100 100 100 100 100 
##$AQSEQ= 0
##$AQ_mod= 1
##$AUNM= <au_zg>
##$AUTOPOS= <>
##$BF1= 200.13
##$BF2= 200.13
##$BF3= 200.13
##$BF4= 200.13
##$BF5= 200.13
##$BF6= 200.13
##$BF7= 200.13
##$BF8= 200.13
##$BYTORDA= 1
##$CFDGTYP= 0
##$CFRGTYP= 5
##$CHEMSTR= <none>
##$CNST= (0..31)
1 1 145 1 1 1 1 1 1 1 1 1 1 1 1 1 1 1 1 1 1 1 1 1 1 1 1 1 1 1 1 1 
##$CPDPRG= <>
##$CPDPRG1= <>
##$CPDPRG2= <>
##$CPDPRG3= <>
##$CPDPRG4= <mlev>
##$CPDPRG5= <mlev>
##$CPDPRG6= <mlev>
##$CPDPRG7= <mlev>
##$CPDPRG8= <mlev>
##$CPDPRGB= <>
##$CPDPRGT= <>
##$D= (0..31)
0 1.2 0 0 0 0 0 0 0 0 0 0.03 0 0 0 0 0 0 0 0 0 0 0 0 0 0 0 0 0 0 0 0 
##$DATE= 1568800991
##$DBL= (0..7)
120 120 120 120 120 120 120 120 
##$DBP= (0..7)
150 150 150 150 150 150 150 150 
##$DBP07= 0
##$DBPNAM0= <>
##$DBPNAM1= <>
##$DBPNAM2= <>
##$DBPNAM3= <>
##$DBPNAM4= <>
##$DBPNAM5= <>
##$DBPNAM6= <>
##$DBPNAM7= <>
##$DBPOAL= (0..7)
0.5 0.5 0.5 0.5 0.5 0.5 0.5 0.5 
##$DBPOFFS= (0..7)
0 0 0 0 0 0 0 0 
##$DE= 6
##$DECBNUC= <off>
##$DECIM= 24
##$DECNUC= <off>
##$DECSTAT= 4
##$DIGMOD= 1
##$DIGTYP= 9
##$DL= (0..7)
0 120 120 120 120 120 120 120 
##$DP= (0..7)
150 150 150 150 150 150 150 150 
##$DP07= 0
##$DPNAME0= <>
##$DPNAME1= <>
##$DPNAME2= <>
##$DPNAME3= <>
##$DPNAME4= <>
##$DPNAME5= <>
##$DPNAME6= <>
##$DPNAME7= <>
##$DPOAL= (0..7)
0.5 0.5 0.5 0.5 0.5 0.5 0.5 0.5 
##$DPOFFS= (0..7)
0 0 0 0 0 0 0 0 
##$DQDMODE= 0
##$DR= 18
##$DS= 0
##$DSLIST= <SSSSSSSSSSSSSSS>
##$DSPFIRM= 0
$$ [...]
##$SUBNAM2= <"">
##$SUBNAM3= <"">
##$SUBNAM4= <"">
##$SUBNAM5= <"">
##$SUBNAM6= <"">
##$SUBNAM7= <"">
##$SUBNAM8= <"">
##$SUBNAM9= <"">
##$SW= 24.0689530833862
##$SWIBOX= (0..15)
0 0 2 0 0 0 0 0 0 0 0 0 0 0 0 0 
##$SW_h= 4816.95568400771
##$TD= 16384
##$TD0= 1
##$TE= 0
##$TE2= 300
##$TE3= 300
##$TEG= 300
##$TL= (0..7)
0 120 120 120 120 120 120 120 
##$TP= (0..7)
150 150 150 150 150 150 150 150 
##$TP07= 0
##$TPNAME0= <>
##$TPNAME1= <>
##$TPNAME2= <>
##$TPNAME3= <>
##$TPNAME4= <>
##$TPNAME5= <>
##$TPNAME6= <>
##$TPNAME7= <>
##$TPOAL= (0..7)
0.5 0.5 0.5 0.5 0.5 0.5 0.5 0.5 
##$TPOFFS= (0..7)
0 0 0 0 0 0 0 0 
##$TUNHIN= 0
##$TUNHOUT= 0
##$TUNXOUT= 0
##$USERA1= <user>
##$USERA2= <user>
##$USERA3= <user>
##$USERA4= <user>
##$USERA5= <user>
##$V9= 5
##$VALIST= <valist>
##$VCLIST= <CCCCCCCCCCCCCCC>
##$VD= 0
##$VDLIST= <DDDDDDDDDDDDDDD>
##$VPLIST= <PPPPPPPPPPPPPPP>
##$VTLIST= <TTTTTTTTTTTTTTT>
##$WBST= 1024
##$WBSW= 4
##$XGAIN= (0..3)
0 0 0 0 
##$XL= 0
##$YL= 0
##$YMAX_a= 149390
##$YMIN_a= -260906
##$ZGOPTNS= <>
##$ZL1= 120
##$ZL2= 120
##$ZL3= 120
##$ZL4= 120
##$ABSF1= 10
##$ABSF2= 0
##$ABSG= 5
##$ABSL= 3
##$ALPHA= 0
##$AQORDER= 0
##$ASSFAC= 0
##$ASSFACI= 0
##$ASSFACX= 0
##$ASSWID= 0
##$AUNMP= <proc_1d>
##$AZFE= 0.1
##$AZFW= 0.1
##$BCFW= 1
##$BC_mod= 2
##$BYTORDP= 1
##$COROFFS= 0
##$CY= 11.3945322036743
##$DATMOD= 1
##$DC= 2
##$DFILT= <>
##$DTYPP= 0
##$F1P= 20.1720416913024
##$F2P= 0.152960286110954
##$FCOR= 0.5
##$FTSIZE= 0
##$FT_mod= 4
##$GAMMA= 1
##$GB= 0.15
##$INTBC= 1
##$INTSCL= 1
##$ISEN= 128
##$LB= 0.24
##$LEV0= 0
##$LPBIN= 0
##$MAXI= 10000
##$MC2= 0
##$MEAN= 0
##$ME_mod= 0
##$MI= 1.114404
##$NCOEF= 0
##$NC_proc= 0
##$NLEV= 6
##$NOISF1= 3.799351
##$NOISF2= 2.8
##$NSP= 1
##$NTH_PI= 0
##$NZP= 0
##$OFFSET= 15.70392
##$PC= 1
##$PHC0= -9572.674
##$PHC1= 12.40096
##$PH_mod= 1
##$PKNL= yes
##$PPARMOD= 0
##$PSCAL= 0
##$PSIGN= 0
##$REVERSE= no
##$SF= 200.130013532006
##$SI= 16384
##$SIGF1= 3
##$SIGF2= 2
##$SINO= 400
##$SIOLD= 16384
##$SREGLST= <1H.CDCl3>
##$SSB= 0
##$STSI= 0
##$STSR= 0
##$SW_p= 3612.71676300578
##$SYMM= 0
##$S_DEV= 0
##$TDeff= 0
##$TDoff= 0
##$TI= <>
##$TILT= no
##$TM1= 0
##$TM2= 0
##$TOPLEV= 0
##$USERP1= <user>
##$USERP2= <user>
##$USERP3= <user>
##$USERP4= <user>
##$USERP5= <user>
##$WDW= 1
##$XDIM= 8192
##$YMAX_p= 0
##$YMIN_p= 0
$$ End of Bruker specific parameters
$$ ---------------------------------
##NTUPLES= NMR FID
##VAR_NAME=  TIME,          FID/REAL,        FID/IMAG
##SYMBOL=    X,             R,               I
##VAR_TYPE=  INDEPENDENT,   DEPENDENT,       DEPENDENT
##VAR_FORM=  AFFN,          ASDF,            ASDF
##VAR_DIM=   8192,          8192,            8192
##UNITS=     SECONDS,       ARBITRARY UNITS, ARBITRARY UNITS
##FACTOR=    0.0002076,     1,               1
##FIRST=     0,             0,               0
##LAST=      1.7004516,     0,               0
##MIN=       0,             -260906,         0
##MAX=       1.7004516,     149390,          0
$$ Real data points
##PAGE= N=1
##DATA TABLE= (X++(R..R)), XYDATA
$$ [...]
2556a769K561M78k528J155J111k433M03J778j243l99K251j561j379J941l3j757
$$ -1769 792 1270 -1258 -103 1008 -1425 -1022 756 -487 -886 1365 -196 -1575 366 333 -1424
2572a424J630J358k122J3J435j418k59K233q83j222K364o28k366J431J471j492
$$ -1424 206 1564 -558 -545 890 -528 -787 1446 563 -659 1705 1077 -1289 142 1613 121
2588A21P17J264j940l49J997j513q94K859n55k385J351O96k076P94J632j462n3
$$ 121 838 2102 162 -187 1810 297 -597 2262 1707 -678 673 1369 -707 87 1719 257 204
2605B04J187k007j102K593l04k020J809M73k322O40R87j534L11J751j619o49K159
$$ 204 1391 -616 -1718 875 571 -1449 360 833 -1489 -849 138 -1396 -1085 666 -953 -1602 557
2622E57j203k060J937J415j674K71M67j649R89J871k054q59K420l58j527J246
$$ 557 -646 -2706 -769 646 -1028 -757 -290 -1939 -950 921 -1133 -1992 428 70 -1457 -211
2638b11J14j721J562R52j835J69J393j671l6K286j412j554K149O85k180P44P45
$$ -211 -97 -1818 -256 696 -1139 -970 423 -1248 -1284 1002 -410 -1964 185 870 -1310 -566 179
2655A79j226J224J065k697L7K887r07j499J627j52j225J780Q6k236J219J972j528
$$ 179 -1047 177 1242 -1455 -1418 1469 562 -937 690 538 -687 1093 1179 -1057 162 2134 606
2672F06l15J491j540n96K455k54k119J315L45j417J208J035k729K43K639j404
$$ 606 291 1782 242 -354 2101 1847 -272 1043 1388 -29 1179 2214 -515 -272 2367 963
2688I63j390J409n79p43J868j63k591J274J416j975R5J547j518o04K152o89j806
$$ 963 -427 982 403 -340 1528 1365 -1226 48 1464 -511 -416 1131 -387 -991 1161 472 -1334
2705a334J631L02j507J383M56k250J105J879j670j336J542j33m20J857j036k345
$$ -1334 297 599 -908 475 931 -1319 -214 1665 -5 -1341 201 68 -352 1505 469 -1876
2721a876J811J607k011k3J444j696K84J686j761j790K548Q47j807R70l40k534
$$ -1876 -65 1542 -469 -492 952 -744 -460 1226 -535 -2325 223 1070 -737 233 -107 -2641
2737b641J724K226k081n64J708j079r50J438n72j361K784P85k718j1Q39j416J135
$$ -2641 -917 1309 -772 -1336 372 -707 -1657 -219 -791 -2152 632 1417 -1301 -1312 -473 -1889 -754
2754g54K173j395j435J932j075j678K054Q35j083J408N52l282J5K041l60J49J904
$$ -754 1419 24 -1411 521 -554 -2232 -178 657 -426 982 1534 -1748 -1733 308 -52 97 2001
2771B001j812j985J775M23j714J653J135j426j4P33k222j25K938k4j283R35r45
$$ 2001 189 -1796 -21 402 -1312 341 1476 50 36 769 -1453 -1578 1360 1336 53 988 43
2788D3k095K188J328j763O56J402j642p15J471j322m23K838j33k572P01O83j573
$$ 43 -2052 136 1464 -299 357 1759 117 -598 873 -449 -872 1966 1833 -739 -38 645 -928
2805i28J528J135j962j32K060j327j036J513m63r93J887J64k441O99J643j469
$$ -928 600 1735 -227 -359 1701 374 -662 851 388 -605 1282 1446 -995 -296 1347 -122
2821a22J5J234j677o93K942o88k191J274L77j341J636Q62k423L05J665j429r93
$$ -122 -107 1127 -550 -1243 1699 1011 -1180 94 471 -870 766 1628 -795 -490 1175 -254 -1247
2838a247J743l65n15J994p45k937J045J701j090Q84R94k200p40K109j112j209
$$ -1247 496 131 -384 1610 865 -2072 -1027 674 -416 468 1462 -738 -1478 631 -481 -1690
2854a690K363O12j554N47m20k341J167K589r37m30P64j910j068K354M03j426J553
$$ -1690 673 1285 -269 278 -142 -2483 -1316 1273 336 -94 670 -1240 -2308 46 449 -977 576
2871E76O53k261k61Q30j231J169K597j503k117J179m88o76J938O47k067Q80J038
$$ 576 1229 -1032 -1293 -463 -1694 -525 2072 569 -1548 -369 -857 -1533 405 1052 -1015 -135 903
2888I03k262l12K006n06J15J902j734k298J605J192j286J148N31k224N53J941
$$ 903 -1359 -1671 335 -171 -56 1846 112 -2186 -581 611 -675 473 1004 -1220 -667 1274
2904A274k131n85K550M8j441J090p33j803K024J687k351P7J460j325m4J600j412
$$ 1274 -857 -1442 1108 1156 -285 805 72 -1731 293 1980 -371 -294 1166 -159 -203 1397 -15
2921a5j119K334K37j934O47O06j508J190J480k321n40K104k47j207J279m32j465
$$ -15 -1134 1200 1437 -497 150 756 -752 438 1918 -403 -943 1161 914 -293 986 554 -911
2938i11J927N43k193N22J562j754K8J767j598q04K183m89j348J061K25j947J502
$$ -911 1016 1559 -634 -112 1450 -304 -276 1491 -107 -911 1272 783 -565 496 721 -1226 276
2955B76J518k069m02J637r08n66J495j077j200K071M11k366N56J453j532P58R66
$$ 276 1794 -275 -677 960 52 -514 981 -96 -1296 775 1186 -1180 -624 829 -703 55 1021
2972A021j878n32K556o27j756J093J96j264J594M91k505N79J918p32r40R63j186
$$ 1021 -857 -1389 1167 540 -1216 -123 73 -1191 403 894 -1611 -1032 886 154 -786 177 -1009
2989a009k76K087k20k791J734J227j599J20R09j583L96K229j495j235J639j9j354
$$ -1009 -1285 802 582 -2209 -475 752 -847 -727 182 -1401 -1005 1224 -271 -1506 133 114 -1240
3006a240J636M87k100P38J284j532l26J809p22p30J676q80j786J898N56j461J107
$$ -1240 396 883 -1217 -479 805 -727 -1053 756 34 -696 980 100 -1686 212 768 -693 414
3023D14Q85j967l41J864j087l27J877p12j545J483q2k297J759J761j389k52P62
$$ 414 1299 -668 -1009 855 -232 -559 1318 606 -939 544 462 -1835 -76 1685 296 44 806
3040H06k009K4K506n83j573J730R6j703K48O53j053J422J898k242j456J393m27
$$ 806 -1203 -1179 1327 744 -829 901 997 -706 -458 195 -858 564 2462 220 -1236 157 -270
3057b70l62K133l71j724J234K80k371P31K087p19RQ87k174r51K012P08j369J048
$$ -270 -632 1501 1130 -594 640 920 -1451 -720 1367 648 657 1544 -630 -1581 431 1139 -230 818
3075H18N53j973L44N13j348J081K430j498j724J180k75j130J846M48j852R52Q62
$$ 818 1371 -602 -258 255 -1093 -12 2418 920 -804 376 101 -1029 817 1265 -587 365 1227
3092A227k309M7J965n49m49J110j233j317J757M80j817J107J121j869R7J135j373
$$ 1227 -1082 -1035 930 381 -68 1042 -191 -1508 249 729 -1088 19 1140 -729 -632 503 -870
3109h70M4J995j184j689J869M31j472O43N22j635O57J290j552k86J879q98j156
$$ -870 -826 1169 -15 -1704 165 596 -876 -233 289 -1346 -689 601 -951 -1237 642 -256 -1412
3126a412J138j75r36J628Q07k291M9J310j185J1J832r70n43J291r43k028J986
$$ -1412 -274 -449 -1385 243 1050 -1241 -1192 118 -1067 -1056 776 -194 -737 554 -389 -2417 -431
3143d31J406j173L71N52j732r7J754q85l33K574o81k536N24M86n17K011R02k331
$$ -431 975 -198 173 725 -1007 -1104 650 -235 -568 2006 1325 -1211 -687 -201 -718 1293 2195 -136
3161a36r0J476j648o35K400O7q36J283j046k229J373J547q68K97Q16j771p74J607
$$ -136 -226 1250 -398 -1033 1367 1434 598 1881 835 -1394 -21 1526 658 955 1771 0 -774 833
3179H33p97r64K218Q62k439j04L83q38J288J264k212k32J975q94j814J414O32
$$ 833 36 -928 1290 2152 -287 -391 -8 -846 442 1706 -506 -738 1237 343 -1471 -57 575
3196E75p26J056l63k036R10J742j625OJ622p68j218J052l43q23J637L56k069P26
$$ 575 -151 905 542 -1494 -584 1158 -467 -461 1161 393 -825 227 -116 -939 698 1054 -1015 -289
3214b89J239j463MJ185j050p66J980n44j814Q03R39j130R74N31k384P40K208j306
$$ -289 950 -513 -509 676 -374 -1140 840 296 -1518 -715 224 -906 68 599 -1785 -1045 1163 -143
3232a43j455J370o9n50J245o17j472J808R57k362j27K340o01p67Q70j112k31K125
$$ -143 -1598 -228 -297 -847 398 -219 -1691 117 1074 -1288 -1415 925 324 -443 427 -685 -916 1209
3250A209j29k272J249R12j273L93Q29j394l43J923l55j232P71l85j035J782P38
$$ 1209 1080 -1192 57 969 -304 89 918 -476 -819 1104 749 -483 288 -97 -1132 650 1388
3267A388k328K49J774j507k43J224o50n12J371p91j111J646R7j855Q60J916j535
$$ 1388 -940 -691 1083 -424 -667 557 -93 -605 766 -25 -1136 510 607 -1248 -388 1528 -7
3284gn51J110o87K7J529j349j292K146K97k184N60J432q85K52M42j431j48K071
$$ -7 -558 552 -135 -108 1421 72 -1220 926 1223 -961 -401 1031 146 398 840 -591 -739 1332
3302A332q47j687J545L52j291R02K11k236J043K252r59j380N99r63N20K098p19
$$ 1332 485 -1202 343 695 -596 306 517 -1719 -676 1576 617 -763 -164 -1127 -607 1491 772
3319G72k572J242J821j224n57M11o33R72J700k073j699K102P76j346P10O43j631
$$ 772 -1800 -558 1263 39 -518 -107 -740 232 1932 -141 -1840 262 1038 -308 402 1045 -586
3336e86O84R30j715J06K074q41j041J281p14j361J669Q41j625L18R60j431jJ416
$$ -586 98 1028 -687 -581 1493 652 -389 892 178 -1183 486 1327 -298 20 980 -451 -452 964
3354I64j363m68K345o03j978R92N31j517J382J022j731k86J055j033k35K185q32
$$ 964 -399 -867 1478 875 -1103 -111 420 -1097 285 1307 -424 -710 345 -688 -923 1262 430
3371D30j585J256Q13j698J15O31q86J388R38k230j191J976J82p61Q20l32j209
$$ 430 -1155 101 914 -784 -669 -38 -924 464 1402 -828 -2019 -43 139 -622 198 -134 -1343
3388a343J452L27j879L89J549p95k34J251j533p47K042k39j448P20R40r41L82
$$ -1343 109 436 -1443 -1054 495 -300 -534 717 -816 -1563 479 240 -1208 -488 452 -489 -107
3405a07L81j483N07K242j483j203J083N67r34P90j04j481J248J456j367p71J252
$$ -107 274 -1209 -702 1540 57 -1146 -63 504 -430 360 256 -1225 23 1479 112 -659 593
3422E93o74n44J661k64j335J231j00j361Q93Q54j305L54J444j212o86J337n91
$$ 593 -81 -625 1036 772 -563 668 568 -793 100 954 -351 3 1447 235 -451 886 295
3439B95q52J530M19j525M32N25j653Q72J502j133q21J492m94j215J293k2r20J142
$$ 295 -557 973 1392 -133 299 824 -829 43 1545 412 -409 1083 589 -626 667 645 -275 867
3457H67L11j927L46J356j251k21J541q31o12J051m62j736J766Q92j377K17O79
$$ 867 1178 -749 -403 953 -298 -519 1022 191 -421 630 168 -1568 198 1090 -287 -70 609
3474F09j311o7J801j122p73J571j25j353Q05L22j363J290Q41j583j96J067q49
$$ 609 -702 -769 1032 -90 -863 708 583 -770 35 357 -1006 284 1125 -458 -654 413 -436
3491d36p80J706m54j159J274P6j525P18J022j463M4J341j181m12J291n87j162
$$ -436 -1216 490 36 -1123 151 227 -1298 -580 442 -1021 -977 364 -817 -1229 62 -525 -1687
3508a687J530L56j630R01O93j452K89J177q45k50J318n47j011J306L07j205Q28
$$ -1687 -157 199 -1431 -530 163 -1289 -1000 177 -668 -918 400 -147 -1158 148 455 -750 78
3525G8P49j394L85J259j352m11J645m53p64J175l08j179J288M96j541M23J235
$$ 78 827 -567 -182 1077 -275 -686 959 506 -258 917 609 -570 718 1214 -327 96 1331
3542A331j139l73J321j021o17J577k01j353R86M06j271O46J029j351j82J376r63
$$ 1331 192 -181 1140 119 -498 1079 878 -475 511 917 -354 292 1321 -30 -212 1164 201
3559B01q18J299k42r44J269K12j543P70Q11j181j4R67o95n27J374n59j208J226
$$ 201 -617 682 440 -504 765 977 -566 204 1015 -166 -180 787 92 -435 939 380 -828 398
3577C98K99j345P03O24j381N26J057j155m81J391o23r59J143p7j106R83P89j606
$$ 398 697 -648 55 679 -702 -176 881 -274 -755 636 13 -946 197 120 -986 -3 786 -820
3595h20J2J277j133M8J156p18r42J613k27j293J155L79j171L75P92j120LJ467
$$ -820 -808 469 -664 -616 540 -178 -1120 493 266 -1027 128 507 -664 -289 503 -617 -614 853
3613H53p29j022J335n2j128J189k2j310P62J183j579k4J184p81o58J523m68j178
$$ 853 124 -898 437 385 -743 446 424 -886 -124 1059 -520 -544 640 -141 -799 724 256 -922
3631i22J061K03j165P23O49j279J16J431j282n52J383m31j009J341J1j296O76
$$ -922 139 342 -823 -100 549 -730 -614 817 -465 -1017 366 -65 -1074 267 278 -1018 -342
3648c42P00r36R3R41j137k61J475o27r14J144J45j034Q83L08j667Q14J342j258
$$ -342 358 -578 -485 456 -681 -942 533 -94 -1008 136 281 -753 130 438 -1229 -415 927 -331
3666c31l14J322n31n63J365m55j293J273Q88j452L57P75r45NJ293j200p62J747
$$ -331 -645 677 146 -417 948 493 -800 473 1361 -91 266 1041 96 101 1394 194 -568 1179
3684A179j21r62O74j79j218J145Q49j466N8J218o33j011R99k55q22J519l9j782
$$ 1179 1058 96 770 591 -627 518 1367 -99 -41 1177 544 -467 532 277 -545 974 935 -847
3702h47O67Q25j059M49Q90q30p21J218n44q52J148L19j104P27K37r56R8J408j266
$$ -847 -180 645 -414 35 925 95 -626 592 48 -804 344 663 -441 286 523 -433 -335 1073 -193
3721a93l30J434p91r89J002J87q57P64Jj384O46J139j500m83J645l16r87O47l78
$$ -193 -523 911 120 -869 133 320 -537 227 228 -1156 -510 629 -871 -1354 291 -25 -1012 -365 -743
3740g43r21J725M02j752K50J082n74j98J096r55m86J573k24j422O97P36r10R88
$$ -743 -1664 61 463 -1289 -1039 43 -531 -729 367 -588 -1074 499 275 -1147 -450 286 -624 364
3758C64L53j669K04J896o36r84J095m37n45R19k35j319J057J028j238m17R93p38
$$ 364 717 -952 -748 1148 512 -472 623 186 -359 560 325 -994 63 1091 -147 -564 429 -309
3776c09J19R08o19r37J200N4j257N15Q51j116L70Q17r94l36J276o75l00J479k97
$$ -309 -190 718 99 -838 362 416 -841 -326 525 -591 -221 596 -398 -734 542 -133 -433 1046 749
3795G49j576O96R47q41M33P30j266j91J614n26j050R31m1m81J016K9j975N02J898
$$ 749 -827 -131 816 -25 408 1138 -128 -319 1295 769 -281 650 609 128 1144 1173 -802 -300 1598
3814A598p79q42K40q19K65J580q32j617J279Q60j121j37L41o15M94J297j527q99
$$ 1598 819 -23 217 -602 -337 1243 411 -1206 73 933 -188 -325 16 -599 -105 1192 -335 -1234
3832a234J381L29p87O92j79j223J175R95j738k31J272k52k16O61j049p83J730
$$ -1234 147 476 -311 381 202 -1021 154 1149 -589 -820 452 200 -16 645 -404 -1187 543
3849E43N48j620K54P47q68M31P27j370r8J519q10r07J251q6j365R79O17q65rM87
$$ 543 1091 -529 -275 472 -396 35 762 -608 -706 813 3 -904 347 261 -1104 -125 492 -373 -382 105
3869A05j139N81J597j352j236J269O05j036N79j81o29Q52Q18j429o48J595o6p03
$$ 105 -1034 -453 1144 -208 -1444 -175 430 -606 -27 -208 -837 15 833 -596 -1244 351 285 -418
3887d18J007q47o81J370M71j430k30J002r3K14K70j588k21K133P3j865J60O53
$$ -418 589 -258 -939 431 902 -528 -758 244 151 365 635 -953 -1174 959 1032 -833 -673 -20
3905b0k36J116j77k013P45J742p69j090N09L1j40J212l89j517P60Q19o37K26O29
$$ -20 -256 860 683 -1330 -585 1157 388 -702 -193 -162 -302 910 521 -996 -236 583 -54 172 801
3924H01j032k91J508n40j118J174J78q91N57M27j213K22J190r80l09J296q49p78
$$ 801 -231 -522 986 446 -672 502 680 -211 346 773 -440 -218 972 -8 -317 979 130 -648
3942f48J154N3q77O59M57r28J10O78j368N49J617p93j158N61O5j98J003l54j659
$$ -648 506 559 -318 341 798 -130 -20 658 -710 -161 1456 663 -495 66 131 -67 936 582 -1077
3961a077P28J835j310q05M12l06L50J288j033j713J405R06q39N1O7j150Q88J242
$$ -1077 -349 1486 176 -629 -217 -523 -173 1115 82 -1631 -226 680 -159 -108 -41 -1191 -303 939
3979I39j500o74J392K46q82M17l59p55J304O75j555p0J167k57o22J035p26n07
$$ 939 -561 -1235 157 403 -479 -62 -421 -1176 128 803 -752 -822 345 88 -534 501 -225 -732
3997g32J424l70j184N33Q63o72K32L66j229r7J608m55q47O92J81j283R02N22j092
$$ -732 692 322 -862 -329 534 -138 94 460 -769 -866 742 287 -560 132 313 -970 -68 454 -638
4016f38K68P26r28N0J167j089q03J493L96q98K47k99r94J227J453j405n45P76
$$ -638 -370 356 -572 -522 645 -444 -1247 246 642 -256 -9 -308 -1302 -75 1378 -27 -572 204
4034B04l62j67R71p09p18J415N57j702j02J138n99N45R39j776l13J469m21j154
$$ 204 -158 -325 646 -63 -781 634 1191 -511 -613 525 -74 471 1410 -366 -679 790 369 -785
4052g85J085L33n82M28k45j455J113J486r41j052P96j49m25J309p47r68J023J038
$$ -785 300 633 51 479 234 -1221 -108 1378 437 -615 181 32 -393 916 169 -799 224 1262
4070A262j244l43R33p32L3J419p54j004P73r7o40R92O11j442P8R49j027J87J127
$$ 1262 18 -325 608 -124 -91 1328 574 -430 343 246 -394 598 1209 -233 -155 794 -233 -46 1081
4089A081r39p90J232k5q46N76j92q87J048N87j447n41J588l38m64P50n90p06J236
$$ 1081 142 -648 584 559 -287 289 97 -790 258 845 -602 -1143 445 107 -357 393 -197 -903 333
4108C33l5j314N37J157r85l68O05p25J92J284o93j471J134P55r49L46J31q31P41
$$ 333 298 -1016 -479 678 -307 -675 -70 -795 -603 681 -12 -1483 -349 406 -543 -197 -66 -897 -156
4127a56J166j482o64J162K71n07O52o31j192J498Q97j408o0R15p90j56J052o61
$$ -156 1010 -472 -1136 26 297 -210 442 -189 -1381 117 1014 -394 -454 461 -329 -485 567 -94
4145i4n51J126j02j147R65L68j302N50J039j048l0R25j009m57J569j36r50M13
$$ -94 -645 481 379 -768 197 565 -737 -187 852 -196 -226 699 -310 -767 802 666 -284 129
4163A29L30j103N47Q85j182P0J178o85r20J267q6p42Q27l0j187R95R24j364m07
$$ 129 459 -644 -97 788 -394 -324 854 169 -751 516 430 -312 515 485 -702 293 1217 -147 -554
4182e54J262m32j47P20r52p26J566L13j386L34M45p07N56P58j384l71J613l08
$$ -554 708 276 129 849 -103 -829 737 1050 -336 -2 443 -264 292 1050 -334 -705 908 600
4200F00r34N59m0p59J204M27j747L72J202j203j68J075m37o67J165m01j083Q64
$$ 600 -334 225 185 -574 630 1057 -690 -318 884 -319 -487 588 151 -516 649 248 -835 29
4218B9O07r16M8P94p28k21J084j037l33J268K8j341P18K53j067O28R25j200J26
$$ 29 636 -280 -232 562 -166 -387 697 -340 -673 595 623 -718 0 253 -814 -186 739 -461 -335
4237c35Q76j037o86J546K9j326Q02K22j035Q57N35j423L28J344q11o73Q39n43
$$ -335 541 -496 -1182 364 393 -933 -131 91 -944 -87 448 -975 -647 697 -114 -787 52 -491
4255d91o69J591l3j297M17P44j054L35R25j139K26J221p56j078J304K14p89N20
$$ -491 -1160 431 398 -899 -482 262 -792 -457 468 -671 -445 776 20 -1058 246 460 -329 191
4273A91J93r05M38R68j125j69J283m77q69P85K0o81Q63L04j269L25R71r36k82
$$ 191 384 -521 -83 885 -240 -409 874 397 -472 313 333 -348 515 819 -450 -125 846 -90 -372
4292c72J029q63m62J214l57j063J126J23q54M19O28p89%J003n67p36J073l92p24
$$ -372 657 -206 -668 546 189 -874 252 375 -479 -60 568 -221 -221 782 215 -521 552 160 -564
4311e64R94K47j170Q97M89j444J97J274p13l50Q69m20p15Q30m0j021R41Q42j269
$$ -564 430 677 -493 404 893 -551 -354 920 207 -143 726 306 -409 421 381 -640 301 1143 -126
4330a26k01P63p73p1J141o13p12Q50M3j321O69P69p66J72P62j293J2J136l01m91
$$ -126 -327 436 -337 -408 733 120 -592 258 301 -1020 -351 418 -348 -176 586 -707 -695 441 140 -351
4350c51Q58k13r70R72q2q05L60J248r71n04Q81n57n69J154l61p85J047J85j380
$$ -351 507 294 -676 296 214 -591 -231 1017 46 -458 423 -134 -703 451 90 -695 352 537 -843
4369h43K00J047p63J94O63p04o29J190m15q56J092J05j067N88M38r53L21Q73p66
$$ -843 -643 404 -359 -165 498 -206 -835 355 -60 -916 176 281 -786 -198 240 -713 -392 481 -285
4388b85l86J067o23n85J177n4j093P38O37r73m3Q74o73r9R34o08o05J304J4j211
$$ -285 -671 396 -227 -812 365 311 -782 -44 593 -380 -423 451 -222 -321 613 5 -600 704 718 -493
4408d93L70O38r87M61O67q53k20J224j009o90J483k2j145Q18L30r22L85O11r52
$$ -493 -123 515 -472 -11 656 -197 -417 807 -202 -892 591 569 -576 242 572 -350 35 646 -306
4427c06K03J175j111o52J340j83r44R01M15j200N99N54r25j2J106q79m71J264
$$ -306 -103 1072 -39 -691 649 466 -478 423 838 -362 237 791 -134 -146 960 81 -390 874
4445H74m77j123R31N30j007L89O62j055J40J012j038m60J409l13q73O47L29j171
$$ 874 397 -726 205 735 -272 117 779 -276 -136 876 -162 -622 787 474 -399 248 577 -594
4463e94R17M58j225K47J001j163k15J100k82j018J303q7j080N83L87r57L20O62
$$ -594 323 781 -444 -197 804 -359 -574 526 244 -774 529 442 -638 -55 332 -625 -305 357
4481C57p61k91J108o31o35R49J0q08N32M22r68K11R65r37k81J226p03n61R21j67
$$ 357 -404 -695 413 -218 -853 96 106 -702 -170 252 -716 -505 460 -477 -758 468 -235 -796 125 -42
4501d2o97O98J62r19M78Q86r67k35J140n70n71R42m01m90P32J57j021Q16M00q43
$$ -42 -739 -41 121 -798 -320 566 -401 -636 504 -66 -637 305 -96 -586 146 303 -718 98 498 -345
4521c45j71J065r20j36J109n16q07R02J07r83P70N03j075K59R62p41n28J256m47
$$ -345 -516 549 -371 -507 602 86 -721 181 288 -695 75 578 -497 -238 724 -17 -545 711 264
4540B64n51Q11k09n96M21N42q48K58N36p07k45J168m31q13J121j09j150J009L00
$$ 264 -287 524 315 -281 140 682 -166 92 628 -79 -324 844 413 -400 721 612 -538 471 771
4559G71j032K90Q35r52RN94k63p13J031k03r05Q56L11r88L27O61r28m5R73n99
$$ 771 -261 29 864 -88 -79 515 252 -461 570 367 -538 318 629 -359 -32 629 -299 -344 629 30
4579C0n18J073l35q09P90L03j078P57M24r75O5Q58p67k58R52l18q29R18J72j086
$$ 30 -488 585 250 -559 231 534 -544 213 637 -338 -273 585 -182 -440 512 194 -635 283 455 -631
4599f31O69M68j015J04J083j084j52J008m78p12J014j08r54P33L25o99L4J081
$$ -631 38 506 -509 -405 678 -406 -558 450 -28 -740 274 166 -788 -55 270 -429 -395 686
4617F86r75k07Q63n88o13J148q8p87N63L25j051K62Q87r13p0J004p30m53P59L9
$$ 686 -289 -496 367 -221 -834 314 226 -561 2 327 -724 -462 425 -488 -558 446 -284 -737 22 61
4637F1p71P94J25q10M22N39p21r9R72o65k20R00m32p01P64K01r81O07O31j006
$$ 61 -710 84 209 -601 -179 360 -361 -460 512 -153 -373 527 95 -606 158 359 -622 -15 616 -390
4657c90J57R64p88m61J048l20o55P66L8j094Q03N41j000L39Q91p34n92J012k59
$$ -390 -233 731 -57 -518 530 210 -445 321 359 -735 68 609 -391 -52 839 105 -487 525 266
4676B66q20J030M35j185P52K78j159M41P88p50k63R16m34o60O36J08o40N38L95
$$ 266 -554 476 911 -274 478 756 -403 38 826 76 -187 729 295 -365 271 379 -261 277 672
4695F72j005K53Q18q83j62J119n87n46J081n37p93O35M28o62K59M86r15j87J032
$$ 672 -333 -80 738 -145 -307 812 225 -321 760 223 -570 65 493 -169 90 576 -339 -526 506
4714E06l71o45Q73j35q23Q26R1j097P45M60p43j4P38p40j20J136n33p55N99J90
$$ 506 135 -510 363 228 -595 231 322 -775 -30 430 -313 -327 411 -329 -449 687 154 -601 -2 188
4734A88r09O15O53r86r3R87p64k45P29m56k83J014m84q21O97P66j076J41Q27j004
$$ 188 -721 -106 547 -439 -532 455 -309 -554 175 -281 -564 450 -34 -855 -158 608 -468 -327 500 -504
4754e04M3J026p05m33P41j68n15N15L94j053O15O32j027k16P66l14k1P82o05p26
$$ -504 -461 565 -140 -573 168 0 -515 0 394 -659 -44 588 -439 -655 111 -203 -224 558 -47 -773
4774g73P55O10r16K47M44p79L74N28o58n17R53Q5q02P46m0r19P27Q91j155j03
$$ -773 -18 592 -324 -77 367 -412 -38 490 -168 -685 268 353 -449 297 257 -662 65 956 -199 -302
4794c02R49o36l21R19m53p77J058K42q28K78K49p28L32P61q60j39R19n49m59Q00
$$ -302 647 11 -310 609 156 -621 437 679 -149 129 378 -350 -18 743 -117 -256 663 114 -345 455
4814D55k01q15P70M93j011N6Q37o14n3O75o84m98R49J75j059O33L51o57K73O30
$$ 455 254 -561 209 702 -309 -253 584 -30 -83 592 -92 -590 359 534 -525 108 459 -198 75 705
4834G05j093r4J137l60o73P40m15m81Q16M35j178K94O11o97O2P05r15j55J046
$$ 705 -388 -482 655 295 -378 362 -53 -534 282 717 -461 -167 444 -253 -191 514 -401 -556 490
4853D90q8r79M31K30o94P10L60j053K24Q96p75n35Q83k11j67O20k59j049P21O65
$$ 490 402 -577 -146 84 -610 100 460 -593 -369 527 -248 -783 100 -111 -278 342 83 -966 -245 420
4873D20q81K24L55n46j28R83o44q06R84K51o62K96K59r55N76J099q23m70P05n03
$$ 420 -461 -237 118 -428 -556 427 -217 -1023 -39 212 -450 -154 105 -850 -274 825 2 -468 237 -266
4893b66n03J269l57n90L46O31r39M09L43q63K82Q82n10p78O87j8n03R06O7j012
$$ -266 -769 500 143 -447 -101 530 -409 0 343 -520 -238 644 134 -644 43 25 -478 428 495 -517
4913e17L49P33p41j72Q56o46j39J008o59p22J008K95j030M02N88q42J41Q26o42
$$ -517 -168 565 -176 -348 508 -138 -277 731 72 -650 358 653 -377 25 613 -229 -88 738 96
4932I6n32J022k06n34M46p3o20R04L80r82j84P46k67k21P03p67n97J132K30q31
$$ 96 -436 586 380 -154 292 219 -401 503 883 -99 -283 463 196 -25 678 -89 -686 446 676 -155
4952a55K69L14o48L97N34j089J12O24j46n53Q45m53p96P31O53j137L24P14p55
$$ -155 114 428 -220 177 711 -378 -266 358 212 -341 504 51 -745 -14 639 -498 -174 540 -215
4971b15k44Q24m03l85R35l24o24K24L48p21N42N57j063M9R06n67l25N20k11l38
$$ -215 -459 365 -38 -423 512 188 -436 -212 136 -585 -43 514 -549 -500 406 -161 -486 34 -177 -515
4991e15Q03L55j458K65Q40l78J12L20q39j94J248l19q41J60M21l56O40O9j195
$$ -515 288 643 -815 -550 290 -88 24 344 -495 -689 559 240 -601 -441 -20 -376 264 333 -862
5010h62K66J274q44l15O10m32k37Q32r7p24M00M47p44K65O65q03kP92o39m35O58
$$ -862 -596 678 -166 -481 129 -303 -540 292 195 -529 -129 318 -426 -161 504 -299 -301 491 -148 -583 75
5031G5K26p72N35L72r22L63O82p13k00Q24n45m2O51k63o99P13K95n87L39R2j066
$$ 75 301 -471 64 436 -486 -123 559 -154 -354 470 -75 -117 534 271 -428 285 580 -7 332 424 -642
5052f42M00J060n67o56O41j80j00N67k76p04N66P74q42j64M60n17K33Q28o82q16
$$ -642 -242 818 251 -405 236 56 -44 523 247 -457 109 883 41 -123 337 -180 53 881 199 -617
5072f17P31M99q09M24K93r64O25O67r94k49P06p0m82N53k4o39O92K22q35RO23
$$ -617 114 613 -196 228 521 -443 182 849 -145 -394 312 242 -240 313 289 -350 342 564 -271 -262 361
5093C61n52j41N78m22m26Q74J8q48L56J27m97N07N11q89k39Q36M0p55P04l25n63
$$ 361 -191 -332 246 -176 -602 272 290 -558 -202 -75 -572 -65 446 -443 -682 154 194 -561 143 -182 -745
5114g45P15M53r17J27N59n82J28R14o71p97Q96N3n06M15p8q46J014M45r50k28
$$ -745 -30 423 -494 -367 192 -390 -262 652 -19 -816 80 133 -373 42 -36 -882 132 577 -373 -601
5134f01R73n59j52O18m49l88R34K3r03J02O06p84N46M62q58j1R99m02o48N04L7
$$ -601 372 -187 -339 279 -170 -558 376 399 -504 -402 204 -580 -34 428 -430 -441 558 156 -492 12 49
5155D9l61M99J84q77J82R54n25l78O69m09k97Q95m24q80Q60J94m63L86K09n61
$$ 49 -312 187 371 -506 -324 630 105 -273 396 -13 -310 585 161 -719 141 335 -128 258 467 -94
5175i4Q1O66l79n57P59l94l54O08O5o93K39N77m21j65O70n90j98Q30j02j033P59
$$ -94 -13 653 274 -283 476 82 -272 336 401 -292 -53 524 103 -62 608 18 -180 650 548 -485 274
5196B74J24o18L97M02r56L13O78n89l85N49j30l14P53k64r72P92N46o39k38N53
$$ 274 398 -220 177 579 -377 -64 614 25 -360 189 59 -255 498 234 -738 54 600 -39 -277 276
5216B76m31k4R69n54p64P40K51p49L47k8o33K97R61r28r1P25n51OL38j31o98O48
$$ 276 -155 -179 790 236 -528 212 463 -286 61 33 -600 -303 658 -270 -361 364 -187 -181 157 26 -672 -24
5238b4M45q35K11L80m64l2O61o04l01O82Nm40K34L72p81L70M91p93J00N80m08
$$ -24 421 -414 -203 177 -287 -319 342 -262 -563 119 124 -316 -82 290 -491 -121 370 -423 -323 257 -151
5259a51m09Q50k82q11R19J42n46Q0K29n49L99P34p34l04Q97l15n43O55p7o92O83
$$ -151 -560 290 8 -803 116 258 -288 -208 21 -528 -129 605 -129 -433 464 149 -394 261 184 -508 175
5280A75M16r37J10O53m83j31Q25o68n08J072j72m91J57L41o27J57N03q48J83R34
$$ 175 591 -346 -236 417 -66 -197 628 -40 -548 524 352 -139 18 359 -268 -111 392 -456 -273 661
5300F61m08l97L03O3k69L38Q0o54L92N80n76j44N65m12j95P35k14o75N19J75n58
$$ 661 253 -144 159 222 -47 291 371 -283 109 689 113 -31 534 122 -73 662 448 -227 292 467 -91
5321i1J04P29p32o6N59n33k63Q11l49m60N43J22p37K93M66n45J97L26n77m31Q84
$$ -91 13 742 10 -56 503 -30 -293 518 169 -291 252 374 -363 -70 396 -149 48 374 -203 -634 250
5342B50k30n14N98J2m19K79K91q85L28P58n40j89M67l83k79Q55o3p80L07N21p48
$$ 250 20 -494 104 116 -303 -24 267 -618 -290 468 -72 -261 206 -177 -456 399 336 -444 -137 384 -364
5363c64J41M60o86J46P84p16l73O10o2m03N29Qn83R3P57n27k18O66m48k45N81
$$ -364 -223 237 -449 -303 481 -235 -608 2 -60 -463 66 74 -509 -416 341 -186 -404 262 -186 -431 150
5384A50j50o14P13K56p38K92M18q12J33O80m30l17P51k20o34P55Q4p31M31L08
$$ 150 0 -614 99 355 -383 -91 327 -485 -352 328 -102 -419 332 112 -522 233 317 -414 17 325
5404C25o78Q0O22m55l17Q16j34p22O01K77p04N21K63p14L74L92m69k53N55k54
$$ 325 -353 -273 349 -106 -423 393 259 -463 138 415 -289 232 495 -219 155 547 78 -175 380 126
5424A26l41N68j30o39O38N29q62J04N92n24j51O16m26m09O05N7o13P57p0o99L85
$$ 126 -215 353 223 -416 222 751 -111 -7 585 61 -90 526 100 -309 296 353 -260 497 427 -272 113
5445A13N21q06O5Q72n78n93R60l10n99O02J27q85L28O25n09k33O63m27k96O08
$$ 113 634 -172 -107 765 187 -406 554 244 -355 247 374 -511 -183 442 -67 -300 363 -64 -360 248
5465B48k58n21N41L35o36J80M34o38L62K09n67j70P20k14o38O46K91j003O06K26
$$ 248 -10 -531 10 345 -291 -111 323 -315 47 256 -311 -481 239 25 -613 33 324 -679 -73 153
5485A53o20L09K79m28j30N48j23n53Q41l00m81M44L75o39m3P54o76j1M91j53n28
$$ 153 -467 -158 121 -307 -437 111 -12 -565 276 -24 -505 -61 314 -325 -368 386 -290 -301 190 37 -491
5506d91P81p3q16L84M13m48J62M66p83J31Q37n31l38O63j76p12P21K47p35K61
$$ -491 290 217 -599 -215 198 -250 -88 378 -405 -274 563 32 -306 357 181 -531 190 437 -298 -37
5526c7O34r35K08M73k76l74Q26o24j24L84J12q63P53L33o03j37M22l43k07Q72
$$ -37 597 -338 -130 343 67 -307 519 -105 -229 155 267 -596 157 490 -113 -250 172 -171 -378 494
5546D94m08m85N41L28q55M91J43l48J44K56m56o7N27j90l57N71pp14N28K81o67
$$ 494 86 -399 142 470 -385 106 249 -99 45 301 -155 -222 305 115 -242 329 322 -392 136 417 -250
5567b50J99K88m37q5O78k62n97R25j05p46O05K6p03M79N16o66j07O77l54l14N53
$$ -250 -51 237 -200 -285 393 131 -466 459 354 -392 213 239 -464 15 531 -135 -242 435 81 -233 320
5588C20N6o95O51K33o02J09M38o03o8O36m39l03O13j33m21M44m7n46L06M43n85
$$ 320 376 -319 332 565 -37 72 510 -93 -161 475 36 -267 346 213 -208 236 189 -357 -51 392 -193
5609a93j3M24l46l28P56k29o00N75L0n43M88K32q27L57K97n40j4P86n30k63N85
$$ -193 -206 218 -128 -456 300 71 -529 46 76 -467 21 253 -574 -217 80 -460 -474 312 -218 -481 104
5630A04r6n40M40K33o04J99N51n95N6N10l99j18N65j48p82N87J23m14K59M62o06
$$ 104 8 -532 -92 141 -463 -264 287 -308 -252 258 -141 -259 306 158 -624 -37 86 -328 -69 393 -213
5651b13m6P62n56m39Q53k48n30O24K10j006N06P03q60j12O55m46LO26k90n31P35
$$ -213 -259 503 -53 -492 361 113 -417 207 417 -589 -83 620 -240 -352 303 -143 -140 486 196 -335 400
5672D00K2n27J46K55m80R8M28k81k99Q08l68n50O36K02n94M70J39o05R7O05n29
$$ 400 422 -105 41 296 -184 -86 342 61 -238 570 202 -348 288 490 -104 366 505 -100 -3 602 73
5693G3l41P39k61l87N51j35l72K83J06l13r2P22p02j19Q61n56m55N22o7l72M75
$$ 73 -268 471 210 -177 374 239 -133 150 256 -57 -149 573 -129 -248 613 57 -398 124 57 -315 160
5714A60R0m38J61M22n85j4N68l63m86R12l10n81P14j19l55N09pl79j9M32m78j15
$$ 160 250 -188 -27 395 -190 -204 364 1 -485 427 117 -464 250 131 -224 285 278 -101 -120 312 -166 -281
5736b81M53k31m52P99j59p59M74K99n21J11M08m78K7O40m63m18P27Q7n29K98J36
$$ -281 172 -59 -511 288 129 -630 -156 143 -378 -267 141 -337 -310 330 -133 -551 176 263 -266 32 168
5757A68o17M07K60n05j89O27k07m43O44j0m72M28K99p11R1M23j80q4M16l94m24
$$ 168 -449 -42 218 -287 -476 151 -56 -499 145 135 -337 91 390 -321 -230 193 13 -71 345 -49 -473
5778d73P25l3o20O40J26o66N7P39n16l49P50m57l33O86r9l51L80J08p02N63L46
$$ -473 252 219 -401 239 365 -301 -244 495 -21 -370 380 -77 -410 276 177 -174 206 314 -388 175 521
5799E21p13m1O83m31k79P01l08n92R36K0m66K02R6m85l4O41m49k70L84k08j26
$$ 521 -192 -233 450 19 -260 441 133 -459 477 497 31 233 329 -156 -190 451 2 -268 116 -92 -218
5820b18N81M0p32L14L98n40J27M46m86k41Q43l31m16M00j29m85N28K54n87J83
$$ -218 363 403 -329 -15 383 -157 -30 416 -70 -311 532 201 -215 185 56 -429 99 353 -234 -51
5840e1M01n41m1N30k71m39O53j70l29L96J92o97O5N23l86J16M41o42j86P83j42
$$ -51 350 -191 -232 298 27 -412 241 71 -258 138 330 -367 -302 221 -165 -49 392 -250 -436 347 205
5861B05p22N84o8l81K85L97o79j55P46j86k79M10j89o24Q36P7p08K92L73o87J09
$$ 205 -517 67 -1 -382 -97 300 -379 -534 212 26 -253 157 -32 -656 180 257 -451 -159 214 -473 -364
5882c64P67l64l71L69j50k96O90n1q90L06O55n80m2N13n44RQ58m02n13M79j3n71
$$ -364 403 39 -332 37 -113 -409 281 230 -660 -354 301 -279 -321 192 -352 -343 515 113 -400 79 66 -505
5904e05O30J30k64m4L88n57j02O82l48l00M03J41m65N29N0o95J96P01o05q8N04
$$ -505 125 255 -9 -53 335 -222 -324 358 10 -290 113 254 -211 318 368 -327 -131 570 -35 -123 381
5925C81o47K3P98l1r42N70M0l97L39L25o04m0O40k24m47O96l18l58N61K14p10
$$ 381 -266 -243 555 524 -418 152 192 -205 134 459 -145 -185 455 231 -216 480 162 -196 365 579 -131
5946a31N6N61n96K58M62p76k94P34j11m76P85k85o70M74J45l92L33K44n60J5O59
$$ -131 -75 486 -110 148 610 -166 -460 274 163 -313 472 187 -483 -9 136 -256 77 321 -239 -224 435
5967D35k77n61O86j14p36P61K03p54R8L63m31P4P72m24p06N01J92k43K29k00m70
$$ 435 158 -403 283 169 -567 194 397 -357 -259 104 -327 -253 519 95 -611 -110 82 -161 68 -132 -602
5988f02L31N83n00k7K56l98j60Q13j60p81P05J35n00J55L75p15J33M83k53k62
$$ -602 -271 312 -188 -215 41 -357 -517 296 136 -645 60 195 -305 -150 225 -490 -357 126 -127 -389
6008c89N90m07l38O07J70p99M93M31p10J67N00m86m8K97j32m11N93Q7o93M36K20
$$ -389 201 -206 -544 63 233 -566 -73 358 -352 -185 315 -171 -219 78 -54 -465 128 215 -478 -42 178
6029A78n55J53N92l75m80R26j67m40M75l22m09O33L65p32Q6M04l16n4N19l36n27
$$ 178 -377 -224 368 -7 -487 439 272 -168 307 -15 -424 209 574 -158 -72 332 16 -38 481 145 -382
6050c82O91R4m50K55Ll75L51L21l90l49L94j30j62O71j71m90M26m7o09L99M10
$$ -382 309 403 -47 208 211 -164 187 508 118 -231 163 33 -129 542 371 -119 307 260 -349 50 460
6071D60n11o8M52m06j14P48m32n57M88K07m38K82j9o95M36M39m06k51L66j77j32
$$ 460 -51 -119 333 -73 -187 561 129 -428 60 267 -171 111 92 -603 -167 272 -134 -385 -19 -196 -328
6092c28O42k63m70J43M54l88L2M52o48mQ41j99l67J52j54k65L61L74q46J79M62
$$ -328 314 51 -419 -276 178 -210 -178 274 -374 -378 463 264 -103 49 -105 -370 -9 365 -481 -302 160
6113A60l66K86K73m95k91O67j2n73M09J80n54J10O42n96r8O04n21k28L01Q8k96
$$ 160 -206 80 353 -142 -433 234 222 -351 58 238 -316 -206 436 -160 -258 346 -175 -403 -102 -14 -310
6134c10L76l3n44O21J48m83k3L48j19k11N23l77n91O66L35n44P7K10l34J80O75
$$ -310 66 33 -511 110 258 -225 -248 100 -19 -230 293 -84 -675 -9 326 -218 -141 69 -265 -85 590
6155E90n43m18O15j65k88M31O9p74N83J43j20k15K36l95o6Q34m16l87M51j04k31
$$ 590 47 -371 244 79 -209 222 291 -483 100 243 123 -92 144 -251 -317 517 101 -286 165 61 -170
6176a70M25K55n94q6M70l69l0N15m66p4M34n6l25K18K68p22K21N43n16J3M82n83
$$ -170 255 510 -84 -170 300 -69 -99 416 -50 -124 310 254 -71 147 415 -307 -86 457 -59 -46 436 -147
6198a47J1M94R2o14R8K80m48M28K38o40q9O61m40K2L73m25l27O82o6l06J71J81
$$ -147 -136 358 450 -164 -66 214 -234 194 432 -208 -297 364 -76 -54 319 -106 -433 249 183 -123 48 229
6220B29n28J93K99l05k08L69j60l09O47k61l16L07J19l38J24K18m00j24Q14m75
$$ 229 -299 -106 193 -112 -320 49 -111 -420 227 -34 -350 -43 76 -262 -138 80 -320 -444 370 -105
6240a05l01O45p6n86M87P4k98J76J88k88j04L96l37k27M62m5l19M15j32m07J09
$$ -105 -406 239 163 -423 64 138 -160 16 204 -84 -188 208 -129 -356 106 61 -258 157 25 -382 -273
6261b73O94p12J13M68o32J5P21k84o29M71N8j44L08k2l57%N80l30l27K84m4k30
$$ -273 421 -291 -178 290 -342 -327 394 110 -519 -48 10 -134 174 152 -205 -205 375 45 -282 2 -42 -272
6283b72M02J11m17J26L75m88J4M27l16j68L15M1n62M62J06l96K35R0k92L07K93
$$ -272 130 241 -176 -50 325 -163 -149 278 -38 -206 109 150 -412 50 156 -240 -5 85 -207 100 393
6304C93o29J42M18k41k04K74K1n60M80M41o26J35L40m95j53P49l74j82K96P2m83
$$ 393 -236 -94 324 83 -121 153 174 -386 94 535 -91 44 384 -111 -264 485 111 -71 225 297 -186
6325a86N34k36k40J26L32k28l02N26k40l66O13k44k91N25k4n56K88L67o89P3M57
$$ -186 348 112 -128 -2 330 102 -200 326 86 -280 333 89 -202 323 299 -257 31 398 -291 -218 239
6346B39l03j54M56j24m49M06j9l86L12L83o25L8M95l12j23J49j88k02O57q7n93
$$ 239 -64 -218 238 114 -335 71 52 -334 -22 361 -264 -226 269 -43 -166 -17 -205 -407 250 163 -430
6367d30M58J84m92J38J33j48l01O82k25k20J62j59l30P17J01n48J41M36m94p0
$$ -430 28 212 -280 -142 -9 -157 -458 224 -1 -221 -59 -218 -548 169 270 -278 -137 299 -195 -265
6387b65M21k91k02N57k52m06M77K8m79L95L20p15K07N66m05k02L05q0k52M22J29
$$ -265 156 -135 -337 220 -32 -438 39 67 -412 -17 303 -412 -205 361 -44 -246 59 -21 -273 149 278
6408B78n97M13K10m46QK91k67j71M97j31k32L12J35n06L72M01p13J17M19j69l30
$$ 278 -319 94 304 -142 -134 157 -110 -281 216 85 -147 165 300 -206 166 567 -146 -29 390 221 -109
6429a09N80l43l63N11j96m80N17L12n60J11J89l56L3N65m72k39N01j87k32L44
$$ -109 471 128 -235 276 80 -400 117 429 -131 -20 169 -187 -154 411 -61 -300 201 14 -218 126
6449A26K44m81J55L05n07l7M22j96j42J51K0l01K93P7m97M18R9m82K02N26m87
$$ 126 370 -111 44 349 -158 -195 227 31 -111 40 60 -241 52 129 -368 50 149 -333 -131 395 -92
6470i2j28J97Pl32L37N0m33L97K33m21nL44m65L3L57j97l11N48M0l81K8K49l47
$$ -92 -220 -23 -16 -348 -11 39 -394 3 236 -185 -190 154 -311 -278 79 -118 -429 119 159 -222 -194 55 -292
6493b92J27N33n79m2L63j09l42N45r4m97L68K36m70J60L31n39K33K80j94m87Q26
$$ -292 -165 368 -211 -253 110 1 -341 204 110 -387 -19 217 -253 -93 238 -301 -68 212 18 -469 357
6514C57l36k84M07Q9m83K71R5j75Q2K21j64l39M02k6l66K98J19l54M12R0l13j7
$$ 357 21 -263 144 233 -250 21 116 -59 23 244 80 -259 143 117 -249 49 168 -186 226 316 3 -14
6536a4L60k87j39M49l11k38K84J60l75P6K72k49j05L56k43j06K68J49n45L76j9
$$ -14 346 59 -80 369 58 -180 104 264 -111 -35 237 -12 -117 239 -4 -110 158 307 -238 138 119
6557A19l43K57J17m50K98K49l37r3M84k84j93L91j22l15M04K29q04K59K96j26
$$ 119 -224 33 150 -300 -2 247 -90 -183 301 17 -176 215 93 -222 182 411 -393 -134 162 36
6577C6o8K30k40k45M55m2l93M99P0n82L15K24l92l7M47m92J34K70j6o01J91L48
$$ 36 -32 198 -42 -287 168 126 -267 232 302 -280 35 259 -133 -170 277 -215 -81 189 173 -428 -237 111
6599A11m26K34L25n25K47K69j85k22K69k2k30J40J6l23K60J44l00K7K52k33O0
$$ 111 -315 -81 244 -281 -34 235 50 -172 97 75 -155 -15 1 -322 -62 82 -218 -191 61 -172 -112
6620a12J63k50k30L51O9j93J26K81m00J82J86l91m4M23k48k50K83j8m17O02J43
$$ -112 51 -199 -429 -78 -9 -202 -76 205 -195 -13 173 -218 -262 161 -87 -337 -54 -72 -489 113 256
6641B56l36k33N86m48r1L95k42k20M32n1k68L04j43j24L9K50m58J24L32k43j85
$$ 256 -80 -313 273 -175 -266 129 -113 -333 99 48 -220 84 -59 -183 -144 106 -352 -228 104 -139 -324
6662c24N83k45l31M59p5j47J71L07o15J04N83o20j08L79J0k38L92R0l89l4L28
$$ -324 259 14 -317 142 67 -80 91 398 -217 -113 470 -150 -258 121 131 -107 285 375 -14 -48 280
6683B80l60K22J20k15n5K72j42k43L64N7n74K98K85j67m9K02l68M4K02M4k19M23
$$ 280 -80 142 262 47 -8 264 122 -121 243 300 -274 24 309 142 93 295 -73 -29 173 217 -2 421
6705D21k68n21M25L16l26R1J5j41k8L58j72m50L93m5l87M85M8m91J74P7j04j85
$$ 421 153 -368 57 373 47 138 153 12 -16 342 170 -280 113 68 -319 166 214 -277 -103 -26 -130 -315
6727c15O30l69k15K77R9n00L09K27n54K75K28l44Q0K87m09J2M70l19k15N07k37
$$ -315 315 -54 -269 8 107 -393 -84 143 -411 -136 92 -252 -172 115 -294 -282 188 -131 -346 161 -76
6748g6j86J95J53k91m6M46l73m9L04o4k10L37n9l88K25K38l14N0J80k73L2M84
$$ -76 -262 -67 86 -205 -251 195 -178 -227 77 13 -197 140 81 -307 -82 156 -158 -108 72 -201 -169 315
6770C15m01j73N07j49l19K14J25l38J84L13n29J79L80j45k15K63k42L4J71k5m51
$$ 315 -86 -259 248 99 -220 -6 119 -219 -35 278 -251 -72 308 163 -52 211 -31 3 174 149 -302
6791c02L89J61j83j74N40l86k50K82n3j4L25J05n87J99K83o27K16N12k60j92K62
$$ -302 87 248 65 -109 431 45 -205 77 24 10 335 440 -147 52 335 -292 -76 436 176 -16 246
6812B46q2k70K69j3k41K56K76o88K29Q7ql35M50m0l65L41j09j10J85K50m66M39
$$ 246 164 -106 163 150 -91 165 441 -247 -18 69 61 -274 176 136 -229 112 3 -107 78 328 -138 301
6834C01j07l01o6M56l55k64N84k13l61M05P9l32p3M90m30J48K37m75j67O22k30
$$ 301 194 -107 -173 283 -72 -336 248 35 -326 79 158 -174 -247 243 -187 -39 198 -277 -444 178 -52
6855e2j30J66J59m17L01K42o38J38L28j40k13L86k49j03K16Q2m12L05L17l70j49
$$ -52 -182 -16 143 -274 27 269 -369 -231 97 -43 -256 130 -119 -222 -6 76 -336 -31 286 -84 -233
6876b33M16l51n5K41p8j89L66l4l70J85L72n28J48L52l92N8K85k11j30K41%l13
$$ -233 183 -168 -223 18 -60 -249 117 83 -287 -102 270 -258 -110 242 -150 -92 193 -18 -148 93 93 -220
6898b20K74O9k37M8M41n14j29M66k02k53N26j34l64K40J68l24J75K78k36j11L58
$$ -220 54 123 -114 -66 375 -139 -268 198 -4 -257 269 135 -229 11 179 -145 30 308 72 -39 319
6919C19k84j29L55n5l51L98j38o8R5K93l69j77N41m43j43L77Q3m83K37K17m52
$$ 319 35 -94 261 206 -145 253 115 47 142 435 66 -111 430 -13 -156 221 304 -179 58 275 -177
6940a77L24J33n69J96M90l70j03L03j31k91M11k8n20L58J97k74J47O3j34p6J06
$$ -177 147 280 -289 -93 397 27 -76 227 96 -195 216 188 -332 26 223 -51 96 159 25 -51 55
6961E5r3l52L82J18l20J65J29m79K13M43l34k82N29j76l80P08j16m54K88l2k80
$$ 55 -38 -390 -8 110 -210 -45 84 -395 -182 261 -73 -355 174 -2 -382 326 210 -244 44 12 -268
6982b68J27J76k31j0L59m79L6L89r2k34J49K64k57j32M41l08J0K16k76j86L72
$$ -268 -141 35 -196 -206 153 -326 -290 99 7 -227 -78 186 -71 -203 238 -70 -60 156 -120 -306 66
7003F6O4m24M57j31j44p3M30n06J75J37j2k20L98l77j21M38r2k47N3M26o88L67
$$ 66 130 -294 163 32 -112 -185 245 -261 -86 51 39 -181 217 -160 -281 157 65 -182 -129 297 -391 -24
7025b4K23k21o3N08k99k94M11j17l19J44L07k96J2L64k61j67L99l42P9L54j32
$$ -24 199 -22 -85 423 124 -170 241 124 -195 -51 256 -40 -28 336 75 -92 307 -35 44 398 266
7046B66n75M12K23o57O12l3j53J7K9Rl79K59m6k9K83r6m26K77J84j73N3J99j33
$$ 266 -309 103 326 -331 281 248 95 112 141 150 -229 30 -16 -45 238 142 -284 -7 177 4 57 256 123
7069A23l50L76J26m39K40J5k39L35K9l71j41M50k67M0J82q7k81L16J29n60L92
$$ 123 -227 149 275 -164 76 91 -148 187 216 -155 -296 154 -113 -73 109 22 -259 57 186 -374 18
7090A8J95m43R8K59o2k14L37l38j35L75pl62K43J63l40L4M46m59j32L87o0l4N7
$$ 18 213 -230 -132 127 65 -149 188 -150 -285 90 83 -279 -36 127 -213 -179 267 -192 -324 63 3 -31 26
7113B6Q9o05L61K15l83K38J82l29J38K90j74k68L60j73l24M09J48o13L19L12m69
$$ 26 115 -490 -129 86 -297 -59 123 -206 -68 222 48 -220 140 -33 -357 52 200 -413 -94 218 -251
7134b51N8K34j00j63M20k43p6K79r0k30J25M68n30k7J61q0j28J90J66n27M59p6
$$ -251 -193 41 -59 -222 198 -45 -121 158 68 -162 -37 431 -99 -126 35 -45 -173 17 183 -344 115 39
7156C9j05J99l1n03K88L64l36oK26k01j23M08o6m03J19K88m45J67L82l60j42L70
$$ 39 -66 133 102 -401 -113 251 -85 -91 135 -66 -189 219 153 -250 -131 157 -288 -121 261 -99 -241 129
7178A29p4j90L93j24m66L60K76n24K77L3j42r5M17k99k35L24n8k07M83k22q6L61
$$ 129 55 -135 258 134 -332 28 304 -220 57 90 -52 -147 270 -29 -264 60 2 -205 278 56 -30 331
7200C31p4l68J66M0j25k37M42j21k27M01Kn53K50M89l96n3K63m58P1L55k16m21
$$ 331 257 -111 55 95 -30 -267 175 54 -173 228 230 -323 -73 416 20 -33 230 -228 -157 198 -18 -439
7222d39M44R2k81M75r2m48N7K75j14j39K73l53J04M56k60l80L48O4m86L80J77
$$ -439 5 97 -184 291 199 -249 -192 83 -31 -170 103 -250 -146 310 50 -330 18 82 -404 -24 153
7243A53k96k14N84k89q6L90k14n19M71J94l92J37J89l26j0K68n3j05J63k8m12
$$ 153 -143 -357 227 -62 -148 242 28 -491 -20 174 -218 -81 108 -218 -228 40 -13 -118 45 17 -395
7264c95M25L10o54lL18j29M7M34l40j22J35n3k00L18O9m00L69J59l52p2K82j59
$$ -395 30 340 -314 -317 1 -128 -81 353 13 -109 26 -27 -227 91 160 -240 129 288 -64 -136 146 -13
7286a3n2M85k56n24N37M3l63K29R2l74K83J98k45j41J88O7l95L08Q0m73M10J14
$$ -13 -65 420 164 -360 177 220 -143 86 178 -196 87 285 40 -101 87 154 -241 67 147 -326 84 198
7308A98l77K46L16m90j1J64L4j38K51J2l75K73K02k35J05P2l48O6M95k91l56L03
$$ 198 -179 67 383 -107 -118 46 80 -58 193 205 -170 103 305 70 175 247 -101 -35 460 169 -187 116
7330A16l5l28K45K41m85N12P6n68K20L79l91p9L06j31k76L53P0n32N09j37k81
$$ 116 81 -247 -2 239 -246 266 342 -226 -6 373 -18 -97 209 78 -198 155 225 -307 202 65 -216
7351b16J40J10j48j71L78j12k04L92l6n69M60J09m26J19J94k05k8M02l20j21K22
$$ -216 -76 34 -114 -285 93 -19 -223 169 133 -436 24 133 -293 -174 20 -185 -213 189 -131 -252 -30
7372c0j10k23K97Q6k33J48L17n38rL26j08Q0J17q5m66N14J55m11K9J48k47K95
$$ -30 -140 -363 -66 20 -213 -65 252 -286 -295 31 -77 3 120 35 -431 83 238 -173 -144 4 -243 52
7394E2K19l86k08M48k10l04M28M4m79L72K85k81j28M37l25j59M94k10k92L52k2
$$ 52 271 -115 -323 125 -85 -389 39 83 -396 -24 261 -20 -148 289 -36 -195 299 89 -203 149 127
7415A27l11K53K29n52p5O32j99j25M84k96l17M11j98j74L11J02l32k7K73k36n5
$$ 127 -184 69 298 -254 -329 303 104 -21 463 167 -150 261 63 -111 200 302 -30 -57 216 -20 -75
7436g5K16k27k2M33k42k31K38J15m28L39K0k24k40O25o0m29K51M6l03K89J91l43
$$ -75 141 -86 -108 325 83 -148 90 205 -223 116 136 -88 -328 297 237 -192 59 105 -198 91 282 -61
7458f1n4K81m36J69M58l95n2K90o0l44L96l7k07J93J7l44k1M48l16P2J35l06m9
$$ -61 -115 166 -270 -101 357 -38 -90 200 140 -204 192 155 -52 141 158 -186 -207 241 -75 -3 132 -174 -223
7481b23K02K00k30r8K31l64J59QK9L3l9K5j65K85j16j71K48j4k55J63K84m83J39
$$ -223 -21 179 -51 -149 82 -282 -123 -115 -86 -53 -92 -67 -232 53 -63 -234 14 0 -255 -92 192 -291 -152
7504a52L42k45k37N33k02k53J40J84k35R8J19k35lL52k80O0K48l07j56L82J42
$$ -152 190 -55 -292 241 39 -214 -74 110 -125 -27 92 -143 -146 206 -74 -14 234 -73 -229 153 295
7525B95l55k2M43k57j18L38l21k73M09k3k99K93M2j08l1K07k52l9M49m92m0K65
$$ 295 -60 -82 361 104 -14 324 3 -270 139 116 -183 110 152 44 13 220 -32 -71 378 -114 -154 111
7547A11j9k91L75j82k25K08L93o10J52M29l36L8K69l22n2J73J77n72M10O3m89
$$ 111 92 -199 176 -6 -231 -23 370 -240 -88 341 5 43 312 -10 -62 111 288 -284 126 189 -300
7568c00L72pj47k67M28j07k73K53K15l83K71J68m41O2M12l58j90O57n50N8L32
$$ -300 72 65 -82 -349 79 -28 -301 -48 167 -216 55 223 -218 -156 256 -102 -292 365 -185 -127 205
7589B05n7j16%P3k74J1K87j31l13M72k93j7K79J74m17K22r0q9p9K55m22K84L16
$$ 205 148 32 32 105 -169 -158 129 -2 -315 157 -136 -153 126 300 -117 105 15 -74 -153 102 -320 -36 280
7612B80m26j35N01l9l98M32K8l91J25J05m05L66M6k66l0K06J5l47L18M8m48N15
$$ 280 -146 -281 220 181 -217 215 243 -148 -23 82 -323 43 89 -177 -207 -1 14 -333 -15 33 -415 100
7634A00J84n65K80L2k85j04L66J27l82L24k04k83L40R6k00J02L11m56J60L04m29
$$ 100 284 -281 -1 31 -254 -358 8 135 -247 77 -127 -410 -70 26 -174 -72 239 -217 -57 247 -182
7655a82J57J06R5k96L30j92k75K74K14l64N9J63j17K2K15k60K8J6K96l60K11J37
$$ -182 -25 81 176 -120 210 18 -257 17 231 -133 -74 89 -28 -6 209 -51 -23 -7 289 -71 140 277
7677B77n50K03K21J18m10L59j48p3K02J63m92J22J99l88L96j26j29r7J93j7PJ21
$$ 277 -273 -70 151 269 -141 218 70 -3 199 362 -130 -8 191 -197 199 73 -56 -153 40 23 30 151
7699A51j81j42L37K80n04J85J78l69p4K89k55%J11J21l00K63K04n16K89Q0k76
$$ 151 -30 -172 165 445 -59 126 304 -65 -139 150 -105 -105 6 127 -173 90 294 -222 67 147 -129
7720a29L1L10j45k52K28K7k18K82k41j63K96J18r4k15L32n6r9NJ74m38J67K47
$$ -129 -98 212 67 -185 43 70 -148 134 -107 -270 26 144 50 -165 167 111 12 17 191 -247 -80 167
7742A67m01J70K37l16J72N6p5k46K63j50n9K56k26j15q9N09l97J71K19j34l25
$$ 167 -234 -64 173 -143 29 85 10 -236 27 -123 -182 74 -152 -267 -356 153 -244 -73 146 12 -313
7763c13K95j58k3L18k1l48P0L08l14R1L13n73K62K33k41o2K75r8p1K15P0l22O9
$$ -313 -18 -176 -199 119 98 -250 -180 128 -186 -95 218 -355 -93 140 -101 -163 112 14 -57 158 228 -94 -25
7786b5J67r0k98L73kl58L47J07l33J71K54m74M12j80Q9j11L2J1j42K59j37j33
$$ -25 142 52 -246 127 125 -233 114 221 -112 59 313 -161 251 71 160 49 81 92 -50 209 72 -61
7808f1J83O9k93J86P6k14l7M22K2l68J21l01q5M53j11k95J14K76j92j0L83l53
$$ -61 122 191 -102 84 160 -54 -91 331 353 -15 106 -195 -280 173 62 -233 -119 157 -35 -45 338 -15
7830a5n4K51j93k51L10J82m05J96O8k70K36K61l63k13K43J51k80J89o2j97L71
$$ -15 -69 182 -11 -262 48 230 -175 21 89 -181 55 316 -47 -260 -17 134 -146 43 -19 -216 155
7851A55o4k26O8J00j10l6K69l26O7J51kk97J82Q1k7j36J57k39J49K97k52j42K97
$$ 155 91 -135 -67 33 -77 -113 156 -170 -103 48 46 -251 -69 12 -15 -151 6 -233 -84 213 -39 -181 116
7874A16p3k25K25n8k54J02L69l20m1L83p4l55L62o0m7k2m4j62K50j10k5j32L84
$$ 116 43 -182 43 -15 -269 -167 202 -118 -159 224 150 -205 157 97 50 28 -16 -178 72 -38 -63 -195 189
7897A89k78L3L38k17k80L51J74n60M79j22k04O1J81o7p7P1N8l30K32m7j05J89
$$ 189 -89 -56 282 65 -215 136 310 -250 229 107 -97 -36 145 78 1 72 130 -200 32 -15 -120 69
7919F9K1j35J64J24j40k07L36k22j92K19kJ2K2N7k21J50N5k27N4J29n4j43K47
$$ 69 90 -45 119 243 103 -104 232 10 -182 37 35 47 69 126 -95 55 110 -117 -63 66 12 -131 116
7942A16o1j27J09J33k80j1K74l70J78K29k01J5L0l7LJ29J18n06K71J56k74J42
$$ 116 55 -72 37 170 -110 -121 153 -217 -39 190 -11 4 34 -3 0 129 247 -259 12 168 -106 36
7964C6L8j17p9K90k31R0J16p7l27L55N1l14J19L65l96q9L43j62l59L34j9p7J56
$$ 36 74 -43 -122 168 -63 27 143 66 -261 94 145 -169 -50 315 -81 -170 173 11 -348 -14 -33 -110 46
7987D6P2k55J02J38k21j48L93q6k45J69j03j97K23M1k78K23K64j04j73K99j90
$$ 46 118 -137 -35 103 -118 -266 127 41 -204 -35 -138 -335 -112 -71 -349 -126 138 34 -139 160 -30
8008c0l35L13j0j34L19l5k41J99J19j84P0m3j41p0K79j22j12O3J73k11J71O0k36
$$ -30 -365 -52 -62 -196 123 88 -153 46 165 -19 51 8 -133 -203 76 -46 -158 -95 78 -133 38 98 -138
8031a38K34P9r9j74K91k56j99L41J08l57K18J06j68r6L31j57j82K43k45M6J18
$$ -138 96 175 76 -98 193 -63 -262 79 187 -170 48 154 -14 -110 221 64 -118 125 -120 -74 44
8052D4J3r6J19l7j01J56K26k03l24K10k4j58L15L2n2J7l1k62L14j2j27n8J72p9
$$ 44 57 -39 80 43 -58 98 324 121 -203 7 -17 -175 140 172 120 137 106 -156 158 146 19 -39 133 54
8076E4j36L52k42l36L62K5k80J33J80k21K5L17m52J72J52j71l13M91o6k18K33
$$ 54 -82 270 28 -308 54 79 -201 -68 112 -109 -84 233 -219 -47 105 -66 -379 112 46 -172 61
8097F1Q6m42K40L10l18M2J9k4p7J19j02m4JL18n50K01J77m8j65J15L3r1K85j52
$$ 61 147 -295 -55 255 -63 -21 -2 -26 -103 16 -86 -130 -129 189 -361 -160 17 -31 -196 -81 -48 -139 146 -6
8121fj0K30J2l69J97R7k82K11M7k69K67j19K94l55J37J29k78J51Q6k46R8q1J65
$$ -6 -16 214 226 -143 54 151 -131 80 127 -142 125 6 300 -55 82 211 -67 84 170 -76 22 -59 106
8144A06j31J4O3j35J12r0p7J87nL9O1N5j23k99K61o9K4Q4N2k15J30L0r4n4K03
$$ 106 -25 -11 52 -83 29 -61 -138 49 44 83 144 199 76 -223 38 -31 -7 77 129 -86 44 74 -20 -74 129
8169A29q3j25K48j1k35L16q4k71J17Q7j47R9K06lk11J63j91N5J82j78k52K79
$$ 129 46 -79 169 158 -77 239 155 -116 1 88 -59 40 246 243 32 195 4 59 241 63 -189 90
8191I0
$$ Imaginary data points
##PAGE= N=2
##DATA TABLE= (X++(I..I)), XYDATA
0@%%%%%%%%%Qj6J6j6J6k4L2l2M0m8N6o6P4q8J04j19J35j53J71j93K21k51K79l11
$$ 0 0 0 0 0 0 0 0 0 0 8 -8 8 -8 8 -16 16 -16 24 -24 32 -34 40 -48 56 -63 72 -81 90 -103 118 -133 146 -165
33a65L50l92M37m86N38n95O58p29Q08q96R94j100J220j357J514j693J901k149
$$ -165 185 -207 230 -256 282 -313 345 -384 424 -472 522 -578 642 -715 799 -894 1007 -1142
51a142K445k810L273l881M721n955P953j1717K1210q6130j88873J83120J97483
$$ -1142 1303 -1507 1766 -2115 2606 -3349 4604 -7113 14097 -72033 -260906 -77786 119697
64A19697l8249j72150m7648R6866Q4510p0842j01884L4810J01780O935l8929j9178
$$ 119697 81448 -90702 -138350 -41484 43026 -27816 -129700 -94890 6890 13825 -25104 -44282
76d4282l1920k3335N8766P7059K034p1380n9502L9324J02130q787j17482j304
$$ -44282 -76202 -99537 -40771 36288 38322 -33058 -92560 -53236 48894 40107 -77375 -78679
88g8679J44300M5335j27121j01140O2069J36652L0625j20789q7357Q3767R9439
$$ -78679 65621 110956 -16165 -117305 -55236 81416 112041 -8748 -96105 -12338 87101
99H7101m7041q1923J1707M8191J6661q349k3384j6606J127J727K5987M7272l1770
$$ 87101 40060 -41863 -30156 18035 34696 26347 2963 -13643 -12516 -10789 15198 62470 30700
112C0700r7218R995J20721L3888r8406p7123M3133J05278K8158r8749p2957P3980
$$ 30700 -66518 -56523 64198 98086 -320 -77443 -34310 70968 99126 377 -72580 1400
124A400Q4371m2643o9197J4782M7770J4635k3454l5391q70K7448J058m878K0137
$$ 1400 85771 43128 -26069 -11287 36483 51118 27664 -7727 -8597 18851 19909 15031 35168
137C5168j7497n3053J6741N9875j6446o2309J166N8171L1008n1485q8397J0402
$$ 35168 17671 -35382 -18641 41234 24788 -37521 -36355 21816 52824 1339 -87058 -76656
149g6656J18929M0311j02077p2302M9466O8356J204n0596l6806L7234O3212j5409
$$ -76656 42273 82584 -19493 -91795 -42329 26027 27231 -23365 -60171 -22937 40275 24866
161B4866o1052p341K8748J8507K1527K230l9166k0403K4894K0813M229m546j9405
$$ 24866 -36186 -43527 -14779 3728 25255 27485 -11681 -32084 -7190 13623 17852 13306 -6099
174f099J756L2099q837m4700P520M5543M704k6976j7430l86K1536J1281l2271
$$ -6099 -4343 27756 18919 -25781 -18261 27282 31986 5010 -12420 -12806 8730 20011 -12260
187a2260j6247M2112J9932l7950k6424R140J5403J9178K293k8175r133J8163l038
$$ -12260 -28507 13605 33537 -4413 -30837 -21697 -6294 12884 15177 -12998 -22131 -3968 -7006
200g006p755J9351J814k2249M888J7478o866p609j042l282J7403K0298k3032k5552
$$ -7006 -14761 4590 6404 -15845 -10957 6521 -345 -7954 -8996 -12278 5125 25423 2391 -23161
214b3161J5487J2037m407J2066M346k2878n850J3424R94K829N464j3388k035J9070
$$ -23161 -7674 4363 -44 12022 16368 -6510 -12360 1064 2058 4887 10351 -3037 -5072 13998
228A3998r208k2489J3974J7096j0305j898O073r501l238M943q369Q171K7625j0069
$$ 13998 4790 -17699 -3725 13371 3066 1168 7241 -2260 -5498 -555 -8924 -753 26872 16803
242A6803l4307n96J7702Q341J0060o069k4966N183K4720r488j8734P889R259N729
$$ 16803 -17504 -18100 -398 7943 18003 11934 -13032 -7849 16871 7383 -11351 -3462 5797 11526
256A1526Q392j8144k6853J5566K6716o831q911L045p011j624O735j1648k588K7167
$$ 11526 19918 1774 -25079 -9513 17203 10372 1461 4506 -2505 -4129 2606 -9042 -11630 15537
270A5537N291k7921j0426Q636O386J3298Q76k6403j309K9917K45k6222n134R805
$$ 15537 20828 -7093 -17519 -8883 -2497 10801 11677 -14726 -16035 13882 14127 -12095 -17229 -7424
284g424J4098J6090j4454l3264P664L0650j381j2388J36o216K132J8569n024k0640
$$ -7424 6674 22764 8310 -24954 -17290 13360 11979 -409 -273 -6489 -4357 14212 9188 -11452
298a1452O368J1968m500K484J915j2151L901J2998j4184j0165J9397O209j3325
$$ -11452 -5084 6884 2384 4868 6783 -5368 -1467 11531 -2653 -12818 6579 12788 -537
311e37K72O49p731P645M682j2907N492J8156j1086j6965M137O41K16J7178K856
$$ -537 -265 384 -7347 298 4980 -7927 -2435 15721 4635 -12330 -8193 -7552 -7336 9842 12698
326A2698j7226j596K88j2650Q872K2725l544j1879l2q564n102J5057L209r050
$$ 12698 -4528 -6124 -5836 -18486 -9614 13111 9567 -2312 -2344 -10908 -16010 -953 2256 -6794
340f794J2326R523j9387j3093M020K666J5732J9363j4050k3848K610M166j612
$$ -6794 5532 15055 -4332 -17425 -13405 -10739 4993 24356 10306 -13542 -10932 -6766 -8378
353h378J5025Q231j2321n01M600j6516o362J8163Q831O19K967j4801j4944J3211
$$ -8378 6647 14878 2557 2056 6656 -9860 -16222 1941 10772 11391 14358 -443 -15387 -2176
367b176Q186j0689Q397J6974j1577j5869j157j356Q349J8633n744j7031N708K637
$$ -2176 6010 -4679 3718 20692 9115 -6754 -7911 -9267 -918 17715 11971 -5060 648 3285
381C285j1900M790J0922n987J734Q696j2712j1263J0765K432m005J0058O11j3333
$$ 3285 -8615 -3825 7097 1110 2844 11540 -1172 -12435 -1670 762 -3243 6815 7426 -5907
395e907L214L661j1734M216J6641o047j0102M857k731k728J0779l532j3031J1540
$$ -5907 -2693 968 -10766 -6550 10091 4044 -6058 -1201 -3932 -6660 4119 587 -12444 -904
409i04J3305j1390p546L304l208N858J3357r298j1659J2394N182j1626R88M954
$$ -904 12401 1011 -6535 -3231 -6439 -581 12776 3478 -8181 4213 9395 -2231 -1243 3711
423C711l289Q475O448j5229n074J2705k826o607J0333J982q406M075r03j3278
$$ 3711 422 8897 15345 116 -4958 7747 4921 -1686 8647 10629 2223 6298 5395 -7883
437g883M719J2657m542k740L319j1440n359J3429q56j1294Q666P322j1623l761
$$ -7883 -3164 9493 4951 2211 5530 -5910 -11269 2160 1304 -9990 -1324 5998 -5625 -9386
451i386J672n875O347J2656q485p802P603m389q682J1751P467q196K813L752j0618
$$ -9386 -7714 -13589 -7242 5414 -3071 -10873 -3270 -7659 -16341 -4590 2877 -5319 -2506 1246 -9372
466i372O90J0451m640j115J2427l744j0803N085J738n633R909P253j2047j955
$$ -9372 -8682 1769 -2871 -3986 8441 4697 -6106 -1021 717 -4916 4993 12246 199 -1756
480a756P298o724k111J0566k954n601Q592k190j2960N779Q141o111J768N244j0283
$$ -1756 5542 -1182 -3293 7273 4319 -1282 7310 5120 -7840 -2061 6080 -31 1737 6981 -3302
495c302k065J1107m246p183R343K616p125M068O6r506P094J1451r059n113Q287
$$ -3302 -5367 5740 1494 -5689 3654 6270 -855 3213 3279 -6227 867 12318 3259 -1854 6433
510F433k879m627P305j179o648Q641J819j1607K395O633q237K73R703p440q051
$$ 6433 3554 -1073 6232 5053 -1595 7046 8865 -2742 -347 6286 -1951 -1678 8025 585 -7466
525g466P656p38p667N782J957p991L890L338j0867P64J0571n472m255Q604l023
$$ -7466 190 -548 -8215 -2433 -476 -8467 -4577 -1239 -12106 -11342 -771 -6243 -10498 -1894 -4917
540d917q031Q579L362p311N510O331p700J343P437o635j095J2788j604p585O689
$$ -4917 -12948 -4369 -1007 -8318 -2808 3523 -4177 -2834 4603 -2032 -3127 9661 8057 472 7161
555G161R20p097O768N657q308J626P380p787l105P849m660n150J0329P5j2201
$$ 7161 8081 984 7752 13409 5101 6727 14107 6320 3215 11064 6404 1254 11583 11658 -543
570e43K004L864o667K373M925q605j043Q447o984q823Q039J604n269O081N21j1195
$$ -543 1461 5325 -1342 1031 5956 -2649 -3692 4755 -2229 -11052 -3013 -1409 -6678 -597 -76 -11271
586a1271K465P658n515J51P463m992l324Q228l880r060R010P535n632P12J042
$$ -11271 -8806 -1148 -6663 -6512 951 -4041 -7365 863 -3017 -12077 -3067 4468 -1164 -452 590
601E90r416K882J1748n626o522Q087N68o475K304k648n300J1445P094j3003n253
$$ 590 -8826 -5944 5804 178 -6344 1743 2311 -4164 -1860 -4508 -9808 1637 8731 -4272 -9525
616i525P346k582q21Q040l710o306Q345J565r535K413M749k458O771N644j3557
$$ -9525 -2179 -4761 -5582 2458 -1252 -7558 787 2352 -7183 -4770 -21 -2479 4292 9936 -3621
631c621n402J3743M053n934J983j518j718R783o15j3877L681J4217l943o645K477
$$ -3621 -9023 4720 8773 2839 4822 3304 1586 11369 10754 -3123 558 14775 10832 4187 6664
646F664l630p96R453l021j0534M630M525n749J586J997j0232O54J0929m429q723
$$ 6664 3034 2238 11691 8670 -1864 2766 7291 1542 3128 5125 -5107 -4453 6476 2047 -6676
661f676M203R64k949N031l505j0175P777J1094p747o046L892k542O76Q469l181
$$ -6676 -2473 -1509 -4458 573 -2932 -13107 -5330 5764 -1983 -8029 -4137 -6679 -6003 2466 -715
676g15o564Q195K235r236J853N402l689L811P998q026p126M882P22Q39R111l280
$$ -715 -7279 916 3151 -6085 -4232 1170 -2519 1292 9290 1264 -5862 -980 -258 581 9692 6412
692F412j2098N414P661r086k541Q350Q40k68J058j1080n284J3846N427q578O28
$$ 6412 -5686 -272 7389 -1697 -4238 4112 4952 4684 5742 -5338 -10622 3224 8651 73 701
707G01J373p243J987O170n706m27R470l116p007J912k751k312J3206M591j4728
$$ 701 2074 -5169 -3182 2988 -2718 -3145 6325 3209 -3798 -1886 -4637 -6949 6257 10848 -3880
722c880m152Q172k21l08K624n266R19R752o568j3197O958J0462k961j330j564
$$ -3880 -8032 140 -81 -389 2235 -3031 -2112 7640 1072 -12125 -5167 5295 2334 1004 -560
737e60q204L689R431n374n213P262n46n987L932l32o032P157P076q556m491M326
$$ -560 -8764 -5075 4356 -1018 -6231 1031 485 -5502 -1570 -1902 -7934 -777 6299 -2257 -6748 -2422
753b422j542J877P711n322p751P536L511p684J711M953k285K660J978r849n27
$$ -2422 -3964 -2087 5624 302 -7449 87 3598 -4086 -2375 2578 293 2953 4931 -4918 -5445
768e445J2272j066o882M473P88p031M157L900m865K656M727p463j877P191l818
$$ -5445 6827 5761 -1121 3352 4140 -2891 1266 5166 301 2957 7684 221 -1656 5535 1717
783A717l942Q661J235q379J238J873l760M970M275q084j410P655m574n392P342
$$ 1717 -2225 6436 7671 -708 530 2403 -1357 3613 7888 -196 -1606 6049 1475 -3917 3425
798C425R95n184M383N62q077K467N594m215N48N119o802l890Q274m78o776M496
$$ 3425 4420 -764 3619 4181 -3896 -1429 4165 -50 498 5617 -1185 -5075 3199 2721 -4055 441
814D41K593m729J899J097p438K820R216n267n611M724p44l452N252m24p009N822
$$ 441 3034 -1695 204 1301 -6137 -3317 5899 632 -4979 -255 -999 -4451 801 377 -6632 -810
830h10N109q217k217N736k112o17N420m210n007P005L36o909M133M667n611P88
$$ -810 4299 -3918 -6135 -399 -2511 -3128 2292 -1918 -6925 80 416 -6493 -2360 2307 -3304 -2516
846b516M268o494j155P649j814l857N573j001o903M208L676m888K748M842o557
$$ -2516 1752 -4742 -5897 1752 -62 -3919 1654 653 -6250 -2042 1634 -3254 -506 4336 -2221
861b221j919N915k690k580P090q15o089M541J316p397L084P158l344j606K247
$$ -2221 -4140 1775 -915 -3495 3595 2780 -3309 1232 2548 -4849 -1765 5393 2049 443 2690
876B690n905n83J0220j558q257M540L919n370J04J466l508N397O840r476p526
$$ 2690 -3215 -3798 6422 4864 -3393 1147 5066 -304 -200 1266 -2242 3155 9995 519 -7007
891g007P499K984k475M107j899p150L569M409n690Q17N444l789r25M440o850o460
$$ -7007 492 3476 1001 5108 3209 -3941 -372 4037 -1653 -836 4608 819 -106 4334 -2516 -8976
907h976J0822P481o470m487k132k676P687O113q831l042Q863j474q069J478K070
$$ -8976 1846 9327 2857 -1630 -3762 -6438 1249 7362 -1469 -4511 4352 2878 -5191 -3713 -1643
922a643Q08Q182l20j2537k133O194P47M183N431q544p541P436K396n578K097M100
$$ -1643 -835 7347 7027 -5510 -7643 -1449 -702 3481 8912 368 -7173 263 2659 -2919 -822 3278
938C278O4L882l728j4669J269J7796M237q053m325m463m58R356J111q402M366
$$ 3278 3342 7224 3496 -11173 -9904 7892 12129 4076 -249 -4712 -5170 4186 5297 -3105 1261
953A261P200o212n621O8k734N405J2906l313j4336k844L490L371P986j227j2172
$$ 1261 8461 2249 -3372 -3304 -6038 -633 12273 8960 -5376 -8220 -4730 -1359 6627 5400 -6772
968f772J898J0542n189r609K995N892N230K792j1287j2913R510J2766k747m542
$$ -6772 -4874 5668 479 -9130 -6135 -243 4987 7779 -3508 -16421 -6911 5855 3108 -1434
982a434j325m533K359Q125m946p023O706N006l485j247m630m953J1081J1254r834
$$ -1434 -2759 -7292 -4933 3192 -1754 -8777 -2071 2935 -550 -1797 -6427 -11380 -299 10955 1121
997A121j1839K989N695M571L224q337p545R973O627q560l855M979K096L759J029
$$ 1121 -10718 -7729 -2034 2537 5761 -2576 -10121 -148 6479 -2081 -5936 -957 1139 4898 5927
1012E927j1869n167J3149P540m418l052n068l874R782P330r007l900P658R12l736
$$ 5927 -5942 -11109 2040 9580 5162 2110 -2958 -6832 2950 10280 1273 -2627 5031 5943 2207
1027B207j340m991J915J4932K292j5138n872M909L355N988K293r032k691P786
$$ 2207 867 -4124 -2209 12723 15015 -123 -5995 -1086 2269 8257 10550 1518 -1173 6613
1041F613k317p125L590M693J97M168l272j3167N4J1948K662j412j275p534k672
$$ 6613 4296 -2829 761 5454 5651 9819 6547 -6620 -6566 5382 8044 6632 5357 -2177 -4849
1056d849Q638L32p849M043O369l804k766k055o395M009J1713j546q532p65j597
$$ -4849 3789 4121 -3728 315 6684 2880 114 -1941 -8336 -4327 7386 5840 -2692 -3457 -5054
1071e054j541Q041J616q346Q92N790l741l533J487k268K798Q885m207j1580J976
$$ -5054 -6595 1446 3062 -5284 -4392 1398 -2343 -5876 -4389 -6657 -3859 5026 819 -10761 -8785
1086h785O256n03J964k06o670K015O648n186m796N864J862k175K767k481p036
$$ -8785 -2529 -3032 -1068 -1274 -7944 -5929 719 -4467 -9263 -3399 -1537 -3712 -945 -3426 -10462
1101a0462N123P114m267j681K315l262Q05O529l691n757O456M434m660J51L3l222
$$ -10462 -5339 1775 -2492 -4173 -1858 -5120 -4315 2214 -1477 -7234 -778 3656 -1004 -853 -820 -4042
1117d042N302O193o117l714N979o34k428N377J73n443L425L306l693Q59K252n190
$$ -4042 1260 7453 1336 -2378 3601 2967 539 5916 6089 646 4071 7377 3684 4543 6795 1605
1133A605J698Q589m088p905L276K894j209L055j535o786L397N533n386k825L979
$$ 1605 3303 11892 7804 -101 3175 6069 4860 7915 6380 -406 2991 8524 3138 313 4292
1148D292j559j426M931l399p391M438M748l390p0n53n415L421O848o306o315O502
$$ 4292 2733 1307 6238 2839 -4552 -114 4634 1244 1174 621 -4794 -1373 5475 -831 -7146 -644
1164f44L259l461q15k608k250Q007L648j0009k901O775M63j380K315m315l427
$$ -644 2615 -846 -1661 -4269 -6519 1488 5136 -4873 -7774 -999 -536 -1916 399 -3916 -7343
1179g343O492K095n456J131J400l960K966M682o656l918O790K132k149K20l775
$$ -7343 -851 1244 -4212 -3081 -1681 -5641 -2675 2007 -4649 -8567 -1777 355 -1794 -1574 -5349
1194e349m075Q003N377o518j516L282l594j91N529j866k352N371K87n141J134
$$ -5349 -9424 -1421 3956 -2562 -4078 -796 -4390 -4581 948 -918 -3270 2101 2388 -2753 -1619
1209a619J62k475P269O678q327o303M294J434M76L919k316k436N944j512j0392
$$ -1619 -1457 -3932 3337 10015 1688 -4615 -321 1113 1589 5508 3192 756 6700 5188 -5204
1224e204P84R878K548n56k246r317j974J0020K210m947J646R06l570J311j039
$$ -5204 -4420 5458 8006 7450 5204 -4113 -6087 3933 6143 1196 2842 3748 178 1489 450
1239D50o954L598J1883n16p726m082l717K014J0790J567q527K9K998m419p62L395
$$ 450 -6504 -2906 8977 8461 735 -3347 -7064 -5050 5740 7307 -1220 -1191 1807 -2612 -3374 21
1255B1j190K177N908n145p890K537K309o10N318J940p500j481L219k962N38N300
$$ 21 -1169 1008 6916 1771 -6119 -3582 -1273 -1883 3435 5375 -2125 -3606 -387 -3349 -2811 2489
1271B489j882k515M150k719o871L875N575k079M87j06n533J288P243l246n235
$$ 2489 607 -1908 2242 -477 -7348 -3473 2102 23 510 404 -5129 -3841 3402 156 -5079
1286e079L792J696j015L272k224p532M041Q105k917l938Q95j255K731O024n784
$$ -5079 -1287 409 -606 2666 442 -7090 -3049 5056 2139 -1799 -904 -2159 572 6596 812
1301H12q397N805P676j629j538k504n296L991P307m267l813M674J100l869P19
$$ 812 -7585 -1780 5896 4267 2729 225 -5071 -1080 6227 1960 -1853 2821 3921 52 771
1316G71k076k673P604N080p107l839K467k031M97N091j461k579M654j894q038
$$ 771 -1305 -3978 3626 8706 1599 -2240 227 -1804 -1307 3784 2323 -256 4398 2504 -5534
1331e534J381N239L79K983J079q636l398N817R15j101L936j237m749K483N42n879
$$ -5534 -4153 1086 1465 4448 5527 -3109 -6507 -690 225 -876 3060 1823 -2926 -443 99 -5780
1347e780J754O262j199m5J229p247m477P752M742k053L22k691n326M235M717n168
$$ -5780 -4026 2236 1037 992 2221 -5026 -9503 -1751 2991 938 1260 -1431 -6757 -2522 2195 -2973
1363b973j008N839j06k692R07m308k117Q598L512o123j257J934k837J615L718
$$ -2973 -3981 1858 1752 -940 -33 -4341 -6458 2140 5652 -471 -1728 206 -2631 -1016 2702
1378B702l731m32O386j853o598K124K246o57L678N23o878R84N885l113l113L098
$$ 2702 -1029 -1461 4925 3072 -3526 -1402 844 187 3865 4388 -2490 -1506 4379 1266 -1847 1251
1394A251j11l51M290l223o609L783N614k770r26J430m108N76N226k861l869M323
$$ 1251 1140 789 5079 1856 -4753 -970 4644 1874 948 2378 -1730 -1154 4072 1211 -2658 1665
1410A665O21l521K507Q06m940J357M250k789l11K996m137k402N408O98m469K297
$$ 1665 2286 -1235 1272 2078 -2862 -1505 2745 -44 -355 2641 -1496 -3898 1510 2208 -2261 36
1426C6J218l770K076K817m636j43M976k249k813L428j045k927M374J044m885J779
$$ 36 1254 -2516 -440 2377 -2259 -2402 2574 325 -2488 940 -105 -3032 1342 2386 -2499 -720
1442g20L546l935o67L265k543K08M956l203n202M242L118k948N84M41l547K869
$$ -720 2826 -1109 -1776 1489 -1054 -846 4110 907 -4295 -53 3065 117 701 1142 -2405 464
1458D64M183n437l094N632P79k567J870j767l710M088K877m162K25K847l636q88
$$ 464 4647 -790 -3884 1748 2527 -40 1830 63 -3647 441 3318 -844 -619 2228 -1408 -2296
1474b296M062k274k967M638N09m133J725L48l794K364L577l629q34L925l164l676
$$ -2296 1766 -508 -3475 1163 1672 -2461 -736 -388 -4182 -1818 1759 -1870 -2704 1221 -1943 -5619
1490e619L932J224k267K970J26m854J552K865l506R30N485k161l464K959r19k646
$$ -5619 -1687 -463 -2730 240 366 -4488 -2936 -71 -3577 -2647 2838 677 -2787 172 -747 -3393
1506c393M487J761l046K437J501n534p50N272k02m00L275k594m338L224J354l600
$$ -3393 1094 2855 -191 2246 3747 -1787 -2537 2735 2533 2133 5408 2814 -1524 1700 3054 -546
1522e46L172L249m040n49J878m694r10N962J57k993J739j512m596K819K475l199
$$ -546 2626 5875 1835 1286 3164 -1530 -2440 3522 3679 686 2425 913 -3683 -864 1611 -1588
1538a588J984L596m707l104L085j182j132N196M76m742J618O68l984J733M218
$$ -1588 396 3992 -715 -3819 -734 -1916 -3048 2148 2624 -2118 -500 168 -3816 -2083 2135
1553B135k535L60L786l831m168L455J460j639L654L83m652P81J918m421N31N984
$$ 2135 -400 -40 3746 -85 -4253 -798 662 -977 2677 3060 -1592 -811 1107 -3314 -2783 3201
1569C201r85k959J938k289l694L807J681k128K813J493n646q68L614k000p29N847
$$ 3201 2216 -743 1195 -1094 -4788 -981 700 -1428 1385 2878 -2768 -3636 -22 -2022 -2751 3096
1585C096M64m384K94r46k006N049L016m376R31L661m606l345L964J679l09K966
$$ 3096 3560 -824 -530 -1476 -3482 1567 4583 207 1138 4799 193 -3152 812 2491 2182 5148
1601E148j784m887K245Q78m064K625N513l331m123J357j750j740L741O18k621
$$ 5148 3364 -1523 722 1600 -2464 161 5674 2343 -1780 -423 -2173 -3913 -172 446 -2175
1616b175K450q33o276J119N047k647j171L822j269k506Q91j470j245O012J648
$$ -2175 275 -558 -6834 -5715 -668 -3315 -4486 -664 -1933 -4439 -3548 -5018 -6263 -251 1397
1631A397n229Q28L202l499q49M964O07j095K029k214j750M645n9m872L295N828
$$ 1397 -3832 -3004 198 -3301 -4150 814 1421 326 2355 141 -1609 3036 2977 -1895 1400 7228
1647G228l047l393J244j071R45L566k320k549L947P9n738J309L267k472Q4L236
$$ 7228 4181 788 2032 961 1906 5472 3152 603 4550 4629 -1109 200 3467 995 1079 4315
1663D315k792k070J698j901p78M811k37m559K684K125n512r17M789R58j70L36
$$ 4315 1523 -547 1151 -750 -1528 3283 3046 -1513 1171 3296 -2216 -3133 1656 2614 2444 2780
1679B780m335j009N848o21n179L131M228l517j835L86k069J857L845k864k178
$$ 2780 -1555 -2564 3284 2663 -2516 615 4843 1326 -509 -123 -2192 -335 3510 646 -1532
1694a532L210k369m739L298L533k436n54O02l300N28K578k616o80M630q57m280
$$ -1532 1678 -691 -5430 -2132 1401 -1035 -1589 -987 -4287 -3759 -1181 -3797 -4477 153 -704 -4984
1710d984K208Q14l082K176L823k100q58J128k603Q96N202j779l778M190K462m469
$$ -4984 -2776 -1962 -5044 -2868 955 -1145 -2003 -875 -3478 -2582 2620 841 -2937 1253 3715 -754
1726g54m15K298J1K422J012n484p55N956q03m735K027K329j357P86j450m576K769
$$ -754 -1169 1129 1140 3562 4574 -910 -1665 4291 3488 -1247 780 3109 1752 2538 1088 -3488 -719
1743g19M881k795k772J653j817j284M305n70m454K498K552l052k10J086k400J911
$$ -719 4162 1367 -1405 248 -1569 -2853 1452 882 -3572 -1074 1478 -1574 -1784 -698 -3098 -1187
1759a187M533l251l781L469J037k998K129J842j826J249N14m316J195N215j802
$$ -1187 3346 95 -3686 -217 820 -2178 -49 1793 -33 1216 1730 -2586 -1391 3824 2022
1774B022k909K791q1k682J723J27j889L192J938n095j077L503j293j042L221q86
$$ 2022 -887 1904 1823 -859 864 991 -898 2294 4232 -863 -1940 1563 270 -772 2449 1563
1790A563k655K689q51m096K572M029k402q43J110k783Q8M579j870l445L197J891
$$ 1563 -1092 1597 746 -3350 -778 3251 849 6 1116 -1667 -1579 3000 1130 -2315 882 2773
1806B773k572P4m56k373L608M214m787l464L545O55r23J227j773k076M223J143
$$ 2773 201 275 -181 -2554 1054 5268 481 -2983 562 1217 294 1521 -252 -2328 1895 3038
1822C038n274l06L935j091p88R78k445K1M671j720n042J929L067j695O11L35k692
$$ 3038 -2236 -2542 1393 302 -486 492 -1953 -1932 2739 1019 -4023 -2094 973 -722 -111 224 -2468
1839b468J283L055l678k716M807J754k340J18j531k627L670K936l497k75L319
$$ -2468 -1185 1870 -1808 -4524 283 2037 -303 -185 -1716 -4343 -673 2263 -1234 -1509 1810
1854A810k494k782K062nK83M392j100n914N80K922j626Q75K819j523o50J406m075
$$ 1810 -684 -3466 -1404 -1409 -1126 3266 2166 -3748 -3168 -246 -1872 -997 1822 299 -351 1055 -3020
1871c020k491N536L726k473o81j149l165J978L416k191P43M011k273m876O91J168
$$ -3020 -5511 25 3751 1278 597 -552 -3717 -1739 1677 -514 229 4240 1967 -2909 -2218 -1050
1887a050Q09M366L03n281k46K587k630j76M163L83j212Q24l336l445M723L859
$$ -1050 -241 4125 4428 -853 -1099 1488 -1142 -1318 2845 3228 2016 2840 -496 -3941 782 4641
1903D641k556o47J000k571M5J994k353M61N299q63n742k13J856M86K502k91m224
$$ 4641 2085 1438 2438 -133 -88 1906 -447 14 5313 4450 -1292 -1505 351 837 3339 3048 -1176
1920a176P84L871k668l249K922J550p15O66k504l178L978L521m405j926K326m32
$$ -1176 -392 3479 811 -2438 484 2034 1319 1985 -519 -3697 281 3802 -603 -2529 -203 -635
1936f35j77J645k862j662M544K34m878K88L404m52L70j87m504P99N434q61l341
$$ -635 -812 833 -2029 -3691 853 1087 -3791 -3503 -99 -551 -181 -368 -4872 -4073 1361 500 -2841
1953b841J477Q79j825J343k51k116L283L658m428k699K684L20l00K742o72k114
$$ -2841 -1364 -485 -2310 -967 -1218 -3334 -51 3607 -821 -3520 -836 -516 -816 1926 1254 -860
1969h60K041r2l913J895M267p93j005j00k873l63M520l04l297K658J358k689r03
$$ -860 1181 1089 -2824 -929 3338 2545 1540 1440 -1433 -1796 2724 2420 -877 1781 3139 450 -453
1986d53N6j224L371L702m517m141K762J496j743J270k39j259K692o60n481M29
$$ -453 -397 -1621 1750 5452 935 -3206 -444 1052 -691 579 340 -919 1773 1113 -4368 -3939
2002c939N744j2k430m10j731l3L683j053l886K544L554k688j582L11j333K425
$$ -3939 1805 1793 -637 -1047 -2778 -2811 872 -181 -4067 -1523 2031 -657 -2239 -1928 -3261 -836
2018h36L844k727l842K657J560j463J063N08j814K309J690m290o42M500k55j778
$$ -836 3008 281 -3561 -904 656 -807 256 764 -1050 1259 2949 -1341 -1983 2517 2262 484
2034D84J153k93j140K472p65l512K824L889l139k732J640Q8O55K033k389k472
$$ 484 1637 1344 204 2676 1911 -1601 1223 5112 1973 -759 881 969 1624 3657 1268 -1204
2050a204L714J208m048j03K222l90O13J011l762p61M542k60l326J322R74j248
$$ -1204 2510 3718 -330 -433 1789 1399 2012 3023 -739 -1500 3042 2782 -544 778 1752 504
2066E04J344o09l881K156M845k569m032N01O82Q17K417l039l963L483L198l914
$$ 504 1848 1239 -2642 -486 4359 1790 -2242 -1741 -1059 -242 2175 -864 -4827 -1344 1854 -2060
2082b060k602J900K17J271J215m145k527M218J604k967N50J037j761J042J333
$$ -2060 -4662 -2762 -2545 -1274 -59 -4204 -6731 -2513 -909 -3876 -3326 -2289 -4050 -3008 -1675
2097a675k601Q95L703j152k798K135O78q85K331K87k384K046K131l224m30L689
$$ -1675 -4276 -3381 322 -830 -3628 -1493 -815 -1700 631 918 -1466 580 2711 -513 -943 2746
2113B746m70q93J366j618j438L386N76l475J144K664k279j560Q34n36J250K991
$$ 2746 2276 1383 2749 1131 -307 3079 3655 180 1324 3988 1709 149 983 447 1697 4688
2129D688l688l941K787K856j600o77mj834K256K032m338k077N009J756j642j485
$$ 4688 1000 -2941 -154 2702 1102 425 421 -1413 843 2875 -1463 -3540 1469 3225 1583 98
2145I8k306m55N463K234m786j505K863j34p42Q66j495N30L891j507n216N17K946
$$ 98 -2208 -2663 2800 5034 248 -1257 1606 1472 730 1596 101 631 4522 3015 -2201 -1684 1262
2162A262Q0O80Kl643L9K711j961j940L274Q52k227j26j308k433K925L581k467
$$ 1262 1342 2022 2024 -1619 -1580 1131 -830 -2770 504 1356 -871 -997 -2305 -4738 -1813 1768 -699
2179f99j481J478j900j024K880O68j090K064q00l305J683K981k159k6K869r03
$$ -699 -2180 -702 -2602 -3626 -746 -78 -1168 896 96 -3209 -1526 1455 -704 -730 2139 1236
2195A236j221L50j894l49N311R56n170j329J813K86J115Q38l418j46L693j478
$$ 1236 15 365 -1529 -1878 3433 4389 -781 -2110 -297 -11 1104 1942 -1476 -1622 2071 593
2211E93m014J501J848m2J289j705m516J619M665j095k017O41o64O09K251j978
$$ 593 -3421 -1920 -72 -114 1175 -530 -5046 -3427 1238 143 -1874 -1233 -1897 -1288 963 -1015
2227a015k763L830L325l022k039M97L77K766K510l772k837L606J536k261O40P75
$$ -1015 -3778 52 3377 355 -1684 -1187 -810 1956 4466 694 -2143 1463 2999 738 1378 2153
2243B153j047J445M71l433q5L282n97j310J508j628k417K043J349j659R04N71
$$ 2153 1106 2551 3022 -411 -496 2786 2189 879 2387 759 -1658 385 1734 75 979 1550
2259A550l099n2K634j292j119K462j019j628J780l93k601K137K766j782j111K89
$$ 1550 -1549 -1601 1033 -259 -1378 1084 65 -1563 217 -176 -2777 -640 2126 344 -767 -478
2275d78j654J214L480j756l168K149J643j943o0L08j154K691J733m506k249L680
$$ -478 -2132 -918 2562 806 -2362 -213 1430 -513 -573 -265 -1419 1272 3005 -1501 -3750 -70
2291g0J385j157J90j502j409L183J059m007P9K979o16m06O49k534r6L873K34l301
$$ -70 1315 158 348 -1154 -2563 620 1679 -2328 -2249 730 114 -292 357 -2177 -2273 1600 1834 -1467
2309a467O69R05j028J624O99k324K40L083j521j833K056M9j342K105J24k978J181
$$ -1467 -798 107 -921 703 1402 -922 -682 2401 880 -953 1103 1152 -190 1915 2039 -939 242
2326B42J822j743K31K001k264j015K263n03j683J733J70k278J613J207k985l66
$$ 242 2064 321 552 2553 289 -726 1537 1034 -649 1084 1254 -1024 589 1796 -1189 -1555
2342a555K471o50l12J064k387j363L710Q68l364o8J594m36Q85Ql014K05M434r58
$$ -1555 916 266 -46 1018 -1369 -2732 978 1846 -1518 -1586 8 -428 457 465 -2549 -2344 2090 1132
2360A132l269O83R71m33J836n59k997J255K812j570j566J196p89J26K857j221
$$ 1132 -2137 -1454 -483 -916 920 361 -2636 -1381 1431 -139 -1705 -509 -1298 -1172 1685 464
2376D64l626J823K503j145n1j92j757J427K872k963k301L298J205j578K52o15
$$ 464 -3162 -1339 1164 19 -32 -224 -1981 -554 2318 -645 -2946 352 1557 -21 231 -384
2392c84j482K133J741k395l07J982j689p53K542m13k047J819O30j624O42J06k018
$$ -384 -1866 267 2008 -387 -694 1288 -401 -1154 1388 975 -1072 747 1377 -247 395 501 -1517
2409a517J865K975k702k255K491N3r52J566n81j609J880Q46k679L03K292j545
$$ -1517 348 3323 621 -1634 857 910 -42 1524 943 -666 1214 2060 -619 -316 1976 431
2425D31j20K313j779k306K088J239j037Q13q79j946K537J643l573j268L655K44
$$ 431 311 2624 845 -1461 627 1866 829 1642 763 -1183 1354 2997 -576 -1844 1811 2055
2441B055j666K2j192n43L054L92l855O49K210j574l69J064j307p73K564n99k122
$$ 2055 389 411 -781 -1324 1730 2122 -1733 -1084 1126 -448 -817 247 -1060 -1833 731 132 -1990
2458a990J051L44j468J632J082l030K8K916j057j620J031l68k72K075n52k900
$$ -1990 -939 -595 -2063 -431 651 -2379 -2351 565 -492 -2112 -1081 -1449 -1721 354 -198 -3098
2474c098K026J927k401l29J967r21l20J620j135j225K127l2j850J811J138k510
$$ -3098 -1072 855 -1546 -1875 92 -829 -1149 471 -664 -1889 238 206 -1644 167 1305 -1205
2490a205n3K121j204l45J925j059n69J782q34k334K018J818j927K97J268j945
$$ -1205 -1258 863 -341 -686 1239 180 -389 1393 559 -1775 243 2061 134 431 1699 -246
2506b46k72K288j089r22K304o99k021J519N81k287J483J878j915n38J310j531
$$ -246 -518 1770 681 -241 2063 1364 -657 862 1443 -844 639 2517 602 64 1374 -157
2522a57p87K568m19j900J856K57k497O16J548j358K73J728j675j361J973p64j142
$$ -157 -944 1624 1205 -695 1161 1418 -1079 -463 1085 -273 0 1728 53 -1308 665 -99 -1241
2539a241J810M45k071J085R52k382L03K138j017q52J718r51j589J719j8j544J900
$$ -1241 569 1014 -1057 28 980 -1402 -1099 1039 22 -830 888 -63 -1652 67 49 -1495 405
2556D05J076k562K49J747j704k39K232p26j152J685k97k131J593J177k126J029
$$ 405 1481 -1081 -832 915 -789 -1028 1204 478 -674 1011 714 -1417 176 1353 -773 256
2572B56J714j989p78J779p51p74K068k70j901J649L53k716J045K039j488n91J526
$$ 256 1970 -19 -797 982 231 -543 1525 1255 -646 1003 1356 -1360 -315 1724 236 -355 1171
2589A171j511r86K032p28j200K073n5k804P57J675j880K09J651j064p64J396j137
$$ 1171 -340 -1326 706 -22 -1222 851 796 -2008 -1251 424 -1456 -1247 404 -660 -1424 -28 -1165
2606a165j454K490M65k297J245J099k135J54J861j145n12K081j281j182K143p8
$$ -1165 -2619 -129 336 -1961 -716 383 -1752 -1598 263 -882 -1394 687 -594 -1776 367 289
2622B89k317J935J671j862m99J013j099M92K083j650j692K724M7k158J073R86
$$ 289 -2028 -93 1578 -284 -783 230 -869 -377 1706 56 -1636 1088 1135 -1023 50 1036
2638A036j752R37J705k053n67K012j153p82K409p25j960J728R47k102J88J663
$$ 1036 -716 221 1926 -127 -694 1318 165 -617 1792 1067 -893 835 1782 -320 -132 1531
2654A531j209L60J398k099q72L136j28k499J178R50j583Q90O42k194P09K013j506
$$ 1531 322 682 2080 -19 -891 2245 2117 -382 796 1746 163 1053 1695 -499 210 2223 717
2671G17j220J890p54j337K052J74k631O59J464j525M32J038j993o13K927j006
$$ 717 -503 1387 633 -704 1348 1522 -1109 -450 1014 -511 -79 959 -1034 -1647 1280 274
2687B74k340J619L80r91J214M14k497J044J834j776o15J743o97j125J869Jk158
$$ 274 -2066 -447 -67 -1058 156 570 -1927 -883 951 -825 -1440 303 -394 -1519 350 351 -1807
2704a807J197J492j723M95Q33j711l9K664j506j662J890M00j213J266n31k322
$$ -1807 -610 882 -841 -346 487 -1224 -1263 1401 -105 -1767 123 523 -690 576 45 -2277
2720b277J554K214j976j005J608n41r02J960j317j636K593J139k122l46Q45j629
$$ -2277 -723 1491 -485 -1490 118 -423 -1325 635 -682 -2318 275 1414 -708 -1054 -209 -1838
2736a838J024K395j537j485J674k71j395J502M74j481K070Q61k973m97J999m77
$$ -1838 -814 1581 44 -1441 233 -38 -1433 69 543 -938 1132 1993 -980 -1477 522 45
2752D5P5K202j570j876J628L41j884J822J378j702m4R34k523m46L098L5j179J146
$$ 45 120 2322 752 -1124 504 845 -1039 783 2161 459 415 1349 -1174 -1620 1478 1513 334 1480
2770A480j020k426J961J522j705P88J565j994p31J147j372n32L367J62k604M30
$$ 1480 460 -1966 -5 1517 -188 600 2165 171 -560 587 -785 -1317 2050 2212 -392 38
2786C8J16j446J616J924k000n67J790j565r90J526k61p06K237j33k813K92J687
$$ 38 154 -1292 324 2248 248 -319 1471 -94 -1084 442 181 -525 1712 1579 -1234 -942 745
2803G45j048M74J273j754q96K249p09j835J672K31j219Q94R29k515L15K266j333
$$ 745 -303 171 1444 -310 -1206 1043 334 -1501 171 402 -817 77 1006 -1509 -1194 1072 -261
2820b61q62J601r87p22K236m49k669J184J397j288M83J482k053n98K189j077j370
$$ -261 -1123 478 -509 -1231 1005 556 -2113 -929 468 -820 -337 1145 -908 -1506 683 -394 -1764
2837a764K097K82j315J223o5k847J106K492q63p11R82j679r02K224N6j678J633
$$ -1764 333 615 -700 523 458 -2389 -1283 1209 346 -365 617 -1062 -1964 260 316 -1362 271
2854B71J366k248m46P18j580J135K934j261j818Q82r69q91K631O99k134Q09J007
$$ 271 1637 -611 -1057 -339 -1919 -784 2150 889 -929 -47 -1016 -1907 724 1423 -711 98 1105
2871A105k326k47J833n72J85K399j670k785J492R04q48J416R62k311J39J258j501
$$ 1105 -1221 -1468 365 -207 -22 2377 707 -2078 -586 318 -530 886 1848 -463 -324 934 -567
2888e67o85K323Q0j080J333r20k480J801J909j208MP31j564k81K013j289j236
$$ -567 -1252 1071 1151 71 1404 484 -1996 -195 1714 506 510 1241 -323 -604 1409 120 -1116
2905a116K461M86k081M96J67j283J562J621k083r61J715n31q16J584q16j402J883
$$ -1116 1345 1831 -250 246 413 -870 692 2313 230 -731 984 453 -363 1221 405 -997 886
2922H86P45k484K48J461j281O56J386j948r25K304j46j771R71L49j506J137J089
$$ 886 1631 -853 -605 856 -425 231 1617 -331 -1256 1048 902 -869 102 451 -1055 82 1171
2939A171k198K26J753j182p09J724p41j500J943K29k054P51J002j603O81J587
$$ 1171 -1027 -801 952 -230 -939 785 44 -1456 487 716 -1338 -587 415 -1188 -507 1080
2955A080j751j243K399l13j308J216k2j511J664P89k488L88J904j116m13J424
$$ 1080 -671 -1914 485 172 -1136 80 58 -1453 211 1000 -1488 -1100 804 -312 -725 699
2971F99j325j075K520l9k322J293O22j252R09R74k287j81K572q12j396J178k44
$$ 699 -626 -1701 819 780 -1542 -249 373 -879 30 1004 -1283 -1464 1108 296 -1100 78 -166
2988a66p28J812jk616R62K026j337p16J340q05m35J927p32j999J580J037j798
$$ -166 -894 918 917 -1699 -737 1289 -48 -764 576 -229 -664 1263 531 -1468 112 1149 -649
3005f49R68R11j675J73J556j110r94K038l54j263J223j73j948J501J659j843j37
$$ -649 319 1230 -445 -272 1284 174 -820 1218 864 -399 824 651 -1297 204 1863 20 -117
3022a17J320j432p73K153o42r40J562l19j726R82Q08j766R26K122j632j209R08
$$ -117 1203 -229 -1002 1151 509 -431 1131 812 -914 68 876 -890 36 2158 526 -683 225
3039B25j043k05K713k74k271J037P33k000L28J345p37N26J565k252j596J859P43
$$ 225 -818 -1023 1690 1416 -855 182 915 -1085 -757 588 -149 377 1942 -310 -1906 -47 696
3056F96r61J567j76k384Q21J098j738K40K500q52j022Q13j492j060K557Q87j868
$$ 696 -265 1302 1126 -1258 -437 661 -1077 -837 1663 811 -211 602 -890 -1950 607 1494 -374
3073c74L75O91j852J02J316p23J45J990j301k522J425Q18r30J121R30k100J23
$$ -374 1 692 -1160 -1058 258 -465 -320 1670 369 -2153 -728 90 -840 281 1211 -889 -766
3090g66J186j770k12K318k91j360J021l70j510J713Q06j896L68J613j530o73J381
$$ -766 420 -1350 -1562 756 465 -895 126 -244 -1754 -41 765 -1131 -763 850 -680 -1353 28
3107B8l59p54J713l31k035J527J130j508J9R07j110N2J789j320q61J828Q4j974
$$ 28 -331 -1085 628 297 -1738 -211 919 -589 -570 337 -773 -721 1068 -252 -1113 715 799 -1175
3125a175J076O16j033J165O80k140l28K124q71n34J719l43j520J152j32j603J509
$$ -1175 -99 517 -516 649 1329 -811 -1139 985 114 -420 1299 956 -564 588 456 -1147 362
3142C62K160j653q95J153j449j91K060o80q27J940k91k796N32J589m93Q46P42
$$ 362 2522 869 -26 1127 -322 -513 1547 867 40 1980 1689 -1107 -575 1014 521 1367 2109
3159B109k100j004J787o26q74K014M49k088L42J34j845J248J889q90q43P53j198
$$ 2109 9 -995 792 166 -708 1306 1755 -333 9 143 -1702 -454 1435 545 -298 455 -743
3176g43j115J945J53j244J674M48k568j31J223l29O96J152j729j035J965j02j972
$$ -743 -1858 87 240 -1004 670 1118 -1450 -1581 -358 -687 9 1161 -568 -1603 362 260 -1712
3193a712J382J140j000L85J24j890O35J915j124j000J795m53j849J160N08j042
$$ -1712 -330 810 -190 195 319 -1571 -936 979 -145 -1145 650 197 -1652 -492 16 -1026
3209a026J203P82k347K42K013j258o97J560o69r19J467K14k058Q31J217j127L41
$$ -1026 177 959 -1388 -1146 867 -391 -1088 472 -197 -1116 351 565 -1493 -662 555 -572 -231
3226b31Q05j525M9K245r08j882J577O88r03M99K82j386J265J182k244m96K436
$$ -231 574 -951 -902 1343 435 -1447 130 818 -85 414 696 -690 575 1757 -487 -983 1453
3243A453m95j166N82j45p79J690K26k141P07J339j416k12J202r06q75J911q9j776
$$ 1453 958 -208 374 229 -550 1140 1366 -775 -68 1271 -145 -357 845 -61 -936 975 886 -890
3261h90O64L25p91J365N39k272l5K126p75j382J720k03j111J095K02j485J122
$$ -890 -226 99 -692 673 1212 -1060 -1095 1031 256 -1126 594 391 -720 375 577 -908 214
3278B14J038j877K80K147j654j074J199K49o70R48m30j732J764J068k173l71K246
$$ 214 1252 -625 -345 1802 148 -926 273 522 -148 800 370 -1362 402 1470 -703 -1074 1172
3295A172q92p44O28p74m25J890l82j851Q88J327j400K65P92j585L93K061p63j900
$$ 1172 280 -464 164 -610 -1035 855 473 -1378 -490 837 -563 -298 494 -1091 -698 1363 600 -1300
3313a300P51N07j29J323k04k776J223K107j176r41O94n3L51J312j616j818J923
$$ -1300 -549 -42 -171 1152 948 -1828 -605 1502 326 -615 79 26 377 1689 73 -1745 178
3330A78J537j719q4R23j369L65J095j279l21J649l53j752J132J1j463J491J345
$$ 178 1715 -4 -88 835 -534 -169 926 -353 -674 975 622 -1130 2 13 -1450 41 1386
3347A386j855l11J182r63m38J460m81r41J798j49k147N43J189p83N17R26j611
$$ 1386 -469 -780 402 -561 -999 461 -20 -961 837 688 -1459 -916 273 -510 7 933 -678
3364f78o87J464n36m50J559j72k010J255J106j736j74J088l77M08J001j690j459
$$ -678 -1365 99 -437 -887 672 500 -1510 -255 851 -885 -1059 29 -348 60 1061 -629 -2088
3381b088K446N57j289K50L13j093R45J052j892J49J703l45j235J096n62j021J888
$$ -2088 358 915 -374 -124 189 -904 41 1093 -799 -650 1053 708 -527 569 7 -1014 874
3398H74J32j734N30J317r96j94R36j229k23K312q88j992J352R87j179K83K73j152
$$ 874 1006 -728 -198 1119 123 -71 865 -364 -587 1725 837 -1155 197 1184 5 288 561 -591
3416e91Q36J501j434j388J742k12q68J362l2j554J038N79j360Q5J524j183m22
$$ -591 245 1746 312 -1076 666 454 -414 948 916 -638 400 979 -381 -296 1228 45 -377
3433c77J548r98j111J297O8j150J306M65j704j6J097q74R0J647j078j265J386
$$ -377 1171 173 -938 359 427 -723 583 1048 -656 -672 425 -449 -359 1288 210 -1055 331
3450C31j40j371J005P10r75K58P66j616j87J617n91p89J328j29j389Q16L45j380
$$ 331 191 -1180 -175 535 -440 -182 584 -1032 -1219 398 -193 -982 346 217 -1172 -356 -11 -1391
3468a391J174J381j709l15R14p02l49J425m87j083J187L40j678P28P90j009M63
$$ -1391 -217 1164 -545 -860 54 -648 -997 428 -59 -1142 45 385 -1293 -565 225 -784 -321
3485c21J196j276r60J420p7j147J334K48j603R34O09j216K98J172j177l57J421
$$ -321 875 -401 -1361 59 -18 -1165 169 417 -1186 -252 357 -859 -561 611 -566 -923 498
3502D98m10j082J159J73j259J367M44j394K48J115p32m10J570q43o04J259o6j460
$$ 498 88 -994 165 338 -921 446 890 -504 -256 859 127 -283 1287 444 -160 1099 1033 -427
3520d27J043P33j216M03R44j213j52J342j007p05J485k07j150P87L26j357P73
$$ -427 616 1349 133 536 1480 267 115 1457 450 -255 1230 1023 -127 660 986 -371 402
3537D02J067j697l4J174n64q73J294n29j101J492L05j523L80R60j337K81J128
$$ 402 1469 -228 -262 912 348 -525 769 240 -861 631 936 -587 -207 753 -584 -303 825
3554H25j259k32J297n29j033J289L18j464N74Q57j524J32J605j225m81J368p17
$$ 825 -434 -666 631 102 -931 358 676 -788 -214 643 -881 -749 856 -369 -850 518 -199
3571a99q16J301k31j374J185O28j184J4J048j128k40J577q51j018J489l0j259
$$ -199 -1015 286 55 -1319 -134 494 -690 -676 372 -756 -996 581 -270 -1288 201 171 -1088
3588a088J055K35j207N50J064j305JJ451r31m38J084k69j160J354L42j600N88
$$ -1088 -33 202 -1005 -455 609 -696 -695 756 -175 -613 471 202 -958 396 738 -862 -274
3605b74J150j015k78J321j168l29J315l02j377J199M14j434O91Q04j140j8J329
$$ -274 876 -139 -417 904 -264 -593 722 420 -957 242 656 -778 -87 717 -423 -441 888
3622H88j082o03J404m68q71J195J68j509Q16N08j069R8J134q74l08J405q76q43
$$ 888 -194 -797 607 139 -732 463 631 -878 -62 446 -623 -525 609 -265 -573 832 -44 -887
3640h87J285J86j497J131P16j532M23J130j140j59J261q38o44J491k10j268Q12
$$ -887 398 584 -913 218 934 -598 -175 955 -185 -344 917 79 -565 926 716 -552 260
3657B60O85j014L44O56r77J70J307q31j210J444J39j006P47J63j417Q54J118j404
$$ 260 945 -69 275 931 -46 124 1431 600 -610 834 973 -33 714 877 -540 314 1432 28
3675B8l35J120p64j43J059p56j214J645L70j498L1P05p57K45J153j386m78J555
$$ 28 -307 813 49 -94 965 209 -1005 640 1010 -488 -457 248 -509 -264 889 -497 -975 580
3693E80l82j336Q75L93q11Q12L91j731L16J441r30l54J207o94q78J347j65r74
$$ 580 198 -1138 -263 130 -681 131 522 -1209 -893 548 -382 -736 471 -223 -1101 246 81 -893
3711h93Q21P48j386J55Q85j213q3J431p62p57J466o74j192J071Q33j190L51M51
$$ -893 -72 676 -710 -555 330 -883 -966 465 -297 -1054 412 -262 -1454 -383 450 -740 -389 62
3729F2j157L25J103j053n74J547N6j153N83J81o67J098O11j717j62J712l79o03
$$ 62 -1095 -770 333 -720 -1294 253 309 -844 -261 -80 -747 351 962 -755 -917 795 416 -187
3747a87R55m72p08J295J49j679P45J131r48R4O63j601L01J448j16j544P24L55
$$ -187 768 296 -412 883 1032 -647 98 1229 281 375 1038 -563 -262 1186 1070 -474 250 605
3765F05j015P55J68j104N09J443j558q00J222n6m97Q91k13j144R91N86j421N31
$$ 605 -410 345 513 -591 -82 1361 -197 -997 225 169 -328 563 350 -794 197 783 -638 -107
3783a07J146j054k37J040n26o58J284k21r92R41K77j588N02J348q72j18Q13r94
$$ -107 1039 -15 -252 788 262 -396 888 667 -325 616 893 -695 -193 1155 283 165 978 -16
3801a6p45J539o3j449Q32L12q79N65K84j749M94J920q78j443Q41j10p1J199m48
$$ -16 -761 778 715 -734 98 410 -469 96 380 -1369 -875 1045 167 -1276 -435 -545 -616 583 135
3820A35j665R29J507j478n15R88m36K09J106j220q69J435Q32j266J92L51r73P43
$$ 135 -1530 -601 906 -572 -1087 -99 -535 -326 780 -440 -1309 126 958 -308 -116 235 -738 5
3838EJ153j491o28J404k3q44O32o29o08J618M49j992P8J210n15q8O87q30n69J426
$$ 5 1158 -333 -961 443 420 -424 208 -421 -1029 589 1038 -954 -876 334 -181 -269 418 -412 -981 445
3858D45k39j214R23N44j328N59J149j045o49J021m34L3J231q10j439J479P73j104
$$ 445 206 -1008 -85 459 -869 -310 839 -206 -855 166 -268 -235 996 186 -1253 226 999 -105
3876a05P3L90p22M42J123j363o64J637nj064M40j02p06J007R48j934j19J237r4
$$ -105 -32 358 -364 78 1201 -162 -826 811 806 -258 182 80 -626 381 1329 -605 -724 513 419
3895D19l23N52j115m34K175lk261J35J660l36J6kj346K63K162q06j631O75O96
$$ 419 96 648 -467 -901 1274 1271 -990 -855 805 469 485 483 -863 -600 1562 756 -875 -200 496
3914D96n54J002j40j669N92J483r79k37N90p22m55J353k31j359Q39R07j148J42
$$ 496 -58 944 804 -865 -273 1210 231 -6 584 -138 -593 760 529 -830 9 916 -232 -90
3932i0O62j037J87J120r23o03J311m08j044P63O40j150N57O59j128J9R65j109
$$ -90 572 -465 -278 842 -81 -684 627 219 -825 -62 578 -572 -15 644 -484 -465 500 -609
3950f09k58J797l80j778O35O57m95O71m3j523N53J842j247j294J054M03o5P03
$$ -609 -867 930 550 -1228 -593 64 -431 240 197 -1326 -773 1069 -178 -1472 -418 -15 -80 623
3968F23p62j672J277J538j028n37L73q10N46J389j101j386J792M20q35K4J14p22
$$ 623 -139 -1811 -534 1004 -24 -561 -188 -998 -452 937 -164 -1550 242 662 -173 -149 -35 -757
3986g57J102R09j599n55J638l58p48P73j07o87R28Q5j608L83J588p73m74O85r29
$$ -757 345 1254 -345 -900 738 380 -368 405 298 -389 539 624 -984 -601 987 214 -260 425 -504
4005e04k58J572l96j310J048K97r91L27R20r00k4R47q02k08R16n59r08J378O45
$$ -504 -762 810 414 -896 152 449 -542 -215 705 -195 -219 728 -74 -282 634 75 -833 545 1190
4024A190j182k52L81o20P23J586j401j427J502J46o56O84k80p98R38O21j661p3
$$ 1190 8 -244 137 -483 240 1826 425 -1002 500 646 -10 674 394 -404 534 1155 -506 -579
4042e79J000j62j55O76j138p87J696o7j193P11J034j133j51N44j142M09J739o39
$$ -579 421 259 104 780 -358 -1145 551 484 -709 2 1036 -97 -248 296 -846 -437 1302 663
4060F63j558Q22J86m60P96n2j222Q18J180j344q20J325k88k14J073n41j367Q42
$$ 663 -895 -73 113 -347 449 397 -825 -7 1173 -171 -991 334 46 -168 905 364 -1003 -161
4078a61O11r93L32J062j554j04J188o54l40R05n46q49J052L62j172J93P89q48
$$ -161 450 -543 -211 851 -703 -807 381 -273 -613 292 -254 -1103 -51 311 -861 -668 121 -727
4096g27M00J054j721m21J650Rj016O30o6q85J038O20j476K29J552j067n88P72
$$ -727 -327 727 -994 -1415 235 244 -772 -142 -208 -1093 -55 565 -911 -682 870 -197 -785 -13
4114a3j11k21J252o01j490J087J060j095j47O65p27K32J298j134j150J544Q35
$$ -13 -124 -345 907 306 -1184 -97 963 -132 -279 386 -341 -109 1189 55 -1095 449 1284
4131A284j317K20j19p75R19J243j398n53J129m88n21J001m9j066R44L40j286O10
$$ 1284 -33 187 68 -707 212 1455 57 -496 633 145 -376 625 576 -490 454 794 -492 118
4149A18N70j044K30J157o79p69R61n69n77J222M64j461L99N04o94J26R66j228
$$ 118 688 -356 -126 1031 352 -417 544 -25 -602 620 1084 -377 22 526 -168 -42 924 -304
4167c04k31J427m70j145J011K26r32O81Pr01O24J210j456n45J447r1p88N48l81
$$ -304 -535 892 422 -723 288 514 -418 263 270 -631 -7 1203 -253 -798 649 558 -230 318 -63
4186f3p60J393M82j595k32J344o12l23R89j150n72J797r0j507N74M84q76O09N63
$$ -63 -823 570 1052 -543 -775 569 -43 -366 623 -527 -1099 698 608 -899 -325 159 -717 -108 455
4205D55j003j61J273p23q05J161j15o09O61l8j218J046R45j197m50J066n58k21
$$ 455 -548 -709 564 -159 -964 197 82 -527 134 96 -1122 -76 869 -328 -778 288 -270 -491
4223d91R10m01q52J168K78j553N26P66r87K50J003q29n04R95m87p73J153K19j204
$$ -491 419 18 -834 334 612 -941 -415 351 -636 -386 617 -212 -716 279 -208 -981 172 391 -813
4242h13M67P39j256O30O89j037k70J764o71r87P02J03m62J080K51j576L17J112
$$ -813 -346 393 -863 -233 456 -581 -851 913 242 -745 -43 60 -402 678 929 -647 -330 782
4260G82n72j99P67n54n05J087k43j158R63O36j109K51N40j025K76R98q54o52J392
$$ 782 210 11 778 224 -281 806 563 -595 368 1004 -105 146 686 -339 -63 935 81 -571 821
4279H21l36j101Q32L00j134Q04N21j388K20J213o37n62R58k79o86Q86J90j235
$$ 821 485 -616 216 516 -618 186 707 -681 -461 752 115 -447 511 232 -454 432 622 -613
4297f13N71P54j147J45J002p85j93J091o84q10R00N65j402P41O06j022J77Q98
$$ -613 -42 712 -435 -290 712 -73 -266 825 141 -669 231 796 -606 135 741 -281 -104 794
4315G94j314l44J573l63r83O43K30r30O00M16j181M66J153j249o60J331o25l3
$$ 794 -520 -864 709 346 -637 6 236 -694 -94 322 -859 -393 760 -489 -1149 182 -443 -476
4333d76P46j76j063M95R47j301M94J001q52l30R00p49l79J069N3p88O89Qr97M11
$$ -476 270 94 -969 -474 473 -828 -334 667 -185 -515 385 -364 -743 326 379 -409 280 288 -709 -298
4353b98Q33j189M99P75q29n95P46K0n83Q64K85j219O33N55j386M49Q92n42m02
$$ -298 535 -654 -155 620 -209 -804 -58 -38 -621 243 528 -691 -58 497 -889 -440 452 -90 -492
4372d92R79o57p14J185Q6j039O90M36o27j79Q43o04k17J186n05q28Q93Pj057J060
$$ -492 487 -170 -884 301 387 -652 38 474 -153 -332 511 -93 -310 876 371 -457 436 443 -614 446
4392D46M99j424N10P96r33l21J026l68o92J137k54r77Q13O41j208K02O16o77j23
$$ 446 945 -479 31 827 -106 -427 599 231 -461 676 422 -555 258 899 -309 -107 509 -168 -291
4411b91J072p08m69J092k68r28R97K67j286L98Q36p88k4Q14o50k53Q87n19p95
$$ -291 781 73 -396 696 428 -500 497 764 -522 -124 712 -76 -100 714 64 -189 698 179 -616
4430f16Q85L19p84L35N44r05k44J073p90k60J046m44q28J051j93q53M98P44j037
$$ -616 269 588 -196 139 683 -222 -466 607 -183 -443 603 159 -669 382 189 -664 -166 578 -459
4449d59J3Q18p20k11J085p53p56J170K44j108L44M20o83K04R16j058p6P62l97
$$ -459 -446 372 -348 -559 526 -227 -983 187 431 -677 -333 87 -596 -392 524 -534 -610 152 -245
4468b45m55J055j76r26P44K42r99K04J078j043jJ038p66o96J283j58j172J105
$$ -245 -700 355 179 -747 -3 239 -760 -556 522 -521 -522 516 -250 -946 337 179 -993 112
4486A12L87j200O42M63q92J36J070j043m15J375l31j076R41M49j180M29P74r01
$$ 112 499 -701 -59 404 -488 -352 718 -325 -740 635 304 -772 169 618 -562 -133 641 -260
4504b60J43Q36p23m76J242m34q88Q97J30r76Q31N24j070J05P55p34l17J036k34
$$ -260 -117 719 -4 -480 762 328 -560 337 467 -509 322 846 -224 -119 636 -98 -415 621 387
4523C87p49R19j42q75O16M33q36K02R44j109J11R04n02p94J130p0r40P49J12q12
$$ 387 -362 557 415 -460 156 589 -247 -45 899 -210 -99 805 303 -491 639 569 -371 378 490 -322
4543c22M54Q00j114n4J062q29l15Q48l18p17P89J47p98K06P09r41l7R98n95o02
$$ -322 132 932 -182 -236 826 -3 -318 530 212 -505 284 431 -367 -161 548 -393 -430 568 -27 -629
4563f29Q31k69n37Q29qp58M64P50j179J65P94p93q3R00l94o70O38K46q48M34O97
$$ -629 202 -67 -604 225 217 -541 -77 673 -506 -341 453 -340 -423 477 83 -587 51 297 -551 -117 580
4584E80j151K89P71r64j59J005l85o09P94p2j188R90K81q85N71O68q20k38R54
$$ 580 -571 -282 489 -475 -634 371 -14 -623 171 99 -1089 -99 182 -703 -132 536 -284 -522 432
4603D32n50o11R79j81q03P86L17q96R8Q62o62j01Q56o76p50J176j81p07P62L04
$$ 432 -118 -729 250 69 -734 52 369 -527 -429 433 -229 -330 526 -150 -900 276 95 -612 150 454
4623D54j110O42N55r00J4R38n94m83J181n57o36P79K61j173O10O61r56J64Q83
$$ 454 -656 -14 541 -359 -345 593 -1 -484 697 140 -496 283 544 -629 -19 642 -314 -150 733
4642G33p07n39J160k86p68Q93k6r36O19M55q72J21R12q03k95R97o04o50J131O6
$$ 733 26 -513 647 361 -407 486 460 -476 143 598 -274 -153 759 -44 -339 658 54 -596 535 601
4662F01j025Q40K06r31K39Q35q67r6R86o40o47R35o4r52R82L41j081M6Q06q13
$$ 601 -424 416 622 -309 -70 765 -102 -198 788 148 -499 436 372 -580 402 743 -338 -292 514 -299
4682b99J83P01k98p30Q24k46q15Q25L13r73N92M10j042Q0R62n46l88Q44l14r16
$$ -299 -116 585 287 -443 381 135 -680 145 458 -515 77 487 -555 -475 487 -59 -447 397 83 -833
4702h33O87M05j017N77N64q56J61P06q89N6R78m23p30P45j27p32P47L30j166N23
$$ -833 -146 259 -758 -181 383 -473 -312 394 -495 -439 539 116 -614 131 4 -728 19 349 -817 -294
4722b94Q99q62l82R18l76l96P53j09p82O26L69q28J82P27p84k2Q75n27p50R13
$$ -294 605 -257 -639 279 -97 -493 260 151 -631 -5 364 -464 -282 445 -339 -361 514 -13 -763 150
4742A50m6n38N74J85q43M12P86q55k66J018m30n59J009n65o24R06K04q29L64M05
$$ 150 104 -434 140 325 -518 -106 680 -175 -441 577 147 -412 597 32 -592 314 518 -311 53 458
4762D58p97J20R60o67n85R41l7o52Q42k82r19Q79O20r06j24O77n55j10R12p16
$$ 458 -339 -219 741 74 -511 430 393 -259 583 301 -618 261 881 -25 -149 528 -27 -137 775 59
4782E9n12J052R1r17M85R3o50J30Q88n33o22Q66j40m35N86r7q20P99L14r99L15
$$ 59 -453 599 690 -227 258 351 -299 -169 719 186 -436 430 290 -145 441 344 -476 323 637 -362 -47
4803d7M96q80J22P16n03m72J139k48q91N45M09n85N5O65r46k20J039n00l25P58
$$ -47 449 -431 -309 407 -96 -568 571 323 -568 -23 386 -199 -144 521 -425 -645 394 -106 -431 327
4823C27k67n51Q90N8j164M50O87m91o9M37p97l79J200J59j116M98J01o37P13N60
$$ 327 60 -491 399 457 -707 -257 430 -61 -130 307 -490 -869 331 490 -626 -128 -27 -664 49 609
4843F09j141p8P95k31l34M78l84n21J017J51j021K12P86p82K36O69r07j17J037
$$ 609 -532 -610 185 -46 -380 98 -286 -807 210 361 -660 -448 338 -444 -208 461 -446 -563 474
4862D74m55r17Q43M28q84N09K46q67M07P90q30O0O68n65j87Q11l29q20Q08M68
$$ 474 19 -898 -55 373 -511 -2 244 -623 -216 574 -256 -196 472 -93 -280 531 202 -618 190 658
$$ [...]
8191B99
##END NTUPLES=NMR FID
##END=
